##TITLE=1H_EC-3242(21)
 CDCl3,8 sc, 
 10.02.2021
##JCAMPDX= 6.0         $$ Bruker NMR JCAMP-DX V2.0
##DATA TYPE= NMR SPECTRUM
##DATA CLASS= NTUPLES
##ORIGIN= UXNMR, Bruker Analytische Messtechnik GmbH
##OWNER= root
$$ XWIN-NMR		Version 3.5
$$ Wed Feb 10 11:35:55 2021 Russian Standard Time (UT+4h)  she@DPX200
##.OBSERVE FREQUENCY= 200.1315066352
##.OBSERVE NUCLEUS= ^1H
##.ACQUISITION MODE= SIMULTANEOUS
##.ACQUISITION SCHEME= undefined
##.AVERAGES= 8
##.DIGITISER RES= 18
##SPECTROMETER/DATA SYSTEM= spect
##.PULSE SEQUENCE= zg30
##.SOLVENT NAME= CD3CN
##.SHIFT REFERENCE= (INTERNAL, CD3CN, 0, 15.9865)
##AUDIT TRAIL= $$ (NUMBER, WHEN, WHO, WHERE, WHAT)
$$ ##TITLE= Audit trail, XWIN-NMR		Version 3.5
$$ ##JCAMPDX= 5.01
$$ ##ORIGIN= Bruker BioSpin GmbH
$$ ##OWNER= she
$$ F:/spectra/data/she/nmr/H-F/1/pdata/1/auditp.txt
$$ ##AUDIT TRAIL=  $$ (NUMBER, WHEN, WHO, WHERE, WHAT)
(   1,<2021-02-10 11:34:03.03 +0400>,<she>,<DPX200>,
      <created by zg, POWCHK disabled, PULCHK disabled
       configuration hash MD5:
       00 E9 B6 7A A2 85 ED C7 34 08 36 98 17 FE 4E 26
       data hash MD5: 16K
       56 39 94 DF FE 2A BB 50 95 F0 1B 15 62 51 59 43>)
(   2,<2021-02-10 11:34:14.01 +0400>,<she>,<DPX200>,
      <Start of raw data processing
       efp BC_mod = 2 LB = 0.24 FT_mod = 6 PKNL = 1 PHC0 = -10758.56 PHC1 = 14.20095 SI = 16K 
       data hash MD5: 16K
       C6 7A 37 43 26 28 8B 78 ED B6 8B 9A AD CF B4 E1>)
(   3,<2021-02-10 11:34:37.09 +0400>,<she>,<DPX200>,
      <pk PHC0 = -8.669629 PHC1 = 7.6 
       data hash MD5: 16K
       BE 50 E2 F3 05 56 63 C1 92 03 B1 69 AB D5 74 E2>)
(   4,<2021-02-10 11:34:40.85 +0400>,<she>,<DPX200>,
      <abs ABSG = 5 
       data hash MD5: 16K
       31 9F 97 C7 DE CA 11 0C 2C 29 98 E7 D3 43 20 42>)
(   5,<2021-02-10 11:35:23.67 +0400>,<she>,<DPX200>,
      <pk PHC0 = 10.62112 PHC1 = -7.399999 
       data hash MD5: 16K
       67 F6 2D C2 CF 23 5E 88 B3 2B 07 90 2D FE 80 E2>)
(   6,<2021-02-10 11:35:26.59 +0400>,<she>,<DPX200>,
      <abs ABSG = 5 
       data hash MD5: 16K
       18 AB 7F 56 58 10 5B 03 51 CF 93 8D 63 B0 B9 F9>)
$$ ##END=
$$ 
$$ hash MD5
$$ D6 99 5F 74 1C B4 C8 E6 88 DF 24 DB 61 B2 C1 0B
##$RELAX= 
##$RELAX= 
##$RELAX= 
##$RELAX= 
##$RELAX= 
##$RELAX= 
$$ Bruker specific parameters
$$ --------------------------
##$DU= <F:/spectra>
##$EXPNO= 1
##$NAME= <H-F>
##$PROCNO= 1
##$TYPE= <nmr>
##$USER= <she>
##$AMP= (0..31)
100 100 100 100 100 100 100 100 100 100 100 100 100 100 100 100 100 100 
100 100 100 100 100 100 100 100 100 100 100 100 100 100 
##$AQSEQ= 0
##$AQ_mod= 1
##$AUNM= <au_zg>
##$AUTOPOS= <>
##$BF1= 200.13
##$BF2= 200.13
##$BF3= 200.13
##$BF4= 200.13
##$BF5= 200.13
##$BF6= 200.13
##$BF7= 200.13
##$BF8= 200.13
##$BYTORDA= 1
##$CFDGTYP= 0
##$CFRGTYP= 5
##$CHEMSTR= <none>
##$CNST= (0..31)
1 1 145 1 1 1 1 1 1 1 1 1 1 1 1 1 1 1 1 1 1 1 1 1 1 1 1 1 1 1 1 1 
##$CPDPRG= <>
##$CPDPRG1= <>
##$CPDPRG2= <>
##$CPDPRG3= <>
##$CPDPRG4= <mlev>
##$CPDPRG5= <mlev>
##$CPDPRG6= <mlev>
##$CPDPRG7= <mlev>
$$ [...]
##$SUBNAM3= <"">
##$SUBNAM4= <"">
##$SUBNAM5= <"">
##$SUBNAM6= <"">
##$SUBNAM7= <"">
##$SUBNAM8= <"">
##$SUBNAM9= <"">
##$SW= 16.9725356469052
##$SWIBOX= (0..15)
0 0 2 0 0 0 0 0 0 0 0 0 0 0 0 0 
##$SW_h= 3396.73913043478
##$TD= 16384
##$TD0= 1
##$TE= 0
##$TE2= 300
##$TE3= 300
##$TEG= 300
##$TL= (0..7)
0 120 120 120 120 120 120 120 
##$TP= (0..7)
150 150 150 150 150 150 150 150 
##$TP07= 0
##$TPNAME0= <>
##$TPNAME1= <>
##$TPNAME2= <>
##$TPNAME3= <>
##$TPNAME4= <>
##$TPNAME5= <>
##$TPNAME6= <>
##$TPNAME7= <>
##$TPOAL= (0..7)
0.5 0.5 0.5 0.5 0.5 0.5 0.5 0.5 
##$TPOFFS= (0..7)
0 0 0 0 0 0 0 0 
##$TUNHIN= 0
##$TUNHOUT= 0
##$TUNXOUT= 0
##$USERA1= <user>
##$USERA2= <user>
##$USERA3= <user>
##$USERA4= <user>
##$USERA5= <user>
##$V9= 5
##$VALIST= <valist>
##$VCLIST= <CCCCCCCCCCCCCCC>
##$VD= 0
##$VDLIST= <DDDDDDDDDDDDDDD>
##$VPLIST= <PPPPPPPPPPPPPPP>
##$VTLIST= <TTTTTTTTTTTTTTT>
##$WBST= 1024
##$WBSW= 4
##$XGAIN= (0..3)
0 0 0 0 
##$XL= 0
##$YL= 0
##$YMAX_a= 215238
##$YMIN_a= -276099
##$ZGOPTNS= <>
##$ZL1= 120
##$ZL2= 120
##$ZL3= 120
##$ZL4= 120
##$ABSF1= 15.98646
##$ABSF2= -0.9862041
##$ABSG= 5
##$ABSL= 3
##$ALPHA= 0
##$AQORDER= 0
##$ASSFAC= 0
##$ASSFACI= 0
##$ASSFACX= 0
##$ASSWID= 0
##$AUNMP= <proc_1d>
##$AZFE= 0.1
##$AZFW= 0.1
##$BCFW= 0
##$BC_mod= 2
##$BYTORDP= 0
##$COROFFS= 0
##$CY= -3
##$DATMOD= 1
##$DC= 0
##$DFILT= <>
##$DTYPP= 0
##$F1P= 0
##$F2P= 0
##$FCOR= 1
##$FTSIZE= 16384
##$FT_mod= 6
##$GAMMA= 0
##$GB= 0
##$INTBC= 1
##$INTSCL= 2.992141e-10
##$ISEN= 128
##$LB= 0.24
##$LEV0= 0
##$LPBIN= 0
##$MAXI= 10000
##$MC2= 0
##$MEAN= 0
##$ME_mod= 0
##$MI= 1.114404
##$NCOEF= 0
##$NC_proc= -7
##$NLEV= 6
##$NOISF1= 3.799351
##$NOISF2= 2.8
##$NSP= 0
##$NTH_PI= 0
##$NZP= 0
##$OFFSET= 15.98646
##$PC= 1
##$PHC0= -10756.61
##$PHC1= 14.40095
##$PH_mod= 1
##$PKNL= yes
##$PPARMOD= 0
##$PSCAL= 0
##$PSIGN= 0
##$REVERSE= no
##$SF= 200.130005635299
##$SI= 16384
##$SIGF1= 3
##$SIGF2= 2
##$SINO= 5.538805
##$SIOLD= 16384
##$SREGLST= <1H.CDCl3>
##$SSB= 0
##$STSI= 16384
##$STSR= 0
##$SW_p= 3396.73913043478
##$SYMM= 0
##$S_DEV= 0
##$TDeff= 16384
##$TDoff= 0
##$TI= <>
##$TILT= no
##$TM1= 0
##$TM2= 0
##$TOPLEV= 0
##$USERP1= <user>
##$USERP2= <user>
##$USERP3= <user>
##$USERP4= <user>
##$USERP5= <user>
##$WDW= 1
##$XDIM= 16384
##$YMAX_p= 386609339
##$YMIN_p= -1153894
$$ End of Bruker specific parameters
$$ ---------------------------------
##NTUPLES= NMR SPECTRUM
##VAR_NAME=  FREQUENCY,     SPECTRUM/REAL,   SPECTRUM/IMAG
##SYMBOL=    X,             R,               I
##VAR_TYPE=  INDEPENDENT,   DEPENDENT,       DEPENDENT
##VAR_FORM=  AFFN,          ASDF,            ASDF
##VAR_DIM=   16384,         16384,           16384
##UNITS=     HZ,            ARBITRARY UNITS, ARBITRARY UNITS
##FACTOR=    0.207333158178281, 1,           1
##FIRST=     3199.37027626478, 0,            0
##LAST=      -197.368854169999, 0,           0
##MIN=       -197.368854169999, -1153894,    0
##MAX=       3199.37027626478, 386609339,    0
$$ Real data points
##PAGE= N=1
##DATA TABLE= (X++(R..R)), XYDATA
$$ [...]
$$ plain form
4942 4557583 4540148 4516648 4620911 4259909 4330056 4402693 4482717 4646627 4013141 3644564
4932 3644564 3998673 4113648 4128168 4329508 4182170 3956577 4140053 4107017 4211677 4283487
4922 4283487 4441865 4303181 4108893 4407360 4207936 3931204 4076564 4107029 4266218 4382656
4912 4382656 4408767 4306919 4149574 3901741 4034427 3903990 3572252 3299529 3716209 3647834
4902 3647834 3565605 3493380 3504563 3301482 3311486 3472583 3171522 3098144 3244348 3447664
4892 3447664 3522027 3503163 3150136 2958021 3238872 2994259 2851923 2541227 2597180 2925767
4882 2925767 3238335 3196453 2874580 2920828 2817531 2737618 3003168 3220903 3111963 3150191
4872 3150191 3136168 2706460 2506738 2530834 2855275 3002131 3356127 3311933 2829519 2808342
$$ packed form
4942D557583j7435k3500J04263l61002P0147P2637Q0024J63910o33486l68577
4932C644564L54109J14975J4520K01340j47338k25593J83476l3036J04660P1810
4922D283487J58378j38684j94288K98467j99424k76732J45360L0465J59189J16438
4912D382656K6111j01848j57345k47833J32686j30437l31738k72723M16680o8375
4902C647834q2229p2225J1183k03081J0004J61097l01061p3378J46204K03316
4892C447664P4363j8864l53027j92115K80851k44613j42336l10696N5953L28587
4882B925767L12568m1882l21873M6248j03297p9913K65550K17735j08940L8228
4872C150191j4023m29708j99722K4096L24441J46856L53996m4194m82414k1177
$$ plain form
4862 2808342 3141368 3175282 3071564 2890264 2746669 2880887 3041609 3093852 2855157 2826193
4852 2826193 2718459 2745855 3055148 3335726 3349153 3434912 3231989 3168754 3112347 2962452
4842 2962452 2931011 3097386 3137422 2831747 2823032 2853366 2866658 3041153 3102441 2775869 2483855
4831 2483855 2427045 2248734 2539286 2601405 2753873 2495925 2225386 1895994 1928258 1815288
4821 1815288 2000702 2149579 2425144 2287221 2397317 2513000 2298894 2203985 2013898 1874297
4811 1874297 2104883 1907252 1971255 1801327 1756283 1896256 1836278 1837749 1752983 1814834 1896515
4800 1896515 2012957 1969704 2017545 1748917 1715677 1881070 1823696 1812054 1781574 1570651 1635224
4789 1635224 1682401 1843387 1887882 1708407 1613203 1697807 1929398 2014829 1995534 1592820 1354448
$$ packed form
4862B808342L33026L3914j03718j81300j43595J34218J60722N2243k38695k8964
4852B826193j07734K7396L09293K80578J3427Q5759k02923o3235n6407j49895
4842B962452l1441J66375M0036l05675q715L0334J3292J74495O1288l26572k92014
4831B483855n6810j78311K90552O2119J52468k57948k70539l29392L2264j12970
4821A815288J85414J48877K75565j37923J10096J15683k14106r4909j90087j39601
4811A874297K30586j97631O4003j69928m5044J39973n9978J471q4766O1851Q1681
4800A896515J16442m3253M7841k68628l3240J65393n7374j1642l0480k10923O4573
4789A635224M7177J60986M4495j79475r5204Q4604K31591Q5431j9295m02714k38372
$$ plain form
4778 1354448 1633628 1851853 1896965 1750300 1583710 1467548 1856324 1928471 1784636 2035204
4768 2035204 1908426 1904627 1920663 1799635 1949997 2019027 2046144 1912232 2145516 2069800 1913973
4757 1913973 2042207 1926891 1871826 1818719 1854448 1543863 1539494 1740408 1938990 2273656
4747 2273656 2177957 1975217 2238102 2524739 2684704 2790530 2608922 2411426 2390607 2410356
4737 2410356 2420657 2343165 2270293 2187409 2095990 2660839 2820484 3095947 3263746 2896030
4727 2896030 2866875 3030976 2575972 2305990 2203409 2208139 2225934 2492380 2560734 2450533
4717 2450533 2437422 2294460 2296811 2303693 2464524 2223923 2547244 2741715 2619554 2601269 2545296
4706 2545296 2407021 2264679 2614784 2677549 2783413 2836730 2774705 2693533 2637875 2748601
$$ packed form
4778A354448K79180K18225M5112j46665j66590j16162L88776P2147j43835K50568
4768B035204j26778l799J6036j21028J50362O9030K7117j33912K33284p5716j55827
4757A913973J28234j15316n5065n3107L5729l10585m369K00914J98582L34666
4747B273656r5699k02740K62885K86637J59965J05826j81608j97496k0819J9749
4737B410356J0301p7492p2872q2884r1419N64849J59645K75463J67799l67716
4727B896030k9155J64101m55004k69982j02581M730J7795K66446O8354j10201
4717B450533j3111j42962K351O882J60831k40601L23321J94471j22161j8285n5973
4706B545296j38275j42342L50105O2765J05864N3317o2025q1172n5658J10726
$$ plain form
4696 2748601 2965624 2961266 2950167 2705097 2711109 2707809 2644016 2691209 3070543 3040297 3037978 3314292
4684 3314292 2961128 2898755 2918025 2795039 2823102 2923252 2920557 2874816 3006448 3369122 3603432
4673 3603432 3370345 3448893 3602756 3882447 4128236 3987077 3971760 4050363 3739362 3714884
4663 3714884 4245935 3803803 3558560 3575369 3623757 3461709 3329697 3441845 3440956 3424724 3475476
4652 3475476 3439769 3223160 2959221 2867582 3097831 3361289 3243903 3047016 3042787 3296264
4642 3296264 3416477 3410066 3388289 3154142 3265187 3161548 3049623 3046570 3195837 3160689 3417220
4631 3417220 3590665 3529057 3741582 3610393 3643190 3918537 4039848 3860123 3738200 4010636
4621 4010636 3979079 3834634 4240990 4446666 4497672 4918021 5245620 4959361 5073596 5200435
$$ packed form
4696B748601K17023m358j1099k45070O012l300o3793M7193L79334l0246k319K76314
4684C314292l53164o2373J9270j22986K8063J00150k695m5741J31632L62674K34310
4673C603432k33087P8548J53863K79691K45789j41159j5317P8603l11001k4478
4663C714884N31051m42132k45243J6809M8388j62048j32012J12148q89j6232N0752
4652C475476l5707k16609k63939r1639K30249K63458j17386j96887m229K53477
4642C296264J20213o411k1777k34147J11045j03639j11925l053J49267l5148K56531
4631C417220J73445o1608K12525j31189L2797K75347J21311j79725j21923K72436
4621D010636l1557j44445M06356K05676N1006M20349L27599k86259J14235J26839
$$ plain form
4611 5200435 5256030 5564701 5681223 5828181 5849350 5892439 5466379 5523075 5359142 5588002
4601 5588002 6120996 6396315 6362342 6253481 6426066 6245383 6597036 6679726 7031480 7047033
4591 7047033 7267840 7614276 7662278 7481139 7173123 6929992 7101715 7270756 6762989 6744528
4581 6744528 6738338 6536279 6885052 7081987 7111589 6956095 7154186 7280146 7266899 7156173
4571 7156173 6838543 6862384 7273134 7557492 7759057 7680961 7432913 7499142 7745191 7752016
4561 7752016 7669599 7713510 8017154 8218960 8176427 8412224 7906989 7499856 7322409 7420282
4551 7420282 7531059 7565306 7115885 6794033 6730533 6677750 6826426 6976347 6883867 7019362
4541 7019362 6976142 6786131 6961877 6857216 6982399 7081583 7506423 7515217 7523819 7408775 7322644
$$ packed form
4611E200435N5595L08671J16522J46958K1169M3089m26060N6696j63933K28860
4601E588002N32994K75319l3973j08861J72585j80683L51653Q2690L51754J5553
4591G047033K20807L46436M8002j81139l08016k43131J71723J69041n07767j8461
4581F744528o190k02059L48773J96935K9602j55494J98091J25960j3247j10726
4571G156173l17630K3841M10750K84358K01565p8096k48048O6229K46049O825
4561G752016q2417M3911L03644K01806m2533K35797n05235m07133j77447R7873
4551G420282J10777L4247m49421l21852o3500n2783J48676J49921r2480J35495
4541G019362m3220j90011J75746j04661J25183R9184M24840Q794Q602j15044q6131
$$ plain form
4530 7322644 7342110 7513864 7912781 8046391 8239700 8543269 8604963 8391858 8233446 7885020
4520 7885020 7542462 7474468 7018543 6980971 6845109 6561049 6674272 7057151 6928074 6891892
4510 6891892 6730729 6479992 6380294 6283348 6394864 6773193 6874883 6998821 6983870 7001531
4500 7001531 7263036 7082310 6864830 7011814 7311529 7576195 8057864 8138039 7872270 7837228
4490 7837228 7964089 7866948 8199768 7820841 7700365 7625055 7451746 7294306 7460964 7574682
4480 7574682 7792151 7916875 8118475 8007160 7895249 8127625 8325624 8403974 8722081 9029663
4470 9029663 9472449 9335522 9079655 8818115 8516356 8654487 8936621 9225935 9456784 9649470
4460 9649470 10063730 9932384 10031004 9991175 9870880 10027243 9954722 10033734 10043963 10170813
$$ packed form
4530G322644J9466J71754L98917J33610J93309L03569O1694k13105j58412l48426
4520G885020l42558o7994m55925l7572j35862k84060J13223L82879j29077l6182
4510F891892j61163k50737r9698r6946J11516L78329J01690J23938j4951J7661
4500G001531K61505j80726k17480J46984K99715K64666M81669Q0175k65769l5042
4490G837228J26861r7141L32820l78927j20476p5310j73309j57440J66658J13718
4480G574682K17469J24724K01600j11315j11911K32376J97999P8350L18107L07582
4470I029663M42786j36927k55867k61540l01759J38131K82134K89314K30849J92686
4460I649470M14260j31346R8620l9829j20295J56363p2521P9012J0229J26850
$$ plain form
4450 10170813 9924641 9896792 9999806 9846316 9741055 9965809 10469441 10796641 10660080 10800404
4440 10800404 10666434 10742250 11302570 11245238 11546277 11714507 12205213 12500692 12583478 12599095
4430 12599095 12197271 12455080 12345660 13081175 13744504 14021781 14444399 14983742 15636160
4421 15636160 15831006 15940606 16027150 15715347 15223661 15124251 14878552 14351184 14444065 14311000
4411 14311000 13816885 13684198 13658586 13643988 13524060 13597156 13467574 13268447 12891596 12834719
4401 12834719 13218190 13107460 12966041 12871094 12560851 12582590 12925965 12727989 13073888 13384123
4391 13384123 13710015 14035078 14118872 14147364 14541121 14731064 14968596 14577861 14221314 13943904
4381 13943904 13519749 12928567 12484136 11738179 11733513 11558842 11289797 11284129 10835054 10328235
$$ packed form
4450A0170813k46172k7849J03014j53490j05261K24754N03632L27200j36561J40324
4440A0800404j33970P5816N60320n7332L01039J68230M90706K95479Q2786J5617
4430A2599095m01824K57809j09420P35515O63329K77277M22618N39343O52418
4421A5636160J94846J09600Q6544l11803m91686r9410k45699n27368R2881j33065
4411A4311000m94115j32687k5612j4598j19928P3096j29582j99127l76851n6877
4401A2834719L83471j10730j41419r4947l10243K1739L43375j97976L45899L10235
4391A3384123L25892L25063Q3794K8492L93757J89943K37532l90735l56547k77410
4381A3943904m24155n91182m44431p45957m666j74671k69045n668m49075n06819
$$ plain form
4371 10328235 10002126 9993275 9750179 9443102 9507530 9588782 9470235 9379779 9287256 9088643
4361 9088643 8661393 8866204 8971582 8756363 9015309 9271953 8819365 9074386 9478209 9307134
4351 9307134 9100283 9002944 8401202 8330713 8262186 7885921 7542843 7375891 7185800 6966400
4341 6966400 6808059 6382841 6138846 6248258 6149523 6272811 6208445 5916126 5682820 5789535
4331 5789535 5990007 5750543 5702475 5867836 5609891 5806869 6100176 6024931 5832158 6012764
4321 6012764 5982819 5930609 6038315 5912424 6238184 6182934 6304438 6094964 5838405 5766566
4311 5766566 5580542 5696798 5402510 5503929 5618603 5533049 5765407 5487227 5285419 5373695
4301 5373695 5405871 5816028 5778933 5704823 5666340 5595179 5554213 5647127 5226676 5307059 5312281
$$ packed form
4371A0328235l26109q851k43096l07077O4428Q1252j18547r0456r2523j98613
4361I088643m27250K04811J05378k15219K58946K56644m52588K55021M03823j71075
4351I307134k06851r7339o01742p0489o8527l76265l43078j66952j90091k19400
4341F966400j58341m25218k43995J09412r8735J23288o4366k92319k33306J06715
4331E789535K00472k39464m8068J65361k57945J96978K93307p5245j92773J80606
4321F012764k9945n2210J07706j25891L25760n5250J21504k09474k56559p1839
4311E766566j86024J16256k94288J01419J14674q5554K32358k78180k01808Q8276
4301E373695L2176M10157l7095p4110l8483p1161m0966R2914m20451Q0383N222
$$ plain form
4290 5312281 5024035 5103926 5486007 5396340 5333160 5148906 5430339 5791846 5785714 5404056
4280 5404056 5204237 5300324 5093981 5208589 5155135 5346061 5011839 4678671 5076017 5077817
4270 5077817 4856698 5219072 4817316 4818539 5071405 5165019 5033582 4968468 4718435 4644833
4260 4644833 4267404 4236469 4474567 4710214 5075918 4872384 4665959 4338944 4293819 4420655
4250 4420655 4071299 4166624 3904442 4082462 4290624 4235923 4273081 4159312 3867795 3952785
4240 3952785 4073148 4297469 4655408 4410307 4202438 4154216 4137335 4054272 4030401 4308884
4230 4308884 4679477 4836689 4904164 5241148 5201366 5378837 5729521 5491623 5201221 5128913
4220 5128913 5120846 5043318 5133575 5253033 5073213 4999201 5113922 5522868 5605598 5449572 5491077
$$ packed form
4290E312281k88246P9891L82081q9667o3180j84254K81433L61507o132l81658
4280E404056j99819R6087k06343J14608n3454J90926l34222l33168L97346J800
4270E077817k21119L62374m01756J223K52866R3614j31437o5114k50033p3602
4260D644833l77429l0935K38098K35647L65704k03534k06425l27015m5125J26836
4250D420655l49356R5325k62182J78020K08162n4701L7158j13769k91517Q4990
4240C952785J20363K24321L57939k45101k07869m8222j6881q3063k3871K78483
4230D308884L70593J57212O7475L36984l9782J77471L50684k37898k90402p2308
4220E128913q067p7528R0257J19458j79820p4012J14721M08946Q2730j56026M1505
$$ plain form
4209 5491077 5456805 5417207 5222973 5033344 4660346 4557785 4519233 4663331 4419334 4283469
4199 4283469 4328278 4469945 4708236 4645773 4877903 4676401 4644417 4769640 4813593 4944710
4189 4944710 4915808 5304480 5529525 5458812 5325852 5309485 4865139 5026865 5380240 5069925
4179 5069925 5078109 4704060 4525114 4549074 4204325 4295079 4090897 4242615 4145168 4094952 3660912
4168 3660912 3702117 3710709 3454638 3604299 3860787 3726430 3673580 3762583 3578067 3770082
4158 3770082 3942037 3874170 3937607 4089738 4344568 4325872 4254283 3964684 4101573 3997990
4148 3997990 3752599 3559343 3751229 4244827 4084916 4111589 4170607 4070529 4158769 4546701
4138 4546701 4806121 4894305 4704426 4499071 4133034 4224499 4099073 4105238 4237390 4277118
$$ packed form
4209E491077l4272l9598j94234j89629l72998j02561l8552J44098k43997j35865
4199D283469M4809J41667K38291o2463K32130k01502l1984J25223M3953J31117
4189D944710k8902L88672K25045p0713j32960j6367m44346J61726L53375l10315
4179E069925Q184l74049j78946K3960l44749R0754k04182J51718r7447n0216m34040
4168C660912M1205Q592k56071J49661K56488j34357n2850Q9003j84516J92015
4158C770082J71955o7867O3437J52131K54830j8696p1589k89599J36889j03583
4148C997990k45391j93256J91886M93598j59911K6673N9018j00078Q8240L87932
4138D546701K59420Q8184j89879k05355l66037R1465j25426O165J32152L9728
$$ plain form
4128 4277118 4190437 4333667 4299189 4055570 3988294 4072608 4275649 4531913 4714416 4388272
4118 4388272 4093364 4037179 3783617 3844068 4352112 4613465 4515402 4432024 4225712 4115648
4108 4115648 3712638 3751443 3857221 3968774 4295721 4180643 4101144 4330766 4074723 4063215
4098 4063215 4315063 4138503 3925151 4278135 4418690 4259334 4287665 4243167 4134311 4265322
4088 4265322 4593119 4855092 5244991 4844981 4573975 4911399 4930400 4673264 4699446 4613837
4078 4613837 4432792 4497968 4622347 4757618 4868010 5360423 5153547 5210480 5711783 5819550
4068 5819550 5826477 5738559 5692326 5517906 5365144 5079624 4938697 4991635 5306513 5414901
4058 5414901 5706147 5616660 5613055 5853242 5508554 5320766 5518814 5806070 5985443 6118275
$$ packed form
4128D277118q6681J43230l4478k43619o7276Q4314K03041K56264J82503l26144
4118D388272k94908n6185k53562O0451N08044K61353r8063q3378k06312j10064
4108D115648m03010L8805J05778J11553L26947j15078p9499K29622k56043j1508
4098D063215K51848j76560k13352L52984J40555j59356K8331m4498j08856J31011
4088D265322L27797K61973L89899m00010k71006L37424J9001k57136K6182q5609
4078D613837j81045O5176J24379J35271J10392M92413k06876N6933N01303J07767
4068E819550O927q7918m6233j74420j52762k85520j40927N2938L14878J08388
4058E414901K91246q9487l605K40187l44688j87788J98048K87256J79373J32832
$$ plain form
4048 6118275 6307837 6066456 5979388 6284368 6336824 6814916 6732132 6687785 6898163 7107513
4038 7107513 7278289 7344141 7606683 7420434 7295192 7595777 7888064 7615472 7516845 7687495
4028 7687495 7560834 7695306 7845306 7739327 7576294 7289837 7166052 7363568 7724144 7894187
4018 7894187 8149293 8361540 7936864 7657815 7612059 7705912 7574821 7861751 8126120 8010736
4008 8010736 8134743 8254149 8243750 8199911 8389721 8945029 9762990 10429126 10942578 11500051
3998 11500051 11963012 11697155 11988503 12399604 12558940 12410354 12449246 12542328 12650085 13103139
3988 13103139 13422315 13373932 13890484 14311693 14161825 14202249 14096412 13570145 13675055 13967215
3978 13967215 13626524 13461510 13293735 13182435 12901940 12946501 12810564 12943303 13626072 14054811
$$ packed form
4048F118275J89562k41381q7068L04980N2456M78092q2784m4347K10378K09350
4038G107513J70776O5852K62542j86249j25242L00585K92287k72592r8627J70650
4028G687495j26661J34472J50000j05979j63033k86457j23785J97516L60576J70043
4018G894187K55106K12247m24676k79049m5756R3853j31091K86930K64369j15384
4008H010736J24007J19406j0399m3839J89810N55308Q17961O66136N13452N57473
3998A1500051M62961k65857K91348M11101J59336j48586L8892R3082J07757M53054
3988A3103139L19176m8383N16552M21209j49868M0424j05837n26267J04910K92160
3978A3967215l40691j65014j67775j11300k80495M4561j35937J32739O82769M28739
$$ plain form
3968 14054811 13931796 13854569 13709724 13389390 13478491 14112813 14586904 15119389 15925695 16858152
3958 16858152 17678562 18754525 19391624 19699652 20072638 19830999 19540609 19188719 18545197
3949 18545197 18070579 17891994 17589571 17510814 17508529 17200898 17379608 17829003 18103616 18163946
3939 18163946 18480420 18583451 18389774 18134395 17883445 17933474 18028114 18383146 18460280 18615794
3929 18615794 18233783 17786420 17771235 18013572 18043253 18369058 18305799 18432379 18670329 18739243
3919 18739243 18976013 19462548 19841506 20499392 21515342 22345029 23047386 23427664 23707549
3910 23707549 24257577 24928832 25946098 26800548 27735841 28356912 29097000 30035336 30828770
3901 30828770 31938492 33022210 34411961 36218563 37913039 39493164 41421054 43742832
$$ packed form
3968A4054811j23015p7227j44845l20334Q9101O34322M74091N32485Q06306R32457
3958A6858152Q20410J075963O37099L08028L72986k41639k90390l51890o43522
3949A8545197m74618j78585l02423p8757k285l07631J78710M49395K74613O0330
3939A8163946L16474J03031j93677k55379k50950N0029R4640L55032P7134J55514
3929A8615794l82011m47363j5185K42337K9681L25805o3259J26580K37950O8914
3919A8739243K36770M86535L78958O57886J015950Q29687P02357L80278K79885
3910B3707549N50028O71255J017266Q54450R35293O21071P40088R38336P93434
3901C0828770J109722J083718J389751J806602J694476J580125J927890K321778
$$ plain form
3893 43742832 45938032 48102370 51072406 54258800 58076200 62713497 67828408 74380676
3885 74380676 83154228 94271243 109163383 127788944 148382917 170831564 193811065
3878 193811065 210524616 211814678 195126293 167252778 138728230 116273577 100544439
3871 100544439 89643222 81997104 76563738 72802216 70364239 67669370 65221529 62468162
3863 62468162 59796722 57396456 55481190 53620798 52141382 51875128 51998609 52831104 53725231
3854 53725231 54354847 55231717 55528104 54525511 52986289 52171215 51121989 49621620 48082999
3845 48082999 46649266 45534782 44419694 43458330 42732636 42137569 42176936 41844247 41932256
3836 41932256 42508113 42996128 43569190 43601857 43471801 43251458 42949752 42920807 42956064 43497586
$$ packed form
3893D3742832K195200K164338K970036L186394L817400M637297N114911O552268
3885G4380676Q773552J1117015J4892140J8625561K0593973K2448647K2979501
3878A93811065J6713551J290062j6688385k7873515k8524548k2454653j5729138
3871A00544439j0901217p646118n433366l761522k437977k694869k447841k753367
3863F2468162k671440k400266j915266j860392j479416k66254J23481Q32495Q94127
3854E3725231O29616Q76870K96387j002593j539222q15074j049226j500369j538621
3845D8082999j433733j114484j115088r61364p25694n95067L9367l32689Q8009
3836D1932256N75857M88015N73062L2667j30056k20343l01706k8945L5257N41522
$$ plain form
3826 43497586 44119953 45362107 46808408 48304931 50674349 53516811 56409306 60372308
3818 60372308 65100513 70477947 77587768 86840384 99002554 114052293 131788761 151801492
3810 151801492 170583786 184152269 187623126 178676061 160090297 135856186 113137172
3803 113137172 95456011 82508959 73188908 66315465 61657788 58067270 55262372 53629016
3795 53629016 52012497 50922915 50226300 49816611 49482449 49115267 48148208 46416124 44139671
3786 44139671 41848097 39709304 37846112 36424046 35070509 34031742 33270681 32587887
3778 32587887 31857534 31372567 30789571 30525478 30464599 30251784 30546803 30868013 30865540 30847922
3768 30847922 30739544 30871560 30751584 31288322 31687853 32089944 32567484 32812027 33254379
$$ packed form
3826D3497586O22367J242154J446301J496523K369418K842462K892495L963002
3818F0372308M728205N377434P109821R252616J2162170J5049739J7736468K0012731
3810A51801492J8782294J3568483L470857q947065j8585764k4234111k2719014
3803A13137172j7681161j2947052r320051o873443m657677l590518k804898j633356
3795E3629016j616519j089582o96615m09689l34162l67182r67059j732084k276453
3786D4139671k291574k138793j863192j422066j353537j038767p61061o82794
3778C2587887p30353m84967n82996k64093o0879k12815K95019L21210k473j7618
3768C0847922j08378J32016j19976N36738L99531M02091M77540K44543M42352
$$ plain form
3759 33254379 33977396 34986653 35959037 37377669 38648428 40010340 41539240 43701660
3751 43701660 45840343 48641741 52100413 56344017 61054478 66606449 73156808 81232909
3743 81232909 91693196 104134045 118255999 135272556 153607554 168344719 176065530
3736 176065530 174750906 165751879 150956024 130411713 108259397 89137951 75126760
3729 75126760 65057983 57199248 51679110 46922733 43177699 40391047 37890939 35605631
3721 35605631 33695954 32703358 31270832 30080748 29410006 28151340 27119369 26042460
3713 26042460 24733526 23648788 22872287 22169301 21476302 20886431 20409518 19925878 19582550
3704 19582550 19249173 18892735 18955642 18584845 18277502 17697449 17360698 16793694 16358384 15747611
$$ packed form
3759C3254379P23017J009257R72384J418632J270759J361912J528900K162420
3751D3701660K138683K801398L458672M243604M710461N551971O550359Q076101
3743H1232909J0460287J2440849J4121954J7016557J8334998J4737165P720811
3736A76065530j314624q999027j4795855k0544311k2152316j9121446j4011191
3729G5126760j0068777p858735n520138m756377l745034k786652k500108k285308
3721C5605631j909677r92596j432526j190084o70742j258666j031971j076909
3713B6042460j308934j084738p76501p02986o92999n89871m76913m83640l43328
3704A9582550l33377l56438O2907l70797l07343n80053l36751n67004m35310o10773
$$ plain form
3694 15747611 15223326 15123693 14890999 14801693 14415744 14318349 13793160 13353241 13695522 13608433
3684 13608433 13434623 13241708 12913059 12418775 12400741 12046082 11932900 11889323 11530398 11491510
3674 11491510 11249643 11083760 10462782 10602478 10748696 10532996 10796991 10714219 10378832 10632850
3664 10632850 10710307 10772079 10980256 11013854 10830667 10884291 10791490 10746626 10504746 10355400
3654 10355400 10472575 10716823 11036310 11038696 11230024 11480413 11755210 11983703 12383164 12675377
3644 12675377 12441769 12306114 12442545 12582471 12778637 12968871 12799660 13043366 13689686
3635 13689686 14127720 14851285 15897011 16788927 17646757 18049753 17966191 17687602 17371236
3626 17371236 17362654 17173674 17209454 17835368 17959539 18330403 17953034 17123218 15952471 14663876
$$ packed form
3694A5747611n24285r9633k32694q9306l85949r7395n25189m39919L42281q7089
3684A3608433j73810j92915l28649m94284j8034l54659j13182m3577l58925l8888
3674A1491510k41867j65883o20978J39696J46218k15700K63995q2772l35387K54018
3664A0632850P7457O1772K08177L3598j83187N3624r2801m4864k41880j49346
3654A0355400J17175K44248L19487K386J91328K50389K74797K28493L99461K92213
3644A2675377k33608j35655J36431J39926J96166J90234j69211K43706O46320
3635A3689686M38034P23565J045726Q91916Q57830M02996q3562k78589l16366
3626A7371236q582j88980L5780O25914J24171L70864l77369q29816j170747j288595
$$ plain form
3616 14663876 13713189 13246597 12750486 12163060 11756351 11350811 11192277 11050182 11146119 11436459
3606 11436459 11229326 11160324 10565801 10068829 9410177 9075714 9062635 9126053 9040830 8897149
3596 8897149 8757533 8536916 8225407 8007764 7861402 7801346 7748461 8218657 8334724 8196486
3586 8196486 8025943 7925765 7765506 7795531 7625875 7208544 7126484 7569594 7733404 7558571
3576 7558571 7531683 7222836 7154014 7161351 7098557 6760996 6719994 6913192 7042880 7383827 7462916
3565 7462916 7308545 7302182 6970682 6754990 6793903 6688857 6575720 7087955 7402988 7074195
3555 7074195 6938420 7023263 6567477 6413060 6424015 6767800 7051524 7450543 7344277 7414793
3545 7414793 7598069 7780342 7706844 7754310 7569694 7394718 7273921 6886012 6718413 6613306
$$ packed form
3616A4663876r50687m66592m96111n87426m06709m05540j58534j42095R5937K90340
3606A1436459k07133o9002n94523m96972o58652l34463j3079O3418q5223j43681
3596H897149j39616k20617l11509k17643j46362o0056n2885M70196J16067j38238
3586H196486j70543j00178j60259L0025j69656m17331q2060M43110J63810j74833
3576G558571k6888l08847o8822P337o2794l37561m1002J93198J29688L40947P9089
3565G462916j54371o363l31500k15692L8913j05046j13137N12235L15033l28793
3555G074195j35775Q4843m55786j54417J0955L43785K83724L99019j06266P0516
3545G414793J83276J82273p3498M7466j84616j74976j20797l87909j67599j05107
$$ plain form
3535 6613306 6124855 6196549 6149951 6120489 5984035 6423962 6571623 6778445 6684096 6467479
3525 6467479 6384287 6285052 6284622 6288955 6281868 6457664 6337848 6452517 6356004 6580785 6491474
3514 6491474 6448235 6579084 6268462 6258314 6391486 6542595 6610738 6808120 6799021 6534194
3504 6534194 6570601 6459575 6617687 6580996 6870915 7196048 7056495 7155345 7328654 7259606
3494 7259606 7190227 7366903 7552006 7705648 7660119 7268895 6970048 7054543 6928907 6892331
3484 6892331 7109968 6917139 7052612 7212681 7163843 7242345 7282072 7413922 7346417 7604486
3474 7604486 7829219 7814129 7837299 7885308 7628294 7702346 7697495 7423882 7656118 7839621 7733365
3463 7733365 7565209 7593233 7785323 7798052 8093996 8272541 8234593 7869398 7785197 7646893
$$ packed form
3535F613306m88451P1694m6598k9462j36454M39927J47661K06822r4349k16617
3525F467479q3192r9235m30M333p087J75796j19816J14669r6513K24781q9311
3514F491474m3239J30849l10622j0148J33172J51109O8143J97382r099k64827
3504F534194L6407j11026J58112l6691K89919L25133j39553R8850J73309o9048
3494G259606o9379J76676J85103J53642m5529l91224k98847Q4495j25636l6576
3484F892331K17637j92829J35473J60069m8838P8502L9727J31850o7505K58069
3474G604486K24733j5090K3170M8009k57014P4052m851k73613K32236J83503j06256
3463G733365j68156K8024J92090J2729K95944J78545l7948l65195q4201j38304
$$ plain form
3453 7646893 7807014 7982215 8340201 8446903 8792576 8886893 9076912 9205286 9227876 9431999
3443 9431999 10343043 10847682 11312792 11753932 12306675 12449457 13087007 13430708 13397683 12667053
3433 12667053 12022182 11366944 10688288 10358672 10353821 10127929 9978317 9884337 10193261 10087472
3423 10087472 9983354 9871085 10057934 10164833 10149566 10242205 10292268 10234734 10631098 11078496
3413 11078496 11193597 11412012 11601852 12037614 12584454 12696067 12894466 13346359 13580833
3404 13580833 14319998 15166769 15855171 16350999 17027464 18036882 18612188 19298913 20370723
3395 20370723 21103774 22317014 23098030 23574823 23475416 22119467 20718485 19648574 19007734
3386 19007734 17858869 16928560 16500751 15819744 15340806 14819821 14770197 14236115 14299727 14349717
$$ packed form
3453G646893J60121J75201L57986J06702L45673R4317J90019J28374K2590K04123
3443I431999R11044N04639M65110M41140N52743J42782O37550L43701l3025p30630
3433A2667053o44871o55238o78656l29616m851k25892j49612r3980L08924j05789
3423A0087472j04118j12269J86849J06899j5267R2639N0063n7534L96364M47398
3413A1078496J15101K18415J89840M35762N46840J11613J98399M51893K34474
3404A3580833P39165Q46771O88402M95828O76465J009418N75306O86725J071810
3395B0370723P33051J213240P81016M76793r9407j355949j400982j069911o40840
3386A9007734j148865r30309m27809o81007m78938n20985m9624n34082O3612M9990
$$ plain form
3376 14349717 14366339 14731085 14623262 15026063 15217539 15581215 16073000 16039770 16119260 16044661
3366 16044661 16453842 16414875 16904277 17370391 17922474 18486107 18659793 18645365 18842479 18996892
3356 18996892 19345216 19656691 20299082 20361353 20454839 20974498 21513931 22204801 23032175 23593564
3346 23593564 24352523 24614709 25519303 25582807 25285252 24739586 24140436 23533979 22607862 21899044
3336 21899044 21418747 20692672 20559096 20553336 20617097 20561146 20405260 20863637 21512083 21804453
3326 21804453 22069284 22748462 23576456 24905666 26352492 27201353 27502740 27502902 27530603 27361363
3316 27361363 27051159 26467475 25935825 25454563 24527116 23508122 22857079 21912397 21157572
3307 21157572 20479481 19858790 19300843 18871052 18512912 18194490 18099490 17949403 18085512 18028057
$$ packed form
3376A4349717J6622L64746j07823M02801J91476L63676M91785l3230P9490p4599
3366A6044661M09181l8967M89402M66114N52083N63633J73686j4428J97114J54413
3356A8996892L48324L11475O42391O2271R3486N19659N39433O90870Q27374N61389
3346B3593564P58959K62186R04594O3504k97555n45666n99150o06457r26117p08818
3336B1899044m80297p26075j33576n760O3761n5951j55886M58377O48446K92370
3326B1804453K64831O79178Q27994J329210J446826Q48861L01387J62K7701j69240
3316B7361363l10204n83684n31650m81262r27447j018994o51043r44682p54825
3307B1157572o78091o20691n57947m29791l58140l18422r5000j50087J36109n7455
$$ plain form
3297 18028057 18163486 18584280 19047453 19022012 18822236 19016093 19885509 20368575 21279452 22350873
3287 22350873 23182413 24099579 25323122 26550419 27376470 28070826 28729024 28868106 28935541
3278 28935541 29438406 30479872 31604221 32921978 34355701 36112755 37588176 39673251
3270 39673251 42687835 46642732 51164376 55989532 61486859 67525267 72871221 77656839
3262 77656839 80343400 80165915 76484196 70823067 64246384 57717083 51914819 47085284
3254 47085284 42962198 39448325 36298248 34075654 31924232 29830946 27999105 26870484
3246 26870484 25352483 24005071 23219429 22292470 21379873 20704653 20076315 19482390 18948856
3237 18948856 18896682 18439641 17906421 17671566 17017575 16576981 16082222 15649905 15475457 15085792
$$ packed form
3297A8028057J35429M20794M63173k5441j99776J93857Q69416M83066R10877J071421
3287B2350873Q31540R17166J223543J227297Q26051O94356O58198J39082O7435
3278B8935541N02865J041466J124349J317757J433723J757054J475421K085075
3270C9673251L014584L954897M521644M825156N497327O038408N345954M785618
3262G7656839K686561j77485l681719n661129o576683o529301n802264m829535
3254D7085284m123086l513873l150077k222594k151422k093286j831841j128621
3246B6870484j518001j347412p85642r26959r12597o75220o28338n93925n33534
3237A8948856n2174m57041n33220k34855o53991m40594m94759m32317j74448l89665
$$ plain form
3227 15085792 14527993 14530900 14545385 14208676 13809607 13711580 13281508 13083258 13234751 13223254
3217 13223254 13243319 13030082 12853158 12746025 12527261 12050620 12145949 12483797 12083016 11631580
3207 11631580 11023101 10823079 10605211 10791791 10653605 10231197 9671932 9931125 10069782
3198 10069782 9756057 9615196 9602344 9244634 9139475 9151058 9259345 9101059 8757258 8705073
3188 8705073 8881569 8873338 8540806 8577021 8673882 8751308 8863420 8898055 8572850 8484578 8726126
3177 8726126 8895169 8725423 8546393 8135657 8102696 8294424 8219106 8057787 7722987 7539758
3167 7539758 7388513 7671452 7780546 7447971 7508914 7678209 7645922 7569600 7404780 7467671
3157 7467671 7043145 7007067 7073581 7334939 7299091 7615632 7820629 7451991 7045842 7075049
$$ packed form
3227A5085792n57799K907J4485l36709l99069r8027m30072j98250J51493j1497
3217A3223254K0065k13237j76924j07133k18764m76641R5329L37848m00781m51436
3207A1631580o08479k00022k17868J86580j38186m22408n59265K59193J38657
3198A0069782l13725j40861j2852l57710j05159J1583J08287j58286l43801n2185
3188H705073J76496q231l32532L6215R6861P7426J12112L4635l25205q8272K41548
3177H726126J69043j69746j79030m10736l2961J91728p5318j61319l34800j83229
3167G539758j51245K82939J09094l32575O0943J69295l2287p6322j64820O2891
3157G467671m24526l6078O6514K61358l5848L16541K04997l68638m06149K9207
$$ plain form
3147 7075049 7413021 7276425 7186063 7375255 7345888 7267400 7484153 7783868 7819798 7861533
3137 7861533 7853256 8378684 8337355 8187464 8661158 8650510 8186667 8061109 7818295 7651838
3127 7651838 7743941 7593096 7981569 8109090 8217346 8509162 8614170 9258350 9401239 9722230
3117 9722230 9723465 9320096 9264621 8906719 8736240 8680774 8720560 8752090 8994332 8731057 9060736
3106 9060736 9543501 9605449 9433842 9222575 9184337 9058047 9023368 8765054 8008881 7926011
3096 7926011 7706176 7596838 7644962 7507582 7427003 7557777 7606750 7751053 7654920 7925574
3086 7925574 8067100 8098140 8350201 8237649 8514785 8724802 8926942 8934120 8742137 8730671
3076 8730671 8570287 8604672 8559078 8936895 8577016 8529696 8799339 8936279 9040478 9138053
$$ packed form
3147G075049L37972j36596r0362J89192k9367p8488K16753K99715L5930M1735
3137G861533q277N25428m1329j49891M73694j0648m63843j25558k42814j66457
3127G651838R2103j50845L88473J27521J08256K91816J05008O44180J42889L20991
3117I722230J235m03369n5475l57902j70479n5466L9786L1530K42242k63275L29679
3106I060736M82765O1948j71607k11267l8238j26290l4679k58314p56173q2870
3096G926011k19835j09338M8124j37380q0579J30774M8973J44303r6133K70654
3086G925574J41526L1040K52061j12552K77136K10017K02140P178j91983j1466
3076H730671j60384L4385m5594L77817l59879m7320K69643J36940J04199R7575
$$ plain form
3066 9138053 9368459 9462641 9635859 9527571 9520952 9419640 9816118 10419978 10920561 11377112
3056 11377112 11703784 11887944 12459282 12845419 12807206 12499534 11730154 11844016 12177954 12038116
3046 12038116 12118699 12259189 12430621 12494170 12630399 12833337 12856654 12592649 12567406 12045866
3036 12045866 11708026 11385836 11071235 10781670 10043576 9736222 9721425 9829256 10398667 10452992
3026 10452992 10284459 10433943 10355262 10508061 10418214 10503872 10995544 11216353 11903429 12591427
3016 12591427 12691043 12703591 12795685 12684668 12257215 11840046 11681142 11292833 11317068 11560094
3006 11560094 11685634 12007711 11882697 12002365 12455651 12424182 12143037 11814667 11637985 11396455
2996 11396455 11220380 10900550 10313981 9758755 9923816 9861649 9962682 10502263 10337731 10413704
$$ packed form
3066I138053K30406R4182J73218j08288o619j01312L96478O03860N00583M56551
3056A1377112L26672J84160N71338L86137l8213l07672p69380J13862L33938j39838
3046A2038116Q0583J40490J71432O3549J36229K02938K3317k64005k5243n21540
3036A2045866l37840l22190l14601k89565p38094l07354j4797J07831N69411N4325
3026A0452992j68533J49484p8681J52799q9847Q5658M91672K20809O87076O87998
3016A2591427R9616J2548R2094j11017m27453m17169j58904l88309K4235K43026
3006A1560094J25540L22077j25014J19668M53286l1469k81145l28370j76682k41530
2996A1396455j76075l19830n86569n55226J65061o2167J01033N39581j64532P5973
$$ plain form
2986 10413704 10640465 10757357 10588725 10566400 11022898 11192245 11356583 11604284 11710326 11896192
2976 11896192 11704904 11942585 12075854 12068156 12249709 12346452 12006778 11830731 11170407 10670805
2966 10670805 10700872 10708965 10680307 10524163 10370006 10140783 9991441 9946645 9783711 9965194
2956 9965194 9919630 9835688 10231333 10508401 10391142 10467975 10496116 10752185 11054481 11296713
2946 11296713 11589840 11570694 11954818 12085087 12349436 12929583 13330657 13620023 14108194 14666792
2936 14666792 14987421 15148884 15074485 15340409 15263840 15081608 15536772 15507098 15667772 15489717
2926 15489717 15075511 14541142 14127780 14150629 13761949 13404354 13440597 13224470 13083062 13189489
2916 13189489 13176583 13186264 12954874 12950047 12646253 12804933 13006082 13385819 13457767 13128707
$$ packed form
2986A0413704K26761J16892j68632k2325M56498J69347J64338K47701J06042J85866
2976A1896192j91288K37681J33269p698J81553R6743l39674j76047o60324m99602
2966A0670805L0067Q093k8658j56144j54157k29223j49342m4796j62934J81483
2956I965194m5564q3942L95645K77068j17259P6833K8141K56069L02296K42232
2946A1296713K93127j9146L84124J30269K64349N80147M01074K89366M88171N58598
2936A4666792L20629J61463p4399K65924p6569j82232M55164k9674J60674j78055
2926A5489717m14206n34369m13362K2849l88680l57595L6243k16127j41408J06427
2916A3189489j2906R681k31390m827l03794J58680K01149L79737P1948l29060
$$ plain form
2906 13128707 13226309 12998463 12915788 12932576 13116686 13194126 13363953 13450230 13886705 14004525
2896 14004525 13742555 14054789 14507671 14440007 14864272 15167314 15161658 14886406 14559832 14440484
2886 14440484 14055075 13740601 13862001 13821377 14040654 13702288 13635335 13498797 13731530 14109850
2876 14109850 14280759 14199994 14034545 14509429 14731279 15151531 15459456 15479931 15469203 15777148
2866 15777148 15898449 15801808 15872045 15795995 15545329 15648903 15743896 15275187 15229991 15036766
2856 15036766 15076077 15233258 15243513 15441182 15538001 15576734 15646941 15996616 16047339 15790906
2846 15790906 16408457 16976278 17112365 17193804 17381101 17568137 17928555 18689299 18826913 19013692
2836 19013692 19546163 20478698 21019354 21840319 22751333 23659183 24508358 25461883 26032696
$$ packed form
2906A3128707R7602k27846q2675J6788J84110P7440J69827Q6277M36475J17820
2896A4004525k61970L12234M52882o7664M24265L03042n656k75252l26574j19348
2886A4440484l85409l14474J21400m0624K19277l38366o6953j36538K32733L78320
2876A4109850J70909q0765j65449M74884K21850M20252L07925K0475j0728L07945
2866A5777148J21301r6641P0237p6050k50666J03574R4993m68709m5196j93225
2856A5036766L9311J57181J0255J97669R6819L8733P0207L49675N0723k56433
2846A5790906O17551N67821J36087Q1439J87297J87036L60418P60744J37614J86779
2836A9013692N32471R32535N40656Q20965R11014R07850Q49175R53525N70813
$$ plain form
2827 26032696 26322741 26074240 26317698 26494269 26704305 27155305 27495993 27855816 28484248
2818 28484248 29179188 29655609 30382774 30618239 30677249 31043246 31092487 31235317 31335542 31896532
2808 31896532 32547825 33264136 34243410 35347978 36822716 38247076 39728322 40864063 41354783
2799 41354783 40675321 39253612 37731850 36668820 36032383 35702638 35632290 35711955 35899917
2790 35899917 36018146 36435940 36775655 37070889 37572594 37783972 38075824 38378763 38258440
2781 38258440 37929874 37940216 38130707 38216065 38873054 39411044 39786319 40349512 41095336 41151905
2771 41151905 41344601 41323309 41396598 41684351 41928167 42697146 43927765 44737961 44932929 45004236
2761 45004236 44658649 44249629 43804102 43720691 43455197 43680705 43688650 43787281 44086831 44124835
$$ packed form
2827B6032696K90045k48501K43458J76571K10036M51000L40688L59823O28432
2818B8484248O94940M76421P27165K35465N9010L65997M9241J42830J00225N60990
2808C1896532O51293P16311R79274J104568J474738J424360J481246J135741M90720
2799D1354783o79462j421709j521762j063030o36437l29745p0348P9665J87962
2790C5899917J18229M17794L39715K95234N01705K11378K91852L02939j20323
2781C8258440l28566J0342J90491Q5358O56989N37990L75275N63193P45824N6569
2771D1151905J92696k1292P3289K87753K43816P68979J230619Q10196J94968P1307
2761D5004236l45587m09020m45527q3411k65494K25508P945R8631K99550L8004
$$ plain form
2751 44124835 44254984 44862905 45637574 46278471 46912420 47140820 47180860 47281892 46817626 46372411
2741 46372411 45965722 45643705 45367965 45337887 45626838 45563299 45505273 45876896 45713266 45691759
2731 45691759 45758852 45234105 44367561 43181698 41613957 40104277 38930733 37920660 37418209
2722 37418209 37176330 36952853 37249949 37016743 36683840 36687248 36357477 36110705 35809900 35512678
2712 35512678 35133309 34788396 34411982 33810414 33341894 32364274 31546307 31303174 30664976
2703 30664976 30334105 30381511 30134000 29446114 29084814 28794025 28517354 28192104 27837488 27627496
2693 27627496 26998184 26717200 26158365 25869070 25645888 25037713 24591158 24554763 24358491 24460063
2683 24460063 24602928 24110237 23942346 23850708 23462605 23206621 23107780 22833994 22455365 22186910
$$ packed form
2751D4124835J30149O07921P74669O40897O33949K28400M0040J01032m64266m45215
2741D6372411m06689l22017k75740l0078K88951o3539n8026L71623j63630k1507
2731D5691759O7093n24747q66544j185863j567741j509680j173544j010073n02451
2722C7418209k41879k23477K97096k33206l32903L408l29771k46772l00805k97222
2712C5512678l79369l44913l76414o01568m68520r77620q17967k43133o38198
2703C0664976l30871M7406k47511o87886l61300k90789k76671l25250l54616k09992
2693B7627496o29312k80984n58835k89295k23182o08175m46555l6395j96272J01572
2683B4460063J42865m92691j67891r1638l88103k55984r8841k73786l78629k68455
$$ plain form
2673 22186910 21989543 21919838 21516308 21173698 20926869 21067900 20889768 20640699 20574855 19822364
2663 19822364 19840518 19703843 19769937 19895594 19895259 19790086 19794462 19260147 18902142 18776964 18650276
2652 18650276 18686064 18914454 18985058 18755397 18599066 18548714 18434400 18403046 18085233 17707410
2642 17707410 17775143 18120838 18308894 18424089 18361520 18151317 17998412 17889931 17664173 17393550
2632 17393550 17545319 17781819 17554420 17333760 17238445 17103815 17088713 17048037 17024346 16930438
2622 16930438 17173890 17714613 17676412 17456667 17469129 17433015 17077377 16522720 16433886 16193429
2612 16193429 16174352 16356009 16785998 16744939 16406107 16178862 16118098 16147320 16193137 16240272
2602 16240272 16268488 16500732 16344684 16421525 16518659 16325117 16215227 16059486 16024944 16146357
$$ packed form
2673B2186910j97367o9705m03530l42610k46829J41031j78132k49069o5844p52491
2663A9822364J8154j36675O6094J25657l35j05173M376n34315l58005j25178j26688
2652A8650276L5788K28390P0604k29661j56331n0352j14314l1354l17813l77823
2642A7707410O7733L45695J88056J15195o2569k10203j52905j08481k25758k70623
2632A7393550J51769K36500k27399k20660r5315j34630j5102m0676k3691r3908
2622A6930438K43452N40723l8201k19745J2462l6114l55638n54657q8834k40457
2612A6193429j9077J81657M29989m1059l38832k27245o0764K9222M5817M7135
2602A6240272K8216K32244j56048P6841R7134j93542j09890j55741l4542J21413
$$ plain form
2592 16146357 16032839 15914756 15569163 15702816 15781442 15819598 16039422 16222440 16618224 16777262
2582 16777262 16691710 16757909 16541311 16490046 16686993 16711927 16773728 16671007 16537794 16193511
2572 16193511 16106694 16117425 16254065 15984804 16072791 16557915 16835533 17139957 17157675 16645472
2562 16645472 16741662 16629371 16805181 16714072 16755031 16848813 16608202 16785157 16623750 16572927
2552 16572927 16679213 16829451 16899028 16829181 16691341 16561413 16484197 16218443 16338569 16353946
2542 16353946 15978028 16025002 16045782 15815870 15484221 15559521 15494565 15517917 15585053 15770868
2532 15770868 16043398 15891934 15586799 15468836 15170047 14855740 14947487 15259927 15280100 15384975
2522 15384975 15708725 15689001 15745773 15537917 15437208 15010547 15082953 15099393 15079680 15205239
$$ packed form
2592A6146357j13518j18083l45593J33653P8626L8156K19824J83018L95784J59038
2582A6777262q5552O6199k16598n1265J96947K4934O1801j02721j33213l44283
2572A6193511q6817J0731J36640k69261Q7987M85124K77618L04424J7718n12203
2562A6645472R6190j12291J75810r1109M0959R3782k40611J76955j61407n0823
2552A6572927J06286J50238O9577o9847j37840j29928p7216k65754J20126J5377
2542A6353946l75918M6974K0780k29912l31649P5300o4956K3352O7136J85815
2532A5770868K72530j51464l05135j17963k98789l14307R1747L12440K0173J04875
2522A5384975L23750j9724N6772k07856j00709m26661P2406J6440j9713J25559
$$ plain form
2512 15205239 15130576 14735429 14445637 14430334 14369583 14274628 14376669 14412710 14537910 14811437
2502 14811437 14953945 14901795 14512854 14502155 14339223 14265569 14433525 14398636 14394494 14830850
2492 14830850 14585895 14755352 14788979 14653021 14671382 14910900 15125170 15167186 15279974 15299268
2482 15299268 14852586 15149405 15349380 14912357 15097457 15074412 14676894 14831712 14650918 14301779
2472 14301779 14080358 14162255 14175123 14299922 14579483 14465311 14402915 14381065 14393613 14386891 14539388
2461 14539388 14334816 14324722 14735219 14560796 14290681 14125574 13904310 13850521 13961468 14218021
2451 14218021 14540910 14659362 14824766 14822316 14738708 14672345 14361694 14044218 14054304 14132374
2441 14132374 14219947 14544492 14229710 13883155 13863627 13844886 13761284 14090554 14039338 13860493
$$ packed form
2512A5205239p4663l95147k89792j5303o0751r4955J02041L6041J25200K73527
2502A4811437J42508n2150l88941j0699j62932p3654J67956l4889m142M36356
2492A4830850k44955J69457L3627j35958J8361K39518K14270M2016J12788J9294
2482A5299268m46682K96819J99975m37023J85100k3045l97518J54818j80794l49139
2472A4301779k21421Q1897J2868J24799K79561j14172o2396k1850J2548o722J52497
2461A4539388k04572j0094M10497j74423k70115j65107k21264n3789J10947K56553
2451A4218021L22889J18452J65404k450q3608o6363l10651l17476J0086P8070
2441A4132374Q7573L24545l14782l46555j9528j8741q3602L29270n1216j78845
$$ plain form
2431 13860493 14028709 14279908 14452897 14610661 14715635 14596019 14491988 14597376 14472206
2422 14472206 14608494 15003806 14867147 14871949 14959079 14990233 14988444 15289181 15202114 14787362 15114247
2411 15114247 15278019 15083683 15085177 15157838 15016332 15196084 15001924 14845845 14785351 14983989
2401 14983989 14917280 14672375 14857283 14882336 14897043 15316530 15295609 15391123 15714729 15716447 15684068
2390 15684068 15836618 16197908 16348309 16053371 15959512 15964772 15983282 16165264 16087980 15645457
2380 15645457 15617476 15801744 15755764 15676924 15444571 15435690 15411384 15558173 15619021 15694102 15841201
2369 15841201 15854102 15987016 16046100 15940934 15893970 15694853 15681319 15823918 16179602 16235226
2359 16235226 16230352 16107080 16202266 16173309 16417422 16349748 16148291 16557644 16869703 16785717
$$ packed form
2431A3860493J68216K51199J72989J57764J04974j19616j04031J05388j25170
2422A4472206J36288L95312j36659M802Q7130L1154j789L00737q7067m14752L26885
2411A5114247J63772j94336J494P2661j41506J79752j94160j56079o0494J98638
2401A4983989o6709k44905J84908K5053J4707M19487k0921R5514L23606J718l2379
2390A5684068J52550L61290J50401k94938r3859N260J8510J81982p7284m42523
2380A5645457k7981J84268m5980p8840k32353q881k4306J46789O0848P5081J47099
2369A5841201J2901J32914N9084j05166m6964j99117j3534J42599L55684N5624
2359A6235226m874j23272R5186k8957K44113o7674k01457M09353L12059q3986
$$ plain form
2349 16785717 16886341 16876002 16728575 16940160 17029214 17115417 17056630 16848167 17216810 17702427
2339 17702427 17534061 17376999 17451973 17762368 17710683 18091384 18078169 18071613 18200362 18592488
2329 18592488 18509573 18405871 18493475 18491133 18646063 18685150 18787730 19298949 19540906 19288903
2319 19288903 19435512 19253740 19245114 19563283 19764469 20146683 20787542 20971412 21238523 21212398
2309 21212398 21194249 21344134 21741592 21973263 22183897 22464899 22928791 23118843 23262112 23394411
2299 23394411 23276139 23855429 24409469 24703456 24623235 24716711 25165203 25483710 25631193 25855384
2289 25855384 26237189 26770955 27042010 27181568 27647997 27950141 28400217 28999464 29528614
2280 29528614 29847216 30078405 30338211 30746662 31145854 31541327 32006620 32347315 32943942
$$ packed form
2349A6785717J00624j0339j47427K11585Q9054Q6203n8787k08463L68643M85617
2339A7702427j68366j57062P4974L10395n1685L80701j3215o556J28749L92126
2329A8592488q2915j03702Q7604k342J54930L9087J02580N11219K41957k52003
2319A9288903J46609j81772q626L18169K01186L82214O40859J83870K67111k6125
2309B1212398j8149J49885L97458K31671K10634K81002M63892J90052J43269J32299
2299B3394411j18272N79290N54040K93987q0221R3476M48492L18507J47483K24191
2289B5855384L81805N33766K71055J39558M66429L02144M50076N99247N29150
2280B9528614L18602K31189K59806M08451L99192L95473M65293L40695N96627
$$ plain form
2271 32943942 33648804 34206486 34695698 34887929 35098823 35374538 36126785 36726299 37034387
2262 37034387 37286069 37488485 38191610 38906802 39429109 39815273 40644153 41087970 41500640
2253 41500640 42266800 42978044 43348221 44277978 45209816 45857461 46484742 46986358 47389675
2244 47389675 47848790 48288544 49017634 50363206 51284795 51940320 52588101 53432081 54333797
2235 54333797 55421087 56239851 57086500 58420705 59907266 60671250 61329845 62154285 63444333
2226 63444333 64897866 66255998 67481995 68824403 70223003 71789150 72740016 73947279
2218 73947279 75536614 76736035 78338769 79999296 81548815 83000818 84656725 86349886
2210 86349886 87779152 89625204 91920470 93729840 95700078 97736494 99827831 101854181
$$ packed form
2271C2943942P04862N57682M89212J92231K10894K75715P52247N99514L08088
2262C7034387K51682K02416P03125P15192N22307L86164Q28880M43817M12670
2253D1500640P66160P11244L70177R29757R31838O47645O27281N01616M03317
2244D7389675M59115M39754P29090J345572R21589O55525O47781Q43980R01716
2235E4333797J087290Q18764Q46649J334205J486561P63984O58595Q24440J290048
2226F3444333J453533J358132J225997J342408J398600J566147R50866J207263
2218G3947279J589335J199421J602734J660527J549519J452003J655907J693161
2210H6349886J429266J846052K295266J809370J970238K036416K091337K026350
$$ plain form
2202 101854181 104301737 106732581 109220154 111995242 114863110 117975049 121008439 124030932
2194 124030932 127259418 130877486 134348441 137793414 141821675 146321861 151087151 156459336
2186 156459336 162349285 168403078 175483750 183038246 190574722 198893146 207810227 217662962
2178 217662962 228701696 240638309 253185217 266724978 281196392 296361879 311946104
2171 311946104 327811663 343384221 357822262 370693804 380261794 385703021 386609339 382371609
2163 382371609 373359571 360372882 344995788 328537242 312656779 297797465 283506780
2156 283506780 270931607 259645583 249379638 240042968 231659954 223773203 217023617 210923802
2148 210923802 204999144 199482713 194330543 190005829 185845015 181915113 178732731 175641739
$$ packed form
2202A01854181K447556K430844K487573K775088K867868L111939L033390L022493
2194A24030932L228486L618068L470955L444973M028261M500186M765290N372185
2186A56459336N889949O053793P080672P554496P536476Q318424Q917081R852735
2178B17662962J1038734J1936613J2546908J3539761J4471414J5165487J5584225
2171C11946104J5865559J5572558J4438041J2871542R567990N441227R06318m237730
2163C82371609r012038j2986689j5377094j6458546j5880463j4859314j4290685
2156B83506780j2575173j1286024j0265945r336670q383014p886751o749586o099815
2148B10923802n924658n516431n152170m324714m160814l929902l182382l090992
$$ plain form
2140 175641739 172823014 170380226 167669205 165380148 163087556 160515879 158386716 156240748
2132 156240748 153644615 151699560 149601605 146907179 144790486 142478692 139925841 136965614
2124 136965614 134325708 131284064 128216311 125757906 122731357 119724504 117094446 114479828
2116 114479828 112181949 110173365 107837496 105149837 102745988 100734689 98761340 96886418
2108 96886418 95243679 93533811 91816169 90214907 88275391 86714123 85375647 83878564
2100 83878564 82625265 81639737 80608087 79298842 77925505 76864784 75644629 74399219
2092 74399219 73548233 72276175 71054268 70427358 69473752 68384650 67548622 66890479 66298587
2083 66298587 66037431 65148981 63941410 63039188 62311175 61852896 61182661 60712881 60056561
$$ packed form
2140A75641739k818725k442788k711021k289057k292592k571677k129163k145968
2132A56240748k596133j945055k097955k694426k116693k311794k552851k960227
2124A36965614k639906l041644l067753k458405l026549l006853k630058k614618
2116A14479828k297879k008584k335869k687659k403849k011299j973349j874922
2108I6886418j642739j709868j717642j601262j939516j561268j338476j497083
2100H3878564j253299r85528j031650j309245j373337j060721j220155j245410
2092G4399219q50986j272058j221907o26910r53606j089102q36028o58143n91892
2083F6298587k61156q88450j207571r02222p28013m58279o70235m69780o56320
$$ plain form
2074 60056561 59120343 58653325 58314302 57915258 57133161 56334369 56005408 55797690 55188273
2065 55188273 54245877 53799002 53427680 53083251 52755099 52702853 52228824 51626197 51231608 50850940
2055 50850940 50702392 50295793 49406448 49213669 48963001 48450367 47996985 47268153 46794735
2046 46794735 46486990 46533996 46379629 45877497 45413354 45552286 45082226 44506025 44098655 43615335
2036 43615335 43390454 43196692 42949400 42750738 42080584 41850816 41715150 41365939 41000979
2027 41000979 40931511 41266385 41005600 40525088 40642484 40521157 40337312 40266156 40119355 39925700
2017 39925700 39660216 39351986 39207980 38992913 39017326 38744652 38380129 38240615 38139225 38236703
2007 38236703 38477509 38134600 37701256 37716367 37446998 37175672 37237240 37263791 36799786 36854186
$$ packed form
2074F0056561r36218m67018l39023l99044p82097p98792l28961k07718o09417
2065E5188273r42396m46875l71322l44429l28152n2246m74029o02627l94589l80668
2055E0850940j48548m06599q89345j92779k50668n12634m53382p28832m73418
2046D6794735l07745M7006j54367n02132m64143J38932m70060n76201m07370m83320
2036D3615335k24881j93762k47292j98662o70154k29768j35666l49211l64960
2027D1000979o9468L34874k60785m80512J17396j21327j83845p1156j46801j93655
2017C9925700k65484l08230j44006k15067K4413k72674l64523j39514j01390R7478
2007C8236703K40806l42909m33344J5111k69369k71326O1568K6551m64005N4400
$$ plain form
1997 36854186 36951225 36501988 36446015 36221251 35832070 35956091 35966675 35970020 35703048 35595184
1987 35595184 35238584 35027667 34910648 34132767 33917458 34100099 34332267 34109452 34072493 33510739
1977 33510739 32734179 32324136 32318260 32472209 32218786 32276706 32182068 32124446 32000435 32008202 31976370
1966 31976370 31765848 31462431 31584160 31190140 30785651 30696007 30526459 30960912 30583071 30493806
1956 30493806 30795611 30296251 30216708 30192670 29915887 29542956 29279000 29248310 29189157 28933334
1946 28933334 28540809 28023741 28096999 27799425 27924684 28026193 27359539 27174335 27241989 27193837
1936 27193837 27319076 27456644 27610757 27325275 27225296 27280101 27066729 27060709 27267456 27127354
1926 27127354 27533219 27732361 27472757 27499538 27723311 27799322 28356073 28837281 29045841 29288260
$$ packed form
1997C6854186R7039m49237n5973k24764l89181J24021J0584L345k66972j07864
1987C5595184l56600k10917j17019p77881k15309J82641K32168k22815l6959n61754
1977C3510739p76560m10043n876J53949k53423N7920r4638n7622j24011P767l1832
1966C1976370k10522l03417J21729l94020m04489q9644j69548M34453l77841q9265
1956C0493806L01805m99360p9543k4038k76783l72931k63956l0690n9153k55823
1946B8933334l92525n17068P3258k97574J25259J01509o66654j85204O7654m8152
1936B7193837J25239J37568J54113k85482r9979N4805k13372o020K06747j40102
1926B7127354M05865J99142k59604K6781K23773P6011N56751M81208K08560K42419
$$ plain form
1916 29288260 29713256 30001129 30044041 30448958 31235720 31986271 32676514 33106520 33436063 34035694
1906 34035694 34453926 34782981 34850377 34911946 34960945 35128924 35201504 34910008 34480316 34686286
1896 34686286 34791809 34597819 34778489 34750206 34527284 33952281 33949635 33998319 34271209 34687979
1886 34687979 35171573 35773323 36501601 37432918 37961731 38506928 39063005 40190266 41424739
1877 41424739 42307313 42946350 43704022 44985857 46496000 48226408 50114573 51351222 52521178
1868 52521178 53468980 54099666 54305963 54288714 53975405 53724163 53202902 53114105 52694672 51951871
1858 51951871 51661253 51609764 51255401 50724612 50594025 50448011 50174134 50582652 50713362 51077629
1848 51077629 51809979 52824074 54300908 55669206 57215947 58667283 60174636 61868953
$$ packed form
1916B9288260M24996K87873M2912M04917P86762P50551O90243M30006L29543N99631
1906C4035694M18232L29055O7396O1569M8999J67979P2580k91496m29692K05970
1896C4686286J05523j93990J80670k8283k22922n75003k646M8684K72890M16770
1886C4687979M83594O01750P28278R31317N28813N45197N56077J127261J234473
1877D1424739Q82574O39037P57672J281835J510143J730408J888165J236649J169956
1868E2521178R47802O30686K06297j7249l13309k51242n21261q8797m19433p42801
1858E1951871k90618n1489l54363n30789j30587j46014k73877M08518J30710L64267
1848E1077629P32350J014095J476834J368298J546741J451336J507353J694317
$$ plain form
1840 61868953 63639955 65204736 67339447 69494985 71604307 74187007 76070500 77922317
1832 77922317 79402442 80856154 81970749 82587716 83033770 83237612 83443734 83667856 84046048
1823 84046048 84516397 84600360 84848533 85471943 85922366 86602845 87970484 89471367 91691820
1814 91691820 93448165 95875366 99133965 102068040 105653932 109660943 113800075 118020369
1806 118020369 122577832 126666784 129699246 132037309 132869458 132315039 130418234 127496146
1798 127496146 123543088 119372042 115111412 111495795 108644329 107037074 105971788 105422459
1790 105422459 105812739 106446880 107475174 109057291 111084043 113270090 116010864 118891552
1782 118891552 122158919 125214848 128404740 131511117 134560429 137601419 140353695 142276386
$$ packed form
1840F1868953J771002J564781K134711K155538K109322K582700J883493J851817
1832G7922317J480125J453712J114595O16967M46054K03842K06122K24122L78192
1823H4046048M70349Q3963K48173O23410M50423O80479J367639J500883K220453
1814I1691820J756345K427201L258599K934075L585892M007011M139132M220294
1806A18020369M557463M088952L032462K338063Q32149n54419j896805k922088
1798A27496146l953058m171046m260630l615617k851466j607255j065286n49329
1790A05422459L90280O34141J028294J582117K026752K186047K740774K880688
1782A18891552L267367L055929L189892L106377L049312L040990K752276J922691
$$ plain form
1774 142276386 143433582 143000143 141568835 139257492 136687611 133200963 129439268 125031776
1766 125031776 120230648 115304536 111309581 107489595 104206061 101915635 100176080 98960964
1758 98960964 98236856 97546517 97369601 97320666 97849648 98587193 99254769 99523732 99577756 99382172
1748 99382172 98814950 97672245 96348555 94650581 92614636 90134446 86916914 83541382
1740 83541382 79786690 75822987 72359014 69231234 66343599 63923784 61468561 59272650
1732 59272650 57254732 55661522 53979527 52325759 50953686 49615432 48520235 47574433
1724 47574433 46433100 45434294 44570877 44096607 43498041 42753129 41925379 41309100 40327474
1715 40327474 39404406 38451081 37242283 36050027 35118821 34326703 33405092 32624302 32056170
$$ packed form
1774A42276386J157196m33439j431308k311343k569881l486648l761695m407492
1766A25031776m801128m926112l994955l819986l283534k290426j739555j215116
1758I8960964p24108o90339j76916m8935N28982P37545O67576K68963N4024j95584
1748I9382172n67222j142705j323690j697974k035945k480190l217532l375532
1740H3541382l754692l963703l463973l127780k887635k419815k455223k195911
1732E9272650k017918j593210j681995j653768j372073j338254j095197r45802
1724D7574433j141333r98806q63417m74270n98566p44912q27750o16279r81626
1715D0327474r23068r53325j208798j192256r31206p92118r21611p80790n68132
$$ plain form
1706 32056170 31430949 30702759 29886510 29300584 28650598 28245720 27673302 27140665 26650123
1697 26650123 26185396 25409590 24778264 24094121 23494695 23434794 23143766 23095331 23110949 22981698
1687 22981698 22422309 22132739 21896994 21535816 21240197 21017186 20733782 20564933 20730831
1678 20730831 20254515 19817225 19411520 19073320 18829932 18667708 18608996 18321938 17912814 17714037
1668 17714037 17249790 16994094 17181615 16959290 16630121 16391917 16161888 15904898 15618294
1659 15618294 15787922 15728902 15382537 15128889 15154868 15045725 14980819 15035171 14791477 14400833
1649 14400833 14270068 14203146 14132249 14218838 14223335 14067786 13868631 13412921 13042104 12722027
1639 12722027 12505776 12206560 12086062 11939668 11891418 11794580 11733887 11714226 11466718 11327233
$$ packed form
1706C2056170o25221p28190q16249n85926o49986m04878n72418n32637m90542
1697B6650123m64727p75806o31326o84143n99426n9901k91028m8435J5618j29251
1687B2981698n59389k89570k35745l61178k95619k23011k83404j68849J65898
1678B0730831m76316m37290m05705l38200k43388j62224n8712k87058m09124j98777
1668A7714037m64247k55696J87521k22325l29169k38204k30029k56990k86604
1659A5618294J69628n9020l46365k53648K5979j09143o4906N4352k43694l90644
1649A4400833j30765o6922p0897Q6589M497j55549j99155m55710l70817l20077
1639A2722027k16251k99216j20498j46394m8250r6838o0693j9661k47508j39485
$$ plain form
1629 11327233 11030255 10802640 10877346 10884100 10619096 10623058 10356196 10464712 10375625 10063582
1619 10063582 9787752 9702710 9828868 9849922 9762501 9616000 9316911 9387910 9176353 9079066
1609 9079066 8852675 8654897 8625000 8941302 9224274 9194484 9045563 8586928 8580593 8423672
1599 8423672 8335488 8305895 8619611 8916474 8813567 8502517 7967075 7814721 8062311 8035357
1589 8035357 7967826 8183840 8091593 7930164 7906905 7829766 7813283 7563599 7725226 7735241 7743286
1578 7743286 7835079 7667881 7620176 7468089 7512962 7666314 7699995 7531790 7458806 7513331 7520032
1567 7520032 7301387 7429046 7714250 7687180 7761401 7978024 7756642 7455886 7533337 7769409
1557 7769409 7412756 7298664 7680121 7477441 7446807 7358199 6944657 6966337 7194524 7781288
$$ packed form
1629A1327233k96978k27615P4706O754k65004L962k66862J08516q9087l12043
1619A0063582k75830q5042J26158K1054q7421j46501k99089P0999k11557r7287
1609I079066k26391j97778k9897L16302K82972k9790j48921m58635o335j56921
1599H423672q8184k9593L13716K96863j02907l11050n35442j52354K47590k6954
1589H035357o7531K16014r2247j61429k3259p7139j6483k49684J61627J0015Q045
1578G743286R1793j67198m7705j52087M4873J53352L3681j68205p2984N4525O701
1567G520032k18645J27659K85204k7070P4221K16623k21382l00756P7451K36072
1557G769409l56653j14092L81457k02680l0634q8608m13542K1680K28187N86764
$$ plain form
1547 7781288 8138523 8092172 8054481 7955619 7840582 7486506 7518952 7460029 7387078 7480942 7835614
1536 7835614 7660903 7774957 8147542 8307546 8636795 8693107 8584724 8620092 9094263 9090826
1526 9090826 9138844 9226775 9004271 8618681 8538944 8529339 8495573 8782050 8815412 8954402 9136494
1515 9136494 9293217 9124413 9237905 9824724 9916868 10263417 10729064 10984407 11106904 11308059
1505 11308059 11128977 11127561 11374868 11458445 11536603 11634485 11908904 11821227 11992763 12532277
1495 12532277 12528766 12805160 12978299 12739104 12825235 12452938 12016875 12089534 12269100 12400266
1485 12400266 12033085 12144283 12108902 11684438 11861812 12018651 12059753 12115245 12382264 12710293
1475 12710293 12993886 13238346 13212034 13113528 13191110 13456245 13683299 14418797 14789551 14729667
$$ packed form
1547G781288L57235m6351l7691r8862j15037l54076L2446n8923p2951R3864L54672
1536G835614j74711J14054L72585J60004L29249N6312j08383L5368M74171l437
1526I090826M8018Q7931k22504l85590p9737r605l3766K86477L3362J38990J82092
1515I136494J56723j68804J13492N86819R2144L46549M65647K55343J22497K01155
1505A1308059j79082j416K47307Q3577P8158R7882K74419q7677J71536N39514
1495A2532277l511K76394J73139k39195Q6131l72297m36063P2659J79566J31166
1485A2400266l67181J11198l5381m24464J77374J56839M1102N5492K67019L28029
1475A2710293K83593K44460k6312r8506P7582K65135K27054P35498L70754n9884
$$ plain form
1465 14729667 14888267 14739601 14395323 14168081 13932086 13888391 13634608 13436208 13298121 12834894
1455 12834894 12979264 12714441 12403975 12124872 11593714 11697611 11886660 11952841 12186090 11907295
1445 11907295 12076293 11979909 11668652 11405652 10989030 10886293 10791375 10791453 11094101 11168377 10851026
1434 10851026 10758599 10599923 10803415 11097064 11499820 11864972 11778216 11893960 11318901 11022383
1424 11022383 10667551 10039390 9941223 10110784 9619846 9016544 8707127 8219607 8193378 8295996
1414 8295996 7989810 7656757 7806371 7840874 7471217 7672489 7851372 7449400 7433649 7464301
1404 7464301 7191108 6929404 6674506 6257917 6344036 6438943 6415121 6139538 6063623 5876239
1394 5876239 5796137 5978591 5711253 5822599 6068072 6181407 6101540 5821720 5560213 5281053
$$ packed form
1465A4729667J58600j48666l44278k27242k35995m3695k53783j98400j38087m63227
1455A2834894J44370k64823l10466k79103n31158J03897J89049O6181K33249k78795
1445A1907295J68998r6384l11257k63000m16622j02737r4918P8L02648P4276l17351
1434A0851026r2427j58676K03492K93649M02756L65152q6756J15744n75059k96518
1424A1022383l54832o28161r8167J69561m90938o03302l09417m87520k6229J02618
1414H295996l06186l33053J49614L4503l69657K01272J78883m01972j5751L0652
1404G464301k73193k61704k54898m16589Q6119R4907k3822k75583p5915j87384
1394E876239q0102J82454k67338J11346K45473J13335p9867k79820k61507k79160
$$ plain form
1384 5281053 5144880 4977727 5191682 4882912 4530608 4353595 4345529 4433303 4286927 4263458
1374 4263458 4191468 4358193 4469716 4427741 4316383 4064240 3676731 3772356 4021825 3930661
1364 3930661 3796486 3707560 3656200 3572881 3593475 3556018 3643007 3653146 3529760 3341970 3072427
1353 3072427 2965760 2815439 3225302 3195751 2971678 3045099 2934516 2958722 2943569 2970285
1343 2970285 2982230 2919315 2928080 3138524 3114617 2908809 2708251 2579707 2780110 3054350
1333 3054350 2765359 2500625 2255664 2244337 2460690 2582876 2583178 2309201 2587179 2597796
1323 2597796 2545565 2502597 2271779 2246018 2493540 2621182 2604740 2538161 2303605 2030352
1313 2030352 2412665 2610779 2639555 2461954 2396176 2371586 2181889 2292789 2195297 2519583
$$ packed form
1384E281053j36173j67153K13955l08770l52304j77013q066Q7774j46376k3469
1374D263458p1990J66725J11523m1975j11358k52143l87509R5625K49469r1164
1364C930661j34175q8926n1360q3319K0594l7457Q6989J0139j23386j87790k69543
1353C072427j06667j50321M09863k9551k24073P3421j10583K4206j5153K6716
1343B970285J1945o2915Q765K10444k3907k05808k00558j28544K00403K74240
1333C054350k88991k64734k44961j1327K16353J22186L02k73977K77978J0617
1323B597796n2231m2968k30818k5761K47522J27642j6442o6579k34556k73253
1313B030352L82313J98114K8776j77601o5778k4590j89697J10900r7492L24286
$$ plain form
1303 2519583 2536039 2089068 2032877 1808254 1574815 1524987 1836394 2008080 1999765 1906759 1707933
1292 1707933 1709179 1909704 1771485 1558201 1451829 1650118 1833051 1992585 2011279 1521183
1282 1521183 1349043 1487186 1712364 1720457 2048852 2165098 2403546 2319068 1948400 1595009
1272 1595009 1734703 1844041 1694703 1620805 1681011 1506977 1450598 1794084 1752579 1727624
1262 1727624 1740963 1469918 1433601 1856444 1788318 1518497 1727116 1936634 2018486 1950372
1252 1950372 1711199 1360095 1614527 1611972 1709549 2173749 2191890 2026276 1947454 1886395 1862206
1241 1862206 1938627 2020510 2167240 2211675 2201402 2326039 2234578 2262937 2188265 2165108 2286526
1230 2286526 2105659 1854590 1569524 1733225 1772437 1665363 1656685 1378824 1573702 1694220
$$ packed form
1303B519583J6456m46971n6191k24623k33439m9828L11407J71686q315r3006j98826
1292A707933J246K00525j38219k13284j06372J98289J82933J59534J8694m90096
1282A521183j72140J38143K25178Q093L28395J16246K38448q4478l70668l53391
1272A595009J39694J09338j49338p3898O0206j74034n6379L43486m1505k4955
1262A727624J3339k71045l6317M22843o8126k69821K08619K09518Q1852o8114
1252A950372k39173l51104K54432k555R7577M64200J8141j65614p8822o1059k4189
1241A862206P6421Q1883J46730M4435j0273J24637r1461K8359p4672k3157J21418
1230B286526j80867k51069k85066J63701L9212j07074q678k77861J94878J20518
$$ plain form
1220 1694220 1634087 1371123 1302076 1305213 1171573 1249118 1143381 1192278 1310306 1394894 1287346
1209 1287346 1454696 1466887 1457196 1757105 1775183 1457233 1352416 1520150 1424956 1683798
1199 1683798 1946341 1605641 1383647 1582210 1275463 1440880 1716163 1407457 1325443 1542073
1189 1542073 1644021 1444825 1578237 1583767 1448667 1545665 1535634 1282328 1463953 1530054
1179 1530054 1677777 1583922 1759237 1598800 1723405 1684887 1701013 1570901 1428447 1340948
1169 1340948 1298906 1672300 1783238 1932633 1392310 886839 1004135 1204923 1627047 1795244
1159 1795244 1641210 1794383 1762261 1506803 1533799 1543639 1034830 886769 1252237 1285146
1149 1285146 1523711 1929410 1728567 1469108 1127337 724750 858853 1187448 1408614 1739982
$$ packed form
1220A694220o0133k62964o9047L137j33640P7545j05737M8897J18028Q4588j07548
1209A287346J67350J2191r691K99909J8078l17950j04817J67734r5194K58842
1199A683798K62543l40700k21994J98563l06747J65417K75283l08706q2014K16630
1189A542073J01948j99196J33412N530j35100R6998j0031k53306J81625O6101
1179A530054J47723r3855J75315j60437J24605l8518J6126j30112j42454q7499
1169A340948m2042L73394J10938J49395n40323n05471J17296K00788M22124J68197
1159A795244j54034J53173l2122k55458K6996R840n08809j48061L65468L2909
1149A285146K38565M05699k00843k59459l41771m02587J34103L28595K21166L31368
$$ plain form
1139 1739982 1791919 1911933 1749004 1508996 1305214 1010004 1278649 1371998 1542487 1604869
1129 1604869 1459098 1341039 1405690 1114937 995476 1435545 1459323 1559400 1730748 1683942
1119 1683942 1311645 1217459 1617063 1765792 1692658 1727867 1642803 1629311 1540150 1247521 1398497
1108 1398497 1597974 1794765 1966048 1861812 2149936 2158292 2003598 1913411 1893984 2252719
1098 2252719 2689354 2749365 2636892 2620585 2596874 2283644 2196392 1989007 1735257 2099546
1088 2099546 2262705 2307748 2208788 2178942 1986014 1638338 1622816 1842811 1865240 2035679
1078 2035679 2203147 2171448 2625919 2432780 2274279 2384692 2426096 2091831 1976259 2100296
1068 2100296 1919725 1941067 1977280 2158811 2173623 2083212 2085308 2210777 2193115 2397886 2691353
$$ packed form
1139A739982N1937J20014j62929k40008k03782k95210K68645R3349J70489O2382
1129A604869j45771j18059O4651k90753j19461M40069K3778J00077J71348m6806
1119A683942l72297r4186L99604J48729p3134L5209q5064j3492q9161k92629J50976
1108A398497J99477J96791J71283j04236K88124Q356j54694r0187j9427L58735
1098B252719M36635O0011j12473j6307k3711l13230q7252k07385k53750L64289
1088B099546J63159M5043r8960k9846j92928l47676j5522K19995K2429J70439
1078B035679J67468l1699M54471j93139j58501J10413M1404l34265j15572J24037
1068B100296j80571K1342L6213J81531J4812r0411K096J25469j7662K04771K93467
$$ plain form
1057 2691353 2700546 2828491 2746020 2512601 2371509 2061465 2026506 2367542 2433024 2286254
1047 2286254 2393156 2448106 2318763 2233950 2011722 2225035 2685671 2729244 2560623 2594000
1037 2594000 2823073 2637580 2583323 2696347 2550257 2426284 2475829 2876085 3033388 2613648
1027 2613648 2587357 2261469 2423579 2595627 2650837 2903496 2878830 3272447 3178723 3297692
1017 3297692 3295833 3266583 3085966 3306971 3348552 3235756 3324978 3300334 3282181 3650900 3842066
1006 3842066 3699770 3986957 4244077 4109073 4415670 4356364 3980767 4143700 4173530 4463306
996 4463306 4808587 4982532 4863828 4782988 4847016 5218870 5629965 5948188 6488304 7111391
986 7111391 7543460 7955521 8090984 8100508 8518470 8916705 9458317 10124992 10338354 10894559
$$ packed form
1057B691353R193J27945q2471k33419j41092l10044l4959L41036O5482j46770
1047B286254J06902N4950j29343q4813k22228K13313M60636M3573j68621L3377
1037B594000K29073j85493n4257J13024j46090j23973M9545M00256J57303m19740
1027B613648k6291l25888J62110J72048N5210K52659k4666L93617r3724J18969
1017C297692j859k9250j80617K21005M1581j12796Q9222k4644j8153L68719J91166
1006C842066j42296K87187K57120j35004L06597n9306l75597J62933K9830K89776
996D463306L45281J73945j18704q0840O4028L71854M11095L18223N40116O23087
986G111391M32069M12061J35463R524M17962L98235N41612O66675K13362N56205
$$ plain form
976 10894559 11256818 11846808 12303418 12980183 13958820 15095538 16564840 18172625 19993571
967 19993571 21119839 22112313 23371101 25074252 27069412 29864660 33502904 38192292
959 38192292 43601614 51398408 62245951 74717208 87824749 103479757 119709995 129379928
951 129379928 124811920 104859252 81685406 63890917 51599219 42839059 36471116 31432902
943 31432902 27658795 25242747 23105840 21286452 20348891 19372767 18255253 17547433 16820891
934 16820891 15490980 14421500 13690983 12946317 12067954 11316622 10578697 10015193 9590038
925 9590038 9110104 8946328 8884223 8733832 8672184 8320821 7959495 7450506 7074465 7070629
915 7070629 6909461 6737758 6615616 6410568 6461042 6179909 5717158 5471996 5285858 5431807
$$ packed form
976A0894559L62259N89990M56610O76765R78637J136718J469302J607785J820946
967A9993571J126268R92474J258788J703151J995160K795248L638244M689388
959C8192292N409322P796794J0847543J2471257J3107541J5655008J6230238R669933
951A29379928m568008j9952668k3173846j7794489j2291698q760160o367943n038214
943C1432902l774107k416048k136907j819388r37561r76124j117514p07820p26542
934A6820891j329911j069480p30517p44666q78363p51332p37925n63504m25155
925I590038m79934j63776o2105j50391o1648l51363l61326n08989l76041l836
915G070629j61168j71703j22142k05048N0474k81133m62751k45162j86138J45949
$$ plain form
905 5431807 5090417 4678546 4823064 4507812 4336364 4420679 4281722 4031257 3639675 3343086
895 3343086 3031315 3333342 3286366 3143782 3040311 3220653 3557610 3639002 3345309 2989441
885 2989441 2794405 2932709 2818886 2595955 2291501 2271194 2497816 2370457 2132521 2080655
875 2080655 2011926 1700976 2042746 2450776 2256385 2370405 2416361 1902563 1965036 1673160
865 1673160 1518608 1589232 1679107 1632192 1833063 2160826 2203388 2111084 1677527 1360613 1127539
854 1127539 1374743 1377007 1285122 1725983 1623668 1531385 1234572 1441656 1310723 987842
844 987842 1008981 1513328 1512008 1724216 1859478 1620555 1705622 1522395 1283652 1064128 1241345
833 1241345 1139023 1552060 1835301 1782725 1727533 1604266 1137502 944177 1352654 1134539
$$ packed form
905E431807l41390m11871J44518l15252j71448Q4315j38957k50465l91582k96589
895C343086l11771L02027m6976j42584j03471J80342L36957Q1392k93693l55868
885B989441j95036J38304j13823k22931l04454k0307K26622j27359k37936n1866
875B080655o8729l10950L41770M08030j94391J14020M5956n13798O2473k91876
865A673160j54552P0624Q9875m6915K00871L27763M2562r2304m33557l16914k33074
854A127539K47204K264r1885M40861j02315r2283k96813K07084j30933l22881
844I87842K1139N04347j320K12208J35262k38923Q5067j83227k38743k19524J77217
833A241345j02322M13037K83241n2576n5192j23267m66764j93325M08477k18115
$$ plain form
823 1134539 1117273 1436139 1468170 1576476 1396201 1336137 1107428 1024214 1010505 1008555 1201755
812 1201755 1277673 902972 1226176 991910 811307 808045 807008 1025347 850226 954887 1165145
801 1165145 997515 727850 418272 614008 958448 1000956 1009918 857703 751641 1033508
791 1033508 926682 684218 684034 745057 726355 705433 616209 536667 409329 304890 372545
780 372545 580771 524075 338341 318666 510506 502718 473653 469653 418184 534977 640609
769 640609 653921 387801 490464 614345 358523 8900 10010 142858 244589 379395
759 379395 595844 666845 309037 315958 463879 469590 449599 326235 508130 496071 482943
748 482943 373814 341425 308847 -38856 143301 313913 166401 560497 525232 295288
$$ packed form
823A134539j7266L18866L2031J08306j80275o0064k28709q3214j3709j950J93200
812A201755P5918l74701L23204k34266j80603l262j037K18339j75121J04661K10258
801A165145j67630k69665l09578J95736L44440M2508Q962j52215j06062K81867
791A033508j06826k42464j84O1023j8702k0922q9224p9542j27338j04439O7655
780C72545K08226n6696j85734j9675J91840p788k9065m000n1469J16793J05632
769F40609J3312k66120J02663J23881k55822l49623J110J32848J01731J34806
759C79395K16449P1001l57808O921J47921N711j9991j23364J81895j2059j3128
748D82943j09129l2389l2578l47703J82157J70612j47512L94096l5265k29944
$$ plain form
738 295288 516988 683039 882124 975382 780704 520983 298136 206965 24229 -63373
728 -63373 259131 540240 487319 715049 751373 726798 446468 381650 383033 176275 515868
717 515868 659748 452460 592419 634458 475064 5062 93269 323452 289825 465397
707 465397 697486 536222 390054 126907 58908 315288 127189 -174396 -90562 -347360
697 -347360 26279 398643 457739 396486 291003 227344 -1537 -78165 -134256 -105026 -71128
686 -71128 -28388 92613 664036 349915 -48848 -182415 -521814 -330793 14569 211944
676 211944 273772 791722 725446 479859 315276 334667 209827 556393 711771 573781
666 573781 988850 1037134 962001 748935 510826 565767 555489 618240 593675 523822 345106
$$ packed form
738B95288K21700J66051J99085R3258j94678k59721k22847r1171j82736q7602
728f3373L22504K81109n2921K27730L6324k4575k80330o4818J383k06758L39593
717E15868J43880k07288J39959M2039j59394m70002Q8207K30183l3627J75572
707D65397K32089j61264j46168k63147o7999K56380j88099l01585Q3834k56798
697c47360L73639L72364N9096o1253j05483o3659k28881p6628n6091K9230L3898
686g1128M2740J21001N71423l14121l98763j33567l39399J91021L45362J97375
676B11944O1828N17950o6276k45587j64583J9391j24840L46566J55378j37990
666E73781M15069M8284p5133k13066k38109N4941j0278O2751k4565o9853j78716
$$ plain form
655 345106 316288 614770 455650 569723 928087 888837 533414 588669 -20802 -57661 184996
644 184996 276570 488540 692257 756256 834234 573617 442600 360224 275300 159369 21147
633 21147 250010 152242 11258 202886 96864 -21973 80490 134800 80089 70491 140674
622 140674 489027 596941 783620 623546 254487 161736 -49099 87399 -41642 -36264
612 -36264 20793 68477 -75001 -129624 -96120 -236843 -122559 -24402 164566 269121 246676
601 246676 44970 -22307 -43866 118869 425850 218019 45660 86296 28403 220129 371450
590 371450 384070 256543 459377 515531 430806 201126 165121 160857 322604 428222 550679
579 550679 420394 189323 15495 112672 54443 -22467 77946 386998 557938 526279 627072
$$ packed form
655C45106k8818K98482j59120J14073L58364l9250l55423N5255o09471l6859K42657
644A84996R1574K11970K03717O3999P7978k60617j31017q2376q4924j15931j38222
633B1147K28863r7768j40984J91628j06022j18837J02463N4310n4711r598P0183
622A40674L48353J07914J86679j60074l69059r2751k10835J36498j29041N378
612c6264N7057M7684j43478n4623L3504j40723J14284R8157J88968J04555k2445
601B46676k01706o7277k1559J62735L06981k07831j72359M0636n7893J91726J51321
590C71450J2620j27527K02834N6154q4725k29680l6005m264J61747J05618J22457
579E50679j30285k31071j73828R7177n8229p6910J00413L09052J70940l1659J00793
$$ plain form
568 627072 567605 329048 444001 318113 305019 452000 244624 199486 66011 162634 360882
557 360882 381817 486943 646720 368365 163217 131660 426655 337552 218737 303028 157245
546 157245 242340 287221 54869 -132008 -140540 302407 333311 -22057 -217797 -120932 -195531
535 -195531 -51599 56735 83108 -22510 -129012 -90484 -536677 -736085 -535562 -136471
525 -136471 160628 173161 102470 -266837 -64447 -320996 -528916 -312302 -240630 -24901
515 -24901 27628 -270924 -210085 -653588 -697406 -742388 -366482 -217560 -188794 -111431 -183270
504 -183270 -309172 -359630 -373511 -20850 -61415 1431 -126218 -165152 -100581 -357870 -278267
493 -278267 -449633 -363210 -249782 -336546 -229590 -250467 -241657 -4353 -110711 198579 -37243
$$ packed form
568F27072n9467k38557J14953j25888j3094J46981k07376m5138j33475R6623J98248
557C60882K0935J05126J59777k78355k05148l1557K94995q9103j18815Q4291j45783
546A57245Q5095M4881k32352j86877q532M42947L0904l55368j95740R6865p4599
535a95531J43932J08334K6373j05618j06502L8528m46193j99408K00523L99091
525a36471K97099J2533p0691l69307K02390k56549k07920K16614P1672K15729
515b4901N2529k98552O0839m43503m3818m4982L75906J48922K8766P7363p1839
504a83270j25902n0458j3881L52661m0565O2846j27649l8934O4571k57289P9603
493b78267j71366Q6423J13428q6764J06956k0877Q810K37304j06358L09290k35822
$$ plain form
482 -37243 -146905 -357124 -512045 -454307 -507209 -460274 -544240 -517288 -305136 -329324 -219400
471 -219400 -103791 -355122 -365882 -9536 62870 105205 -31682 -292190 -441864 -528561 -391949
460 -391949 -474855 -173128 -131811 -370160 -269973 -183164 86061 -52648 -13047 -368641 -492684
449 -492684 -345188 -585237 -396278 -241035 -218978 -245232 -269808 -139086 -331536 -410818 -569577
438 -569577 -532532 -559653 -441473 -404233 -364909 -703406 -636863 -414000 -193771 -48809 -238097
427 -238097 -169501 -96736 -296913 -472810 -440075 -784882 -944388 -611354 -680900 -702620 -404398
416 -404398 -365746 -212350 -105543 -156374 -57420 -16239 -280726 -279115 -4846 -214446 -419718
405 -419718 -106322 -41221 -299206 -448696 -686924 -666824 -395136 -319656 -207529 -266660 -355432
$$ packed form
482c7243j09662k10219j54921N7738n2902M6935q3966K6952K12152k4188J09924
471b19400J15609k51331j0760L56346P2406M2335j36887k60508j49674q6697J36612
460c91949q2906L01727M1317k38349J00187Q6809K69225j38709L9601l55594j24043
449d92684J47496k40049J88959J55243K2057k6254k4576J30722j92450p9282j58759
438e69577L7045k7121J18180L7240L9324l38497O6543K22863K20229J44962j89288
427b38097O8596P2765k00177j75897L2735l44807j59506L33034o9546k1720K98222
416d04398L8652J53396J06807n0831R8954M1181k64487J611K74269k09600k05272
405d19718L13396O5101k57985j49490k38228K0100K71688P5480J12127n9131q8772
$$ plain form
394 -355432 -236977 -504794 -631703 -621085 -652196 -471269 -326051 -202368 -389542 -639216
384 -639216 -524026 -362947 -507238 -616281 -345839 -371296 -76935 -116091 -413401 -595922
374 -595922 -722835 -331469 11981 84147 -82168 -250659 -493292 -709690 -746640 -650639
364 -650639 -721524 -329998 -351088 -293253 -79853 -389640 -622749 -376010 -179158 -60905
354 -60905 -165549 -271693 -482118 -650173 -841548 -705184 -746999 -633382 -511440 -482675
344 -482675 -526470 -644576 -669509 -647074 -645461 -575892 -239544 -377568 -570643 -635128 -538433
333 -538433 -581345 -645514 -694735 -332326 -200427 -140927 -175635 -336108 -582025 -507980 -347524
322 -347524 -466365 -316347 -344443 -667907 -586991 -251708 -264796 -555930 -626284 -519866 -583740
$$ packed form
394c55432J18455k67817j26909J0618l1111J80927J45218J23683j87174k49674
384f39216J15190J61079j44291j09043K70442k5457K94361l9156k97310j82521
374e95922j26913L91366L43450P2166j66315j68491k42633k16398l6950R6001
364f50639p0885L91526k1090N7835K13400l09787k33109K46739J96852J18253
354f0905j04644j06144k10425j68055j91375J36364m1815J13617J21942K8765
344d82675m3795j18106k4933K2435J613O9569L36348j38024j93075o4485R6695
333e38433m2912o4169m9221L62409J31899N9500l4708j60473k45917P4045J60456
322c47524j18841J50018k8096l23464Q0916L35283j3088k91134p0354J06418o3874
$$ plain form
311 -583740 -354347 -169745 -283600 -732174 -964758 -1003015 -965770 -572247 -480027 -418923 -533262
300 -533262 -687767 -496680 -468488 -369163 -385278 -287877 -459742 -410136 -327628 -561012 -736286
289 -736286 -357415 -301032 -276983 -311015 -466392 -505817 -719922 -697465 -655931 -578647 -391303
278 -391303 -47454 87309 -117387 -219452 -330388 -464569 -456171 -273238 -187769 -196308 -104081
267 -104081 -657262 -978716 -795741 -515577 -740159 -463448 -264810 -109060 86665 -53316
257 -53316 -569024 -945333 -973114 -648105 -458944 -527134 -611740 -736439 -498876 -573505 -369484
246 -369484 -593740 -878001 -551738 -736799 -568569 -357974 -706312 -793893 -870967 -670861
236 -670861 -706536 -659220 -738745 -571241 -256819 -490440 -681499 -559641 -633908 -528103 -645815
$$ packed form
311e83740K29393J84602j13855m48574k32584l8257L7245L93523R2220O1104j14339
300e33262j54505J91087K8192R9325j6115R7401j71865M9606Q2508k33384j75274
289g36286L78871N6383K4049l4032j55377l9425k14105K2457M1534P7284J87344
278c91303L43849J34763k04696j02065j10936j34181Q398J82933Q5469q539R2227
267a04081n53181l21454J82975K80164k24582K76711J98638J55750J95725j39981
257e3316n15708l76309k7781L25009J89161o8190q4606j24699K37563p4629K04021
246c69484k24256k84261L26263j85061J68230K10595l48338q7581p7074K00106
236f70861l5675M7316p9525J67504L14422k33621j91059J21858p4267J05805j17712
$$ plain form
225 -645815 -940985 -1042909 -926366 -696586 -510013 -113579 -114495 -149577 -543118 -608630 -428725
214 -428725 -421118 -847021 -837220 -574984 -728725 -820717 -517387 -696547 -739382 -310643 -158113
203 -158113 -493742 -665900 -812839 -640590 -434252 -565670 -810152 -951770 -788962 -638153
193 -638153 -449912 -265068 -286434 -403990 -615603 -761542 -651863 -768261 -680346 -780169
183 -780169 -778954 -1050368 -838458 -625158 -833844 -715425 -509276 -606963 -638606 -711502 -846304
172 -846304 -1081184 -852586 -832932 -777527 -719877 -979254 -977253 -893275 -934022 -778749 -735041
161 -735041 -697479 -614059 -680676 -438035 -519165 -776971 -961413 -1000138 -878767 -617098 -543951
150 -543951 -808483 -696722 -393941 -624070 -631919 -570039 -762549 -720279 -261804 -211027 -591602
$$ packed form
225f45815k95170j01924J16543K29780J86573L96434r16l5082l93541o5512J79905
214d28725P607m25903R801K62236j53741r1992L03330j79160m2835M28739J52530
203a58113l35629j72158j46939J72249K06338j31418k44482j41618J62808J50809
193f38153J88241J84844k1366j17556k11613j45939J09679j16398Q7915r9823
183g80169J215k71414K11910K13300k08686J18419K06149r7687l1643p2896j34802
172h46304k34880K28598J9654N5405N7650k59377K001Q3978m0747J55273M3708
161g35041L7562Q3420o6617K42641q1130k57806j84442l8725J21371K61669P3147
150e43951k64532J11761L02781k30129p849O1880j92510M2270M58475N0777l80575
$$ plain form
139 -591602 -711728 -727472 -818621 -832282 -657611 -891749 -977246 -842479 -713838 -526185 -260630
128 -260630 -501898 -629499 -653207 -812469 -618805 -407138 -716618 -575051 -610318 -666734
118 -666734 -327072 -549540 -832525 -836286 -695174 -898788 -721376 -742962 -832711 -720902 -651765
107 -651765 -813493 -922836 -1024136 -1012961 -881904 -764446 -829521 -900377 -870855 -904226 -798975
96 -798975 -329132 -385915 -397234 -571540 -541305 -763123 -902915 -661018 -549704 -642990 -530124
85 -530124 -742283 -876905 -632628 -753456 -853223 -770338 -701447 -725677 -678432 -696592 -769669
74 -769669 -744121 -811634 -764354 -875910 -936594 -745228 -775709 -811229 -716656 -723876 -838727 -770108
62 -770108 -783822 -933328 -1095567 -904150 -678619 -695771 -699012 -553016 -659860 -912494 -912861
$$ packed form
139e91602j20126j5744r1149j3661J74671k34138q5497J34767J28641J87653K65555
128b60630k41268j27601k3708j59262J93664K11667l09480J41567l5267n6416
118f66734L39662k22468k82985l761J41112k03614J77412k1586q9749J11809O9137
107f51765j61728j09343j01300J1175J31057J17458o5075p0856K9522l3371J05251
96g98975M69843n6783j1319j74306L0235k21818j39792K41897J11314r3286J12866
85e30124k12159j34622K44277j20828r9767Q2885O8891k4230M7245j8160p3077
74g69669K5548o7513M7280j11556o0684J91366l0481l5520R4573p220j14851O8619
62g70108j3714j49506j62239J91417K25531j7152l241J45996j06844k52634l67
$$ plain form
51 -912861 -1032393 -880436 -827685 -870878 -646638 -919013 -1231392 -1057488 -909151 -851349 -707123
40 -707123 -708721 -679063 -759092 -780201 -711622 -883523 -1047531 -1095812 -842406 -619583 -923207
29 -923207 -1006385 -1001899 -1103592 -1141347 -720741 -589162 -471372 -540473 -534462 -800492 -903773
18 -903773 -1051705 -1064264 -1054038 -995602 -911937 -827353 -723151 -749961 -886783 -934410 -1095455
7 -1095455 -998730 -956741 -683807 -619703 -720356 -845983 -890798
0 -890798
$$ packed form
51i12861j19532J51957N2751m3193K24240k72375l12379J73904J48337N7802J44226
40g07123j598K9658q0029k1109O8579j71901j64008m8281K53406K22823l03624
29i23207q3178M486j01693l7755M20606J31579J17790o9101O011k66030j03281
18i03773j47932j2559J0226N8436Q3665Q4584J04202k6810j36822m7627j61045
7a095455R6725M1989K72934O4104j00653j25627m4815
0h90798
$$ Imaginary data points
##PAGE= N=2
##DATA TABLE= (X++(I..I)), XYDATA
$$ plain form
16383 -4919162 -4818972 -4808798 -4545716 -4614005 -4529306 -4371138 -4360464 -4481355 -4747557 -4706798
16373 -4706798 -4342640 -4225824 -4088270 -3902174 -3810841 -3965054 -3991921 -4133419 -4035977 -4115552
16363 -4115552 -3850786 -3672137 -3631202 -3573948 -3618883 -3540533 -3565951 -3542889 -3614287 -3536486 -3310538
16352 -3310538 -3267167 -3404785 -3313558 -3484197 -3420597 -3060466 -3168604 -3258115 -3026517 -3078334
16342 -3078334 -3103966 -2873359 -2948413 -3046916 -3022896 -2847192 -2719964 -2654892 -2604505 -2631241 -2434691
16331 -2434691 -2385245 -2409911 -2345135 -2265780 -2464480 -2303470 -1899328 -2167098 -2108772 -1961082
16321 -1961082 -1821697 -1784604 -1895912 -2203634 -2061566 -1824087 -1706753 -1730857 -1398458 -1396376
16311 -1396376 -1431461 -1285947 -1456331 -1639078 -1685871 -1542909 -1265674 -997835 -1017391 -1201237
$$ packed form
16383d919162J00190J0174K63082o8289Q4699J58168J0674j20891k66202M0759
16373d706798L64158J16816J37554J86096R1333j54213k6867j41498R7442p9575
16363d115552K64766J78649M0935N7254m4935P8350k5418K3062p1398P7801K25948
16352c310538M3371j37618R1227j70639O3600L60131j08138q9511K31598n1817
16342c078334k5632K30607p5054r8503K4020J75704J27228O5072N0387k6736J96550
16331b434691M9446k4666O4776P9355j98700J61010M04142k67770N8326J47690
16321a961082J39385L7093j11308l07722J42068K37479J17334k4104L32399K082
16311a396376l5085J45514j70384j82747m6793J42962K77235K67839j9556j83846
$$ plain form
16301 -1201237 -1187496 -1075881 -989588 -1202573 -957477 -853755 -1154497 -904195 -549240 -459442
16291 -459442 -591251 -647894 -647266 -691208 -885901 -1052648 -1126481 -926342 -801449 -578580 -480527
16280 -480527 -538810 -575524 -280027 -480310 -573422 -431921 -152071 245392 461031 262260
16270 262260 -222790 -42096 199393 53306 290517 121167 161877 402036 588026 628494
16260 628494 638819 726555 679279 742429 837075 642002 733061 587756 456218 659451 857475
16249 857475 574914 737542 1020008 1029962 919017 1017682 957330 978889 1296844 1310124 1135058
16238 1135058 997065 1003747 950475 1120711 1094652 988503 963245 1003400 1155394 1390006
16228 1390006 1354516 1400423 1651557 1649245 1594394 1248322 1119934 1086790 1242218 1361042
$$ packed form
16301a201237J3741J11615Q6293k12985K45096J03722l00742K50302L54955Q9798
16291d59442j31809n6643O28m3942j94693j66747p3833K00139J24893K22869R8053
16280d80527n8283l6714K95497k00283r3112J41501K79850L97463K15639j98771
16270B62260m85050J80694K41489j46087K37211j69350M0710K40159J85990M0468
16260F28494J0325Q7736m7276O3150R4646j95073R1059j45305j31538K03233J98024
16249H57475k82561J62628K82466R954j10945R8665o0352K1559L17955J3280j75066
16238A135058j37993O682n3272J70236k6059j06149k5258M0155J51994K34612
16228A390006l5490M5907K51134k312n4851l46072j28388l3144J55428J18824
$$ plain form
16218 1361042 1394609 1432690 1375999 1653597 1557712 1348648 1191215 1206958 1504285 1868305
16208 1868305 1815868 1737807 1892411 1674605 1800034 1701807 1638376 1597218 1452748 1656130
16198 1656130 1752651 1901797 2099783 1979308 1931768 1717224 1916966 2114912 1844510 1863769
16188 1863769 2041101 2321849 2319188 2590479 2660520 2481739 2084368 1714088 1914931 1951425
16178 1951425 2044310 2652290 2791273 2694468 2561616 2471707 2265873 2211899 2353562 2518630
16168 2518630 2765579 2877253 2631051 2474444 2368998 2516854 2467729 2414445 2258128 2626307
16158 2626307 2966834 2977922 2701356 2648991 2474310 2488425 2533407 2122850 1874413 2049634
16148 2049634 2235456 2474735 2339137 2445007 2650374 2757393 2868724 2559146 2511015 2486930
$$ packed form
16218A361042L3567L8081n6691K77598r5885k09064j57433J5743K97327L64020
16208A868305n2437p8061J54604k17806J25429r8227o3431m1158j44470K03382
16198A656130R6521J49146J97986j20475m7540k14544J99742J97946k70402J9259
16188A863769J77332K80748k661K71291P0041j78781l97371l70280K00843L6494
16178A951425R2885O07980J38983r6805j32852q9909k05834n3974J41663J65068
16168B518630K46949J11674k46202j56607j05446J47856m9125n3284j56317L68179
16158B626307L40527J1088k76566n2365j74681J4115M4982m10557k48437J75221
16148B049634J85822K39279j35598J05870K05367J07019J11331l09578m8131k4085
$$ plain form
16138 2486930 2481864 2651273 2865356 2771654 2442815 2057524 2285966 2278560 2780212 3011562
16128 3011562 3027330 2919446 2725942 3102818 2869205 2782641 2810310 3059045 2875517 2818611
16118 2818611 2726097 2860848 3267993 2796359 3041502 2997746 2672022 2862935 3206445 3149226
16108 3149226 2802583 2771043 2956892 2827813 3096614 3122503 2765456 3143043 3170196 2835852
16098 2835852 2892037 2789694 2745933 3097265 2987826 2672936 2636618 3052093 3208532 3183501
16088 3183501 2961238 2610286 2758910 3048038 2973530 3161465 3203326 2965598 3046164 2995365
16078 2995365 2850928 2754332 2595839 2687606 2824753 3135197 3207507 2946415 2832398 2950746
16068 2950746 3040701 2991407 2993006 3023340 2936824 3016310 2974407 2628582 2584583 2840745 3248404
$$ packed form
16138B486930n066J69409K14083r3702l28839l85291K28442p406N01652K31350
16128C011562J5768j07884j93504L76876k33613q6564K7669K48735j83528n6906
16118B818611r2514J34751M07145m71634K45143m3756l25724J90913L43510n7219
16108C149226l46643l1540J85849j29079K68801K5889l57047L77587K7153l34344
16098B835852N6185j02343m3761L51332j09439l14890l6318M15475J56439k5031
16088C183501k22263l50952J48624K89128p4508J87935M1861k37728Q0566n0799
16078B995365j44437r6596j58493R1767J37147L10444P2310k61092j14017J18348
16068B950746Q9955m9294J599L0334q6516P9486m1903l45825m3999K56162M07659
$$ plain form
16057 3248404 2914719 2804279 2658049 2909069 2816634 2851525 2924320 2672997 2708219 2925658
16047 2925658 3197387 2951976 2802785 3176814 2858338 3002798 3442903 3332297 3302877 3307287
16037 3307287 3172921 2750988 2718471 2804115 3157237 3335059 3301106 3221286 3053253 2871950
16027 2871950 2767734 3217707 3273757 3074849 3241853 3189114 3129510 3037163 2702983 2421764
16017 2421764 2453466 2860982 3034404 3107885 3120062 3243015 3207508 3280543 3158160 2992999
16007 2992999 3103818 3547782 3567772 3328817 3138600 2791482 2556284 2552865 2676501 2852076
15997 2852076 3006136 3182181 3323790 3182544 2899121 3022171 2932824 2894079 2904413 2830469
15987 2830469 2735403 2784858 3395683 3131017 2662809 2879163 2767347 2779397 2906690 2969074
$$ packed form
16057C248404l33685j10440j46230K51020r2435L4891P2795k51323L5222K17439
16047B925658K71729k45411j49191L74029l18476J44460M40105j10606k9420M410
16037C307287j34366m21933l2517Q5644L53122J77822l3953p9820j68033j81303
16027B871950j04216M49973N6050j98908J67004n2739n9604r2347l34180k81219
16017B421764L1702M07516J73422P3481J2177J22953l5507P3035j22383j65161
16007B992999J10819M43964J9990k38955j90217l47118k35198l419J23636J75575
15997B852076J54060J76045J41609j41246k83423J23050q9347l8745J0334p3944
15987B830469r5066M9455O10825k64666m68208K16354j11816J2050J27293O2384
$$ plain form
15977 2969074 3183958 3076909 3157264 3259086 3277228 3175385 2980884 2761241 2752881 2804376
15967 2804376 3135765 3142228 3133355 2878299 2916853 2737454 2545141 2650119 2973860 2749355
15957 2749355 2733443 2801962 2752174 2901070 2951707 3106755 2950998 2946845 2937188 2876474 2997277
15946 2997277 2853647 2824927 2884352 2978349 2875327 2574397 2539442 2680961 3086250 2933088
15936 2933088 2978758 3085865 3332872 3361581 3189706 3266486 3078938 3105127 3213644 2960016
15926 2960016 2723492 2696927 2679172 2778232 2699985 2948202 2803574 2978392 3215362 3109764
15916 3109764 2768744 2760149 2509386 2607149 2922613 3171613 3305859 3245852 3347063 3454270
15906 3454270 3173214 2919893 2688883 2853895 2967910 3075363 3037412 2682360 3002624 3013295
$$ packed form
15977B969074K14884j07049Q0355J01822J8142j01843j94501k19643q360N1495
15967B804376L31389O463q873k55056L8554j79399j92313J04978L23741k24505
15957B749355j5912O8519m9788J48896N0637J55048j55757m153r657o0714J20803
15946B997277j43630k8720N9425R3997j03022l00930l4955J41519M05289j53162
15936B933088M5670J07107K47007K8709j71875P6780j87548K6189J08517k53628
15926B960016k36524k6565j7755R9060p8247K48217j44628J74818K36970j05598
15916C109764l41020q595k50763R7763L15464K49000J34246o0007J01211J07207
15906C454270k81056k53321k31010J65012J14015J07453l7951l55052L20264J0671
$$ plain form
15896 3013295 3056506 2992766 2888621 2688637 2705373 2948739 3245455 3313051 3055722 3297825
15886 3297825 3518503 2919765 2638431 2813676 2751308 2880706 3175779 3060762 3076340 3072014
15876 3072014 2939742 2806329 2944503 2679768 2872099 3139921 3025210 2838931 2951530
15867 2951530 3015911 2812762 2764301 2920192 2697248 2637078 2965712 2837219 2810519 2973362
15857 2973362 2747210 2857857 3072745 3207854 3131485 3037256 2845872 2700818 2986972 3003159
15847 3003159 2902839 3007457 2723828 2682205 2607597 2968686 3084426 2877340 2898585 2683069
15837 2683069 2923106 3540195 3430427 3281045 3219657 2856035 2799774 3017807 2989153 2932875
15827 2932875 3158482 3140170 3004468 3214443 3079101 2933998 2795783 2720550 2862473 2934202
$$ packed form
15896C013295M3211o3740j04145j99984J6736K43366K96716O7596k57329K42103
15886C297825K20678n98738k81334J75245o2368J29398K95073j15017J5578m326
15876C072014j32272j33413J38174k64735J92331K67822j14711j86279J12599
15867B951530O4381k03149m8461J55891k22944o0170L28634j28493k6700J62843
15857B973362k26152J10647K14888J35109p6369r4229j91384j45054K86154J6187
15847C003159j00320J04618k83629m1623p4608L61089J15740k07086K1245k15516
15837B683069K40037O17089j09768j49382o1388l63622n6261K18033k8654n6278
15827B932875K25607j8312j35702K09975j35342j45103j38215p5233J41923P1729
$$ plain form
15817 2934202 3006927 2968226 3015076 3121867 2957381 2767376 2775958 2727674 2825174 2849882 2806038
15806 2806038 2759918 2906711 2996346 2876144 3157946 3122816 2654886 2745751 3184217 3217177
15796 3217177 3078111 3118783 3056322 3136487 3099104 3120595 3071203 3102150 3074937 3154654 2941981
15785 2941981 3159039 2890224 2867421 3177849 3092332 2910935 3047136 2876698 2697632 2998362
15775 2998362 3108863 2804864 2945313 3015087 3097036 3161873 3007084 2896114 2893618 3014698
15765 3014698 3012524 3327686 3358493 3117211 3186940 3366152 3070899 2980921 3166204 3074267
15755 3074267 3237843 3295716 3186568 3425655 3630930 3376649 3262341 3064857 2790780 2866030
15745 2866030 3016555 3022650 3476506 3458873 3348655 3168379 3246791 3136765 3271278 3403309
$$ packed form
15817B934202P2725l8701M6850J06791j64486j90005Q582m8284R7500K4708m3844
15806B806038m6120J46793Q9635j20202K81802l5130m67930R0865M38466L2960
15796C217177j39066M0672o2461Q0165l7383K1491m9392L0947k7213P9717k12673
15785B941981K17058k68815k2803L10428q5517j81397J36201j70438j79066L00730
15775B998362J10501l03999J40449O9774Q1949O4837j54789j10970k496J21080
15765C014698k174L15162L0807k41282O9729J79212k95253q9978J85283r1937
15755C074267J63576N7873j09148K39087K05275k54281j14308j97484k74077P5250
15745B866030J50525O095M53856j7633j10218j80276P8412j10026J34513J32031
$$ plain form
15735 3403309 3293473 3062733 3101441 3011037 3003207 3123220 2878730 3217979 3115014 3086047
15725 3086047 3384424 3485172 3419786 3197513 2889409 2820880 2983727 3348434 3201532 3350460
$$ packed form
15735C403309j09836k30740L8708r0404p830J20013k44490L39249j02965k8967
15725C086047K98377J00748o5386k22273l08104o8529J62847L64707j46902J48928
$$ [...]
##END NTUPLES=NMR SPECTRUM
##END=
