##TITLE=1H_EC-3240
 CDCl3, 8 sc, 
 24.12.2020
##JCAMPDX= 6.0         $$ Bruker NMR JCAMP-DX V2.0
##DATA TYPE= NMR SPECTRUM
##DATA CLASS= NTUPLES
##ORIGIN= UXNMR, Bruker Analytische Messtechnik GmbH
##OWNER= root
$$ XWIN-NMR		Version 3.5
$$ Thu Dec 24 10:54:19 2020 Russian Standard Time (UT+4h)  she@DPX200
##.OBSERVE FREQUENCY= 200.1315066352
##.OBSERVE NUCLEUS= ^1H
##.ACQUISITION MODE= SIMULTANEOUS
##.ACQUISITION SCHEME= undefined
##.AVERAGES= 8
##.DIGITISER RES= 18
##SPECTROMETER/DATA SYSTEM= spect
##.PULSE SEQUENCE= zg30
##.SOLVENT NAME= CDCl3
##.SHIFT REFERENCE= (INTERNAL, CDCl3, 0, 16.0113)
##AUDIT TRAIL= $$ (NUMBER, WHEN, WHO, WHERE, WHAT)
$$ ##TITLE= Audit trail, XWIN-NMR		Version 3.5
$$ ##JCAMPDX= 5.01
$$ ##ORIGIN= Bruker BioSpin GmbH
$$ ##OWNER= she
$$ F:/spectra/data/she/nmr/H-F/1/pdata/1/auditp.txt
$$ ##AUDIT TRAIL=  $$ (NUMBER, WHEN, WHO, WHERE, WHAT)
(   1,<2020-12-24 10:53:10.35 +0400>,<she>,<DPX200>,
      <created by zg, POWCHK disabled, PULCHK disabled
       configuration hash MD5:
       00 E9 B6 7A A2 85 ED C7 34 08 36 98 17 FE 4E 26
       data hash MD5: 16K
       11 96 3B 73 94 4E 93 0A F4 91 0D EB C3 70 EA 7A>)
(   2,<2020-12-24 10:53:13.00 +0400>,<she>,<DPX200>,
      <Start of raw data processing
       efp BC_mod = 2 LB = 0.24 FT_mod = 6 PKNL = 1 PHC0 = -10770.97 PHC1 = 20.40095 SI = 16K 
       data hash MD5: 16K
       F6 13 42 A6 5F 8A 6A 77 CD 4F 30 E3 5D E7 50 A1>)
(   3,<2020-12-24 10:53:27.31 +0400>,<she>,<DPX200>,
      <pk PHC0 = 3.082597 PHC1 = 0 
       data hash MD5: 16K
       36 F4 7A A4 58 9A D4 77 1A 28 11 BA A6 2A 11 E7>)
(   4,<2020-12-24 10:53:30.95 +0400>,<she>,<DPX200>,
      <abs ABSG = 5 
       data hash MD5: 16K
       39 B0 86 2B C3 11 1A F3 99 00 06 08 61 35 F0 6B>)
(   5,<2020-12-24 10:53:59.23 +0400>,<she>,<DPX200>,
      <abs ABSG = 5 
       data hash MD5: 16K
       36 E2 B7 3A FD D4 02 40 29 CA 51 27 C8 64 E0 8B>)
$$ ##END=
$$ 
$$ hash MD5
$$ 03 11 89 B4 96 EC 3C BC CF 29 E9 25 F2 EE EB 3E
##$RELAX= 
##$RELAX= 
##$RELAX= 
##$RELAX= 
##$RELAX= 
##$RELAX= 
$$ Bruker specific parameters
$$ --------------------------
##$DU= <F:/spectra>
##$EXPNO= 1
##$NAME= <H-F>
##$PROCNO= 1
##$TYPE= <nmr>
##$USER= <she>
##$AMP= (0..31)
100 100 100 100 100 100 100 100 100 100 100 100 100 100 100 100 100 100 
100 100 100 100 100 100 100 100 100 100 100 100 100 100 
##$AQSEQ= 0
##$AQ_mod= 1
##$AUNM= <au_zg>
##$AUTOPOS= <>
##$BF1= 200.13
##$BF2= 200.13
##$BF3= 200.13
##$BF4= 200.13
##$BF5= 200.13
##$BF6= 200.13
##$BF7= 200.13
##$BF8= 200.13
##$BYTORDA= 1
##$CFDGTYP= 0
##$CFRGTYP= 5
##$CHEMSTR= <none>
##$CNST= (0..31)
1 1 145 1 1 1 1 1 1 1 1 1 1 1 1 1 1 1 1 1 1 1 1 1 1 1 1 1 1 1 1 1 
##$CPDPRG= <>
##$CPDPRG1= <>
##$CPDPRG2= <>
##$CPDPRG3= <>
##$CPDPRG4= <mlev>
##$CPDPRG5= <mlev>
##$CPDPRG6= <mlev>
##$CPDPRG7= <mlev>
##$CPDPRG8= <mlev>
##$CPDPRGB= <>
##$CPDPRGT= <>
##$D= (0..31)
0 1.2 0 0 0 0 0 0 0 0.06 0 0.03 0 0 0 0 0.0002 0 0 0 0 0 0 0 0 0 0 0 0 
0 0 0 
##$DATE= 1608792789
##$DBL= (0..7)
$$ [...]
##$SUBNAM3= <"">
##$SUBNAM4= <"">
##$SUBNAM5= <"">
##$SUBNAM6= <"">
##$SUBNAM7= <"">
##$SUBNAM8= <"">
##$SUBNAM9= <"">
##$SW= 16.9725356469052
##$SWIBOX= (0..15)
0 0 2 0 0 0 0 0 0 0 0 0 0 0 0 0 
##$SW_h= 3396.73913043478
##$TD= 16384
##$TD0= 1
##$TE= 0
##$TE2= 300
##$TE3= 300
##$TEG= 300
##$TL= (0..7)
0 120 120 120 120 120 120 120 
##$TP= (0..7)
150 150 150 150 150 150 150 150 
##$TP07= 0
##$TPNAME0= <>
##$TPNAME1= <>
##$TPNAME2= <>
##$TPNAME3= <>
##$TPNAME4= <>
##$TPNAME5= <>
##$TPNAME6= <>
##$TPNAME7= <>
##$TPOAL= (0..7)
0.5 0.5 0.5 0.5 0.5 0.5 0.5 0.5 
##$TPOFFS= (0..7)
0 0 0 0 0 0 0 0 
##$TUNHIN= 0
##$TUNHOUT= 0
##$TUNXOUT= 0
##$USERA1= <user>
##$USERA2= <user>
##$USERA3= <user>
##$USERA4= <user>
##$USERA5= <user>
##$V9= 5
##$VALIST= <valist>
##$VCLIST= <CCCCCCCCCCCCCCC>
##$VD= 0
##$VDLIST= <DDDDDDDDDDDDDDD>
##$VPLIST= <PPPPPPPPPPPPPPP>
##$VTLIST= <TTTTTTTTTTTTTTT>
##$WBST= 1024
##$WBSW= 4
##$XGAIN= (0..3)
0 0 0 0 
##$XL= 0
##$YL= 0
##$YMAX_a= 547270
##$YMIN_a= -466047
##$ZGOPTNS= <>
##$ZL1= 120
##$ZL2= 120
##$ZL3= 120
##$ZL4= 120
##$ABSF1= 16.01132
##$ABSF2= -0.9613438
##$ABSG= 5
##$ABSL= 3
##$ALPHA= 0
##$AQORDER= 0
##$ASSFAC= 0
##$ASSFACI= 0
##$ASSFACX= 0
##$ASSWID= 0
##$AUNMP= <proc_1d>
##$AZFE= 0.1
##$AZFW= 0.1
##$BCFW= 0
##$BC_mod= 2
##$BYTORDP= 0
##$COROFFS= 0
##$CY= -3
##$DATMOD= 1
##$DC= 0
##$DFILT= <>
##$DTYPP= 0
##$F1P= 0
##$F2P= 0
##$FCOR= 1
##$FTSIZE= 16384
##$FT_mod= 6
##$GAMMA= 0
##$GB= 0
##$INTBC= 1
##$INTSCL= 2.992141e-10
##$ISEN= 128
##$LB= 0.24
##$LEV0= 0
##$LPBIN= 0
##$MAXI= 10000
##$MC2= 0
##$MEAN= 0
##$ME_mod= 0
##$MI= 1.114404
##$NCOEF= 0
##$NC_proc= -4
##$NLEV= 6
##$NOISF1= 3.799351
##$NOISF2= 2.8
##$NSP= 0
##$NTH_PI= 0
##$NZP= 0
##$OFFSET= 16.01132
##$PC= 1
##$PHC0= -10767.89
##$PHC1= 20.40095
##$PH_mod= 1
##$PKNL= yes
##$PPARMOD= 0
##$PSCAL= 0
##$PSIGN= 0
##$REVERSE= no
##$SF= 200.1300006595
##$SI= 16384
##$SIGF1= 3
##$SIGF2= 2
##$SINO= 5.538805
##$SIOLD= 16384
##$SREGLST= <1H.CDCl3>
##$SSB= 0
##$STSI= 16384
##$STSR= 0
##$SW_p= 3396.73913043478
##$SYMM= 0
##$S_DEV= 0
##$TDeff= 16384
##$TDoff= 0
##$TI= <>
##$TILT= no
##$TM1= 0
##$TM2= 0
##$TOPLEV= 0
##$USERP1= <user>
##$USERP2= <user>
##$USERP3= <user>
##$USERP4= <user>
##$USERP5= <user>
##$WDW= 1
##$XDIM= 16384
##$YMAX_p= 343050268
##$YMIN_p= -412087
$$ End of Bruker specific parameters
$$ ---------------------------------
##NTUPLES= NMR SPECTRUM
##VAR_NAME=  FREQUENCY,     SPECTRUM/REAL,   SPECTRUM/IMAG
##SYMBOL=    X,             R,               I
##VAR_TYPE=  INDEPENDENT,   DEPENDENT,       DEPENDENT
##VAR_FORM=  AFFN,          ASDF,            ASDF
##VAR_DIM=   16384,         16384,           16384
##UNITS=     HZ,            ARBITRARY UNITS, ARBITRARY UNITS
##FACTOR=    0.207333158178281, 1,           1
##FIRST=     3204.34550500145, 0,            0
##LAST=      -192.393625433328, 0,           0
##MIN=       -192.393625433328, -412087,     0
##MAX=       3204.34550500145, 343050268,    0
$$ Real data points
##PAGE= N=1
##DATA TABLE= (X++(R..R)), XYDATA
$$ [...]
7187c7031M1936J6762l3555k9833J1366j007O104j8353Q86k354L3006p352J8637
7174g88K768k6857J8876L7774r766l2764J3655J0913P141l916J2422m759J0338
7161C5037N750J5137p342j8594l7742k563K3870M431J656K5564N327j4759j0427
7148B5345k0887j1735K3375L1633r890P578n915J444k0194k6297K7387K8783N932
7135E6559o908k2108n396J4678k4965M509k1355n220l1768K1148j956J9468k4900
7122b8214m287L136R910l644l466J5308K672P021J6910n823j1364J3836O431k8425
7108i999o774J7781k848j7441p81Q679j9900k6913K0855J8131L5527l723p456
7095E138j0605J1211L574P126J5048l9560J7718K1440J7465K8576k1273l7417
$$ plain form
7187 -37031 4905 21667 -11888 -41721 -30355 -31362 -25258 -43611 -42725 -45079 -12073 -19425 -788
7174 -788 1980 -24877 -6001 31773 22007 -10757 2898 13811 20952 17036 29458 24699 35037
7161 35037 40787 55924 48582 29988 -7754 -10317 13553 17984 19640 45204 50531 35772 25345
7148 25345 4458 -7277 16098 47731 37841 45419 39504 40948 20754 -5543 21844 50627 56559
7135 56559 49651 27543 22147 36825 11860 16369 -4986 -10206 -41974 -20826 -22782 -3314 -28214
7122 -28214 -32501 -29365 -19455 -23099 -26565 -11257 -8585 -1564 15346 9523 -1841 11995 18426 -9999
7108 -9999 -16773 1008 -1840 -19281 -20062 -11383 -31283 -58196 -37341 -19210 16317 12594 5138
7095 5138 -5467 5744 9318 16444 31492 -8068 9650 31090 48555 77131 55858 18441
7083A8441N668J324J3766M005j6752M858n4579n616M8124j4835l4549K1835K4666
7070A6356j9015j9895l0215J5922K0571L0731Q814j6056r513K1181k356n179J4565
7057B5911K5610o112p868J5012l0898m9397O186K3819j5292k2375Q581l537K8582
7044a778j320J5052l71m670q645M4103J0534j2599o599q70j0505L0418J6571j3196
7030E6125j3544K584k1674N329k3137K714O174J6786L869J2321K627j5594n444
7017B9136q348k1759P20J0064j692j7824j2946L5266M9191j6396j1814J0219k2923
7004B0894O945J0959m2867n553J6807M6654J0345o0718k7726r533M5024m794k0259
6991a3822J9791N169J5642n935l1146K3166j7631J6511l446m934J6028J3924m764
$$ plain form
7083 18441 24109 25433 39199 43204 26452 31310 -23269 -28885 19239 4404 -30145 -8310 16356
7070 16356 -2659 -22554 -52769 -36847 -16276 14455 23269 7213 -2300 18881 16525 11346 25911
7057 25911 51521 45409 37541 52553 21655 -27742 -21556 2263 -13029 -35404 -26823 -30360 -1778
7044 -1778 -3098 11954 11583 6913 -1732 42371 52905 40306 33707 32837 22332 52750 69321 56125
7030 56125 42581 45165 23491 28820 5683 8397 14571 31357 35226 47547 50174 34580 29136
7017 29136 20788 -971 -251 9813 8121 -9703 -22649 12617 61808 45412 33598 43817 20894
7004 20894 27839 38798 -4069 -9622 7185 53839 64184 3466 -24260 -33793 11231 6437 -13822
6991 -13822 5969 11138 26780 20845 -10301 12865 -4766 11745 8299 3365 19393 33317 28553
6978B8553L261j9461L627K4579R463o875J9365j2109J523m358k1730k7010k840
6965d012L5712P298m2443l759J7587O646J3823J0171j6491j0377j3438L0095M912
6952C5724R725p830M792p546j2067j2703K801K883j57k316k2089P932J6150q889
6938F410q950J5221p567j6658J3375q169l978K8796K075j7688N817r366J2883
6925A2201M085K856J8306J0097l6362j4979L3505K0879k115r141j1163o539N714
6912B7344j5295J9010j9958k9072L4301L459j5547R581o579j54P361k9287O911
6899g925J9243j708M1853J4936J3079k829j4156r343j8067m4919K9299o887j4453
6886a877n894j3603J8599n460N172M874k913l2999r22K4750M584L9820K4488j7953
$$ plain form
6978 28553 31814 12353 15980 40559 50022 43147 62512 50403 51926 47568 25838 -1172 -4012
6965 -4012 31700 38998 -3445 -7204 10383 17029 30852 41023 24532 14155 717 30812 35724
6952 35724 45449 37619 42411 34865 22798 10095 12896 15779 15622 13306 -8783 -851 15299 6410
6938 6410 -2540 12681 5114 -11544 1831 -6338 -10316 18480 20555 2867 8684 -682 12201
6925 12201 16286 19142 37448 47545 11183 -3796 29709 50588 48473 39332 28169 21630 27344
6912 27344 12049 31059 11101 -17971 16330 19789 4242 13823 7244 7090 14451 -14836 -7925
6899 -7925 11318 9610 51463 66399 79478 76649 62493 53150 35083 -9836 19463 12576 -1877
6886 -1877 -7771 -21374 -2775 -8235 -3063 1811 -1102 -34101 -35023 -10273 -5689 34131 58619 40666
6872D0666m826k2198j4116L5490r706j559n621K9420m0399j0546l139P870R949
6859A1285j0180M988m205r486J0131P414J8095K400j6809M552J3636M013M453
6846D0287J6457p239k1389j1531K0969J3730K5604m2727m029K8062p794k567j4305
6833C3528P215O207r996j9817n776P908R79j3664P764J9616R982l4609l3231J6354
6819g540J9106K5944J427J2245q261j1476K627J4126j7620k7673j619J5318Q655
6806B5259L4423k9125k9468J8938K665M964j9121j0326L4370J7211L181j8259
6794C4712P840J7048j9308K0888J116j0810r016k588l7880J2719K4380K207m2282
6781i74R473K1578J4178k3919k0741R931j9916N401K5017j3080j5718r997Q164
$$ plain form
6872 40666 35840 13642 -474 35016 25310 23751 18130 47550 7151 -3395 -6534 1336 11285
6859 11285 1105 6093 1888 -7598 2533 9947 28042 30442 13633 18185 31821 35834 40287
6846 40287 56744 49505 28116 16585 37554 51284 76888 34161 30132 58194 50400 47833 33528
6833 33528 40743 46950 36954 17137 11361 19269 20248 6584 14348 33964 43946 9337 -23894 -7540
6819 -7540 11566 37510 38937 51182 42921 31445 34072 48198 30578 2905 1286 16604 25259
6806 25259 59682 30557 1089 20027 22692 27656 8535 -1791 32579 49790 52971 34712
6794 34712 42552 59600 40292 61180 62296 51486 42470 39882 2002 14721 39101 41308 -974
6781 -974 8499 30077 44255 20336 -405 9526 -10390 -4989 20028 6948 -8770 -18767 -10603
6768a0603N244R299R22N832K7196j7666r402r304J5085K785j1719j5875j1497
6755a9703J5518N0436N092K836k1351j9829j61P269n754j1787L060J5051k5154
6742d477J6142k5023J5261L3229o550J3789j3625J1378Q868K0513j1088n685J0945
6729F3677M755q364k1858J9951m2677K3701L3687l7053k4847l6159J4046L0495
6717A9354N920j1415J020j8512K3164J4420J3583L955j2510j7111J499K8665O113
6704E8145m990J0795l512m915J3139m8870l0080J0867J1423J2122K1060p595r959
6691B7630k4941k8182j82K5206L3677K7313K8700q222k9545l3602m511K7112R145
6678D9598k33n521K44k3817J7318j9398j8501J1309L5107J1610j1070k7665j8240
$$ plain form
6768 -10603 -5359 3940 4862 10694 37890 20224 10822 1518 16603 19388 7669 -8206 -19703
6755 -19703 -4185 46251 51343 54179 32828 12999 12838 20107 14353 2566 5626 20677 -4477
6742 -4477 11665 -13358 1903 35132 28582 42371 28746 40124 48992 69505 58417 52732 63677
6729 63677 68432 60068 38210 58161 15484 39185 72872 35819 10972 -25187 -11141 19354
6717 19354 25274 13859 14879 -3633 19531 33951 47534 51489 38979 21868 23367 52032 58145
6704 58145 53155 63950 60438 55523 68662 19792 -10288 579 12002 24124 45184 37589 27630
6691 27630 2689 -25493 -25675 -469 33208 60521 89221 80999 51454 17852 13341 40453 49598
6678 49598 49365 43844 44088 20271 37589 18191 -310 10999 46106 57716 46646 18981 741
6665G41J2158l378M602O473J4504O151l565J5152j1627n138r83j0176L4039j0540
6651D8413J9728k8147p266J4987q175J1095J8019j6467N915P869j538M002l1151
6638C7284r490j1159L720J3756L4932J1914l5524k3269M001K3422P569q768R027
6625E7415O880J7471J743j9724k7676j2791N1651K1162j0832m0665q712j978m137
6612B9807j5913J829M381j910j4092o07m711K18K3180L379j817K6997q520J1193
6598E3414K0556O817j6235j3134J9947P607L918l628q529N714l405k7050l4000
6585A1992j7330L5512K698r114k0745J212j9966J781K8862M5220L5770j9701j3740
6572F2451k031j1308P305M0969J6719m3126M907j3936J9310j7196R560P31m9693
$$ plain form
6665 741 12899 9521 14123 20596 35100 41251 37686 52838 41211 36073 35090 24914 58953 48413
6651 48413 68141 39994 32728 47715 39540 50635 68654 52187 58102 65971 64433 68435 37284
6638 37284 27794 16635 20355 34111 69043 80957 45433 22164 26165 49587 57156 48388 57415
6625 57415 64295 81766 83509 63785 36109 23318 74969 96131 85299 44634 35922 33944 29807
6612 29807 13894 15723 20104 18194 4102 3495 -1216 -998 22182 25561 23744 50741 42221 53414
6598 53414 73970 80787 64552 51418 71365 78972 82890 79262 70733 76447 73042 45992 11992
6585 11992 -5338 30174 32872 23758 3013 4225 -15741 -13960 14902 60122 95892 76191 62451
6572 62451 60420 49112 56417 97386 114105 70979 75886 61950 81260 64064 73624 74355 24662
6559B4662k3578P497L4874M0542J9883n0096r434P482q19j3619L6958p21J9512
6546I3143p733M612l1715j8645K9221M0356r08M048k1934j3551P190k4104N468
6533F5448J206k1006r794j970Q761p53l083Q486k0258K799k583O522L7896p993
6519F3678l6513L1247Q645k894l967q85K6520J3353o425j0567k02J0923k2534
6506G0379L5304j3029k6868j7956j554J7555K1962l811L0575J2909j8257J5918
6494A23127K609L631L809L2063L3981M7358K9538l602n8122k1166m863m0583k8864
6481A18916m650j8973l2295q899K6755L055j9546j8814l4745L1467j343M8967
6469H9895m157k8662N859N91l972J0406N4733J3221n0987j703M342k1983K8718
$$ plain form
6559 24662 1084 8581 43455 83997 103880 53784 44350 51832 51013 37394 74352 73631 93143
6546 93143 85410 90022 58307 39662 68883 109239 108331 112379 90445 76894 84084 59980 65448
6533 65448 66654 45648 35854 33884 42645 41892 38809 47295 27037 29836 27253 33775 71671 63678
6519 63678 27165 58412 67057 64163 60196 59311 85831 99184 92759 82192 81990 92913 70379
6506 70379 105683 92654 65786 47830 46276 63831 85793 81982 112557 125466 107209 123127
6494 123127 125736 129367 133176 165239 199220 246578 276116 272514 214392 193226 188363 147780 118916
6481 118916 114266 95293 62998 54099 80854 83909 64363 45549 10804 42271 40928 89895
6469 89895 85738 57076 62935 63526 59554 69960 124693 137914 86927 85224 89566 67583 96301
6456I6301K7106o868j9337R39l949j8590k1554j7761j9107K2937L142l468N400
6443D5191J93Q814k798K6063J4234m2834L1436R706P196K9803J7981j3133n2000
6430G9852o808M8558j3449J2878N463l1824j8525l0480K0800N606O007o932J1144
6417H2290l3407O566k074J9959q745k601p317N2146J6748m6167K236K4921J3347
6404A17902j8714k5126r977o163K6281L2210k3728m5086j9223K5678J9516j2930
6392F0640k1155j0169j7274L6945l7373p755M6271J7205j167q595K1241O662j7356
6379F8120K0277k2677J6716K0390R336j9903k4778J0425J4252N112J8425l2882
6367H2813l1828J1219K0378j6303N6002n403l3343M780j0611l185M197K3826L1657
$$ plain form
6456 96301 123407 116539 97202 98141 94192 75602 54048 36287 17180 40117 43259 39791 45191
6443 45191 45384 54198 51400 77463 91697 48863 80299 90005 97201 127004 144985 131852 79852
6430 79852 73044 121602 108153 121031 126494 94670 76145 45665 66465 72071 78078 71146 82290
6417 82290 48883 55449 53375 73334 64589 61988 54671 106817 123565 77398 79634 104555 117902
6404 117902 99188 74062 64085 57922 84203 116413 92685 47599 28376 54054 73570 60640
6392 60640 39485 29316 12042 48987 11614 3859 50130 67335 66168 57573 78814 85476 68120
6379 68120 88397 65720 82436 102826 112162 92259 67481 77906 92158 97270 115695 82813
6367 82813 50985 62204 82582 66279 122281 116878 83535 88315 77704 74519 78716 102542 134199
6354A34199J1383m1096N087L5019k2672q323P111j0219J5685m74j1375o491j3255
6341I4579j5890r274O691l3170n000k4092M9616K6970r663k3288J3860K8586q719
6328I1206J6320R510K1994k3669o716M1031R035m1246j4815P908l4K6006J8971
6315A55501p241k8841j7118j7883J1052J1530l5064J368J1237M6784J8292n600
6303A44017l2946k5956j2783L6026K0072K5748K5890n872j5067j4486j0737K0531
6291A54437M019k3959p941O526k3782Q94K7891M526m5403k799J4332n201k5477
6278G8063K1355L4241j6456j2934O150k2826l08K2868L0262K4161k274j3527m085
6265A44690N759L0890k59k5340l9303O271J3877J0768o465j0769J331P813k819
$$ plain form
6354 134199 145582 104486 109573 144592 121920 113597 120708 110489 126174 125700 114325 107834 94579
6341 94579 78689 69415 76106 42936 37936 13844 63460 90430 80767 57479 71339 99925 91206
6328 91206 107526 117036 139030 115361 108645 149676 158711 117465 102650 110558 110524 136530 155501
6315 155501 148260 119419 102301 84418 95470 107000 71936 73304 84541 131325 149617 144017
6303 144017 111071 85115 72332 108358 128430 154178 180068 174196 159129 144643 133906 154437
6291 154437 158456 134497 126556 133082 109300 110194 138085 142611 97208 94409 108741 103540 78063
6278 78063 99418 133659 117203 104269 110419 87593 87285 110153 140415 164576 162302 148775 144690
6265 144690 150449 181339 181080 155740 116437 122708 136585 147353 140888 130119 131450 139263 136444
6252A36444n742J1846J5646Q162k253J9111o045r462O616K1457J0765J7293o318
6239B17520j1322j6155k1371L9838L9951j6745m6316l7394J7201R984J5141L566
6227A93898J2149k0365k2358j2084r840K1548p983q674J9421J0854k37J6642K4913
6214B17884K3171j2348j8381O452o212J235O375k2246O158J3332k1881M926m796
6201A93669L9852q372P673l600o507p181j5280K5890Q78K1507j2657M446k891
6188B37427P741K3523L5688p321J4189p565J6203M040r576j082P444J7671k2272
6175C16110l2816M427L4791L2702P870k1365L549m612l971M2071L3994K2393K8306
6162D63449p434k4605L4140O4235L2267j4968Q308q422l1959K5150L5026K2156
$$ plain form
6252 136444 130702 142548 158194 166356 164103 183214 177169 167707 174323 195780 206545 223838 217520
6239 217520 206198 190043 168672 208510 248461 231716 185400 148006 165207 175191 190332 193898
6227 193898 206047 185682 163324 151240 141400 162948 154965 146291 165712 176566 176329 192971 217884
6214 217884 241055 228707 210326 216778 210566 211801 218176 195930 202088 215420 193539 198465 193669
6201 193669 233521 225149 232822 229222 222715 215534 200254 226144 227022 248529 235872 240318 237427
6188 237427 245168 268691 304379 297058 311247 303682 319885 323925 314349 313267 320711 338382 316110
6175 316110 283294 287721 322512 355214 363084 341719 345268 340656 336685 378756 412750 435143 463449
6162 463449 456015 431410 465550 529785 562052 547084 555392 546970 515011 540161 575187 597343
6150E97343j2891J7606j784J1106k2606M073j8708Q450K7876J327o014j419M4034
6137F48393L9220K0719J259L592J6917l606N034J6045M6295L299Q865k1128N830
6124G90734J6255L1186J8566J5069k5246m022M0610N9361P4052K3573J2991L648
6112A056777K4827M9259M5149R5864j661L0784K8232P4007L0357K5238K2562O6170
6100A547565N6419Q3697N3927M1791Q6845J19555J29615R2085R1538J03394R6076
6089B502507J00985J39723J27674J30830J06302J47729J38401J65097J92539J94061
6079C945848K43449K14791K49927L42284L99391M65730N64107O98307Q58696J073613
6069I056143J232516J597938K070422K751542L902197N205656N606694L547644
$$ plain form
6150 597343 584452 602058 600274 611380 588774 592847 574139 582589 610465 611792 605778 604359 648393
6137 648393 687613 708332 709591 713183 730100 726494 731528 747573 793868 797167 806032 784904 790734
6124 790734 806989 838175 856741 871810 846564 842542 883152 942513 1016565 1040138 1053129 1056777
6112 1056777 1081604 1130863 1176012 1271876 1270215 1300999 1329231 1403238 1433595 1458833 1481395 1547565
6100 1547565 1603984 1687681 1741608 1783399 1870244 1989799 2119414 2211499 2303037 2406431 2502507
6089 2502507 2603492 2743215 2870889 3001719 3108021 3255750 3394151 3559248 3751787 3945848
6079 3945848 4189297 4404088 4654015 4996299 5395690 5861420 6425527 7123834 7982530 9056143
6069 9056143 10288659 11886597 13957019 16708561 20610758 25816414 31423108 34970752
6061C4970752m455515q129425n584377l639868k387151j720424j227169j049978
6053F776845q42190o94927n71190n05929m34033l51314k71650k46195j90880k00836
6043B467701j35353j84761j35719j37608j07693r5184o3422o6027m7611o8425
6033A425898n2870n4811m9337n8849j0440L183l4346l0069l6395k2789n2113r2626
6021I34436j0442l9715k723m4330n9095k8379l1463o8061m421j3086k7262m851
6009F00608m1113k4632j1250J4325L6368r025m6254q987K1856K1224j0759k4342
5997E18019j6907l8800O683M2377P330j9245m5144k5008J3206K9075l9663L491
5985D35414l925k3927k3548k3624K7365l4337l3779j1481K890j119K440j6500
$$ plain form
6061 34970752 30515237 22385812 16801435 13161567 10774416 9053992 7826823 6776845
6053 6776845 5934655 5239728 4668538 4162609 3728576 3377262 3105612 2859417 2668537 2467701
6043 2467701 2332348 2147587 2011868 1874260 1766567 1671383 1607961 1541934 1494323 1425898
6033 1425898 1373028 1318217 1268880 1210031 1199591 1202774 1168428 1138359 1101964 1079175 1027062 934436
6021 934436 923994 884279 881556 837226 778131 749752 718289 650228 645807 632721 605459 600608
6009 600608 559495 534863 523613 537938 574306 565281 519027 510040 531896 553120 542361 518019
5997 518019 501112 462312 468995 511372 518702 499457 454313 429305 442511 471586 431923 435414
5985 435414 431489 407562 384014 360390 387755 353418 319639 308158 311048 309929 312369 295869
5973B95869J079P320K9491q77l2307j8120M8654q843l167N166k8j7985j4847k4307
5959B67098j6416J9349j3272l7957J050k2662j6779J5734N295k877l1657j1239
5947A55667J152O3672m267J657J8279o008Q215M6305l464k71k7028j4882k0757
5934B18270j1567j3864p01J1267k0124j3439l0936r823p717J7139J7510O526O60
5921A63201N427J0160L899j8932J7615L2514p548M600k0099k6159k0796J0135
5909A54017K7819j8125j2469j8468l7908K2584N711m603r044j3321N548j6852
5897H4889m750l708M7644j200n119r457k9506K5853J4216K4971q53j4689K1002
5884A49293j6887l133j7467J0893K4391K1416l2012l5285Q355k2244P616j3676
$$ plain form
5973 295869 296948 304268 333759 332882 300575 282455 331109 322266 319099 324265 324237 306252 291405 267098
5959 267098 250682 270031 256759 218802 219852 197190 180411 196145 201440 198563 166906 155667
5947 155667 156819 220491 216224 217881 236160 230152 238367 284672 281208 280937 253909 239027 218270
5934 218270 206703 192839 192138 203405 183281 169842 138906 129083 121366 138505 156015 162541 163201
5921 163201 168628 178788 182687 163755 181370 213884 206336 210936 190837 164678 143882 154017
5909 154017 181836 163711 151242 132774 94866 117450 123161 118558 109514 96193 101741 84889
5897 84889 80139 76431 124075 122875 117756 108299 78793 104646 118862 143833 142980 128291 149293
5884 149293 132406 129273 111806 122699 147090 168506 136494 101209 109564 87320 94936 81260
5872H1260j4674P585K4835P068J6445k417O459J5806K8234J7206j7831k9297l1436
5859A09243M8343M4588l3626n2881k6795K8739J8819K2189l245n1566l0696k9709
5847D3403p830K8062k6051J5558M4523k192k1806k3280R758L1564J804J1727q204
5834I7036K57O52o885J4626J8529R212l4505n450J7688N198J6879j3261l6720
5821H3256j9559j8657J7843K2226j0015P946j1079K1835k65k3640k2889K0751
5809F7753L8733J3769q589j1425L0357J0525O680K2157j8304j1404j8137l7035
5797H5080o39Q437q823k3718J8933k6241j4304J4881M4319J9123k1431j3769J5452
5784I7300K3213p433k1420K1189o881L99n975n171n436K6384j5508k2460k7651
$$ plain form
5872 81260 66586 74171 99006 106074 122519 120102 126561 142367 170601 187807 169976 140679 109243
5859 109243 157586 202174 168548 115667 88872 117611 136430 158619 155374 103808 73112 43403
5847 43403 35573 63635 37584 53142 97665 95473 73667 50387 60145 91709 93513 105240 97036
5834 97036 97293 97945 91060 105686 124215 133427 98922 93472 111160 116358 133237 119976 83256
5821 83256 63697 45040 62883 85109 75094 83040 71961 93796 93531 69891 47002 67753
5809 67753 106486 120255 111666 100241 130598 141123 147803 169960 151656 140252 122115 85080
5797 85080 84441 92878 84055 60337 79270 53029 38725 53606 97925 117048 95617 81848 97300
5784 97300 120513 113080 91660 112849 105968 106367 100392 95221 89785 116169 100661 78201 50550
5771E0550L348J2984O594K1366j4927n979R092Q208j9182P26k463J4629K3935
5758A08881j069R731J1098j5826n794J0931M6437J390j8990J5455K2782J3136
5746A98162p913o2736j778j6673j0201O386Q788k9547j5124M5589R699j9962k48
5733A04442J1898j9392O650q974O290L2377K4818k0579m2590j4249J2308J2529
5721A05528N668J8462j0186k4854j2962P806o127K1102L8513R110m0177n2481
5709E9402k604K5827J5198j1553M858L4588K5903j6118J610J4930K257r854K628
5696A47072r445n148j953j2220j3802R225R452J9575l904k3271J3917N053k3005
5683A11546P276J2755n328K1547P35j9865K1225J4238O912p992k8716l249K8934
$$ plain form
5771 50550 53898 66882 73476 94842 79915 73936 83028 91236 72054 72780 70317 84946 108881
5758 108881 107812 117543 128641 112815 107021 117952 164389 165779 146789 162244 185026 198162
5746 198162 190249 127513 125735 109062 98861 105247 114035 84488 69364 114953 124652 104690 104442
5733 104442 116340 96948 103598 94624 100914 133291 158109 137530 94940 80691 92999 105528
5721 105528 111196 129658 119472 94618 81656 89462 83335 104437 142950 152060 111883 59402
5709 59402 56798 82625 97823 86270 91128 125716 151619 135501 137111 152041 154298 144444 147072
5696 147072 137627 132479 130526 118306 104504 113729 123181 142756 138852 115581 129498 134551 111546
5683 111546 118822 131577 126249 147796 148531 128666 149891 164129 171041 163049 134333 131084 160018
5670A60018M7799k6951j5666K614k868j1257L4516R425k9490q076K3711j4542
5658A69233j6090j3071m998k4254M1285K2709m21m5198k9178M3142K2648J9176
5646A84983P307J6862l633k4439l342N5734N88L425j7439p964p711J5079L4368
5633B53818L1609K0127K1846j3623l8864m7313r518j9374k0817N820L4077k0727
5621A97061j0022J8596P740L3230l518k3865l5197j2083M8877J7553k691n2346
5609A83335k5352p078m302J1511j962N146M1322k1013l2809J6444J1304J4793
5597A91339L9812P608k3163j1592J5550p076k3857M3776O2356r833m8547o032
5585B30341J4855M0736R872L8840l7707n5757n059j4463j7311P568J439K3941
$$ plain form
5670 160018 207817 180866 165200 167814 164946 153689 188205 197630 168140 160064 183775 169233
5658 169233 153143 140072 135074 110820 152105 174814 174393 129195 100017 143159 165807 184983
5646 184983 192290 209152 205519 181080 177738 233472 234060 237485 220046 212082 204371 219450 253818
5633 253818 285427 305554 327400 313777 274913 227600 218082 198708 177891 183711 217788 197061
5621 197061 187039 205635 213375 246605 243087 219222 184025 171942 220819 238372 235681 183335
5609 183335 157983 150905 146603 158114 156152 161298 202620 181607 148798 165242 176546 191339
5597 191339 231151 238759 215596 204004 219554 212478 188621 232397 294753 284920 236373 230341
5585 230341 245196 285932 295804 334644 296937 241180 236121 221658 204347 211915 213354 237295
5573B37295J0052n786j1165k4557L7756L0361J5264O234P550J0464K8773K2713
5561C64954N142L6570J1526L0022K5204K2266N1778K9357J693n1147o7917n8112
5549D01336m3639j0102K3170N855Q061k4461L364J1593J1412M9837L0595L095
5537D70116L866O529j8028O529N4659Q3056M2386N3277K7685M1167N5816j62m8280
5524G78616o5636q2395q5670p2345l2863k1323J0667k1579j5429l8475J7738K0085
5512C91391L8883K0480l4061O495O954O601L9620J8573K4173P732M9183L9508
5500F15532N402J0977r015k8829P686o2872o2117k8478j3417j7138J4901R207
5488D41839Q800J279j8105p176n841K608K8623K3563m410q614p34J2886j0038
$$ plain form
5573 237295 247347 241561 230396 205839 243595 273956 289220 295454 303004 313468 342241 364954
5561 364954 370096 406666 418192 448214 473418 495684 547462 576819 578512 527365 459448 401336
5549 401336 357697 347595 370765 376620 384681 360220 363584 375177 386589 436426 467021 470116
5537 470116 473982 480511 462483 469012 523671 606727 649113 702390 730075 771242 827058 826896 778616
5524 778616 712980 630585 544915 472570 439707 418384 429051 407472 392043 353568 371306 391391
5512 391391 430274 450754 416693 423188 430142 436743 476363 494936 519109 526841 576024 615532
5500 615532 620934 631911 622896 594067 601753 538881 476764 448286 434869 417731 432632 441839
5488 441839 450639 451918 433813 426637 420796 423404 452027 475590 471180 462566 461832 474718 464680
5475D64680j7011j2802J9822M4364l0846k7246n183K772K4404p293k4956j2253
5463D18452K011J8264K2386J5675q19j9396O478j6925K3565l139J9837l2277m914
5450D49198M746M624k2370M2868J3806J7028J2024k9378n2320q901M073M3800
5438D79198K1551K4716R358J4559k0708l653o169J5273J1584L1340j2034K7218
5426E92233k7786n231K0362R634L8976M082j8665j6853j1270o514r80J2892l8422
5413E52458m321J3845j1757K1180R607j284J1433k3803j0572M2135J9418J4579
5401F32918R360K4199L895J749m573m932j4601K3729J0380j5567p248K4284J616
5388F85209N402k5405p473k673Q779M214j2809o180M085L646J2043J2316Q642
$$ plain form
5475 464680 447669 434867 454689 499053 468207 440961 435778 438550 462954 455661 430705 418452
5463 418452 420463 438727 461113 476788 475969 456573 463051 446126 469691 466552 486389 454112 449198
5450 449198 453944 458568 436198 479066 492872 509900 521924 492546 440226 431325 435398 479198
5438 479198 500749 525465 534823 549382 528674 525021 518852 534125 545709 577049 565015 592233
5426 592233 564447 559216 579578 589212 628188 632270 613605 596752 585482 578968 577988 590880 552458
5413 552458 548137 561982 550225 571405 581012 579728 591161 567358 556786 598921 618339 632918
5401 632918 642278 666477 670372 672121 667548 662616 648015 671744 682124 666557 659309 683593 685209
5388 685209 690611 665206 657733 655060 663839 668053 655244 649064 653149 656795 668838 681154 689796
5375F89796o756J2833M5618L1398j534J0692n855R353L7644o26l8161N321M1255
5362H30978L816j8142K862j5213J3737m102J8630J5946K2137k1480K9523J7774
5350H96466j9820p370K8740J6646J736n391J7025K3610N7331K0674K1888m4482
5338A007053n258K3261K4709q688j251M891N228j449k6687p750L3724K1853j9885
5325A049751j2932J6358K9468K2443j460j0530O508N6039O3869J6669Q307M4678
5313A289168K8931K4883M1531J1131j2476K6371K1439J0594N97j9466O586q829
5301A420460K3150K1897M0879J4839P852j5062K0628M5334O0168Q1927N6717N8415
5289A837204O4019M4761K6811K7609O7945N9231O8995N6308N2609L4372J142Q626
$$ plain form
5375 689796 683040 695873 741491 772889 771355 782047 776192 785545 823189 822563 784402 789723 830978
5362 830978 834794 816652 819514 804301 818038 813936 832566 848512 870649 849169 878692 896466
5350 896466 876646 869276 898016 914662 916398 911007 928032 951642 1008973 1029647 1051535 1007053
5338 1007053 1001795 1025056 1049765 1041077 1039826 1044717 1049945 1048496 1021809 1014059 1047783 1069636 1049751
5325 1049751 1036819 1053177 1082645 1105088 1103628 1093098 1099606 1155645 1219514 1236183 1244490 1289168
5313 1289168 1318099 1342982 1384513 1395644 1383168 1409539 1430978 1441572 1442169 1422703 1429289 1420460
5301 1420460 1443610 1465507 1506386 1521225 1529077 1514015 1534643 1579977 1640145 1722072 1778789 1837204
5289 1837204 1901223 1945984 1972795 2000404 2068349 2127580 2196575 2252883 2305492 2339864 2341006 2349632
5277B349632J1211J513M4505M5851R093K8908L0274Q967N1994K4426O5750K9878
5265B702002J04134P8381R2870Q4786Q3621J04089Q9071O4747J17987R2834N2023
5254C666545M9619K8282P3018P0227O0258Q3513O7418O3197O7323P3646N1723
5243D354769Q3109J05668J03338J07083J27187J08856J11080J20037J44300J42126
5233E507553J79485J96973J58532J57508J66052J91401K23684K57372K56442K70860
5223G565862L01432K70291K44208K95570L17945L31995L17632L39731L57521M05168
5213A0747355M47038N08656N41456N53525O21404O88006Q07975R04562J012318
5204A6832295J214532J455928J806960K161272K664807L310053M133406N319712
$$ plain form
5277 2349632 2360843 2362356 2406861 2452712 2461805 2490713 2520987 2529954 2581948 2606374 2672124 2702002
5265 2702002 2806136 2884517 2977387 3062173 3145794 3249883 3338954 3403701 3521688 3614522 3666545
5254 3666545 3716164 3744446 3817464 3887691 3947949 4031462 4098880 4162077 4229400 4303046 4354769
5243 4354769 4437878 4543546 4646884 4753967 4881154 4990010 5101090 5221127 5365427 5507553
5233 5507553 5687038 5884011 6042543 6200051 6366103 6557504 6781188 7038560 7295002 7565862
5223 7565862 7867294 8137585 8381793 8677363 8995308 9327303 9644935 9984666 10342187 10747355
5213 10747355 11194393 11703049 12244505 12798030 13419434 14107440 14915415 15819977 16832295
5204 16832295 18046827 19502755 21309715 23470987 26135794 29445847 33579253 38898965
5196C8898965O716246P457353O156682J170647n343628q027547o832850m888609
5188C5307259l349447k367461j628883j137361p13022l41620n1687J95390M91308
5179B6404476P28226R95041J290485J718920K246693K849393L588924M532697
5171D4354855N732910P426792R635234J1852301J2903318J0484070K257171q209794
5163I6436857j4475197j4670336j1558120q282041n899035m446152l410433k688409
5155C1007134k049906j585680j209000q59329n80527l43154p5084K73010O92816
5146B5270280J071328J473141J990335K623726L420242M559437O006655P105774
5138E3520918O421825K132399m515801r092457r154506o825109m827384l493496
$$ plain form
5196 38898965 45615211 53072564 59229246 60399893 55056265 47028718 40195868 35307259
5188 35307259 31957812 29590351 27961468 26824107 26111085 25769465 25717778 25913168 26404476
5179 26404476 27132702 28127743 29418228 31137148 33383841 36233234 39822158 44354855
5171 44354855 50087765 57514557 67149791 79002092 91905410 102389480 104646651 96436857
5163 96436857 81961660 67291324 55733204 47451163 41552128 37105976 33695543 31007134
5155 31007134 28957228 27371548 26162548 25303219 24722692 24379538 24304454 24577464 25270280
5146 25270280 26341608 27814749 29805084 32428810 35849052 40408489 46415144 53520918
5138 53520918 59942743 62075142 57559341 48466884 39312378 32487269 27659885 24166389
5130B4166389k709849k188190j774798j465963j231263j017805r08591p70068
5122A2099862o56320n28792m31109l66668k90256k22002j44171o7304L1137J17884
5112I542261o871j33826k52155k22918p1611Q5949K77229N26933P76753P57842
5102A1279586K79536q55301j384287j070528p49998n37357l94529l56979l00166
5093E909977k29949j61122j72129j61595j46116r3554k7937k9262K4011N9606
5083D971930N2252M6945p0370j51210j33579l3409O7966J39999J58227K01454
5073E250205K75761M40333P03260R04618R58009O11267n32166j349644j154624
5064F107019q03735n71296m33614l17380k95089k65666k52099j67620j53633j36156
$$ plain form
5130 24166389 21456540 19268350 17493552 16027589 14796326 13778521 12869930 12099862
5122 12099862 11443542 10914750 10483641 10116973 9826717 9604715 9460544 9393240 9424377 9542261
5112 9542261 9535390 9401564 9149409 8926491 8854880 8940829 9218058 9744991 10521744 11279586
5102 11279586 11559122 10703821 9319534 8249006 7499008 6961651 6567122 6210143 5909977
5093 5909977 5680028 5518906 5346777 5185182 5039066 4945512 4917575 4888313 4912324 4971930
5083 4971930 5024182 5071127 5000757 4849547 4715968 4682559 4750525 4890524 5048751 5250205
5073 5250205 5525966 5966299 6669559 7574177 8532186 9143453 8611287 7261643 6107019
5064 6107019 5303284 4731988 4298374 3980994 3685905 3420239 3168140 3000520 2846887 2710731
5054B710731j20700j07089p1621o3122r616j3892j9254J0735J5091K7491M2384
5043B401138J9427P1221M3784O6794R7808J36059J83356K31233K58837K36680
5033C746337j31699m54076m69628l47445k85915j81470j18635j17107j09891p0561
5023A459910m1751o0472k4209k0286l9002j9937j3591k0882K0700j1238k9517
5012A199725k0053j2094k0188m7409n4222l0938l7063J451l9305n0655j6868k2256
5000H50125J2940k8586j7568K5920k1999j437J2444J6017k9473J1993p12N994
4988H35658J4494o135j0509L187m249j1778m4743m378k6869k9384j7617k1630
4976F76047k5229M157l2111J044k2122J3503J2185K6860j9172j4332K8871K6049
$$ plain form
5054 2710731 2590031 2482942 2411321 2348199 2338583 2324691 2305437 2316172 2331263 2358754 2401138
5043 2401138 2420565 2491786 2535570 2602364 2700172 2836231 3019587 3250820 3509657 3746337
5033 3746337 3614638 3160562 2690934 2343489 2057574 1876104 1757469 1640362 1530471 1459910
5023 1459910 1418159 1357687 1333478 1313192 1274190 1254253 1240662 1219780 1240480 1229242 1199725
5012 1199725 1179672 1167578 1147390 1099981 1045759 1014821 977758 979209 939904 889249 872381 850125
5000 850125 863065 834479 816911 842831 820832 819395 831839 847856 818383 830376 829664 835658
4988 835658 850152 844017 833508 836695 832446 820668 775925 771547 744678 715294 697677 676047
4976 676047 650818 654975 622864 623908 601786 615289 627474 654334 635162 620830 649701 675750
4964F75750K381k2540M8513J3532l462J62k3142k379M4267L2256j3737J3541K4486
4951G89628l3533q1155n3737l4854l0131j7873k7620n3889m066m2786L4400K2604
4939D66988k94J7117N464P975m757N6156M4257K6667k8545j3458J4795L2969J2985
4926F38319K5933J9634M8616M4175O4768P2524N1449R3259J16749N13j27129j44034
4914I04776j18024p6131m8854l2318N701j1746j6492q855j8775N022P119l5197
4902E56226k3844k0284J6286Q913k928l9424n64L1536l495M270L2095R291L5127
4889F03205M4315P2317J1347J09117J63586J26529L9365o9777j47989j04231r1744
4878G56040n8372m7709k3220k4887L715o5302m2917j8804q035m078o0482n2988
$$ plain form
4964 675750 678131 655591 704104 717636 714174 714336 691194 688815 733082 765338 751601 765142 789628
4951 789628 756095 674940 621203 586349 556218 538345 510725 456836 452770 409984 444384 466988
4939 466988 466694 483811 489275 497250 492493 548649 592906 619573 591028 577570 592365 625334 638319
4926 638319 664252 683886 732502 776677 841445 913969 965418 1058677 1175426 1175939 1048810 904776
4914 904776 786752 710621 661767 629449 635150 623404 606912 598057 579282 584304 591423 556226
4902 556226 532382 512098 528384 537297 534369 494945 494381 525917 522422 526692 558787 568078 603205
4889 603205 647520 719837 731184 840301 1003887 1130416 1169781 1100004 952015 847784 756040
4878 756040 697668 649959 626739 601852 605567 540265 497348 478544 470509 466431 405949 352961
4866C52961j8715O055K9640k65K1982K914J745j5662P632N7035K3322L1297K2642
4853E22583L9687M2538N5040N7793K5591J1932O155p860k5841l3790m6116p9282
4841E68430n0359k9967m8894k8322j6036k6298M3403j6710l3631K1311N0193L8617
4829D71737N5641N2686N2650Q688m7099n8964J694k3086k3452l4223M0840n34
4817D96578m1631l3533j1127o421L5185J4815l7305j5184J0351j7526J5972R829
4805D20003J5506N2479R1896O1615O1193Q0569N0612J4278m8487p5779q9951k7345
4793F06589j4147o5257l4438l4847j5009l1558J3193J4792j5034m4768m7602k2496
4781C09418K0666l456K1875L8862l4146M2066O2661L1737M5251O1370N6616k2501
$$ plain form
4866 352961 334246 340301 369941 369676 391658 394572 396317 380655 388287 445322 468644 499941 522583
4853 522583 562270 604808 659848 717641 743232 755164 761319 753459 727618 693828 647712 568430
4841 568430 518071 488104 439210 410888 394852 368554 411957 395247 361616 382927 433120 471737
4829 471737 527378 580064 632714 641402 594303 535339 537033 513947 490495 456272 497112 496578
4817 496578 454947 421414 410287 403866 439051 453866 416561 401377 411728 394202 410174 420003
4805 420003 435509 487988 579884 641499 702692 783261 833873 848151 799664 723885 633934 606589
4793 606589 592442 527185 492747 457900 442891 411333 424526 439318 424284 379516 331914 309418
4781 309418 330084 326628 348503 387365 353219 395285 457946 489683 534934 596304 652920 630419
4769F30419l7684m6996m5700O946l7120l1804k2582j9964o1270j2563K4337R22
4757C46941j5418m603j302p983k314j4029K0669O290l42M4170L0775M25j2784
4744C90495L1186M3894M1376L7527Q362J7828L2926N1564l105k8491n9408k3511
4732E40643l3560l5159j8775Q031k2738m6239P113L096j6534J5245K0086J4065
4720D35274J8260l799P945J068N6784M6688K678L9671K5873K1784M9517R8915
4708H00658Q8821J6749L5421q3674n2250o5408j06342o6925m4451O903j0411o298
4696E12793l5569j3127J3989K1024M2724l6325R46K1484J6851L3549M595k1543
4684E61391m789J5354K3878M1126L1850K802L1898J9264J4153o1554m8414l3671
$$ plain form
4769 630419 592735 545739 500039 506985 469865 438061 415479 395515 334245 321682 346019 346941
4757 346941 331523 326920 325618 317635 315321 301292 321961 328251 327909 372079 402854 403279 390495
4744 390495 421681 465575 506951 544478 552840 570668 603594 655158 652053 623562 564154 540643
4732 540643 507083 471924 453149 461180 438442 392203 399316 402412 385878 401123 421209 435274
4720 435274 453534 449735 457680 458748 515532 562220 564898 604569 630442 652226 701743 800658
4708 800658 889479 906228 941649 857975 805725 740317 633975 567050 522599 529502 519091 512793
4696 512793 477224 464097 478086 499110 541834 505509 506455 527939 544790 578339 582934 561391
4684 561391 556602 571956 595834 636960 668810 671612 703510 722774 736927 675373 626959 593288
4672E93288k1097m0642j0658l913l4875N398M487L0624P951q061J9501k1966j2550
4659E07487j8696P354J5241j694n547L6007L2402l6721j0511J8798K1583j5535
4647E50168P080O047l5004k5169M272M1365K0117J5724K086K2115L527o444k9249
4634E76635J27K7607O340L7177J7936k6838K1068J8039j0441m0010O691J7969
4622F52300K7092M9233n1339r815j1848q838J8814K591J3480N442R253K7246J3003
4609G36614K8152R696P876M113L6300K9707J2935J3158m178L900K2289K6101J2622
4596I39285l605N0602K38K6425J1610k0786k1401p463M7019J6407K0822j63j5355
4583A043635J4761L9209M9212k6745l016N5333K4182J5941R313k6594K1337L3123
$$ plain form
4672 593288 572191 531549 520891 516978 482103 487501 491988 522612 530563 522502 542003 520037 507487
4659 507487 488791 496145 511386 509692 504145 540152 572554 535833 525322 544120 565703 550168
4647 550168 557248 563295 528291 503122 507394 548759 568876 584600 586686 608801 612328 605884 576635
4634 576635 576762 604369 610709 647886 665822 638984 660052 678091 667650 627640 634331 652300
4622 652300 679392 728625 677286 667471 655623 646785 665599 668190 681670 687112 696365 723611 736614
4609 736614 764766 774462 782338 786451 822751 852458 865393 878551 874373 878273 900562 926663 939285
4596 939285 935680 986282 986520 1012945 1024555 1003769 982368 974905 1021924 1038331 1059153 1058990 1043635
4583 1043635 1058396 1097605 1146817 1120072 1117056 1172389 1196571 1212512 1221825 1195231 1216568 1249691
4571A249691l804j4164j2921J59L8103J5380J0221k971K3161m822J6243M3277
4559A357553M4737o567M8385M5463K4404L0813N8919P4750M444K1218O3973J8001
4547A786093L0743K1879O3625M3961O4436L8741K8630O0795L7816N8465Q2627
4536B317811Q5472J21207J25612J07122J34429R6200R6437J24287J60683J60100
4526C529360J07843J11281J35126J66702J33279J33605K54478K65142K66382K93336
4516E396534K72279L39334M17605N31270O65658Q01240R56399J171873J521985
4507A2074177J979288K631696L684580M923915N325301L315922m075897p418802
4499B2440180n142232l415558k258654j654848j199446j003284p43626o69972
$$ plain form
4571 1249691 1245887 1231723 1218802 1218961 1257064 1272444 1282665 1279694 1302855 1298033 1314276 1357553
4559 1357553 1402290 1395723 1444108 1489571 1513975 1544788 1603707 1678457 1682901 1704119 1768092 1786093
4547 1786093 1816836 1838715 1902340 1946301 2010737 2049478 2078108 2138903 2176719 2235184 2317811
4536 2317811 2403283 2524490 2650102 2757224 2891653 2987853 3084290 3208577 3369260 3529360
4526 3529360 3637203 3748484 3883610 4050312 4183591 4317196 4571674 4836816 5103198 5396534
4516 5396534 5668813 6008147 6425752 6957022 7622680 8423920 9380319 10552192 12074177
4507 12074177 14053465 16685161 20369741 25293656 30618957 33934879 29858982 22440180
4499 22440180 17297948 13882390 11623736 9968888 8769442 7766158 7022532 6352560
4491F352560n48452m01446l51519l04116k90252k69893j65138j52403j11946j62293
4481C595102j33636j43489j02434j06066m3916n1902k2527n8685j7660l0585Q33
4470B885035l3325L938K4273J8314L8396O0669P176j363j6199j0233K3583P139
4458C007403J9923J9062J9764M728n2532l0987K1375J39K559k998K6966N4423
4446C089825L8288O974P331L5324M8580M7082O2203P4567M3394O5333L2036O1534
4434C612471J04876O7245Q0819P5058O0612P1862P3724M3916P2177J04201Q1635
4423D448596R2061J10274P8521O7015P8117R5282J16819J15277Q4157R5253J06470
4412E487842J62436J53233J11557J22554J74988J67275K07625K11387K28554K47576
$$ plain form
4491 6352560 5804108 5402662 5051143 4747027 4456775 4186882 4021744 3869341 3757395 3595102
4481 3595102 3461466 3317977 3215543 3109477 3065561 3013659 2991132 2932447 2914787 2884202 2885035
4470 2885035 2851710 2855648 2879921 2898235 2936631 2997300 3004476 3003113 2986914 2976681 3000264 3007403
4458 3007403 3027326 3046388 3066152 3070880 3018348 2987361 3008736 3008875 3011434 3008436 3035402 3089825
4446 3089825 3128113 3135087 3142418 3177742 3226322 3273404 3335607 3410174 3453568 3518901 3550937 3612471
4434 3612471 3717347 3784592 3865411 3940469 4001081 4072943 4146667 4190583 4262760 4366961 4448596
4423 4448596 4540657 4650931 4729452 4796467 4874584 4969866 5086685 5201962 5286119 5381372 5487842
4412 5487842 5650278 5803511 5915068 6037622 6212610 6379885 6587510 6798897 7027451 7275027
4402G275027K59173L09360K65065K93795L11908L59350L70358L95253M45043M76973
4392A0761305M81338M58712L71124L65598M54623N35477O29248O66448O88658
4383A5412531P02078Q01589R22257J162378J438688J711777K142320K651596L381588
4374C0326802M354141N605434O868800P127948M618193o92860n552593p187379
4366D5468486n828435l900403k627615j932290j533534j325302r84621n51458
4358B6784828j52098J14098K27890L10616M65387P00719J057869J412909J839116
4349C2761334K357429K912322L666831M640965N949900P774389J0001476J1925470
4341H1990116J1950317Q182185k70245q275134j2795169j3595091j1029729q006918
$$ plain form
4402 7275027 7534200 7843560 8108625 8402420 8714328 9073678 9444036 9839289 10284332 10761305
4392 10761305 11242643 11701355 12072479 12438077 12892700 13428177 14057425 14723873 15412531
4383 15412531 16114609 16916198 17838455 19000833 20439521 22151298 24293618 26945214 30326802
4374 30326802 34680943 40286377 47155177 54283125 58901318 58208458 52655865 45468486
4366 45468486 39640051 35739648 33112033 31179743 29646209 28320907 27336286 26784828
4358 26784828 26632730 26746828 26974718 27285334 27750721 28451440 29509309 30922218 32761334
4349 32761334 35118763 38031085 41697916 46338881 52288781 60063170 70064646 81990116
4341 81990116 93940433 102122618 101852373 93577239 80782070 67186979 56157250 48150332
4333D8150332n840347m436829l376304k654940k087378j702746j343097j063322
4325B5645369q43399o66770l29360m491L05088O14594J007516J398060J723026
4316B8849633K051996K488586L218736M358550N764298O835877N862927J340947
4308F0771550n214121q895447q430627o419711m634295l408695k630663k134470
4300A9003521j829850j523644j288590j074910r12263q43737p14725o38114n13781
4291I663907m11568l55749k88755k04432j79000j87961k57014l28849l79198l09925
4281F761456k84849k46280k43269k36654j90965j62966r0710j25332j39988j38748
4271D901695j18577j35683j25490j46666j22923r6210j21688j29889j32836p5194
$$ plain form
4333 48150332 42309985 37873156 34496852 31841912 29754534 28051788 26708691 25645369
4325 25645369 24801970 24135200 23805840 23801349 24106437 24721031 25728547 27126607 28849633
4316 28849633 30901629 33390215 36608951 40967501 46731799 53567676 59430603 60771550
4308 60771550 55557429 46661982 38231355 31811644 27177349 23768654 21137991 19003521
4300 19003521 17173671 15650027 14361437 13286527 12374264 11530527 10815802 10177688 9663907
4291 9663907 9252339 8896590 8607835 8403403 8224403 8036442 7779428 7450579 7071381 6761456
4281 6761456 6476607 6230327 5987058 5750404 5559439 5396473 5305763 5180431 5040443 4901695
4271 4901695 4783118 4647435 4521945 4375279 4252356 4156146 4034458 3904569 3771733 3696539
4261C696539o9558o4715m3601m7434q668m8128m0287k0051J2717l7923o9678m0574
4249C218639k526O680J2301K1990L8459k4958l8452p5151r7453n3095o9297n0884
4237B886253o4509j25099q1466p7960m0820j1836q331n4714o2849l5580k8706
4226B294383Q028M0413K8733M0127M6556M1011N7683J09260J20878J57584J74074
4215C118730K19003K60827K53143K4049k62499l50282k83123k11096k12950j53760
4205B402042j30343j25312r7057p1178p2026l5190m9880l6474n6947K6975L0424
4194A785034k5874k571k6649m0439M0084k3320k8354q062j9699k1641k2186k5572
4182A580751M356o68J813l7323K8890J4254K0104q487r628J6254P195N63j1932
$$ plain form
4261 3696539 3626981 3562266 3518665 3471231 3462563 3414435 3374148 3354097 3366814 3328891 3259213 3218639
4249 3218639 3216113 3222793 3235094 3257084 3295543 3270585 3232133 3156982 3059529 3006434 2937137 2886253
4237 2886253 2821744 2696645 2615179 2537219 2496399 2484563 2476232 2421518 2358669 2323089 2294383
4226 2294383 2302411 2342824 2371557 2411684 2458240 2499251 2556934 2666194 2787072 2944656 3118730
4215 3118730 3337733 3598560 3851703 3875752 3613253 3262971 2979848 2768752 2555802 2402042
4205 2402042 2271699 2146387 2049330 1978152 1906126 1870936 1821056 1784582 1727635 1754610 1785034
4194 1785034 1759160 1756589 1729940 1689501 1729585 1706265 1677911 1669849 1650150 1628509 1606323 1580751
4182 1580751 1585107 1584439 1586252 1548929 1577819 1592073 1612177 1603690 1594062 1610316 1617511 1618074 1606142
4169A606142n5108k3717K1359k0176k4793L211m894N5032n260p591J3218K2817
4157A580240K6678N8658r051M530n4604j8884K3407M9748N3723O7867J16205M9696
4145A948213P6862P6405K9947K1699J0550n4086q0714k4078k4010M610r40K1314
4133B005772K1510m1324j09209r3787n3764l8323m6202j2760j0211l472R099l501
4121A623828O940j0066O2695R7897O1028L1613J29635J60662J46069J65611K30299
4110B706211K31119K37917J37003o0138j97891k65930k65610j97628j05916r8599
4100B120538p2650q9360j00151l7768j473p383K91m285k1563J5990L2235Q8760
4088A923181J3903l829M3069N7812O6224P2860M4885R8420J12905J53813J62805
$$ plain form
4169 1606142 1551034 1527317 1548676 1528500 1503707 1506918 1502024 1557056 1551796 1544205 1557423 1580240
4157 1580240 1606918 1665576 1656525 1661055 1606451 1587567 1610974 1660722 1714445 1782312 1898517 1948213
4145 1948213 2025075 2101480 2131427 2153126 2163676 2109590 2028876 2004798 1980788 1985398 1984458 2005772
4133 2005772 2027282 1985958 1876749 1782962 1729198 1690875 1644673 1631913 1621702 1618230 1627329 1623828
4121 1623828 1630768 1620702 1683397 1781294 1842322 1873935 2003570 2164232 2310301 2475912 2706211
4110 2706211 2937330 3175247 3312250 3252112 3054221 2788291 2522681 2325053 2219137 2120538
4100 2120538 2047888 1958528 1858377 1820609 1819136 1811753 1812044 1807759 1786196 1802186 1834421 1923181
4088 1923181 1937084 1933255 1976324 2034136 2100360 2173220 2218105 2316525 2429430 2583243 2746048
4077B746048K25446K47196L01022J89368m7819k41394k90229k55133j71001j23037
4067B580467j32209j19680r4832j17370q4472n7676j0305k5788j0149K1055Q003
4056A957044k1478Q945l9851k5564j6341k8067j4937J5524N2516L3713R5499O7063
4044B084066R446Q0724Q7853J38522R2626L8050l1629j9447l1089j00k7813J2839
4032B434048j4429j544N9760K6548K594m53o0893J7952M2453N6419M0206n0052
4020B552609j9730J9175J8891m2205n2926m815K6582k774k9969r2293k0338J4486
4008B366693P4050J08076K3823L5923O8399J05144R9697J42305J61042J49973
3998C335125J51695J31716Q3720J13045P9537P0231L8808N1845Q7821J15222J40141
$$ plain form
4077 2746048 2971494 3218690 3519712 3709080 3661261 3419867 3129638 2874505 2703504 2580467
4067 2580467 2448258 2328578 2233746 2116376 2031904 1974228 1963923 1938135 1927986 1949041 1957044
4056 1957044 1935566 1944511 1904660 1879096 1862755 1834688 1819751 1835275 1887791 1921504 2017003 2084066
4044 2084066 2093512 2174236 2262089 2400611 2493237 2531287 2499658 2480211 2449122 2449022 2421209 2434048
4032 2434048 2419619 2418075 2477835 2504383 2506977 2506524 2445631 2463583 2506036 2562455 2602661 2552609
4020 2552609 2532879 2552054 2570945 2528740 2475814 2470999 2497581 2494807 2464838 2372545 2352207 2366693
4008 2366693 2440743 2548819 2572642 2608565 2676964 2782108 2881805 3024110 3185152 3335125
3998 3335125 3486820 3618536 3702256 3815301 3894838 3965069 4003877 4055722 4143543 4258765 4398906
3987D398906J32344J14946J86059K36542K80587L82598M64225O64362Q38456Q92522
3977H591547M99897n02809p98292m49405k05094p6499q6752q179J2790P009o3104
3966F921109o7492j00122m6257n1430J5015O791J2053k8783j3704l944J17962
3955F761198J41501J18102O3616M6477K7997Q5405Q9427J25855J04539J48677
3945G712794P9541J02997J33337J60079R0990J23721R3452J99201K17210K93122
3935I206444K29369L18651K94654K98692K44194L11264L07466L52365L25133L99845
3925A2288077L01396L74099L74181M82915M76995N18069M52518M91218M92362
3916A6251830N89480O80263R11440R60998J195603J262877J265564J106833J078615
$$ plain form
3987 4398906 4531250 4646196 4832255 5068797 5349384 5731982 6196207 6860569 7699025 8591547
3977 8591547 9091444 8588635 7790343 7340938 7135844 7059345 6972593 6964414 6977204 6984213 6921109
3966 6921109 6853617 6753495 6707238 6655808 6670823 6677614 6689667 6660884 6647180 6643236 6761198
3955 6761198 6902699 7020801 7084417 7130894 7158891 7244296 7333723 7459578 7564117 7712794
3945 7712794 7792335 7895332 8028669 8188748 8279738 8403459 8496911 8696112 8913322 9206444
3935 9206444 9435813 9754464 10049118 10347810 10592004 10903268 11210734 11563099 11888232 12288077
3925 12288077 12589473 12963572 13337753 13820668 14297663 14815732 15268250 15759468 16251830
3916 16251830 16841310 17521573 18433013 19394011 20589614 21852491 23118055 24224888 25303503
3907B5303503R24793J022773J133590J267498J273046J371870J376062J516350
3899C5189485J602624J999224K291524K580678K556519K999033L583472M410916
3891E7213475N109236O250723P632343R544052J1262366J3900142J7602371K2732872
3883A51247580K9811208M1162080N0560840N0844994J9423566m7905973o8519682
3876B26624613m9819795l4133297k3634046j7670679j3580870j0930699q829788
3869F8025439p395582o197943n289477m331537l750244l107218k574412j988043
3861C3390983j683724j460019j498121j279137j148129q11653o13229l01411j25045
3852B4470515J56921L05226P24258R43004Q73404j91631p03439j68188N09430
$$ plain form
3907 25303503 26228296 27251069 28384659 29652157 30925203 32297073 33673135 35189485
3899 35189485 36792109 38791333 41082857 43663535 46220054 49219087 52802559 57213475
3891 57213475 62322711 68573434 76205777 85749829 97012195 110912337 128514708 151247580
3883 151247580 181058788 222220868 272781708 323626702 343050268 295144295 226624613
3876 226624613 176804818 142671521 119037475 101366796 87785926 76855227 68025439
3869 68025439 60629857 54431914 49142437 44810900 41060656 37953438 35379026 33390983
3861 33390983 31707259 30247240 28749119 27469982 26321853 25510200 24896971 24595560 24470515
3852 24470515 24627436 24932662 25656920 26599924 27473328 27281697 26578258 26410070 26919500
3843B6919500J216451K218584L270304L782396K694647k619436o610578n254554
3835B5617314l664462k563997k016685j531950j296090j052293r66529p44359
3827A1780949o78442n19350n07908l82169l55986k83385l30614k65633l33997
3818H123465k71712k63450j95930j80958j76098j78941j07116j51124j24621j40014
3808F333501q0178j53712j26636j66241j22701j21942p0218j12277j41229j40646
3798E097721j31130j34638q6451j19770j32388j45304j23140r3297m809m1166
3788D085628l3707q6448r5422k0375Q7761R3785P3749n9213j00799n6905p1360
3777C816694j17614j56987j54752j15538j29384j07746j43384j54595j30354r3096
$$ plain form
3843 26919500 28135951 30354535 33624839 37407235 40101882 37482446 30871868 25617314
3835 25617314 21952852 19388855 17372170 15840220 14544130 13491837 12525308 11780949
3827 11780949 11102507 10583157 10075249 9693080 9337094 9053709 8723095 8457462 8123465
3818 8123465 7851753 7588303 7392373 7211415 7035317 6856376 6749260 6598136 6473515 6333501
3808 6333501 6253323 6099611 5972975 5806734 5684033 5562091 5491873 5379596 5238367 5097721
3798 5097721 4966591 4831953 4745502 4625732 4493344 4348040 4224900 4131603 4126794 4085628
3788 4085628 4051921 3965473 3870051 3849676 3937437 4031222 4104971 4045758 3944959 3888054 3816694
3777 3816694 3699080 3542093 3387341 3271803 3142419 3034673 2891289 2736694 2606340 2513244
3767B513244r1812p5646o7017m6708J3279N6240N2733m428K3239k6211M1888N0290
3755B439091Q719m6738m6446k2758n1344l5974l8849m4937r3369j22563o6478
3744A878354m8081l2895m5964k7633k9616J5744J7000j0150Q242O392k3746l5169
3732A672478k7276n465J3816j1933l5170k6976m1378l1702k9855p303k9417j2304
3720A427515o2329l6350l6153J1346J9738l2712r1261m665P046P0230J7688K2946
3708A313039n7101m2142j038j7172J8564n953N7201K6538m5258n79o744P2494
3696A311849N8184J8310p7540j9172Q247j597J7974M6258L5275J0086Q651j895
3684A414630J9487P4289Q4822N3860L1575N3856L9787P2383O0797Q7107R5863
$$ plain form
3767 2513244 2421432 2345786 2278769 2232061 2245340 2301580 2354313 2349885 2373124 2346913 2388801 2439091
3755 2439091 2447810 2401072 2354626 2331868 2280524 2244550 2205701 2160764 2067395 1944832 1878354
3744 1878354 1830273 1797378 1751414 1723781 1694165 1709909 1726909 1716759 1725001 1731393 1707647 1672478
3732 1672478 1645202 1639737 1653553 1641620 1606450 1579474 1538096 1506394 1476539 1469236 1439819 1427515
3720 1427515 1365186 1328836 1292683 1304029 1323767 1291055 1199794 1195129 1202175 1272405 1290093 1313039
3708 1313039 1255938 1213796 1212758 1195586 1214150 1208197 1265398 1291936 1246678 1246099 1239355 1311849
3696 1311849 1370033 1388343 1310803 1291631 1299878 1298281 1316255 1362513 1397788 1407874 1416525 1414630
3684 1414630 1434117 1508406 1593228 1647088 1678663 1732519 1772306 1844689 1905486 1992593 2088456
3673B088456J55618R2255N9983N1727P7137J70440K42114K97676M14280N81513
3663D231199P69566P36526J86527o91885p96492o19629m50345m44592m42297l46829
3653B131749k55390j84707j28489j26830r0577n8527q5515o7099m4715m9552l6532
3642A003816K995k3742k4060l9970m4853j59L0594J9959R074m4365p9101l4377
3630G75811L522L495N127n0566N752K2257K367J982P563L2098J577j6778n622
3617G88585l6477k2843n372j7083n3060k9965m1377m3135m1031o800J4395J1842
3605E17679j6648l9820o3629J9191K5336N3580k0411k0450k085J9160q162N259
3593D69000Q514M4155L0092j7866q8286m8587K8085M0591N600j7384q5382l2282
$$ plain form
3673 2088456 2244074 2336329 2396312 2448039 2525176 2695616 2937730 3235406 3649686 4231199
3663 4231199 5000765 5737291 5923818 5231933 4435441 3815812 3365467 2920875 2478578 2131749
3653 2131749 1876359 1691652 1563163 1436333 1345756 1287229 1201714 1134615 1089900 1040348 1003816
3642 1003816 1006811 983069 959009 919039 874186 874027 904621 924580 933654 889289 810188 775811
3630 775811 779333 782828 787955 737389 743141 765398 767765 769747 777310 809408 810985 794207 788585
3617 788585 752108 729265 723893 706810 653750 623785 582408 539273 498242 491442 505837 517679
3605 517679 501031 461211 397582 416773 442109 495689 475278 454828 452743 471903 463741 469000
3593 469000 477514 521669 551761 533895 445609 397022 425107 465698 471298 453914 368532 336250
3581C36250L5030J6935j2432L3179n879J5229Q52P512k8896L9400O9599M3234
3569E50013l8251k4415N72P4345L2256L2320L7917J4995l6467j4809j0128L3776
3557F52124L4127k502j9249m860L5349K0764N4001O8068M0898O8571J04851J45295
3545A197437K20155K95211K87530J26567k09455l63604k57143j73041r5965o2259
3535I65433q5667j05897o2064k2717l6097m3237l6253o4543o0055m512P365j0354
3523D41402j9211m296J1722k791R713P304R111K0424L4489J8388p534m2517M549
3510D80753K939M1690K3957M0590M449j0523o314K4831k5211n1720m5286m5034
3498D35121l8603k3069k4620J4537k3949L3229l061L2016J8116K1210o840q099
$$ plain form
3581 336250 371280 388215 375783 408962 403083 418312 419164 426676 397780 437180 506779 550013
3569 550013 511762 487347 487919 562264 594520 626840 664757 679752 643285 628476 618348 652124
3557 652124 686251 683749 664500 659640 694989 715753 769754 837822 878720 947291 1052142 1197437
3545 1197437 1417592 1712803 2000333 2126900 1917445 1553841 1296698 1123657 1027692 965433
3535 965433 879766 773869 711805 689088 652991 609754 573501 508958 448903 444391 451756 441402
3523 441402 422191 417895 429617 426826 436539 443843 452954 473378 507867 526255 518721 476204 480753
3510 480753 483692 525382 549339 589929 594378 583855 577541 602372 577161 525441 480155 435121
3498 435121 396518 373449 348829 363366 339417 372646 369585 401601 419717 440927 434087 425988
3486D25988L4271J5844K6167J897Q335N1327L5863J9258j3030K2840L5981K3493
3474F88234m5391o0038l5815k4496l5725j0606l0945j8650J1988L3493Q47L236
3462D76132m7796L7871J9030J0307K8541L8381k7100k769P928J3491M2309J6996
3450F13321L1367J9469K4159J4780K4241m9307k0002j7620m1082q5126k9558j8956
3438D65686Q536j2232j2549j5186J301J3163k088N6602R898k023j6379K7320K6240
3425E48289Q868r78o381N2611k0101J8930L8999J2292J9721k1365n4585l5707
3413E60593k7599l743l5334m2149k384K8891J3847l7042p941K7917L2795K2900
3401E30751J9619k8317k2806L9383L573m679m1449J477j837j1524K651K5341Q491
$$ plain form
3486 425988 460259 476103 502270 504167 512502 563829 599692 618950 605920 628760 664741 688234
3474 688234 642843 582805 546990 522494 486769 476163 445218 426568 438556 472049 472896 476132
3462 476132 428336 466207 485237 495544 524085 562466 535366 532597 540525 554016 596325 613321
3450 613321 644688 664157 688316 703096 727337 678030 658028 640408 599326 514200 484642 465686
3438 465686 474222 461990 449441 434255 435556 448719 446631 503233 513131 511108 494729 522049 548289
3425 548289 557157 556179 549798 602409 582308 601238 640237 652529 672250 650885 596300 560593
3413 560593 532994 529251 493917 451768 449384 478275 492122 455080 447139 475056 507851 530751
3401 530751 550370 522053 499247 538630 542203 537524 496075 497552 495715 484191 486842 512183 520674
3388E20674j6937j3533j5029l9844k9n338j8886L7531l314K3929J5103K1175K2867
3375E28369r357K0789k1782k445J35J1544J3271R969p857k9832k7424k2801K3714
3362D86293K1930o764J5889m3004k3699Q17L4002N4806p359j0544K9349K5103
3350E76819q945m748J0726m802L5580J2881n857n390L070K6689J4670l9019k5425
3337E86249k6192K9294K3084K522j7659J2116L46K52J9017K5850P165L968j8251
3324F47761J9690J3868M3469O1332m917J7376o072L2808J2309j773j8382m373
3312H13096O445q739l2227n456M4485L3414J1860l450n0880j8152K2412N0709
3300H63517L0760o976J810J9827k5132O936J9034L9973K4158n034N1108O721N12
$$ plain form
3388 520674 503737 490204 475175 435331 435302 429964 411078 448609 445295 469224 484327 505502 528369
3375 528369 519012 539801 518019 515574 515709 527253 540524 550493 542636 512804 485380 462579 486293
3362 486293 508223 501459 517348 474344 450645 451462 485464 540270 532911 522367 551716 576819
3350 576819 567874 563126 573852 569050 604630 617511 611654 606264 609334 636023 650693 611674 586249
3337 586249 560057 589351 612435 614957 597298 609414 609760 610012 629029 654879 662044 666012 647761
3324 647761 667451 681319 724788 786120 781203 798579 792507 825315 837624 835851 817469 813096
3312 813096 819541 810802 778575 773119 817604 851018 862878 859428 808548 790396 812808 863517
3300 863517 894277 887301 889111 908938 883806 890742 909776 949749 973907 968873 1019981 1026702 1027214
3287A027214L0946J6379M1324r518j2088N9443K8316l226J6227J9057K5663J0181
3275A249918J2462J7771K4277M0222K2685j3336K0311m519M8777P8569O4499K8458
3263A590094J3454K2573J7963Q3635R1669O1971J9171M8413O208R208L1325O8154
3251B063838L6984L8677K4993J6951N7096O5439M3575J9881K6568O0579N0997
3240B505578L9869N7233J3579N3601Q0695Q9498N1939O5957J06609Q7956P2378
3229C224892Q5414O1390R4278J15177J38998J10931J04315J21697J24803R8876
3219D280771J25991J43892J39630J33195J32560J11041J70887J92272K00197K11087
3209E841523J92071K05498K70898L37336L50696L98143M80393N24050O51831P45484
$$ plain form
3287 1027214 1058160 1074539 1115863 1106345 1094257 1153700 1182016 1178790 1195017 1214074 1239737 1249918
3275 1249918 1262380 1280151 1304428 1344650 1367335 1353999 1374310 1369791 1418568 1497137 1561636 1590094
3263 1590094 1603548 1626121 1644084 1727719 1819388 1881359 1900530 1948943 1955151 1964359 1995684 2063838
3251 2063838 2100822 2139499 2164492 2181443 2238539 2303978 2347553 2367434 2394002 2454581 2505578
3240 2505578 2545447 2602680 2616259 2669860 2750555 2840053 2891992 2957949 3064558 3152514 3224892
3229 3224892 3310306 3371696 3465974 3581151 3720149 3831080 3935395 4057092 4181895 4280771
3219 4280771 4406762 4550654 4690284 4823479 4956039 5067080 5237967 5430239 5630436 5841523
3209 5841523 6033594 6239092 6509990 6847326 7198022 7596165 8076558 8600608 9252439 9997923
3199I997923Q79822J081647J410737J778901K130957K116094J308908l69537j717529
3190A8617923j838629j328291q91159n49215m18658k65606j21000j4081J26578
3181A3317862K03700L01401L95907N22026O76241Q81805J058287J268312J560038
3172B0185579J867973K227764K798598L560874M613595N843914O675940O038988
3164E3813225K760305j569407m214099o014958o192051m854206l530235k514194
3156B7684380j847950j345625j001024p40307m84912k65135J3344K56897M94570
3147B2764238Q23661J134389J498643J855783K370523L016335L868396M952537
3139D2284505O259744P351756P421430N020741K175961O1430k947505o332741
$$ plain form
3199 9997923 10877745 11959392 13370129 15149030 17279987 19396081 20704989 20335452 18617923
3190 18617923 16779294 15451003 14559844 14010629 13591971 13326365 13205365 13191284 13317862
3181 13317862 13521562 13822963 14218870 14740896 15417137 16298942 17357229 18625541 20185579
3172 20185579 22053552 24281316 27079914 30640788 35254383 41098297 47774237 53813225
3164 53813225 56573530 55004123 50790024 44775066 38583015 33728809 30198574 27684380
3156 27684380 25836430 24490805 23489781 22749474 22264562 21999427 22012771 22269668 22764238
3147 22764238 23587899 24722288 26220931 28076714 30447237 33463572 37331968 42284505
3139 42284505 48544249 55896005 63317435 68338176 70514137 70575567 67628062 61295321
3131F1295321q608690q021058o154507m498112l373511k572953k050831j618084
3123B4397575j351443j063959q06751n34189k76554L0734K55153N43948Q39930
3114B2034444J130713J558668K074157K705959L499782M320807M860291M461493
3106D6646314L153793K20010l352373n284157o137779n539302m117845l071258
3098B2517403k318432j822618j508046j276900j145479r36313p81554o16150n24183
3089A1587728l92416k96598k19315n7977N9202J35081K66027M29010N74252P71505
3079A2856499J149295J370173J270615L75957j173743k097313j949731j445643
3071A0356109j050925p97955o15183n50469m59644l90446l66991l36532k54076
$$ plain form
3131 61295321 52686631 44665573 38511066 34012954 30639443 28066490 26015659 24397575
3123 24397575 23046132 21982173 21175422 20641233 20364679 20395413 20650566 21194514 22034444
3114 22034444 23165157 24723825 26797982 29503941 33003723 37324530 42184821 46646314
3106 46646314 49800107 50020117 46667744 41383587 35245808 29706506 25588661 22517403
3098 22517403 20198971 18376353 16868307 15591407 14445928 13509615 12728061 12111911 11587728
3089 11587728 11195312 10898714 10679399 10621422 10680624 10815705 11081732 11510742 12084994 12856499
3079 12856499 14005794 15375967 16646582 17022539 15848796 13751483 11801752 10356109
3071 10356109 9305184 8507229 7892046 7341577 6881933 6491487 6124496 5787964 5533888
3062E533888k35731k17118k26625k34359k19903j64927j41248j36898j44827j55110
3052C657142j01351p5619q2737q0809o9176m4948n8185p6539m4949k1626k7360
3041B973843k3535o6567n6665m4013k9379q107l197k7979q8251o4688m3410m3388
3029B474664q3409r9226o5455m3484l3243m3456o5957l0265l4694n3797m463P867
3017A925082J8067j7338J0628O263j4217K2438J8134L7894J7031O003p389k4028
3005A998568o0530o1760m2794m4981m2071r560q6981p2609n731j4523r390J5164
2993A562802l574j2615m637l1716J4061L4903O3240P4055N7556K5992N6390J31418
2981A967875Q7236N8489L7529j2094j6714q6185j01853j16062j24842r3772r0000
$$ plain form
3062 5533888 5298157 5081039 4854414 4620055 4400152 4235225 4093977 3957079 3812252 3657142
3052 3657142 3555791 3480172 3397435 3316626 3247450 3202502 3144317 3067778 3022829 3001203 2973843
3041 2973843 2950308 2883741 2827076 2783063 2753684 2745577 2742380 2714401 2626150 2561462 2518052 2474664
3029 2474664 2391255 2292029 2226574 2183090 2149847 2106391 2040434 2010169 1975475 1921678 1917215 1925082
3017 1925082 1943149 1925811 1936439 1942702 1928485 1950923 1969057 2006951 2023982 2029985 2022596 1998568
3005 1998568 1938038 1876278 1833484 1788503 1746432 1736872 1649891 1577282 1571551 1557028 1547638 1562802
2993 1562802 1559228 1546613 1541976 1510260 1524321 1559224 1622464 1696519 1754075 1780067 1836457 1967875
2981 1967875 2055111 2113600 2151129 2139035 2122321 2036136 1934283 1818221 1693379 1599607 1509607
2970A509607k1977k4974j3783j4338p607k9144l7423K0903K4354j4716L8497J0787
2958A440186N649K2485K8336Q3558J20327R1532P1825J31387J11329M2237P85
2947B149636j8569r0402j34476r4121j11546j11751p2492k1056l0175n1812m4156
2936A369080j459M9149j2012l509K0891L6118K0992N5040M2439N6841J05108J32563
2924A871241M6967M5307O1949N1472N5648J7708q343j7473n1718p5395n6256k6395
2912A914712O182L5707R3096O8718J31304J90527K90235M00997M76686O29985
2902D238149N53835J26167m45481o63950m96487l12355j58773j23416j51234j87111
2892B379344k13053j60871j10482j26086q6776j00269r0694o0242n0582m6442
$$ plain form
2970 1509607 1487630 1462656 1448873 1434535 1426928 1397784 1360361 1381264 1405618 1390902 1429399 1440186
2958 1440186 1445835 1468320 1496656 1580214 1700541 1792073 1863898 1995285 2106614 2148851 2149636
2947 2149636 2131067 2040665 1906189 1812068 1700522 1588771 1516279 1495223 1465048 1413236 1369080
2936 1369080 1367621 1416770 1404758 1401249 1422140 1458258 1479250 1534290 1576729 1633570 1738678 1871241
2924 1871241 1918208 1963515 2025464 2076936 2132584 2150292 2141949 2124476 2072758 1997363 1941107 1914712
2912 1914712 1920894 1956601 2049697 2118415 2249719 2440246 2730481 3131478 3608164 4238149
2902 4238149 4791984 4918151 4472670 3808720 3312233 2999878 2841105 2717689 2566455 2379344
2892 2379344 2166291 2005420 1894938 1768852 1682076 1581807 1491113 1430871 1380289 1333847
2882A333847j9480m818n941k4474l0274K8304K5938K4675R735j5454M5519O3069
2870A430646J19116J20061J19591J32201P4233k8838j17107j54708j49384j34183
2860A411628j09581o6725n3645n0110k4898l9554k2278j1222k03L0331K1977N4562
2848A140282j980l2061j7714J6708k6771k3043M3757N0876P4749P3539O8543L6236
2836A403121m502l3530q1156q7983j07992p2828o2418l0714o5963k8671M616K515
2824H34495m485L6996L2137K2597M2344l260k1323p0793n9021j8296n4032l8851
2812F98508K0415k65k012j9278O358N846K9406k7463l9154n4140l6258j2140L7103
2799F06926j4110l730p584J5332Q65j90M334L692N0101K749j8283m7546l5737
$$ plain form
2882 1333847 1314367 1309549 1303608 1279134 1248860 1277164 1303102 1327777 1337512 1322058 1367577 1430646
2870 1430646 1549762 1669823 1789414 1921615 1995848 1967010 1849903 1695195 1545811 1411628
2860 1411628 1302047 1235322 1181677 1131567 1106669 1067115 1044837 1033615 1033412 1063743 1085720 1140282
2848 1140282 1138302 1106241 1088527 1105235 1078464 1055421 1099178 1150054 1224803 1298342 1366885 1403121
2836 1403121 1398619 1365089 1283933 1195950 1087958 1015130 952712 921998 856035 827364 831980 834495
2824 834495 830010 867006 899143 921740 964084 960824 939501 868708 809687 791391 737359 698508
2812 698508 718923 718658 716646 697368 703726 709572 738978 711515 672361 618221 581963 569823 606926
2799 606926 592816 589086 581502 596834 597699 597509 601843 605535 655636 658385 640102 592556 556819
2786E56819k4766j9766k8455m2821k9717K430j6384o105j2324L714o76l1662l3860
2773C16427K7470M8274J6246K4260q19n3445m3370J4319L0371K4967j1496j6904
2761C76300n249m3926q73r062R714Q116K8288j1893m3550j3255k039K4069K392
2748C19032k2376L909J7177m008m429P684M9446P936J277K7939J337j3852k3216
2735C67856R786J8985j3045m4805N296j283L9083L3968j3415j9575j037k9172
2723C52642K1358K1360k5996K2860J6341m205J3339K3415J8684J1505j1564k4571
2711D35168l5772K8297J7980j909l5750M42K9843M627l9874Q367J6960k0158L8465
2698D46686J6208p478J3093L7136M642J8044j3541K0948M9415K9862J641k8998
$$ plain form
2786 556819 532053 512287 483832 441011 411294 413724 397340 391235 378911 382625 381949 350287 316427
2773 316427 343897 392171 408417 432677 431858 378413 335043 349362 379733 404700 393204 376300
2761 376300 371051 327125 326252 317190 326904 335020 363308 351415 307865 294610 292571 316640 319032
2748 319032 296656 300565 317742 313734 309305 316989 366435 374371 375648 403587 404924 391072 367856
2735 367856 377642 396627 383582 338777 344073 342790 381873 415841 402426 382851 381814 352642
2723 352642 374000 395360 369364 392224 408565 404360 417699 441114 459798 471303 459739 435168
2711 435168 399396 427693 445673 443764 408014 408456 438299 442926 403052 411419 428379 408221 446686
2698 446686 462894 455416 468509 505645 510287 528331 514790 535738 585153 615015 616656 587658
2686E87658L0471L3988K4102J3727R176J2214K5345O4888K2472R480J0467M4156
2674H88144L5408J7828L4750M3655M4991L8030M1639M0776J7980K0105M9866O2377
2662A335549L4923P0410L4660J3604J4931j400J4991P518J3031k7011j9181k5029
2650A466996k2591j0542l0040k8827p817n1926m9973n8413l0560n3301m1919p3811
2638A007276l4840j0926k2168j1514m1550m3924n7047o2438k4195p782P830j8773
2626F79949k8639l6823P4j1242j1297j85j739p144k2199j9562j431j2124L196
2613E30834n995K2103J2290p975J1119l3357l0208l3598N425J1230P273k3996
2601D65145k2728k862Qm013n34p4J3392n87j8331k4678J68j6374j664p238j1899
$$ plain form
2686 587658 618129 652117 676219 689946 699122 711336 736681 801569 824041 833521 843988 888144
2674 888144 923552 941380 976130 1019785 1064776 1102806 1144445 1185221 1203201 1223306 1273172 1335549
2662 1335549 1370472 1440882 1475542 1489146 1504077 1502677 1517668 1525186 1538217 1511206 1492025 1466996
2650 1466996 1444405 1433863 1403823 1374996 1367179 1315253 1265280 1206867 1176307 1123006 1081087 1007276
2638 1007276 972436 961510 939342 927828 886278 842354 785307 722869 698674 690892 698722 679949
2626 679949 651310 614487 614561 603319 592022 591837 590098 582954 560755 541193 539762 527638 530834
2613 530834 524839 546942 559232 551257 562376 529019 498811 465213 470638 481868 489141 465145
2601 465145 442417 439555 439563 435550 435016 434942 448334 447747 429416 404738 404906 388532 386868 379630 367731
2586C67731K9128k381J2520k8133l3243q081L1308J3619l7027k0038J1074L9857
2574C76334K8088m7707m8003l5776j0561L6496K0485J2090j0168j1111j2461j9738
2562B77968k1243k0505k88L0852J8032N249J1079R687J3554k3861l25K3965j0930
2549C13234J2554j1517k5285O145k932j9703J3067J2097L0406J1998k3347l3062
2537B83655n326J4603L4957p554j4592k8911K7429L5581m191j1703R869N556k989
2524C36384L504j2655j4135J4356L3161j8097j5712k3436J669P709O947l276r012
2511C07407o859q167J1239l991j085N796j8353j6994j8666J9732J4800J0378J6078
2498C11315j3006J2787k3014M417J0210M734K1051M776k7471J172J476k759J0014
$$ plain form
2586 367731 396859 394478 406998 378865 345622 337541 368849 382468 345441 325403 336477 376334
2574 376334 404422 356715 308712 272936 262375 298871 319356 331446 321278 310167 297706 277968
2562 277968 256725 236220 235932 266784 284816 290065 301144 310831 324385 300524 300199 324164 313234
2549 313234 325788 314271 288986 295131 292199 272496 285563 297660 328066 340064 316717 283655
2537 283655 278329 292932 327889 320335 305743 276832 304261 339842 335651 323948 333817 339373 336384
2524 336384 339888 327233 313098 327454 360615 342518 326806 303370 305039 312748 319695 316419 307407
2511 307407 300548 292381 303620 299629 298544 304340 285987 268993 250327 270059 284859 295237 311315
2498 311315 298309 311096 288082 292499 302709 307443 328494 333270 305799 306971 308447 305688 315702
2485C15702K6034J7117n711j2445L3762K2587L2690k2509l2978k2635J4068K3457
2473C89139M121L2863j9882j8445j6422k283k0081J0880Q639Q113k253l0057Q623
2460C52955Q256J5041N385K1254K4911k1589q670k0080K9484M0442m567r176j8641
2447D15005l1601J2753K0978n390j8709j2888K165M596j0566L908J7651J1482
2435D09384j0470r798l941j4506J0786N7758p93R596l5053q303L5746J2679O136
2422D59221j6338J9764K7861K0729j3648K768L4762k837k5409k1667K3860o094
2410E02972M8196K7937J0136l2972j6024L0321J0529j5946p491M426M2693o042
2398E98735j6456M1555R76j6188j0477K8695J1757L8980l5336K490K4075j3622
$$ plain form
2485 315702 341736 358853 353142 340697 374459 397046 429736 407227 374249 351614 365682 389139
2473 389139 393260 426123 406241 387796 371374 369091 349010 359890 368529 376642 374389 344332 352955
2460 352955 361211 376252 381637 402891 427802 406213 397543 377463 406947 447389 442822 433646 415005
2447 415005 383404 396157 417135 411745 393036 380148 382313 386909 376343 380251 397902 409384
2435 409384 398914 389116 385175 370669 381455 439213 438420 448016 412963 404660 440406 453085 459221
2422 459221 442883 462647 490508 511237 497589 500357 535119 532282 506873 485206 509066 502972
2410 502972 551168 579105 589241 556269 540245 570566 581095 565149 557658 562084 604777 598735
2398 598735 582279 623834 624810 608622 598145 626840 638597 677577 642241 644731 668806 655184
2386F55184K3214M7118l926l7873J7709l602L5322J1394K4526J1594J6926L9096
2374H36682l056l247J8397L7767J7357O7956J5188M9855J3874L1528N1400L7240
2362A170941J3255K842N5977L5203K0689O4606M6794P1796M1333O1310O3411R7992
2350A746149Q1384J04354J13882J19940J91060K07899K77489L41039L62149M23203
2340C968548O19237Q45308J084334J114029O01851p01722j351474j022250p10069
2331D447792m88937l36477k53325k00661j27019j52548p5595o150l6177j3611
2321B757292R619M8645R0625O7881O2207J17008J63510J94268J85048K57141L51019
2310D304263M29047N15110O50753P80869J068766J477381J962986K176466J669515
$$ plain form
2386 655184 678398 725516 721590 683717 701426 697824 733146 744540 769066 780660 797586 836682
2374 836682 833626 830379 848776 886543 903900 971856 987044 1036899 1050773 1082301 1133701 1170941
2362 1170941 1184196 1187038 1243015 1278218 1298907 1363513 1410307 1482103 1523436 1584746 1648157 1746149
2350 1746149 1827533 1931887 2045769 2165709 2356769 2564668 2842157 3183196 3545345 3968548
2340 3968548 4587785 5433093 6517427 7631456 8233307 7531585 6180111 5157861 4447792
2331 4447792 3958855 3622378 3369053 3168392 3041373 2888825 2813230 2807080 2770903 2757292
2321 2757292 2766911 2815556 2906181 2974062 3036269 3153277 3316787 3511055 3696103 3953244 4304263
2310 4304263 4733310 5248420 5899173 6680042 7748808 9226189 11189175 13365641 15035156
2301A5035156q16347k709159k332525j622912j136976q42580n84897m83236l84674
2292D121850k96089k41756j91705j63517j44738j50021j25070n1447l5239j2973
2282B709295L949L4137N0882O4453P7716R8595J41112K22296K77271L58414M67870
2271D505990O02251Q64648R87336Q84980p866j207139j272216r15858o46475m67127
2261C328524l37887k80787k26355k15343j41205j42233j06686r5315r8341p5952
2251A608420o0778l7483q039o3064o8868j7918l2254l2453k8713k0574j4481Q649
2239A232444n828o598j957l9732l7749J1163m0975m0950l8959m0305q46p567l6150
2226I45991n0509K3895o284n128J5596J907k852Q238j6670l1167k041q355p589
$$ plain form
2301 15035156 14218809 11509650 9177125 7554213 6417237 5574657 4989760 4506524 4121850
2292 4121850 3825761 3584005 3392300 3228783 3084045 2934024 2808954 2757507 2722268 2709295
2282 2709295 2713244 2747381 2798263 2862716 2940432 3039027 3180139 3402435 3679706 4038120 4505990
2271 4505990 5108241 5972889 6960225 7845205 7837339 6630200 5357984 4442126 3795651 3328524
2261 3328524 2990637 2709850 2483495 2268152 2126947 1984714 1878028 1782713 1684372 1608420
2251 1608420 1547642 1510159 1502120 1439056 1370188 1352270 1320016 1287563 1258850 1238276 1223795 1232444
2239 1232444 1226616 1220018 1218061 1178329 1140580 1151743 1110768 1069818 1030859 990554 989708 982141 945991
2226 945991 895482 919377 913093 907965 923561 925468 922616 930854 914184 883017 880976 872621 865032
2213H65032M752O534k2974n708J9030J529o788j1276Q302j1247J8648J6495j3912
2200H68417O818o839N904j3756J4438r91M4816J4294j2203j6911K2972K8065K3872
2187I78896Q337M7519O2790O9721M8656L5619O6887J29149J88691J62098N5992
2176A854355n9245j44902j11683q2462q6891m2857m0869m5000j9392l7734j0283
2165A173037j710J603q748j042K1638j420N4425K6290L7087N3002N4428M5540
2153A454130J8859R1183J26908R8334J30599J33453J63874K78786L49246L85672
2143C231044L41077N9655k00067j42779o3174J184M8559J66050K07384J75483
2133C824416M8896j51143l25305k49822j63040j75861j84558k00481j67220j43358
$$ plain form
2213 865032 869784 876318 853344 847636 866666 868195 861407 850131 858433 847186 865834 882329 868417
2200 868417 875235 868396 874300 860544 874982 873991 918807 933101 920898 903987 926959 955024 978896
2187 978896 987233 1034752 1097542 1167263 1215919 1251538 1318425 1447574 1636265 1798363 1854355
2176 1854355 1795110 1650208 1538525 1456063 1369172 1326315 1285446 1240446 1221054 1183320 1173037
2165 1173037 1171327 1172930 1164182 1163140 1184778 1183358 1237783 1264073 1301160 1354162 1408590 1454130
2153 1454130 1472989 1564172 1691080 1789414 1920013 2053466 2217340 2496126 2845372 3231044
2143 3231044 3572121 3631776 3431709 3288930 3225756 3226940 3275499 3441549 3648933 3824416
2133 3824416 3873312 3722169 3396864 3147042 2984002 2808141 2623583 2423102 2255882 2112524
2123B112524j13663n2098m3928l6150k1154k0592K4455M8601M7893J3338L7510
2112A996736R9857J85040K24745K38218J90786p767n2716R4708K02079K98247
2102C469933M16856N21521N19554L47987r7887m68254n31779m13572l86636l79552
2092B998171l43918k86875k15625j66623j59542j12440j01208m7294q3194n4216
2082A427236n2410n7644N20l7773k8043k248K1924L8055O1881O3157Q557K0343
2070A463555J01310J63626K05317K27854K34842K00082N8318j94465k81872k44491
2060A934076j99493j41493j54607j52368j34791r8878n5213p3684n3839p2090
2050G97620n5415l0849m6570m7780k7721R211k3592k8562j6372L826Q654k6400
$$ plain form
2123 2112524 1998861 1946763 1902835 1866685 1845531 1824939 1849394 1897995 1945888 1959226 1996736
2112 1996736 2096593 2281633 2506378 2744596 2935382 2927615 2874899 2969607 3171686 3469933
2102 3469933 3886789 4408310 4927864 5275851 5177964 4709710 4177931 3764359 3377723 2998171
2092 2998171 2654253 2367378 2151753 1985130 1825588 1713148 1611940 1564646 1481452 1427236
2082 1427236 1374826 1317182 1317702 1279929 1251886 1249638 1271562 1309617 1371498 1434655 1443212 1463555
2070 1463555 1564865 1728491 1933808 2161662 2396504 2596586 2654904 2460439 2178567 1934076
2060 1934076 1734583 1593090 1438483 1286115 1151324 1052446 997233 923549 869710 797620
2050 797620 742205 711356 664786 617006 589285 598496 574904 546342 529970 533796 542450 516050
2038E16050j0087l0647j6521m739j5975R784j1140J0836l996J7535k7533M098
2026D37665n463K2556k0126l314j1092M871J35j3684n988l2053R11J1017j1782
2013C73653l3819j0341m938M2365K336k9985k1852K441K436P51l3324j3829J3130
2000B89024j1590Q036l0609k4753K1418J1535m264o023J5281K7606P259j5977
1988B86943J364j1356j1207j5437j6606k5913K9967L4292l72l279j8565l5681
1976B14150j0700J0675J560J239K6245L4534l1413r929J4292m042j496k9441r282
1963B06392j489j3938R263J3724J0079M768M282J9918P6k1035k4258j0776j2625
1950A84381L642J3924L6283j3755j689N99l288k8924j8998j501j3574M1075N5789
$$ plain form
2038 516050 505963 475316 458795 454056 438081 447865 436725 447561 443565 461100 433567 437665
2026 437665 432202 454758 434632 431318 420226 425097 425232 411548 405560 373507 374418 385435 373653
2013 373653 339834 329493 324555 366920 369256 339271 317419 319860 322296 323047 289723 275894 289024
2000 289024 277434 285470 254861 230108 251526 263061 258797 252774 268055 295661 302920 286943
1988 286943 288307 276951 265744 250307 233701 207788 237755 272047 271675 268396 249831 214150
1976 214150 203450 214125 215685 216924 243169 277703 246290 236361 250653 246611 245115 215674 206392
1963 206392 204903 190965 200228 213952 224031 228799 233081 252999 253075 232040 207782 197006 184381
1950 184381 188023 201947 238230 224475 222786 223385 220097 191173 172175 170674 157100 198175 253964
1937B53964j3281l2866l0105J9310j1333Q469k1945n95J4983l70l0215Q098N211
1924A69325J5615M005r781K0045O149j2080o992o829L017L1648J1505l3419k9252
1911A62956K6177J6791R48p145j8045L110P517J4422J8253k5763k9828K8378L4828
1898B32599J7979j5243K2700L1810L078p346j4082J1124r050K5594J3268K4471
1886C36902K5394N867o058r602j7878K6354L4916L1362J9736K0559o248K6084
1874D87388J0553J4892M4992N240m8323M317J738j2669m6730k3157j2906L9508
1862D64843J6074K1274o034j0576l3838j2164j1030j2893J2729M9845l96q60J8264
1849D95238j930N646K2199K7731J2490M0354M2095Q347L1478L4721M4194M4645
$$ plain form
1937 253964 240683 207817 177712 197022 185689 194158 172213 171618 186601 186231 156016 164114 169325
1924 169325 184940 188945 179164 199209 205358 193278 186286 179457 182474 214122 225627 192208 162956
1911 162956 189133 205924 206872 199727 181682 184792 192309 206731 224984 199221 169393 197771 232599
1898 232599 250578 235335 258035 289845 292923 285577 271495 282619 273569 299163 312431 336902
1886 336902 362296 368163 362105 352503 334625 360979 395895 427257 446993 467552 461304 487388
1874 487388 497941 512833 557825 563065 514742 519059 520797 508128 461398 438241 425335 464843
1862 464843 480917 502191 496157 485581 451743 439579 428549 415656 428385 478230 477834 476974 495238
1849 495238 493308 498954 521153 548884 561374 601728 643823 652170 683648 718369 762563 807208
1837H07208n593j991R72k4740n5719n4430n5207K1540r93l1010Q754J3000r756
1824F12035l4483m1133m7984k8485R151J458r756k0647L99k1415j6238j2585J4505
1811D04822K77K3633n6j6298L2597N525M467J4887K9720O493m467J7484Q933l5348
1797D92669l4247N57m0296J7355J8707k0509p731k2609j7912l8639m9833j7365
1785B80147K3677K2473k9928j7995l51k5319j1825K0295J6541j3730l5535k0937
1773B07513k3322P213j1947N243j6962J1373R534j5433p939N235j1907r926k1315
1760A27360q992m119J0051L2507p59j4809j5115K239J1271j4647K4513J0496j6997
1747A42999Q00K7366M74m848k0922k950J9028j1562Q507j360o619r543k693k180
$$ plain form
1837 807208 801615 799624 800596 775856 720137 665707 610500 632040 631047 600037 608791 621791 612035
1824 612035 577552 536419 488435 459950 469101 470559 460803 440156 440555 419140 402902 390317 404822
1811 404822 405099 428732 428676 412378 444975 450500 454967 469854 499574 506067 501600 519084 528017 492669
1797 492669 458422 458979 418683 436038 454745 434236 426505 403896 385984 347345 297512 280147
1785 280147 303824 326297 296369 278374 278023 252704 240879 261174 277715 263985 228450 207513
1773 207513 184191 191404 179457 184700 167738 179111 188645 173212 165273 170508 158601 148675 127360
1760 127360 118368 114249 124300 156807 156048 141239 126124 128363 139634 124987 149500 159996 142999
1747 142999 143799 171165 171639 166791 145869 142919 161947 150385 158892 157532 150913 141370 138677 136497
1733A36497j1964J1141K1834N456K3862j3455m3448n519J0675j5217j7371m8801
1721E3690L307K4216J4823N148m866k331J114K0524k2917o635J3471N158m724
1708I9978k5799K841j3662J439j984K7827j9240j2247q511J6208o458k2962P638
1695D5068N702q072l5154j0154K5954J1904O218L7805P269j379m209R53K0335
1682A02240j0713j3664L809q150j0554L8548J0017j1364l0618j2257k5563m2308
1670a0577L2399N3495J3660K260j4295j2577j1284J2979R79k5080O601l766P517
1657E2311J2469k6520J8792J8542j1984p307J8527J6789l4962p207O5K4483j7019
1644E6979j3285j8361J8743J5125j3465q461Q251l0247Q318J3244J6119j3056
$$ plain form
1733 136497 124533 135674 157508 162964 186826 173371 129923 124404 135079 119862 102491 53690
1721 53690 56997 81213 96036 101184 96318 93987 95101 115625 92708 86073 99544 104702 99978
1708 99978 74179 77020 63358 64797 62813 90640 71400 59153 50642 66850 60392 37430 45068
1695 45068 50770 42698 7544 -2610 23344 35248 41466 79271 86540 85161 80952 81905 102240
1682 102240 91527 77863 81672 73522 62968 101516 111533 100169 69551 57294 31731 -10577
1670 -10577 21822 75317 88977 91237 76942 64365 53081 66060 67039 41959 48560 44794 52311
1657 52311 64780 38260 57052 75594 63610 56303 74830 91619 56657 49450 49515 73998 56979
1644 56979 43694 25333 44076 59201 45736 37275 45526 15279 23597 36841 52960 39904
1632C9904j117Q467j0821J4540k9724j0662J9548L8775P9k2347R823k2644J8478
1619E2299J0772p055r023J5615k0752L147l121j3139K5178q687K9523R30l1495
1606D4192k0062j463M738J9265J6867J263o417J7007k4627k9300K614L849M518
1593C2444K0120o084J522J712J8037l078j1161k2872j4038J1022M127J9697L597
1580E5045j739M951l4702l93J8311M99j744j1743Q986J0507J7955q410j5738j7069
1566B4716J2939M3937k3915j5255l0253m8686M4643J4324J4383k2554r045J1181
1554A6415L4548R640j7706j0533j3543K2294J1783K8628J8419j9119j2438j8361
1542E0027j2523J1440M587l539Q729J9467N596j2878k5959Q155k6285M4279j3617
$$ plain form
1632 39904 38787 47254 36433 50973 21249 10587 30135 68910 68989 46642 56465 33821 52299
1619 52299 63071 56016 46993 62608 41856 45003 41882 28743 53921 45234 74757 75687 44192
1606 44192 24130 22667 27405 46670 63537 64800 58383 75390 50763 21463 24077 27926 32444
1593 32444 52564 46480 48002 49714 67751 64673 53512 30640 16602 27624 31751 51448 55045
1580 55045 53306 58257 23555 23162 41473 41972 40228 28485 37471 47978 65933 57523 41785 24716
1566 24716 37655 81592 57677 42422 12169 -36517 8126 22450 36833 14279 5234 16415
1554 16415 50963 60603 42897 32364 18821 41115 52898 81526 99945 80826 68388 50027
1542 50027 37504 48944 53531 49992 58721 78188 83784 70906 44947 53102 26817 71096 57479
1529E7479k144L86p148j2754N811j2408L756M811Q074J2078j8238o944L400K6161
1515F2320J9710Q209j2666j6969j5376R904J3269l2329q568J9832j0931k009K4818
1502E9214M834k9942L107J6701J1197J317R511k76N2303N546n0217m4292L9645
1489G8648K0305j2582m2141K0273L1810n752j584j2743R555J4952J4273O609k6771
1476I4852l0110k5920K796M4886K1869O558J9645k537K012j7091k2710L1980j3626
1463A12604k504M802K8927P100k21k7780k5680j5972j5033R667K1352j1961j0420
1450G4881J6495j0604j1198p003Q38K5435L794j50L392o504O443N789R125l9776
1436G0957K5823J8765M4188M370l5048j3140p220L4686j0669j0601j619j669R364
$$ plain form
1529 57479 55335 55721 48573 35819 41630 29222 32978 37789 45863 57941 39703 32759 36159 62320
1515 62320 82030 90239 77573 60604 45228 55132 68401 36072 27504 47336 36405 34396 59214
1502 59214 64048 34106 37213 53914 65111 66428 75939 75663 127966 133512 83295 39003 78648
1489 78648 98953 86371 44230 64503 96313 90561 88977 76234 85789 100741 115014 121623 94852
1476 94852 64742 38822 41618 86504 108373 114931 134576 132039 134051 116960 94250 126230 112604
1463 112604 110100 114902 143829 150929 150708 122928 97248 81276 66243 75910 97262 85301 74881
1450 74881 91376 80772 69574 62571 63409 88844 92638 92488 95880 89376 95819 101608 110733 70957
1436 70957 96780 115545 159733 164103 129055 115915 108695 143381 132712 122111 120492 118823 128187
1423A28187M6k3169k2943r354P516L9687l4854j5623J8640J3318m280L3031K0173
1410A50375n859m140l5520p155J3858R127j187j5239J4846R714j2784p688L872
1397A12220j0629k8914L72Q56J1047L999k6646N736J6515k8472m897J038O970
1384E9195K9501k639j6998m5438l477J8284j1913j8894J8438K5471j315l18r622
1371D0275m2531J7595P441l054N666l435K9487J0065o145k6983K5771n601K7689
1358G6240L7103P203l2241l6380L4314n832j5884m531J8769p926l724K8184m6723
1345D8572k2767l217J0005M274L1873J2250j0334k2998j4743j877J7479k825Q283
1332E3975k4337j7579K3386K813j2930k5848J1792J5182j6960J9642k5380R074
$$ plain form
1423 128187 128233 105064 82121 72767 80283 119970 85116 69493 88133 101451 97171 130202 150375
1410 150375 144516 140376 104856 97701 111559 120686 119499 104260 119106 128820 116036 108348 112220
1397 112220 101591 72677 73049 73905 84952 88951 62305 68041 84556 56084 51187 52225 59195
1384 59195 88696 86057 69059 23621 20144 38428 26515 7621 26059 51530 50215 49897 40275
1371 40275 -2256 15339 22780 19726 25392 21957 51444 61509 55364 28381 54152 48551 76240
1358 76240 113343 120546 88305 51925 86239 80407 64523 59992 78761 70835 67111 95295 48572
1345 48572 25805 22588 32593 36867 68740 80990 70656 47658 32915 31038 48517 45692 53975
1332 53975 29638 12059 35445 38258 25328 -520 11272 26454 9494 29136 3756 12830
1320A2830j0442L920J0591l7299k6283M8799n449J87L1245k3404j2716O997k2240
1307b3264M2559Q30m153L8428P144k7078k7990j2405K9522L3356j572J1225o1575
1294E027L2M5889j5373m1065J6659K0789m494O650m104j4993J9573J0849k0585
1281B4854k4550m511o949M4990K5037k1376j7072Q518j9017M5289j1298J2264
1269E6179J7903m1934k8002n548j1716K7133K4536j1209j9642j7723j0914J1697
1257i240j1375l6439K9989L7561n610m571j9605j9551K0586L6209J8839j0615
1245B6178N367o268J2606J5159R32k3790l925L9978J0554j0928l0164K20K697
1232C8616J2138j1846J7044K0501j2591l0694K2293N432J5014J507k3978j045
$$ plain form
1320 12830 2388 6308 16899 -20400 -46683 2116 -3333 -3146 28099 4695 -8021 -1024 -23264
1307 -23264 19295 20125 15972 54400 61544 34466 6476 -5929 23593 56949 55377 66602 5027
1294 5027 5059 50948 35575 -5490 11169 31958 27464 34114 30010 15017 34590 45439 24854
1281 24854 304 -4207 -11156 33834 58871 37495 20423 28941 9924 55213 43915 56179
1269 56179 74082 32148 4146 -1402 -13118 14015 38551 27342 7700 -10023 -20937 -9240
1257 -9240 -20615 -57054 -27065 10496 4886 315 -19290 -38841 -18255 17954 36793 26178
1245 26178 31545 25277 37883 53042 53974 30184 26259 66237 76791 65863 35699 35919 38616
1232 38616 50754 38908 55952 76453 63862 33168 55461 60893 75907 77414 53436 52391
1220E2391K0888J7364K2519J0735k7262k9651M155J7384K8962M3355j2946k6153
1208A21741l8524m3650Q496j8744j2302K0083Q535N209q156j9292l1021J5080
1196G455J3862K6458N883k9309M346J3071J0124j9252r930J7020p591R296k5953
1183A5480J6592M3800l3805l6996J0331K4953J3840L8183Q701l9155J7364J7486
1171I6774j02n081l2746N595M2729J6713L883l3846L887J4510j0378P999R88l706
1157A07219j4444m4101k1045J1850O279k1677n008J0219j8661J0241K5k1104n60
1144g67J9300L1425J737R998j1536j9488l989J631k6956K8350r815J6362j4551
1131B1701l1186J778M4811L1299k3644l6246j4683O5172L1979l2118k4546J753
$$ plain form
1220 52391 73279 90643 113162 123897 96635 66984 71139 88523 117485 160840 147894 121741
1208 121741 83217 39567 48063 29319 17017 37100 45635 50844 42688 23396 -7625 7455
1196 7455 21317 47775 53658 24349 28695 41766 51890 32638 22708 39728 32137 41433 15480
1183 15480 32072 75872 42067 5071 15402 40355 54195 92378 101079 61924 79288 96774
1171 96774 96672 91591 58845 64440 107169 123882 127765 93919 97806 112316 101938 109937 110925 107219
1157 107219 92775 48674 27629 39479 45758 24081 19073 29292 10631 20872 20897 -207 -767
1144 -767 18533 49958 51695 61693 50157 30669 26680 28311 1355 29705 19890 36252 21701
1131 21701 -9485 -7707 37104 68403 44759 8513 -6170 59002 90981 58863 34317 36070
1119C6070k47L878M755k143L6554o678j3676K1990m1370k993L2653L7946J585
1106A08324k8357k4946k66q222r036k6413L2259M792k3001M272j1734M514L2673
1093E4859n72k0068R868J2733J9964J8107J7767l9640l4950J5380J1832o898J5550
1080G3932J1845O898L071J7711o103j1298k591L1384M5742N2503m2723j5392l2751
1067A32228j8786j1166J7804K219l2087K877m342L1264l3534O584K0512l352j2208
1054I8013L3501J1837K4435L941j9125p775L2413J8939k4337j2533j247o457K3790
1041A75395R310m2220k7362K3118K4563j7199j782O596P425m861j3157K7654K3838
1028A91318K8082Q676k9841J7372J4067M3203K4839l1842j5158J9223N94k5036
$$ plain form
1119 36070 35823 39701 44456 42313 78867 72189 58513 80503 39133 36140 68793 106739 108324
1106 108324 79967 55021 54755 46533 37497 11084 43343 48135 25134 29406 17672 22186 54859
1093 54859 54287 34219 44087 56820 76784 94891 112658 73018 38068 53448 65280 58382 73932
1080 73932 85777 92675 95746 113457 107354 96056 93465 124849 170591 223094 180371 164979 132228
1067 132228 113442 102276 120080 122299 90212 93089 88747 120011 86477 93061 113573 110221 98013
1054 98013 131514 143351 167786 171727 152602 144827 177240 196179 171842 159309 158062 151605 175395
1041 175395 184705 142485 115123 138241 162804 145605 143823 150419 157844 152983 139826 167480 191318
1028 191318 219400 228076 198235 215607 229674 272877 297716 265874 250716 269939 270533 245497
1016B45497q948J0026M6042M4070M660m0525j9508k219K2242K6164N274j4592
1004C18183L6524R474j679j8897K1395J6360J3613k419N108O719J8055M6018q832
991D59622m0100Q927p134K5808K0300L979P882M929O369N022L0206K4178K8938
978E78926M2311K8904P734n629K3254M1861J9455N5634K9954L1974K2256R854
966H86488Q485M8345N2547M4213R7840L5841M4598J13025R2414M9538Q2270M6851
954A602455O9751R2340J08011P8691R7043R5799J53697J83275J93479K35595L00427
943C210563K03043R8784Q8691K06631K51614L76993M63646O52286Q01694R83370
933G337315J207138J508803J995136L008559L762838L963436J130394m371125
$$ plain form
1016 245497 236549 246575 292617 336687 341347 300822 281314 279095 301337 327501 332775 318183
1004 318183 354707 364181 362502 343605 365000 381360 394973 392554 397662 404381 422436 468454 459622
991 459622 419522 428449 421315 447123 467423 471402 479284 484213 490582 495604 525810 549988 578926
978 578926 621237 650141 657875 652246 675500 717361 736816 792450 822404 854378 876634 886488
966 886488 894973 943318 995865 1040078 1137918 1173759 1218357 1331382 1423796 1473334 1555604 1602455
954 1602455 1672206 1764546 1872557 1951248 2048291 2144090 2297787 2481062 2674541 2910136 3210563
943 3210563 3413606 3512390 3601081 3807712 4059326 4436319 4899965 5552251 6353945 7337315
933 7337315 8544453 10053256 12048392 15056951 18819789 22783225 23913619 19542494
925A9542494m889878l158549k083512j437242j103151q99343p33372n69112m75643
916D192692m09407l05015k09943j27358j03896j92038k61734k67198k08990j32203
906A974910j38836j22478j12375r0202p6323n4124m7663n8701o8474o0447m5526
895A099761m7533Q551J4470l0957q7091o3951l3896k1248m3732k4367j4106k05
883G55696k5831l2096n0407m0552k3278j7474r783k8499r063j9805j0426J8841
871E07323l1559P2k6955Q872n678k9909k6835L4409J2318k6734l8673k672J4511
858C88490J5439j4707k8821l7299N138J5511j574j3286r341o282k4535j4482R075
845B83326l1417P820K416k168j345j9397j9881K0975L2089P64j9966J0767l029
$$ plain form
925 19542494 14652616 11494067 9410555 7973313 6870162 5970819 5237447 4668335 4192692
916 4192692 3783285 3478270 3268327 3140969 3037073 2845035 2583301 2316103 2107113 1974910
906 1974910 1836074 1713596 1601221 1511019 1434696 1380572 1332909 1274208 1205734 1145287 1099761
895 1099761 1052228 1060779 1075249 1044292 957201 893250 859354 838106 794374 770007 755901 755696
883 755696 729865 697769 647362 606810 583532 566058 556275 527776 518713 498908 488482 507323
871 507323 475764 475836 448881 457753 452075 422166 395331 429740 442058 415324 376651 373979 388490
858 388490 403929 389222 360401 323102 328240 343751 342177 328891 319550 313268 288733 274251 283326
845 283326 251909 259729 262145 259977 258632 239235 219354 240329 272418 273182 253216 263983 260954
832B60954P042o017l959J5119j9893k7856k5093l949m727k2404O007j7329J4537
819A72432N377j2252j1003J3576k47l0013k2146Q956M6718J0501J5532O503m3501
806A60433k9169j29m621k900l852K2109J9578k4217o433P504J2632j6546j3974
793A20415j1660l8307p065J5482J4368j7288J7490j4693J4160j5188K1669J4582
781A13965J5275k2230k9717J955O43L3540j2518r623O596q71k1549j1763K0834
768H4537J3946j4972l65q192J0945R019l8811r051m199J6595J7819K4124p759
755I3636m5110k0160L3490J2852j9875O753l57j2737K0653J3378o798j9472P136
742F3389j244k9120R962o274J1137k260J4850J2048j1181k650j2936Q23K35L8107
$$ plain form
832 260954 267996 261979 258020 273139 253246 225390 200297 196348 191621 169217 175224 157895 172432
819 172432 177809 165557 154554 168130 167883 137870 115724 124680 171398 181899 197431 203934 160433
806 160433 131264 131135 126514 123614 119762 141871 161449 137232 130799 138303 150935 134389 120415
793 120415 108755 70448 63383 78865 93233 75945 93435 78742 92902 77714 99383 113965
781 113965 129240 107010 77293 79248 79891 113431 100913 91290 97886 97015 75466 63703 84537
768 84537 98483 83511 83146 74954 85899 94918 56107 47056 42857 59452 77271 101395 93636
755 93636 48526 28366 61856 74708 54833 61586 61229 48492 69145 82523 75725 56253 63389
742 63389 62145 33025 42987 36713 47850 45590 60440 72488 61307 58657 45721 46544 46779 84886
728H4886P803m5084P21j0643K0516J2284m639p146k2306J2033J419O687j5451
715D1080j7534n183j536Q282j7364J2142l778q984q223R273j0941R05J6185l5642
701b1318K4909L5053L688j7248m569J5748k4313L283J0246L2826k330k1347k1762
688A2866k047O988o419j628k6866j7049R533L8498Q324j5370J683K1264j8872
675A0905p86j3517K2044L2712K6685o137j6795k0625p356K0492L0790l663J5494
662I0243k6603n2995r655k4258K9516J6194j3394p141k6335K2692j3535j2417
650b7688k076k602J6951K4716K0950J7461p231R609L8254J6520l4830m3632n047
637B1355k747Q57K2144l113k2013k4796o162J1780k704J750Q741j5756p024l580
$$ plain form
728 84886 92689 47605 48326 37683 58199 70483 65844 58698 36392 48425 49844 56531 41080
715 41080 23546 18363 16827 25109 7745 19887 16109 7125 -1098 8175 -2766 -1861 14324 -21318
701 -21318 3591 38644 42332 25084 20515 36263 11950 15233 25479 58305 55975 34628 12866
688 12866 10819 17807 11388 9760 -17106 -34155 -24622 13876 22200 6830 8513 29777 10905
675 10905 10119 -3398 18646 51358 78043 71906 55111 34486 27130 47622 78412 74749 90243
662 90243 63640 10645 990 -23268 6248 22442 9048 1907 -24428 -1736 -15271 -27688
650 -27688 -29764 -32366 -15415 9301 30251 47712 40481 50090 88344 104864 70034 26402 21355
637 21355 18608 19465 41609 38496 16483 -8313 -14475 -2695 -5399 -3649 5092 -10664 -17688 -21268
623b1268J7680J2999n344j4011j5985p478R731L1786l7888J0725J2260J6447K744
610A2398j8320k78J3228j088K498k9102m93K4904k529K1885K7831K1532k3173
597D9293l6459j3131q77Q941j0604J0051J7705m001j8611J5081k0085k9962j1524
584d4183j6643J8523L0314j8845j5529L844K6598P569L336j4727j5680o292J029
571d0686J4323J6426J2848l2037l1858M4408J1860j4591r312R432K7499j0999
559b687N971J990p674l885k0404N298k3937P213J4533o829j3726K4637J2267j4611
545b1844j9825k824M921R582K871R247j393R944J9139k5107l7401k3025L4523
532d1192K3076Q148r021j0630J893M004j670j2788R035N563o537j3469l0210p859
$$ plain form
623 -21268 -3588 9411 4067 -9944 -25929 -33407 -23676 8110 -29778 -19053 -6793 9654 12398
610 12398 -5922 -6200 7028 5940 8438 -20664 -21157 3747 1218 23103 50934 72466 49293
597 49293 12834 -297 -1174 7767 -2837 7214 24919 20918 2307 17388 -2697 -32659 -44183
584 -44183 -60826 -42303 -11989 -30834 -46363 -42519 -15921 -8352 -5016 -19743 -35423 -41715 -40686
571 -40686 -26363 -9937 2911 -29126 -60984 -16576 -4716 -19307 -28619 -19187 8312 -2687
559 -2687 3284 5274 -2400 -6285 -26689 -21391 -45328 -38115 -23582 -30411 -44137 -19500 -7233 -21844
545 -21844 -41669 -44493 -39572 -29990 -27119 -17872 -19265 -9321 9818 -15289 -52690 -75715 -41192
532 -41192 -18116 -9968 -18989 -29619 -27726 -23722 -25392 -38180 -29145 -23582 -30119 -43588 -73798 -81657
518h1657P940M0981K1605j9840j4266O807j3264L3028J6629k9327k5186J1323
$$ plain form
518 -81657 -73717 -32736 -11131 -30971 -45237 -38430 -51694 -18666 -2037 -31364 -56550 -45227
$$ [...]
##END NTUPLES=NMR SPECTRUM
##END=
