##TITLE=1H_EC-3239
 CDCl3, 8 sc, 
 15.12.2020
##JCAMPDX= 6.0         $$ Bruker NMR JCAMP-DX V2.0
##DATA TYPE= NMR SPECTRUM
##DATA CLASS= NTUPLES
##ORIGIN= UXNMR, Bruker Analytische Messtechnik GmbH
##OWNER= root
$$ XWIN-NMR		Version 3.5
$$ Tue Dec 15 10:34:35 2020 Russian Standard Time (UT+4h)  she@DPX200
##.OBSERVE FREQUENCY= 200.1315066352
##.OBSERVE NUCLEUS= ^1H
##.ACQUISITION MODE= SIMULTANEOUS
##.ACQUISITION SCHEME= undefined
##.AVERAGES= 8
##.DIGITISER RES= 18
##SPECTROMETER/DATA SYSTEM= spect
##.PULSE SEQUENCE= zg30
##.SOLVENT NAME= CDCl3
##.SHIFT REFERENCE= (INTERNAL, CDCl3, 0, 15.9833)
##AUDIT TRAIL= $$ (NUMBER, WHEN, WHO, WHERE, WHAT)
$$ ##TITLE= Audit trail, XWIN-NMR		Version 3.5
$$ ##JCAMPDX= 5.01
$$ ##ORIGIN= Bruker BioSpin GmbH
$$ ##OWNER= she
$$ F:/spectra/data/she/nmr/H-F/1/pdata/1/auditp.txt
$$ ##AUDIT TRAIL=  $$ (NUMBER, WHEN, WHO, WHERE, WHAT)
(   1,<2020-12-15 10:32:10.82 +0400>,<she>,<DPX200>,
      <created by zg, POWCHK disabled, PULCHK disabled
       configuration hash MD5:
       00 E9 B6 7A A2 85 ED C7 34 08 36 98 17 FE 4E 26
       data hash MD5: 16K
       00 97 03 A5 FD C4 C0 ED 8B 18 A1 A2 73 12 5C 81>)
(   2,<2020-12-15 10:32:13.45 +0400>,<she>,<DPX200>,
      <Start of raw data processing
       efp BC_mod = 2 LB = 0.24 FT_mod = 6 PKNL = 1 PHC0 = -10757.22 PHC1 = 11.60089 SI = 16K 
       data hash MD5: 16K
       6D F0 17 87 BF D6 16 B6 22 E8 F1 9A CE 42 1E D1>)
(   3,<2020-12-15 10:32:45.85 +0400>,<she>,<DPX200>,
      <pk PHC0 = 4.54821 PHC1 = -5.4 
       data hash MD5: 16K
       6A 7F 27 A5 4E A2 00 C0 11 77 5C 0D FD D5 AA BB>)
(   4,<2020-12-15 10:32:49.25 +0400>,<she>,<DPX200>,
      <abs ABSG = 5 
       data hash MD5: 16K
       5C DA BF BD 09 53 47 EA D8 99 4E 98 A1 5C B9 47>)
$$ ##END=
$$ 
$$ hash MD5
$$ B0 11 AD 46 C5 A8 2F 0F BC BA F7 BC 03 B0 60 F3
##$RELAX= 
##$RELAX= 
##$RELAX= 
##$RELAX= 
##$RELAX= 
##$RELAX= 
$$ Bruker specific parameters
$$ --------------------------
##$DU= <F:/spectra>
##$EXPNO= 1
##$NAME= <H-F>
##$PROCNO= 1
##$TYPE= <nmr>
##$USER= <she>
##$AMP= (0..31)
100 100 100 100 100 100 100 100 100 100 100 100 100 100 100 100 100 100 
100 100 100 100 100 100 100 100 100 100 100 100 100 100 
##$AQSEQ= 0
##$AQ_mod= 1
##$AUNM= <au_zg>
##$AUTOPOS= <>
##$BF1= 200.13
##$BF2= 200.13
##$BF3= 200.13
##$BF4= 200.13
##$BF5= 200.13
##$BF6= 200.13
##$BF7= 200.13
##$BF8= 200.13
##$BYTORDA= 1
##$CFDGTYP= 0
##$CFRGTYP= 5
##$CHEMSTR= <none>
##$CNST= (0..31)
1 1 145 1 1 1 1 1 1 1 1 1 1 1 1 1 1 1 1 1 1 1 1 1 1 1 1 1 1 1 1 1 
##$CPDPRG= <>
##$CPDPRG1= <>
##$CPDPRG2= <>
##$CPDPRG3= <>
##$CPDPRG4= <mlev>
##$CPDPRG5= <mlev>
##$CPDPRG6= <mlev>
##$CPDPRG7= <mlev>
##$CPDPRG8= <mlev>
##$CPDPRGB= <>
##$CPDPRGT= <>
##$D= (0..31)
0 1.2 0 0 0 0 0 0 0 0.06 0 0.03 0 0 0 0 0.0002 0 0 0 0 0 0 0 0 0 0 0 0 
0 0 0 
##$DATE= 1608013930
##$DBL= (0..7)
120 120 120 120 120 120 120 120 
##$DBP= (0..7)
150 150 150 150 150 150 150 150 
##$DBP07= 0
##$DBPNAM0= <>
##$DBPNAM1= <>
##$DBPNAM2= <>
##$DBPNAM3= <>
##$DBPNAM4= <>
$$ [...]
##$SUBNAM3= <"">
##$SUBNAM4= <"">
##$SUBNAM5= <"">
##$SUBNAM6= <"">
##$SUBNAM7= <"">
##$SUBNAM8= <"">
##$SUBNAM9= <"">
##$SW= 16.9725356469052
##$SWIBOX= (0..15)
0 0 2 0 0 0 0 0 0 0 0 0 0 0 0 0 
##$SW_h= 3396.73913043478
##$TD= 16384
##$TD0= 1
##$TE= 0
##$TE2= 300
##$TE3= 300
##$TEG= 300
##$TL= (0..7)
0 120 120 120 120 120 120 120 
##$TP= (0..7)
150 150 150 150 150 150 150 150 
##$TP07= 0
##$TPNAME0= <>
##$TPNAME1= <>
##$TPNAME2= <>
##$TPNAME3= <>
##$TPNAME4= <>
##$TPNAME5= <>
##$TPNAME6= <>
##$TPNAME7= <>
##$TPOAL= (0..7)
0.5 0.5 0.5 0.5 0.5 0.5 0.5 0.5 
##$TPOFFS= (0..7)
0 0 0 0 0 0 0 0 
##$TUNHIN= 0
##$TUNHOUT= 0
##$TUNXOUT= 0
##$USERA1= <user>
##$USERA2= <user>
##$USERA3= <user>
##$USERA4= <user>
##$USERA5= <user>
##$V9= 5
##$VALIST= <valist>
##$VCLIST= <CCCCCCCCCCCCCCC>
##$VD= 0
##$VDLIST= <DDDDDDDDDDDDDDD>
##$VPLIST= <PPPPPPPPPPPPPPP>
##$VTLIST= <TTTTTTTTTTTTTTT>
##$WBST= 1024
##$WBSW= 4
##$XGAIN= (0..3)
0 0 0 0 
##$XL= 0
##$YL= 0
##$YMAX_a= 529447
##$YMIN_a= -586410
##$ZGOPTNS= <>
##$ZL1= 120
##$ZL2= 120
##$ZL3= 120
##$ZL4= 120
##$ABSF1= 15.97817
##$ABSF2= -0.9944916
##$ABSG= 5
##$ABSL= 3
##$ALPHA= 0
##$AQORDER= 0
##$ASSFAC= 0
##$ASSFACI= 0
##$ASSFACX= 0
##$ASSWID= 0
##$AUNMP= <proc_1d>
##$AZFE= 0.1
##$AZFW= 0.1
##$BCFW= 0
##$BC_mod= 2
##$BYTORDP= 0
##$COROFFS= 0
##$CY= -3
##$DATMOD= 1
##$DC= 0
##$DFILT= <>
##$DTYPP= 0
##$F1P= 0
##$F2P= 0
##$FCOR= 1
##$FTSIZE= 16384
##$FT_mod= 6
##$GAMMA= 0
##$GB= 0
##$INTBC= 1
##$INTSCL= 2.992141e-10
##$ISEN= 128
##$LB= 0.24
##$LEV0= 0
##$LPBIN= 0
##$MAXI= 10000
##$MC2= 0
##$MEAN= 0
##$ME_mod= 0
##$MI= 1.114404
##$NCOEF= 0
##$NC_proc= -4
##$NLEV= 6
##$NOISF1= 3.799351
##$NOISF2= 2.8
##$NSP= 0
##$NTH_PI= 0
##$NZP= 0
##$OFFSET= 15.98335
##$PC= 1
##$PHC0= -10752.67
##$PHC1= 6.20089
##$PH_mod= 1
##$PKNL= yes
##$PPARMOD= 0
##$PSCAL= 0
##$PSIGN= 0
##$REVERSE= no
##$SF= 200.130006257245
##$SI= 16384
##$SIGF1= 3
##$SIGF2= 2
##$SINO= 5.538805
##$SIOLD= 16384
##$SREGLST= <1H.CDCl3>
##$SSB= 0
##$STSI= 16384
##$STSR= 0
##$SW_p= 3396.73913043478
##$SYMM= 0
##$S_DEV= 0
##$TDeff= 16384
##$TDoff= 0
##$TI= <>
##$TILT= no
##$TM1= 0
##$TM2= 0
##$TOPLEV= 0
##$USERP1= <user>
##$USERP2= <user>
##$USERP3= <user>
##$USERP4= <user>
##$USERP5= <user>
##$WDW= 1
##$XDIM= 16384
##$YMAX_p= 332719565
##$YMIN_p= -168543
$$ End of Bruker specific parameters
$$ ---------------------------------
##NTUPLES= NMR SPECTRUM
##VAR_NAME=  FREQUENCY,     SPECTRUM/REAL,   SPECTRUM/IMAG
##SYMBOL=    X,             R,               I
##VAR_TYPE=  INDEPENDENT,   DEPENDENT,       DEPENDENT
##VAR_FORM=  AFFN,          ASDF,            ASDF
##VAR_DIM=   16384,         16384,           16384
##UNITS=     HZ,            ARBITRARY UNITS, ARBITRARY UNITS
##FACTOR=    0.207333158178281, 1,           1
##FIRST=     3198.74789550772, 0,            0
##LAST=      -197.991234927058, 0,           0
##MIN=       -197.991234927058, -168543,     0
##MAX=       3198.74789550772, 332719565,    0
$$ Real data points
##PAGE= N=1
##DATA TABLE= (X++(R..R)), XYDATA
$$ [...]
7898A73656j9930k9414j0237O1225k1830n2926J3726K9918k6411m525j6362o46
7886I6244K5256J0453k2307M7846M1779m4481j4652J9525N276o3460P503m366
7874A04616M0645m8580J9954k403p219O1623k9992L9062l5043p363J9548o0312
7862I4536N1509M021k7119K2210k8625J4206L783j0329J9087N784k6963j3199
7850A08901k287n61K2025o0181j2368L4043P8143j1835J185N711J4002k9425j5911
7837A31442K7326K272O26O4555K0396k6978J3559l1576k2402M0095K8828Q472
7825B56615m202L0825l497k3952r852M8922m8698J2359j3875m5822K5759K4051
7813B48633M721k4779n7222M0890J8870o2474R654m58o14n76R863n196j9356l5061
$$ plain form
7898 173656 153726 124312 114075 175300 153470 100544 114270 144188 117777 113252 96890 96244
7886 96244 121500 131953 109646 157492 199271 154790 140138 159663 164939 101479 108982 104616
7874 104616 145261 96681 116635 114232 107013 168636 138644 177706 142663 135300 154848 94536
7862 94536 146045 150066 122947 145157 116532 130738 134521 124192 143279 149063 122100 108901
7850 108901 106614 106053 128078 67897 55529 89572 167715 155880 157065 162776 176778 147353 131442
7837 131442 158768 161040 161666 226221 246617 219639 233198 201622 179220 219315 248143 256615
7825 256615 252413 283238 279741 255789 245937 294859 246161 258520 244645 198823 224582 248633
7813 248633 253354 228575 171353 212243 231113 168639 178293 177835 177221 176645 186508 181312 161956 126895
7799A26895Q90n2061J573O843K6469K3656n4430j5414L5765L2166l041o37K3059
7786A51733P0083k6604o0719l9560N371l39N153J0464n801J8351n3676o5250K0906
7773C0112k025J4628J5563q66Q8039o5735o9788J2105K0011j696L1885l6819k748
7760C2666l846k473r225K1379N453j4921L3776O2387O421q0880l0031O2391K071
7747H5168j1309k5133k0291k563o0670R663K2616L928L7488k207l4115O555J9601
7734B8731j6834J9597K1115Q957K0859l274j4883r146K2155k698j9967q939r724
7721C5949q236k9562N0412L6018J83m9845l7851L3644Q510j4732l9473j0390M8160
7708B2787o845k3196M0354Q466j5436J1586j8619J081l103M025j7800p511k554
$$ plain form
7799 126895 127785 75724 77297 84140 110609 134265 79835 64421 100186 132352 129311 128674 151733
7786 151733 221816 195212 134493 94933 100304 99965 105118 115582 109781 128132 74456 9206 30112
7773 30112 28087 42715 58278 57412 145451 79716 9928 22033 42044 40348 72233 35414 32666
7760 32666 28820 26347 17122 38501 43954 29033 62809 125196 131617 50737 20706 83097 85168
7747 85168 73859 48726 28435 25872 -34798 -25135 -2519 1409 38897 36690 2575 9130 28731
7734 28731 11897 31494 52609 61566 82425 79151 64268 55122 77277 74579 54612 45673 35949
7721 35949 27713 -1849 48563 84581 84764 34919 -2932 30712 39222 24490 -14983 -25373 22787
7708 22787 15942 -7254 33100 41566 26130 37716 19097 20178 17075 21100 3300 -4211 -6765
7695f765M7486j0471P810L0351j0878l1256q442L46Q127l3026j0506K2412M2469
7682D7657M9913m3643n4675K8945k501m2744L6585L3693K0455k9293K0953L2204
7670I7549k6451k4524M953l7073l2429K3365J6568l2183M1547J4458L424k1819
7658B7385M740K6621l7020K2142J7510k2774p535K2544L254m934l3356r012j1766
7645b201j4968Q5811l928Q618l5985J3097k584k7636j8467n778M0294k1110k0073
7632d910L6011M248o104M5556k2752p961j061j6733j1679j3550N4885K3563l2005
7619D7508l0986M1237j1957m955k0835l0920k3196K4588O017l316J4358J7733
7607B5276p3093L419L2222L8880l2371l7856M9972P702k062K7853l204M403l6697
$$ plain form
7695 -6765 40721 30250 38060 68411 57533 26277 17835 18181 26308 -6718 -17224 5188 47657
7682 47657 97570 53927 -748 28197 25696 -17048 19537 53230 73685 44392 65345 97549
7670 97549 71098 46574 51527 14454 -17975 5390 21958 -10225 31322 45780 49204 27385
7658 27385 32125 58746 21726 43868 61378 38604 31069 53613 56867 51933 18577 9565 -2201
7645 -2201 -17169 68642 64714 73332 37347 50444 47860 20224 1757 -4021 36273 15163 -4910
7632 -4910 31101 35349 29245 74801 52049 44088 43027 26294 14615 1065 55950 79513 47508
7619 47508 16522 57759 45802 40847 20012 -10908 -34104 -9516 -3499 -6815 7543 25276
7607 25276 -47817 -44398 -12176 26704 -5667 -43523 6449 14151 12089 39942 36738 41141 4444
7594D444L1145J6072q4935m4826J3179O4988j4543n208K1763N1572k8360k8895
7582c604k6737J6934M5288l1565p712k841K0463J6237k4134J630j0234j9603N4656
7569B8778l0891r2147L8732M4989L6443j0984k155N469L2413l8742O146P961k227
7556B3785J952l2573J3717m577j965J808j5529r585J1636l80j8929L1761M7554
7543D8675O759m9877m6162K6719L7308P80j662J1k530l9582j1047L2396J4276
7530A6064J1018o558m8559J1243J4014n717J7301N0099n5271m162Q327J6822k7294
7517b673l9320l370J0626K94j8545l724m341K5120J9419j1558O544p791L9352
7504A0033l0743m854M9159n683P10R51l0710K9444j1444k9403J3213J4308M0962
$$ plain form
7594 4444 35589 51661 -33274 -78100 -64921 67 -14476 -19684 2079 53651 25291 -3604
7582 -3604 -30341 -13407 31881 316 -7396 -10237 10226 26463 2329 3959 -6275 -25878 28778
7569 28778 -2113 -94260 -55528 -10539 25904 14920 12765 18234 50647 11905 18051 26012 23785
7556 23785 25737 -6836 6881 2304 339 2147 -13382 -22967 -11331 -11711 -30640 1121 48675
7543 48675 55434 5557 -40605 -13886 23422 24202 22540 22551 20021 -19561 -30608 1788 16064
7530 16064 27082 20524 -28035 -16792 -2778 -8495 8806 58905 3634 -528 7799 24621 -2673
7517 -2673 -41993 -45363 -34737 -34443 -52988 -56712 -61053 -35933 -16514 -28072 -21528 -29319 10033
7504 10033 -20710 -25564 23595 17912 18622 19573 -11137 18307 6863 -22540 -9327 4981 45943
7491D5943j3598k5825J807j322k8199j2920L2934K6270n6905K5379L0416K1563
7479D5543p615K4204n15m588j2722l5430l2812J1406K150j1760J997K2442J0174
7466A2474q749l8223O039l7431j3874N4205l1191M0976J7224j4278L8280m078
7454B1374j6730J3811l0639J3834M9162M593m6392l2546M1467L5764j1748K197
7442D4147J532o9280m3374K0489L0594j3699k7326L7874o5933N242M6028j0710
7430d4416k3496m895O2144P869k2158O593J5728j3751n227m561J6593p584M9069
7417C1908l5j4029l6557K0394l1875o543K0343k0504J035l8156J6189l842L5473
7404b6199M6391j3063j4242j680R425K1946j4305J2959j8429J1438M3605m9391
$$ plain form
7491 45943 32345 6520 8327 7005 -21194 -34114 -1180 25090 -31815 -6436 23980 45543
7479 45543 37928 62132 61617 57029 44307 8877 -23935 -12529 -10379 -22139 -20142 2300 12474
7466 12474 3725 -34498 -28459 -65890 -79764 -25559 -56750 -15774 1450 -12828 25452 21374
7454 21374 4644 18455 -12184 1650 50812 55405 9013 -23533 17934 53698 41950 44147
7442 44147 45679 -23601 -66975 -46486 -15892 -29591 -56917 -19043 -84976 -79734 -33706 -44416
7430 -44416 -67912 -72807 -10663 -2794 -24952 -18359 -2631 -16382 -21609 -26170 -9577 -17161 31908
7417 31908 31873 17844 -18713 1681 -30194 -36737 -16394 -36898 -35863 -74019 -57830 -61672 -26199
7404 -26199 20192 7129 -7113 -8793 632 22578 8273 21232 2803 14241 57846 8455
7392H455n3236j7095K1450l4106K9524N3352j4421m6854J2223K6480l916k1228
7380c9372k3255l245K416q300L3486J5456l556L5960k852o108L6179k309l6308
7367a808j4791P546K3048m751K7194K4080q0253J0597M944m0891r325K2547J0039
7354b1824P84j5973J3877j1835l322J5597K9149n012n7337j1990N8069j7512k8748
7341e6077N2361r488R683m3559J499K6039L3203k8848o0290K8536L1039l1355
7329d7257j5210k3804K1116L2870Q85K0850J3915J134k8544J5858M6883j9658
7317A9038L83n415j6420J910K7508J2641m3344r881j1577J581n669n2781K7177
7304e4849n4520O110M1590K5093r561j1474J5385L5884j1560j6745L567J145O688
$$ plain form
7392 8455 -44781 -61876 -40426 -74532 -45008 8344 -6077 -52931 -40708 -14228 -18144 -39372
7380 -39372 -62627 -65872 -63456 -71756 -38270 -22814 -26370 9590 6738 630 36809 34500 -1808
7367 -1808 -16599 -9053 13995 9244 36438 60518 -19735 -9138 -4194 -45085 -54410 -31863 -21824
7354 -21824 -21040 -37013 -23136 -34971 -38293 -22696 6453 1441 -55896 -67886 -9817 -27329 -56077
7341 -56077 -3716 -13204 -3521 -47080 -45581 -19542 13661 -15187 -75477 -46941 -15902 -47257
7329 -47257 -62467 -86271 -65155 -32285 -31400 -10550 3365 4499 -24045 -8187 38696 19038
7317 19038 19421 14006 -2414 -504 27004 39645 -3699 -13580 -25157 -23576 -29245 -82026 -54849
7304 -54849 -109369 -103259 -61669 -36576 -46137 -57611 -42226 -6342 -17902 -34647 -31080 -29935 -23247
7291b3247J3878j1328M1160p748k3769r410R05R609K2987J6609m4658J7000J5878
7278A7866m1202k2395n331K1928j3840L2812k041k4965K7235J0324j4921K8987
7266A4457J2001k2844m4985l307L7453M0316k7733o1783p688K6595J8959j008
7254a9567m2655j1922L3428J9663m4698l3897O3566l424L6357k372L0806k4380
7242I05n0947k719P6912K4239m6897J6673L8892n5875j3393q606J5327K8651r1430
7229f8268J5093J2755p337j319k9368N933N390j4955L4375K7678K62Q223o8141
7216g9679K6654M1156M075m9724J0759K9772J665k0073j6528P918J8656R86J3749
7203a0614l1926L729l247K1309K26L4143M8390q058n991k7242m5702j2304J7618
$$ plain form
7291 -23247 -9369 -20697 20463 12715 -11054 -20464 -19559 -9950 13037 29646 -15012 1988 17866
7278 17866 -23336 -45731 -51062 -29134 -42974 -10162 -12203 -37168 -9933 391 -14530 14457
7266 14457 26458 3614 -41371 -44678 -7225 33091 5358 -56425 -64113 -37518 -18559 -19567
7254 -19567 -62222 -74144 -40716 -21053 -65751 -99648 -36082 -39506 -3149 -5521 25285 905
7242 905 -50042 -52761 24151 48390 1493 18166 57058 1183 -12210 -20816 -5489 23162 -68268
7229 -68268 -53175 -40420 -47757 -49076 -78444 -72511 -67121 -82076 -47701 -20023 -19761 -11538 -79679
7216 -79679 -53025 -11869 -7794 -57518 -46759 -16987 -15322 -35395 -51923 -44005 -25349 -24363 -10614
7203 -10614 -42540 -38811 -42058 -20749 -20523 13620 62010 53952 47961 20719 -24983 -37287 -19669
7190a9669K9855p339M0966J3709m6495p0424J8466L6759J1401l5692j3329m73
7178d2265J0004m0597J6523L9993l799k2833k5285K1929R024K9046l6668j7383
7166f2311K1780M2368p673j2955k9083K012J2478P9127N0l2334J0444j1709j9334
7153g140J5950K873K892J0801k5037M3740K7080n2049m01K8348J474k5166l8538
7140a5173J2241k4034J972K4093j5290n000m6760K1913k4882m6501j8640N5406
7128h0655L0978P508j9503M1565K8055K00K3771j7386J0756l5127L867K1451l2854
7115a7374R594N582l8370n172K7709Q168J8684o7772m362k9817K3666L4574j7479
7102e2369l0268Q5015Q753l7251l7622L3924Q1607l1666l2483J2682m1128l2396
$$ plain form
7190 -19669 10186 2847 43813 57522 11027 -59397 -40931 -4172 7229 -28463 -41792 -42265
7178 -42265 -32261 -72858 -56335 -16342 -20141 -42974 -68259 -46330 -37306 -8260 -44928 -62311
7166 -62311 -40531 1837 -5836 -18791 -47874 -45862 -33384 45743 45793 13459 23903 12194 -7140
7153 -7140 8810 11683 14575 25376 339 44079 71159 19110 18709 47057 48531 23365 -15173
7140 -15173 -2932 -26966 -24994 -901 -16191 -21191 -67951 -46038 -70920 -117421 -136061 -80655
7128 -80655 -49677 -42169 -61672 -20107 7948 8148 31919 14533 25289 -9838 -5971 15480 -17374
7115 -17374 -7780 -2198 -40568 -45740 -18031 -9863 8821 -58951 -63313 -93130 -69464 -34890 -52369
7102 -52369 -82637 2378 11131 -26120 -63742 -29818 51789 20123 -12360 322 -40806 -73202
7090g3202J084K0743P777l1940o103L4541K6710l3177L672J2733m453M2147L2421
7077C2953k8995l157N7634k846j7664j4616K4569Q411K420J5617j2608r2238K2278
7064h242Q591m6629M8281K5736k5393o3608J0888j2364j0205o8265M3489K0631
7052g7090L465l579K7843r088j0272K5384O3503k607L94l1808j9173n965N8853
7039A9860K3482j3273n4118L519J7556p9167k1388N1730M9770L5488q830k822
7027B1807o652k8581l9020O6612J2206L4417m0061L2844O905k0638r335m8621
7015a8117p795j4318j4046k2245J7658K5155j8030l5173K5888r523j0103K7365
7003e3284J9088j4927K3062p984r076l580O4781j71l8238k1830R602K5483J1232
$$ plain form
7090 -73202 -72118 -51375 -43598 -75538 -81641 -47100 -20390 -53567 -49895 -37162 -41615 532 32953
7077 32953 3958 801 58435 55589 37925 23309 47878 56289 58709 74326 61718 -30520 -8242
7064 -8242 349 -46280 2001 27737 2344 -61264 -50376 -62740 -72945 -141210 -97721 -77090
7052 -77090 -73625 -77204 -49361 -58449 -68721 -43337 20166 17559 17953 -13855 -33028 -38993 19860
7039 19860 43342 30069 -24049 -20530 -2974 -82141 -103529 -51799 -2029 33459 24629 21807
7027 21807 15155 -13426 -52446 14166 26372 60789 20728 53572 60477 39839 30504 -18117
7015 -18117 -25912 -40230 -54276 -76521 -58863 -33708 -51738 -86911 -61023 -70546 -80649 -53284
7003 -53284 -34196 -49123 -26061 -34045 -43121 -46701 18080 17909 -20329 -42159 -32557 -7074 4158
6990D158N543j4020L9166k145j4159L2938j0730n9398k8927O4220J8042j7168
6978A7520o5544k2508J5802K3898k6660p632J3837L4077k7792q428J5457J6846
6966b1127r48o112L4647m332j3227j6987L1029J3006o3034j795o642k9201N5394
6953b9329J5122k2890Q539J5347K550N699n774J5498K7738j6230j579J8550k786
6940C0455m3528M9753k8123J4267K0919m4719n1820K0673N111J8455J7128P356
6928A5927k9712p650o059J9110K0811K4485n1773p7035P9768J3474n8939p9415
6916a37008O1981O7463k2465q731K4377M1434j5826p612j9862k27j0595L9339
6904A2268J2012K8720M315r4414k3785K9384J5326k6944K8922j4183M728l1358
$$ plain form
6990 4158 9701 -4319 34847 32702 18543 51481 40751 -18647 -47574 16646 34688 17520
6978 17520 -48024 -70532 -54730 -30832 -57492 -65124 -51287 -17210 -45002 -53430 -37973 -21127
6966 -21127 -22075 -28187 6460 2128 -11099 -28086 2943 15949 -47085 -48880 -55522 -84723 -29329
6953 -29329 -14207 -37097 -28558 -13211 -10661 -4962 -10736 4762 32500 16270 14691 33241 30455
6940 30455 -13073 36680 8557 22824 43743 -976 -52796 -32123 -27012 -8557 8571 15927
6928 15927 -13785 -21435 -27494 -8384 12427 36912 -14861 -91896 -12128 1346 -57593 -137008
6916 -137008 -75027 -7564 -30029 -38760 -14383 27051 11225 3613 -16249 -16476 -27071 12268
6904 12268 24280 53000 57315 -37099 -60884 -31500 -16174 -43118 -14196 -28379 -23651 -55009
6892e5009j540K6032k760J522K1426k1114N047K2367K0067m890k5448M518L1845
6879B2063l5019k7053L537J4354l5009J155j5338N9957M5301o6792k8649J2940
6867d8553Q3874J2194o3184J7441L52r500k7930J262L6279J1696m4749K6711j1293
6854a5400l5840J3512L2701k6394j9267L9978k1540j2046M4322q453m8395k9334
6842h6156L1353M2204l5541N4535J2236m5959N982K6809L563r527J8601r8K121
6829B0123M721j6449m3609K6099J8317P10m5022J4940O486J580k7289k5242l205
6816f7840N306J9447L351L8154l9249m098r064J7109J2960J3708J3703m3189n213
6803d4915L9695r720N81l0974K7308m9389n109L5576J2018O406J0772o084M0770
$$ plain form
6892 -55009 -56549 -30517 -33277 -31755 -10329 -31443 -26396 -4029 16038 11148 -14300 -9782 22063
6879 22063 -12956 -40009 -36472 -22118 -57127 -55972 -71310 -11353 33948 -32844 -61493 -48553
6867 -48553 35321 47515 -15669 1772 2124 -7376 -35306 -34044 2235 13931 -30818 -4107 -15400
6854 -15400 -51240 -37728 -5027 -31421 -50688 -10710 -32250 -44296 26 -8427 -56822 -86156
6842 -86156 -54803 -12599 -48140 6395 18631 -27328 -21346 5463 9026 -501 18100 18002 20123
6829 20123 24844 8395 -35214 -9115 9202 9912 -35110 -20170 -13684 -12104 -39393 -64635 -67840
6816 -67840 -62534 -43087 -39736 -1582 -40831 -44929 -53993 -36884 -23924 -10216 3487 -39702 -44915
6803 -44915 -5220 -14940 -14359 -45333 -18025 -67414 -72523 -36947 -24929 -18523 -7751 -13835 26935
6790B6935J0526k3285O725o3943N293L4025J1346k7204l754L7651j7907j983m318
6777i893J2252k0454k3083j4666M0875l9013M6359k2394r206J1887j1387J2394
6765b6329J5493J033J3840j3109r607o047k926L0154m6316k9077j5736N8026O60
6752b9941k4496K4833O4397j1621p2592O695M8252l241l8340K7540M9758l5523
6740E721n2796L3646L2479j687j021k1685K1005L6668m7540j8246N6620n4956
6728a1792j2488K9573K3397k2897k0672l7454j5858k245M0630P120L094j5784
6716c5376p188L0887L857m8214j139L5541J6240O9650p6714m0665L5472K0744
6704C095J5646k2271l4454m271K0154J2450L5373j7929j2794l0048N434P7274
$$ plain form
6790 26935 37461 14176 20901 -43042 -37749 -3724 7622 -19582 -23336 14315 -3592 -5575 -9893
6777 -9893 2359 -18095 -41178 -55844 -14969 -53982 -7623 -30017 -39223 -27336 -38723 -26329
6765 -26329 -10836 -9803 4037 -9072 -18679 -24726 -27652 2502 -43814 -72891 -88627 -30601 -29941
6752 -29941 -54437 -29604 34793 23172 -49420 -42725 5527 2286 -36054 -8514 41244 5721
6740 5721 -47075 -13429 19050 17363 16342 -5343 15662 52330 4790 -13456 43164 -11792
6728 -11792 -24280 5293 28690 5793 -14879 -52333 -68191 -70436 -29806 -22686 -19592 -35376
6716 -35376 -42564 -11677 -7820 -56034 -57173 -21632 -5392 64258 -12456 -53121 -17649 3095
6704 3095 18741 -3530 -37984 -42255 -22101 -9651 25722 7793 -5001 -35049 -29615 47659
6692D7659k3078l9436J3962L9217J6585m4022n997k6285k4656n6887J6251P4222
6680a2465K900l0833j8743J8949P0120l1852n8391K137N4502J430m8220M5329
6668e137k4578n6453J9369O0555K0117m2093j4578L0573L2264l9377j339J8286
6656b391k0614k4086O590L6552m04l1863L1105j3450l2822N3609m4247K5764R931
6643f326k0212k9979J4443J7747R685j214l8928J110J5862o2150L201M4376L194
6630d9191K1268j9395J2671k672J6319J6652J4122L241j6478J2171L4459l5352
6618G815k1239k1438J1417K5632n3245j3230L2455J6063k5913m5727L0154M542
6606e2714Q152r064J1045K5893k809L6322K8852k0561m160j5997J6339J1920l3397
$$ plain form
6692 47659 24581 -14855 -893 38324 54909 10887 4890 -21395 -46051 -102938 -86687 -12465
6680 -12465 -9565 -40398 -59141 -40192 29928 -1924 -60315 -58178 -3676 -2246 -50466 -5137
6668 -5137 -29715 -86168 -66799 -6244 13873 -28220 -42798 -12225 20039 -19338 -20677 -2391
6656 -2391 -23005 -47091 -40501 -3949 -4353 -36216 -5111 -18561 -51383 2226 -42021 -16257 -6326
6643 -6326 -26538 -56517 -42074 -24327 -14642 -15856 -54784 -53674 -37812 -99962 -96761 -52385 -49191
6630 -49191 -27923 -47318 -34647 -37319 -21000 -4348 9774 13015 -3463 8708 43167 7815
6618 7815 -13424 -34862 -23445 2187 -51058 -64288 -31833 -15770 -41683 -87410 -57256 -52714
6606 -52714 -44562 -53626 -42581 -16688 -19497 16825 45677 25116 20956 4959 21298 33218 -179
6593a79m2446k1604J3663J6927j8741M4899L840l2735J9992l1929J4470l1641
6581f5484L1789N5228N11J367q737k6279N3578K0824l3572k4747R573K3876n710
6568C2217o4785L688J8297k1020J147j4353n3524M9670M7292l3577m4856K5355
6556e4449P8084j7588m9481L0252R797j3097O539L301m04Q042k1239j0367n098
6543c5708O1794P087k3848n3859M876N9646l1544k2860K4654j405J7283k2794
6531a6678j3556j4432M142K4919M0712k617k464k3681J4673J1909j4407J1317
6519A9837m3000l5183J937L0986J7217J1894r495p855J7999J1904m1746j8243
6507d3748L5919j8887K1485p995M1027M8202q4453K1305k7311P411k3276j4935
$$ plain form
6593 -179 -42625 -64229 -50566 -33639 -52380 -7481 -3641 -36376 -16384 -48313 -33843 -65484
6581 -65484 -33695 21533 22044 23411 14674 -11605 41973 62797 29225 4478 14051 37927 32217
6568 32217 -32568 -28880 -10583 -31603 -30456 -44809 -98333 -48663 -1371 -34948 -79804 -54449
6556 -54449 23635 6047 -43434 -13182 -3385 -16482 -9943 -6642 -7046 996 -20243 -30610 -35708
6543 -35708 26086 33173 9325 -44534 -39658 19988 -11556 -34416 -9762 -11167 6116 -16678
6531 -16678 -30234 -44666 -40524 -15605 25107 22490 20026 -3655 11018 22927 8520 19837
6519 19837 -23163 -58346 -56409 -25423 -8206 3688 -5807 -13662 4337 16241 -25505 -43748
6507 -43748 -7829 -26716 -5231 -13226 27801 76003 -8450 12855 -14456 -7045 -30321 -45256
6495d5256K4678L912o3278K0494J6651p760k9759R744L1364L6364l53j0178J7389
6482D012J746j075K1021q844j9866P8K7065J6752K068j3371r659l5687J9048j6105
6468a2817j7702q745m924k4148m5693j2895N3979J4607K1357K9076j3735j3385
6456c5025K2222J0418m7193k326P6272J1779n6020L2265O5347l5292l4939J6157
6444B3665j8134m6541J3981K542j3764k4104J5912K1326l5728k521P772o514M1268
6431b0840L4192k3100J7260k5325j8296J5479J4666M3148o4076m0121O1413L8089
6419C2489p1952n6631R5939q194o6301n6621M4706P2403R082n2585L2029K8616
6407B980o0839j4261O7703K561k5866l1786L6523L7804j1211k9690K4124M5536
$$ plain form
6495 -45256 -20578 -16666 -79944 -59450 -42799 -50559 -80318 -70574 -39210 -2846 -3199 -13377 4012
6482 4012 5758 4683 25704 16860 -3006 -2928 24137 40889 42957 29586 19927 -15760 3288 -12817
6468 -12817 -30519 -39264 -44188 -68336 -114029 -126924 -72945 -58338 -36981 -7905 -21640 -35025
6456 -35025 -12803 -2385 -49578 -51904 24368 36147 -19873 12392 77739 42447 7508 23665
6444 23665 5531 -41010 -27029 -24487 -38251 -62355 -46443 -25117 -60845 -63366 -55594 -62108 -20840
6431 -20840 13352 -9748 7512 -17813 -36109 -20630 -5964 37184 -26892 -67013 -5600 32489
6419 32489 -39463 -96094 -155 -8349 -74650 -131271 -86565 -14162 -5080 -57665 -25636 2980
6407 2980 -57859 -72120 -4417 -1856 -27722 -59508 -22985 14819 3608 -26082 -1958 43578
6395D3578j4514j7912j85O588m068L651m7143m4934J2276k3055J9214L1553j3830
6382d8781l2252r97K3009J4726K0016M0278k9746j820L2537M154N0490k5761k0541
6369B5312O816k6829k6815j8289N9082k5858k9643K1691M3062m2701r4375N5542
6357e3005O6342k7050l0033K6056K1810J8154L0062R928l7220j6070K4777m6213
6345a2462j9078Q253J6317o122R174J6663l1957n3402J6306l1313j9467L4259
6333g2829J0521j233j8969M6747N9353p0185j274N2419K3902l0363J8603N2183
6321F8875n7460p2476K7733L1430l2618J5251k2976M3537L947l8698R983q876
6309c2348M6776j6048o053k0085J1291K3781m8679J0063L3954m1649j9670L6224
$$ plain form
6395 43578 29064 11152 10967 17555 13487 17138 -30005 -74939 -62663 -85718 -66504 -34951 -48781
6382 -48781 -81033 -82030 -59021 -44295 -24279 15999 -13747 -15567 16970 21124 71614 45853 25312
6369 25312 32128 5299 -21516 -39805 19277 -6581 -36224 -14533 28529 -14172 -108547 -53005
6357 -53005 13337 -13713 -43746 -17690 4120 22274 52336 62264 25044 8974 33751 -12462
6345 -12462 -31540 -23287 -6970 -13092 -3918 12745 -19212 -72614 -56308 -87621 -107088 -72829
6333 -72829 -62308 -63541 -82510 -35763 23590 -46595 -47869 4550 28452 -1911 16692 68875
6321 68875 11415 -61061 -33328 -1898 -34516 -19265 -42241 1296 5243 -33455 -23472 -32348
6309 -32348 14428 -1620 -7673 -27758 -16467 7314 -41365 -31302 2652 -38997 -58667 -22443
6297b2443J0938m0342o5340O5270K583K2929J5740k5278l400M2315J0657m9679
6285c6050k5993k4025L8204K3828k157J356j6364J0784K6248J5077N026K5044
6273D0978j6823m3529m804J6744l6819l6520M1955M6350k6763l3123p0454Q2498
6261d0310J1286m1471M0679L9383L4129k227m7779J4029m437r273m1446J7981
6249b9456J8115j3689l7765J1073l2825J6490L6778L0575o0694J1761L9750k7716
6237c7603K2564M9701L8509m0802j4594l942K6302o405n9504M0168K4438m076
6225C4756j3756m886J8125J728n8267l9086k3481P3997J5077n7215O5896j2313
6213E75m3922n241j4483L5906N475k7572j2909J1744O130L831J0891p304M0369
$$ plain form
6297 -22443 -11505 -51847 -117187 -51917 -49334 -26405 -10665 -35943 -39343 2972 13629 -36050
6285 -36050 -62043 -86068 -47864 -24036 -26193 -24837 -41201 -30417 -4169 10908 15934 40978
6273 40978 24155 -19374 -24178 -7434 -44253 -80773 -38818 7532 -19231 -52354 -122808 -40310
6261 -40310 -29024 -70495 -29816 9567 43696 41469 -6310 7719 3282 -5991 -47437 -29456
6249 -29456 -11341 -25030 -62795 -51722 -84547 -68057 -31279 -704 -61398 -49637 -9887 -37603
6237 -37603 -15039 34662 73171 32369 17775 13833 40135 33730 -25774 14394 38832 34756
6225 34756 21000 16114 34239 35967 -22300 -61386 -84867 -10870 4207 -53008 12888 575
6213 575 -43347 -48588 -63071 -27165 -21690 -49262 -62171 -50427 -44297 -40466 -29575 -36879 3490
6200C490m1954n624J9596J9691Q806m1969O729N6273k4993J1883o0586l902M3659
6187h901q98m7785N7288L8165p055j2093L9803K1562K0698o6708k380l2826K1176
6174B0046K3331j5359J4279n0629m6441j3158L8044P058k1811J8939m4726J8591
6162e1836m3922L7597L5794m5964J1231O2814J1199m1749l0368Q8818m330p9264
6150d9980o079P0100k2405o2274J5866N1267J5617o8451L3226Q5470m5703o3490
6138d6836k2616N259P4430l0013J6029J9639j2584l6913o102j4911M1359j007
6126a4266l4484J5748K1940K945k3409o0862K0159J0205R213L9426m3186j5552
6114g2123N7904j4360n3003K341M3896J2079o3051N4820L4278n2110j3257M3891
$$ plain form
6200 3490 -38464 -44088 -24492 -4801 4005 -37964 -31235 25038 45 11928 -48658 -52560 -8901
6187 -8901 -9799 -57584 -296 37869 30814 18721 58524 80086 100784 34076 31696 -1130 20046
6174 20046 43377 28018 42297 -8332 -54773 -67931 -29887 -22829 -44640 -25701 -70427 -51836
6162 -51836 -95758 -58161 -22367 -68331 -57100 5714 16913 -24836 -55204 33614 29284 -49980
6150 -49980 -56059 14041 -8364 -70638 -54772 -3505 12112 -56339 -23113 62357 16654 -46836
6138 -46836 -69452 -64193 10237 -19776 -3747 15892 3308 -33605 -39707 -54618 -13259 -14266
6126 -14266 -48750 -33002 -11062 -8117 -31526 -92388 -72229 -62024 -52811 -13385 -56571 -72123
6114 -72123 -14219 -28579 -81582 -79241 -35345 -23266 -86317 -31497 2781 -49329 -62586 -18695
6102a8695O679J233J9030k8143O4635L4482n0962n0527K8483N0110j2634o6077
6090b2386M646p255j7831L0467k546k2445J7279j0064K9051L271k3758j9095K2518
6077a8148r343O9738q171l8516j9518q134J7592k9193l080M6846j137L7443k101
6064C4278N679k1418m231m114j9768L6346J5571j3803l2638P630k7595J7793L0060
6051B3790j424N661r936k1527l3550L0097Q51L379J128k3885L267j8457l5786
6038g6392K7381K7965p298n4957m971P4263K1275m0430n572M2704j7947K7501
6026A3522l4721k5149N0409J3207l7370J8517j6270K2793M732J190J7180m8500
6014b0460K1239k0142J4444l237j1146o831L1562j1725J5385j5481l4777J1721
$$ plain form
6102 -18695 -12016 -10783 8247 -19896 44739 79221 28259 -22268 6215 56325 43691 -22386
6090 -22386 -17740 -24995 -42826 -12359 -14905 -37350 -20071 -30135 -1084 2187 -21571 -40666 -18148
6077 -18148 -27491 42247 34076 -4440 -23958 -32092 -14500 -43693 -46773 73 -1064 36379 34278
6064 34278 39957 18539 14308 10194 -9574 26772 42343 28540 -4098 3532 -24063 -6270 23790
6051 23790 22366 28027 18091 -3436 -36986 -6889 -6038 -2659 -1531 -25416 -22149 -40606 -76392
6038 -76392 -49011 -21046 -28344 -83301 -88272 -14009 7266 -33164 -38736 3968 -13979 13522
6026 13522 -21199 -46348 4061 17268 -20102 -1585 -17855 4938 9670 10860 28040 -20460
6014 -20460 779 -19363 -4919 -8156 -19302 -26133 5429 -6296 9089 -6392 -41169 -29448
6002b9448J7077P856j9763m363j5484j1659J6542q847j9401M7332j6197j7546
5990e3901k285N2650J2061n2180L2132M4186k5299k0658O69J5539O89J2299L9059
5977E4961l1276j6931j3868m5237L9757M6288K8160j1242o5654L8637L4384q8994
5965c1015j901K7049N7138l092n8703o4793N7275J2547J1197m4372p257J6492
5953b9435p0765k8419P7387n722M794p59p018J2250J8777k8647K6811J4658N8359
5940D2271j8954o923J8558J1703k673j3227J169Q308l7317P708o494m919k6853
5927b7643N59J6530l075m009o417l1380P824K7965l1826M3647n0948K7611j176
5914c2338K625N2460K2262m5183j6921J7154j502l2538J3487j461l6021j4948
$$ plain form
6002 -29448 -12371 -4515 -24278 -28641 -44125 -55784 -39242 -48089 -67490 -20158 -36355 -53901
5990 -53901 -56186 -3536 8525 -43655 -11523 32663 7364 -13294 -12625 2914 3603 15902 54961
5977 54961 23685 6754 -7114 -52351 -12594 33694 61854 50612 -15042 23595 57979 -31015
5965 -31015 -32916 -5867 51271 48179 -10524 -75317 -18042 -5495 5702 -38670 -45927 -29435
5953 -29435 -100200 -128619 -51232 -56954 -52160 -52919 -59937 -47687 -28910 -57557 -30746 -16088 42271
5940 42271 23317 16394 34952 46655 43982 30755 31924 40232 2915 10623 4129 -790 -27643
5927 -27643 -27084 -10554 -13629 -17638 -24055 -55435 -47611 -19646 -51472 -7825 -58773 -31162 -32338
5914 -32338 -29713 22747 45009 -174 -17095 59 -1443 -33981 -20494 -21955 -57976 -72924
5902g2924N5050j8609m6801M0565K194q502j0504j9242N2518L0540K6633O130
5890C7048R548K0408n355n3580N9152k4151l0526L2934J8061k1546j472p0082
5878b9561k2001n567k4766p476J8882M8805M6605m3182k1675L688m2102L8812
5866c9538R114j467Q782M8419J1545o1093J2649K340L7915o3869J1574L3601K864
5853A2836j8483l4567k405O084k0287J1188J9223M06O105J696p162M2191o5134
5840d8309R738O0840L7079k2016m0083P939M256k228k7395J3357q919l8890j4320
5827f8951j7447L3970J9430j1061L0218k6231j7445J3856K5187K3936j6226K664
5815h100N6899l91j4970J9298K7968r53m3766m8525M7094J1003k0873m0644J2566
$$ plain form
5902 -72924 -17874 -36483 -83284 -42719 -40525 -49027 -59531 -78773 -26255 4285 30918 37048
5890 37048 46596 67004 61649 8069 67221 43070 12544 45478 63539 41993 40521 -29561
5878 -29561 -51562 -57129 -81895 -89371 -70489 -21684 24921 -18261 -39936 -36248 -78350 -39538
5866 -39538 -30424 -31891 -23109 25310 36855 -24238 -11589 -9249 28666 -35203 -23629 9972 12836
5853 12836 -5647 -40214 -42619 -36535 -56822 -45634 -26411 -26005 -19900 -18204 -25366 16825 -48309
5840 -48309 -38571 22269 59348 37332 -2751 5188 9444 7216 -20179 -6822 -15741 -54631 -68951
5827 -68951 -86398 -52428 -32998 -44059 -13841 -40072 -57517 -43661 -18474 5462 -10764 -8100
5815 -8100 48799 48408 33438 52736 80704 79751 35985 -12540 34554 45557 24684 -15960 -3394
5802c394J552L0144J2632O65J0556k7775m1483K7183O2911l1977o5446j6470K5079
5789a5823K1453n518j125k7159J6278K926L326n0743j3245J7600O5808j7648l33
5776d203l1881j6398K4023Q251p551J4714j8457J8787J5863r001r404J1477K2289
5763A8509P924j5155M5277O285j4947k0456q132J5403J9007l1738Q578M4112k9675
5750D4992k5191r743j4598m318J0013k5082K863R497m4428N496k7541K8547k2198
5737g1691L457O7303k2269j4348J7924L2872j6292J1481K9635M5289p383m9735
5725B6243J9288M3523k6296N243j5380l526M74m887p062J057j3679j7104l989
5712C905K8068m1669l3269K5504l331o0274K3317K3659J7996j3758m6798Q2813
$$ plain form
5802 -3394 -1842 28302 40934 41599 52155 24380 -17103 10080 72991 41014 -24432 -40902 -15823
5789 -15823 5630 112 -1013 -28172 -11894 -8968 -5642 -56385 -69630 -52030 13778 -3870 -4203
5776 -4203 -36084 -52482 -28459 -20208 -27759 -13045 -31502 -12715 3148 -5853 -15257 -3780 18509
5763 18509 26433 11278 56555 62840 47893 27437 19305 34708 53715 21977 30555 74667 44992
5750 44992 19801 10058 -4540 -8858 1155 -23927 -21064 -11567 -55995 -50499 -78040 -49493 -71691
5737 -71691 -68234 -931 -23200 -37548 -19624 13248 -3044 8437 38072 83361 75978 26243
5725 26243 45531 89054 62758 68001 52621 49095 49569 44682 37620 38677 24998 7894 3905
5712 3905 31973 -9696 -42965 -17461 -20792 -81066 -57749 -34090 -16094 -29852 -76650 6163
5700F163j9512l7967j3392L2697Q8937Q494n8232O114L1569K912q091o6072j0211
5687c6591L2811K4488k9192j930J398M0012L2372j5572j5356O996k2152O37J2449
5674C0370L7893L511j4668l5865Q007Q675M816k7470J0314L7117j5863k9989R14
5661A7762p2940K2093L0581m693o2535k1491J2651K8774k8329q420N4161J3874
5649a8512K0612M1994m9676L5860K5117R434m0769l455K1266L369M764J6744L7321
5636A04069m1734j3613k6109J5279l3019k0458M5863j4386m7825Q251l0501k0804
5624g4987J6669L2368j5730K9905q586k6215M1616L4244J4691l1876O43j2k2060
5611i330j0799m2411Q6707J2744m6845O817J0364l5384J7053n43m83K5612K5599
$$ plain form
5700 6163 -13349 -51316 -64708 -32011 56926 65420 7188 13302 44871 47783 39692 -26380 -36591
5687 -36591 -3780 20708 -8484 -10414 -9016 30996 63368 47796 32440 39436 17284 17921 30370
5674 30370 68263 71774 57106 21241 29248 37923 42739 15269 25583 62700 46837 16848 17762
5661 17762 -55178 -33085 -2504 -7197 -69732 -91223 -78572 -49798 -78127 -86547 -32386 -18512
5649 -18512 2100 44094 -5582 30278 55395 64829 24060 20605 41871 45240 50004 66748 104069
5636 104069 62335 48722 22613 37892 4873 -15585 30278 15892 -31933 -23682 -54183 -74987
5624 -74987 -58318 -25950 -41680 -11775 -20361 -46576 -4960 29284 43975 12099 12742 12730 -9330
5611 -9330 -20129 -62540 24167 36911 -9934 -3117 7247 -28137 -11084 -11627 -12110 13502 39101
5598C9101l5195o691J5525N0565j4189j0592m6058K7333M1313l0516j8461j0988
5586A147L7436K9915j9481k1696l5078O429m802j8081M4385j9628n4282m5334
5574i9070M6279K2560p8162R617N5408k9776j0495Q4774O166q05q5Q5684L3368
5561A25463n1704j4771K5384m224O690j1444l4670K7279k1361r332q581k709n2170
5548b6150O336L1873K7356j6611m2003N4877l5639M398L7568M9673l7899n2478
5536A301M4129L1852n6941K6596K9962j8884p6134k4041L8980J0685k8123L1236
5524A0618L1163k8610k5106o0352R278O2027l574m9897N1865K3883M455N9676
5512H5426O6463k1273n1599M174R2144m3669p3050J6997J3194k9021k5538J9944
$$ plain form
5598 39101 3906 -2785 12740 63305 49116 38524 -7534 19799 61112 30596 12135 1147
5586 1147 38583 68498 49017 27321 -7757 -1328 -6130 -24211 20174 546 -53736 -99070
5574 -99070 -52791 -30231 -108393 -98776 -43368 -73144 -83639 1135 7301 6496 6411 92095 125463
5561 125463 73759 58988 84372 80148 86838 75394 40724 68003 46642 37310 28729 26020 -26150
5548 -26150 -19814 12059 39415 22804 -19199 35678 39 4437 42005 91678 53779 1301
5536 1301 45430 77282 20341 46937 76899 58015 -18119 -42160 -3180 7505 -20618 10618
5524 10618 41781 13171 -11935 -72287 -63009 -982 -4556 -54453 -2588 21295 25750 85426
5512 85426 151889 130616 79017 83191 175335 131666 58616 75613 88807 59786 34248 54192
5500E4192J318n1894M8587J2632l6889p8043J539J2740J0150M2857p736m803R552
5487A4202l0720K217J5267M4093L4506j7531J3632L2991o7487o1836L8985O5296
5475H3615P199m4967k415j3903p345L9375L676l3010o2544M8312J0864K927n362
5462B6422m896r773J5182O1684N2932n8307l2503j2206q889j7566L3779M2711
5450H8570l6250l7153j680l6780k6735K3932j318j1486K7639K7480j1866L630
5438G983l4384L5744n65k2792M5758M3562J6871m0296l0022K7268J9897k8094
5426D0930N296Q92Q4003K2206j09890k8061K1494Q950l3685o05J6088j5758l5220
5413b3360L0361j7923J4058K9862J7664j7622J230O877j1632o724j5983O851O77
$$ plain form
5500 54192 55510 3616 52203 64835 27946 -50097 -48558 -35818 -25668 17189 9453 4650 14202
5487 14202 -16518 -14301 966 45059 79565 62034 75666 108657 41170 -20666 18319 83615
5475 83615 90814 45847 43432 29529 22184 61559 65235 32225 -30319 17993 28857 31784 26422
5462 26422 21526 11753 26935 88619 141551 83244 50741 38535 29646 12080 45859 88570
5450 88570 52320 15167 13487 -23293 -50028 -26096 -27414 -38900 -11261 16219 4353 7983
5438 7983 -26401 9343 8778 -14014 31744 75306 92177 51881 21859 49127 69024 40930
5426 40930 46226 47118 131121 153327 43437 15376 36870 45820 12135 11530 27618 11860 -23360
5413 -23360 7001 -10922 3136 32998 50662 33040 34270 41147 29515 22791 6808 13659 14336
5400A4336l7025L5613m0115N6K0100k925R638M736j4643M995M2804L7816j0798
5387F4588m0450L9962M5390p963P366m5919L0102k7544l1581K4669J1715j2259
5375E8076j2519J5458o4788k8444L100L8148J9993j1285K8136Q638m8785j8667
5363a2939M2515N865L2358J2785k01k7168j0318l3366P276M2702K354m7657k7831
5350a3625N0857m397j4424q030m5071J9755M9523J9360K301j0512K5886N783J2294
5337H9700J6038L1993K2239j9819k0759l7168R816O281L7880j9767o3821R53k5807
5324B7759m3563J5849m0422K0412J9650l5930J0619l688M159L325L2805K0705
5312C1680j8275J7624Q030L5524J5192j5099J6115K0930K4639m6889m938J165
$$ plain form
5400 14336 -22689 12924 -27191 -27135 -7035 -9960 -322 4414 -10229 -5234 37570 75386 64588
5387 64588 24138 64100 109490 101527 108893 62974 93076 65532 33951 58620 70335 58076
5375 58076 45557 61015 -3773 -32217 -29117 9031 29024 17739 45875 54513 5728 -12939
5363 -12939 29576 35441 67799 80584 80383 53215 42897 9531 16807 59509 61863 14206 -13625
5350 -13625 37232 32835 18411 10381 -34690 -14935 34588 53948 56249 45737 71623 77406 89700
5337 89700 105738 137731 159970 140151 119392 82224 92040 98321 136201 116434 52613 53566 27759
5324 27759 -15804 45 -40377 -19965 -315 -36245 -25626 -29314 -25155 -21830 10975 31680
5312 31680 13405 31029 39059 74583 89775 74676 90791 111721 136360 89471 84533 85698
5300H5698K519j5598J3848k8109N320l5308j5089m313j1367L1485n1342l148N226
5287b0178L824L3876k2235m621N6921N9559n4844L754J1033m570l4561j3127j3429
5274A402P139q38n1728k7902M7028K4883m140J3838K9578J861k3541M1995L244
5261F2819k4107m891K2884L2469m8784J792N7243K8603j3069L457L347L2177m4199
5248A09741m2346k8698J9310j412O743m4272j2819j8059l400L9680l8652k5483
5236c9667J8494N2616p1008k4062p581P1508L3886k1602L5094M0124n428K7338
5224A09712K1146m6897L4179M1687k4870o2241m163L7960o324l3104M950R46m0215
5211C2766j2767L3683j2706q395l594j5981j3334j4894K9805O079L2772L0367
$$ plain form
5300 85698 88217 72619 86467 58358 63678 28370 13281 8968 -2399 29086 -22256 -25404 -20178
5287 -20178 -16354 17522 -4713 -9334 47587 107146 52302 56056 67089 62519 27958 14831 1402
5274 1402 8541 7703 -44025 -71927 -24899 -16 -4156 9682 39260 41121 17580 59575 62819
5261 62819 38712 33821 56705 89174 40390 42182 99425 128028 114959 118416 121763 153940 109741
5248 109741 67395 38697 58007 56595 63338 19066 6247 -11812 -15212 24468 -14184 -39667
5236 -39667 -21173 31443 -39565 -63627 -71208 300 34186 12584 47678 87802 82374 109712
5224 109712 130858 83961 118140 159827 134957 72716 68553 106513 100189 67085 72035 72981 32766
5211 32766 19999 53682 40976 32581 28987 13006 -328 -15222 14583 20662 53434 83801
5199H3801k1581l0380J8633j5534j2173J0325J9939k651j4866K5309j6918o127
5187C7777j8664M245J2322N93k651Q568n046j2128O1202J2895j7663R159J2475
5174A03084m1551K5763J956O595j2329J9967j0125K3795k6092J8837N364O215
5162A21479m4712j7265k6010o4873K406J9445L5714j1275n989n1328K2397o060
5150b6071K0395L1688k1542j1941J2589M8318M430M7783l4366J9031J1387q668
5138I3033j5539O765l67J9150m7997K5011K5693k290J507N770k2158l266j602
5125H3710k8155q277j1560J1169j7546R127r863J4892n718K406k0633Q293j9262
5112H583M2379L7257J3055n5852K910K6508L1163K3045l9861m186J4806L7535
$$ plain form
5199 83801 62220 31840 50473 34939 22766 33091 53030 50379 35513 60822 43904 37777
5187 37777 19113 23358 35680 36273 33622 42190 37144 25016 86218 99113 81450 90609 103084
5174 103084 61533 87296 89252 95847 83518 103485 93360 117155 91063 109900 115264 121479
5162 121479 76767 59502 33492 -31381 -28975 -9530 26184 14909 8920 -42408 -20011 -26071
5150 -26071 -5676 26012 4470 -7471 5118 53436 57866 105649 71283 90314 101701 93033
5138 93033 77494 84259 83892 103042 55045 80056 105749 103459 104966 110736 88578 85312 83710
5125 83710 55555 47278 35718 46887 29341 38468 28605 43497 37779 40185 19552 27845 8583
5112 8583 50962 88219 101274 45422 48332 74840 106003 129048 89187 85001 99807 137342
5100A37342o708k5073J6268m6732J5801Q512J5353j1715j2317O442L7828J4775
5088A49776l7881j2741J2958q044k6546L3637J3542l3441K0031L6738j6895n2744
5076G8390J0764N4566n9892p2967k3804M6207M2180k9652M944K4380K0381l775
5064I1722J5183p563K0224r382L9911K1400k3870q940J2712J1707L2756P393M6042
5051B49295K3614j0544n9936N3013O2478j4643J8667J1573q679J3197k1069o6546
5039B50420n1412l9636Q796k2786R211l21k8442N052K2068n571K3263P674j3831
5026A64485L2997L2954N0511p307n152k9222K1698O4302J3544L5826O994M7364
5014D28994O4589K6544q2885n5172K7865m2093m9635l4920k4221J7553J8303k8805
$$ plain form
5100 137342 130634 105561 121829 75097 90898 99410 114763 103048 90731 97173 135001 149776
5088 149776 111895 99154 112112 104068 77522 111159 124701 91260 111291 148029 131134 78390
5076 78390 89154 143720 83828 10861 -12943 33264 75444 45792 50736 75116 95497 91722
5064 91722 106905 99342 119566 110184 150095 171495 147625 138685 151397 163104 195860 203253 249295
5051 249295 272909 262365 202429 255442 317920 303277 321944 333517 324838 338035 316966 250420
5039 250420 199008 159372 168168 145382 154593 154272 125830 130882 152950 147379 170642 178316 164485
5026 164485 197482 230436 280947 273640 268488 239266 260964 325266 338810 374636 381630 428994
5014 428994 493583 520127 437242 382070 409935 367842 318207 283287 259066 276619 294922 266117
5002B66117K4852O9769n871l6193P842j6719k4900J4149K5527o904K6241L5616
4990C79526l5139l384J513P3336M6627N221J3451K2389O1631J1796q8638j0537
4978D77792o7617n2674J7480k1002K1270K4257J1529N909K3002j8084p893P2489
4966D86458L8390o8896j1736j3931m0106J1273m0708J769l7631R917N3391L5127
4954D23317P3995P2846K1271J21808J53530J76150J28030Q4458m096j20345k16287
4943I14677j76346j07568j7481m5452m6937j4210K2067p6256n0575O5278J2057
4932D79254o5354n5033M247O4877J1811j5038O522R943N1703M3221L7568O6850
4920F40571J9504M8708R7008M2529P6719J47929J64897Q1519k1844j29616j89173
$$ plain form
5002 266117 290969 360738 354867 318674 326516 309797 284897 299046 324573 317669 343910 379526
4990 379526 344387 341003 342516 415852 462479 467700 481151 503540 565171 576967 488329 477792
4978 477792 410175 357501 374981 353979 375249 399506 411035 416944 439946 421862 413969 486458
4966 486458 524848 455952 444216 430285 390179 401452 360744 362513 324882 334799 388190 423317
4954 423317 497312 570158 591429 713237 866767 1042917 1170947 1255405 1251309 1130964 914677
4943 914677 738331 630763 613282 567830 520893 506683 528750 452494 401919 467197 479254
4932 479254 413900 358867 363114 427991 439802 424764 431286 441229 492932 536153 573721 640571
4920 640571 660075 708783 805791 848320 925039 1072968 1237865 1319384 1297540 1167924 978751
4909I78751j67945k61606j01876M3850m3220j05454o9287N569j9462k8803K292
4898B32809l426M3968L3750K295K1923K360K8102n792J2918L2568K1878M5757
4886D69110L3534l7117J501l6815J6945K3662L8539R9384L2914l2772q4510r2803
4874D31572o1452l6190k244p545n0535n388L130n4543k847j7375M5025m4198m6350
4861A51060K9251j2026k5537K6043L1269l976N611M0958J3980P118m9659m2756
4849A71336M5689Q7082j9026j5393j1930J8012o0808P4442N5395l2074m4040p107
4837B61578O1491M8199o1750p9122k265L7333O384O400N718k9045k0681M2887
4825B77127J2930j797r6189L9376O2521k6542l5769K5823m522L2025j015L4528
$$ plain form
4909 978751 810806 549200 447324 491174 447954 342500 273213 278782 259320 230517 232809
4898 232809 229383 273351 307101 309396 331319 333679 361781 355989 368907 401475 423353 469110
4886 469110 502644 465527 467028 430213 447158 470820 509359 608743 641657 608885 524375 431572
4874 431572 370120 333930 331686 324141 273606 268218 271348 216805 213958 196583 241608 197410 151060
4861 151060 180311 168285 142748 168791 200060 196084 201695 242653 256633 263751 214092 171336
4849 171336 217025 304107 285081 269688 257758 275770 214962 289404 344799 312725 268685 261578
4837 261578 323069 371268 309518 230396 228131 265464 271848 278248 283966 254921 234240 277127
4825 277127 290057 288260 192071 231447 293968 267426 231657 257480 252958 284983 283968 318496
4813C18496K9946j9446N8175j2812J6088L6536K2430L0835Q33k0123J9179M6199
4801E26336P9645j1806M5623N1665J4875M1159N5146J14817J60085R8097O2806
4790A238448r9460j82983j13034q4496o1857p7844k7897n741k8659K1311j4693
4779E63095N3204l614O4840j2538Q916j166r263P9766J33257J7721N4684L9097
4767I87999R8090J28322J29694J66362K63249K07270N6456j30452k45948k48386
4757A412656k08136p0897n5635p4233j06743o9524j4836k9365n451o7760k3961
4746F86115O0598J2813J5588l2890l7850O5452j773K1398k1544O1697Q4494O9395
4734I83493J06120J18038J25078r299j68688k09036n8080j4015j04849n2272j3195
$$ plain form
4813 318496 348442 328996 387171 374359 390447 426983 449413 480248 481081 460958 480137 526336
4801 526336 605981 594175 639798 691463 706338 747497 802643 917460 1077545 1175642 1238448
4790 1238448 1138988 956005 842971 758475 696618 618774 590877 585136 556477 577788 563095
4779 563095 616299 612685 677525 664987 673903 672737 663474 743240 876497 894218 948902 987999
4767 987999 1086089 1214411 1344105 1510467 1773716 1980986 2037442 1906990 1661042 1412656
4757 1412656 1204520 1133623 1077988 1003755 897012 827488 812652 783287 777836 710076 686115
4746 686115 746713 759526 775114 742224 704374 769826 768053 789451 767907 829604 914098 983493
4734 983493 1089613 1207651 1332729 1323430 1154742 945706 887626 873611 768762 716490 703295
4723G03295l5177j256N03j2358P0K9181O123N508p34j1575L2071k4099J496m9687
4709F43361J5588p1967k7941K7550P528k1142m477J8907m6201L3936l4452N1871
4697E92561M3783J514j5825K318P5754J3367m2925k6244K5065L8099k3899K2049
4685G05617J1284J6610j957N053M943M4036l9373L7773k3555J4244J4778Q153
4673G97606P9068k3425k8642N6230K5960k918J2154L9607J7228J0664o231K9502
4661A006803l6160k4341Q809j0329J9970j3794N094K9663n2740k9571K4865L6578
4649I64847J2917K7561L183L3517L3209r34K8245N3499M5153j7383M8075O5725
4637A297614M7902L4652j952k3293o143J3997k7473l7627j9663O9673K2371J2511
$$ plain form
4723 703295 668118 666862 667365 655007 655077 684258 690381 695889 695155 683580 715651 691552 693048 643361
4709 643361 658949 586982 559041 586591 594119 572977 568500 587407 541206 575142 540690 592561
4697 592561 636344 637858 622033 624351 700105 713472 670547 644303 669368 707467 683568 705617
4685 705617 716901 733511 731554 736607 741550 785586 746213 783986 760431 774675 789453 797606
4673 797606 876674 853249 824607 880837 906797 903879 916033 955640 972868 983532 977301 1006803
4661 1006803 970643 946302 955111 944782 964752 950958 956052 985715 932975 903404 928269 964847
4649 964847 977764 1005325 1008508 1042025 1075234 1074300 1102545 1156044 1201197 1183814 1231889 1297614
4637 1297614 1345516 1380168 1378216 1354923 1348780 1362777 1335304 1297677 1278014 1347687 1370058 1382569
4625A382569n6948N4360P5835m290m1359J5148O1141J4844L1715N6444K7720p7130
4613A540049k3978o2309o2427J6256m1698P1933R45j5850J1948l7234k0824O608
4601A383419M485L777M0774N6589K9715L2658O6596O7833o676O9485J19441L1203
4589A899299R072Q2661J6980m4762p38m1994j9944n9264M2164L3330l0967j7983
4577A867854L3687K2494N663o5739J110R524k3876O602j7498L5365K2763m8612
4565A849337K6288K5501P7126K1163M5818N7773L4038L5943K9552K7646O799N5670
4553B292654Q9867K2103M1544R1709Q6348M3832O4975J3545N7921O5107j3724
4542B855881P822M3976K1718j0843l7789P8378N0752n9271l7834L5985P6345J0053
$$ plain form
4625 1382569 1325621 1379981 1455816 1451526 1410167 1425315 1486456 1501300 1533015 1589459 1617179 1540049
4613 1540049 1516071 1453762 1391335 1407591 1365893 1437826 1438771 1422921 1434869 1397635 1376811 1383419
4601 1383419 1387904 1391681 1432455 1489044 1518759 1551417 1618013 1685846 1679170 1748655 1868096 1899299
4589 1899299 1908371 1991032 2008012 1963250 1962512 1920518 1900574 1841310 1883474 1916804 1885837 1867854
4577 1867854 1901541 1924035 1929698 1863959 1865069 1874593 1850717 1857319 1839821 1875186 1897949 1849337
4565 1849337 1875625 1901126 1978252 1999415 2045233 2103006 2137044 2172987 2202539 2230185 2236984 2292654
4553 2292654 2382521 2404624 2446168 2537877 2624225 2668057 2733032 2746577 2804498 2869605 2855881
4542 2855881 2863703 2907679 2929397 2918554 2880765 2959143 3009895 2950624 2912790 2948775 3025120 3035173
4530C035173J538O1613L6877r773K209M7975J00952J43485M0557Q7649J12247
4519C660502O6215M8297O1617J10169J20033P8666J01133R7290J10218R7832P7267
4508D629239J08478K13635R0447O8372J32169J37535O8638O3190J49524K09665
4498E870892K50215J94010J16466J07821K09984J90264R8746J09637J70336J62143
4488G480514Q7689J18721J60906J68689J27399J34752K19218K01906K37330K28013
4478I165137J97951L13014K83205L10148L22108L99879L95515L54100L55456L84698
4468A2481211M48746N31320N21973N07114N59616N94945O40596N93468O60597
4459A7539586P46284P33993N77413N76889O52326P23303P23147P65770Q64756
$$ plain form
4530 3035173 3036711 3098324 3135201 3125428 3127637 3175612 3276564 3420049 3460606 3548255 3660502
4519 3660502 3726717 3775014 3836631 3946800 4066833 4145499 4246632 4343922 4454140 4551972 4629239
4508 4629239 4737717 4951352 5041799 5110171 5242340 5379875 5448513 5511703 5661227 5870892
4498 5870892 6121107 6315117 6431583 6539404 6749388 6939652 7038398 7148035 7318371 7480514
4488 7480514 7568203 7686924 7847830 8016519 8143918 8278670 8497888 8699794 8937124 9165137
4478 9165137 9363088 9676102 9959307 10269455 10591563 10991442 11386957 11741057 12096513 12481211
4468 12481211 12929957 13461277 13983250 14490364 15049980 15644925 16285521 16878989 17539586
4459 17539586 18285870 19019863 19597276 20174165 20826491 21549794 22272941 23038711 23903467
4450B3903467J015697R79120J087291J099830J163238J290284J406031J582160
4442C3527118J743197J871950K039175K186461K623250L229418M049854M889224
4434E6159647N638429O381603P590391R327013J1968396J4891966J8913227K4230827
4426A55101499K4074285M407197k2247679k7866181j9896904j3064495q893588
4419I1614134o964766n756726m105897k426970j167647k46963K70103R44398J477649
4410G3637315J931153K368125L495488M857255O643999Q158626R812680J1478234
4402A22382875J4136317J7977487K3529903K9707480L8736359M7364261L8884883
4395C32719565n742794m8580177n2991189m1749817k9418989k1149690j6427049
$$ plain form
4450 23903467 24919164 25898284 26985575 28085405 29248643 30538927 31944958 33527118
4442 33527118 35270315 37142265 39181440 41367901 43991151 47220569 51270423 56159647
4434 56159647 61798076 68179679 75770070 85097083 97065479 111957445 130870672 155101499
4426 155101499 179175784 183582981 161335302 133469121 113572217 100507722 91614134
4419 91614134 84649368 78892642 74786745 72359775 71192128 70945165 71215268 72159666 73637315
4410 73637315 75568468 77936593 81432081 86289336 92933335 101091961 110904641 122382875
4402 122382875 136519192 154496679 178026582 207734062 246470421 293834682 332719565
4395 332719565 326976771 278396594 225405405 183655588 154236599 133086909 116659860
4388A16659860j3272683j0178228p461963n268966m048642l211540k449333j788703
4380F8979802j437851q76376q9881J026795K223128L374586M274646N393382O942746
4371H9810977R205869J2041780J5407953K0580624K6267970K0228470r165896
4364A84377747l2922156l1062140k1889986j5140781j1246083r175381p645682
4357E5295538n953615m645346l660954l041978k714517k469010k185606k060165
4349B8564347j798140j629533j364462j193048r56644q34622n66347n04552o31790
4340A9085209q19337q38025o85387m77208n41684o11362m59493m02450m93199
4331A3757064m22714l66624l42064l92123l97892l30401l98406l84877m01508
$$ plain form
4388 116659860 103387177 93208949 85746986 80478020 76429378 73217838 70768505 68979802
4380 68979802 67541951 66665575 66575694 67602489 69825617 73200203 77474849 82868231 89810977
4371 89810977 99016846 111058626 126466579 147047203 173315173 193543643 184377747
4364 184377747 151455591 120393451 98503465 83362684 72116601 62941220 55295538
4357 55295538 49341923 44696577 41035623 37993645 35279128 32810118 30624512 28564347
4349 28564347 26766207 25136674 23772212 22579164 21622520 20787898 20221551 19716999 19085209
4340 19085209 18265872 17427847 16742460 16265252 15723568 15112206 14652713 14250263 13757064
4331 13757064 13334350 12967726 12625662 12233539 11835647 11505246 11106840 10721963 10320455
4322A0320455l66023k86446k31050k67768k24119j98761j87147k12709r0870n6250
4312H199312n4539j19666j45122k08194k50978j64738j05679j04223j53424j34134
4302F758615p9258k05799k05627j59748j58615j96481j54730r0103j8865j23095
4292E366294j42637j43464p2648n5838j17353j62297r5043j00106r8916j26680
4282D251312j29296j19691q2720q9787l1609n2640j01270n0127m6241l4713q1815
4271C431403r0651p2154r4486r9076q5289l905p0461p1301j6047k484o5606m1935
4259B718008m3129j6295L286L9666J3088n694n7869p2461o4212j2859n5698k5519
4247B420312l8856p6726m3789n0988o5385q5507q1560q4155k6483m0996j02909
$$ plain form
4322 10320455 9954432 9667986 9436936 9169168 8945049 8746288 8559141 8346432 8255562 8199312
4312 8199312 8144773 8025107 7879985 7671791 7420813 7256075 7150396 7046173 6892749 6758615
4302 6758615 6679357 6473558 6267931 6108183 5949568 5753087 5598357 5508254 5489389 5366294
4292 5366294 5223657 5080193 5007545 4951707 4834354 4672057 4577014 4476908 4377992 4251312
4282 4251312 4122016 4002325 3919605 3829818 3798209 3745569 3644299 3594172 3547931 3513218 3431403
4271 3431403 3340752 3268598 3174112 3075036 2989747 2985842 2915381 2844080 2828033 2825549 2759943 2718008
4259 2718008 2674879 2658584 2661870 2701536 2714624 2708930 2651061 2578600 2514388 2501529 2445831 2420312
4247 2420312 2381456 2304730 2260941 2209953 2144568 2059061 1977501 1893346 1866863 1825867 1722958
4236A722958q8478p6121k318l3209J1825m7564r9354q51J4442K841N3393M0778
4224A498342M2207N2126l6592J753L843m423m5564R17J322j7637o8587j2076M3476
4211A459107l2124q4483p8387j4031n7668j28281l3780K0545k9048j00925j2989
4200I07936L4275j8394j8232o359n73M2536k3477q77P187k3973k8718n2296Q896
4187H27931n537m1039j7312J3710J5372j2909J4043J8154N035q3601n5937K8628
4175G06538m4122j0253J5268o2R612j8726L5064J6711k1332o472o715J0407K57
4162F86175l2970P443q5814n5139m6804p4123l3881j686o1539J664K1277j7115
4150C07488j2802l6264K0306k859N931J4221K7645J4284o370N9813K4987M6081
$$ plain form
4236 1722958 1634480 1558359 1556041 1522832 1534657 1487093 1387739 1386888 1401330 1404171 1457564 1498342
4224 1498342 1540549 1592675 1556083 1557836 1561679 1557256 1511692 1512609 1513931 1496294 1427707 1415631 1459107
4211 1459107 1426983 1342500 1264113 1250082 1192414 1064133 1030353 1050898 1021850 920925 907936
4200 907936 942211 923817 905585 899226 898653 941189 917712 916835 924022 900049 871331 819035 827931
4187 827931 822394 781355 764043 777753 793125 780216 794259 812413 817448 733847 677910 706538
4175 706538 662416 652163 667431 667369 676981 658255 693319 710030 688698 682226 675511 685918 686175
4162 686175 653205 660648 574834 519695 472891 398768 364887 363201 301662 303326 324603 307488
4150 307488 294686 258422 278728 275869 281800 296021 323666 337950 331580 391393 416380 462461
4138D62461L6336N281l73N026J7194p200k8366R075l866r2046o1720k0803j06117
4125B14882k2412j0893K9214j0326k1298l6568N1043N026l6790K4033q650M2010
4113B19271J4995j3934l4244L7991L3739J1252L3592J9083n1711R356M365k6147
4101B57608n7361j2704M9585J0220o7647O180m6090M312K2854J5985L309J3216
4089A99467L3106L4568J7008q47J8206M1153o816N8641P302l6665l4592M2837
4077C73368L69n7641Q583Q273m928j7942Q929j0639q7176J9724N4397J1528M2326
4064C49171m5K9579l0702M9964J26142J06349N7866J34521J62767L1611n9193
4053I58030j10326j36193o3528m3194l5273n1879j1164o2364k4205J7135J642
$$ plain form
4138 462461 498797 504078 503705 508731 525925 518725 490359 499434 495568 403522 341802 320999 214882
4125 214882 192470 181577 210791 200465 179167 142599 193642 198668 161878 185911 177261 219271
4113 219271 234266 220332 186088 224079 257818 269070 302662 321745 270034 279390 283755 257608
4101 257608 200247 187543 237128 247348 179701 185881 139791 144103 166957 182942 186251 199467
4089 199467 232573 267141 284149 283302 301508 342661 335845 394486 401788 365123 330531 373368
4077 373368 373737 316096 324679 332952 328024 310082 319011 308372 221196 240920 295317 306845 349171
4064 349171 349126 378705 348003 397967 524109 630458 688324 822845 985612 1017223 958030
4053 958030 847704 711511 647983 604789 569516 517637 506473 444109 419904 437039 438681
4042D38681J4001m6351K0024N6045J5047k1198J9826M9872K0831R6950J75368
4031H39096L6209N7062K26343K32996K12300J45664Q1953j38356k65393k95526
4021A132348j84621j07525j39287j18938n0770l6525j9448m9792j06203k7105
4011B92134j2285O473L02L3472J0399r704M5260L1225P0965L2971J14676P2481
3999F88369P6092J63189J43674K2809K1832j27553j50221j34015j56384o7678
3989D80114l9628p5213p7241r975p7230n0262q604j0563m5397j410J358O7280
3977A53229j7342o5972k3073L9256K7128j7089J1067P1753k1819p80j7305j7332
3965A21721J3204m780k8965q336J0944k2820N2384K1364j01691m2750L5338N7258
$$ plain form
4042 438681 452682 406331 426355 482400 497447 476249 496075 545947 566778 663728 839096
4031 839096 875305 932367 1158710 1391706 1604006 1749670 1831623 1693267 1427874 1132348
4021 1132348 947727 840202 700915 581977 531207 494682 475234 425442 319239 292134
4011 292134 279849 286322 286624 320096 330495 320791 366051 397276 468241 501212 615888 688369
3999 688369 764461 927650 1071324 1094133 1115965 988412 838191 704176 547792 480114
3989 480114 440486 365273 288032 278057 200827 150565 141961 131398 86001 84591 85949 153229
3977 153229 135887 69915 46842 86098 113226 96137 107204 178957 157138 156358 139053 121721
3965 121721 134925 130145 101180 92844 103788 80968 133352 154716 53025 10275 45613 102871
3953A02871m5058l7613K055L9523m4104K0117K7686K8018q548k5564K857J6648
3941G8888j1293k5911m0027M2629N320n5988N507J4937j4427j3751L3593k3738
3929d261M1088j5480k8143K4276p192K2220j9428m8325L5675N8276j5598m9037
3917e929j1059O7195O32j1376M1014M2005p8857j5426O5538k3018J4143j4120
3905G0742L6956j8643J6222m2751m5561K8224K4040k7646l9854k4414K825n8907
3893g8767j5147n198M1840P712k4938K8164K916k5923Q064M0300l115L1837J5610
3880B3355M5816j2369j6896N555N052J3217m8613L656q182L819p0856k0689j4763
3867i1898J2012m4130J8452N6098L6854m2548l1363L0994K7365k0256J3678M5430
$$ plain form
3953 102871 57813 20200 22255 61778 17674 37791 65477 93495 84947 59383 62240 78888
3941 78888 67595 41684 1657 44286 49606 -6382 -875 14062 -365 -14116 19477 -4261
3929 -4261 36827 21347 -6796 17480 10288 32508 13080 -35245 430 58706 43108 -5929
3917 -5929 -16988 50207 50839 39463 80477 122482 43625 28199 93737 70719 84862 70742
3905 70742 107698 89055 105277 62526 16965 45189 69229 41583 1729 -22685 -19860 -78767
3893 -78767 -93914 -99112 -57272 -49560 -74498 -46334 -43418 -69341 -61277 -20977 -24092 7745 23355
3880 23355 69171 56802 39906 45461 50513 63730 15117 18773 10591 14410 -56446 -77135 -91898
3867 -91898 -79886 -124016 -105564 -49466 -12612 -55160 -86523 -55529 -28164 -48420 -34742 10688
3855A0688M2067k3067k3617K4639o286m839l1307j4493K0448k7687n6715l9441
3843a29610r726L4310J3283m293N1778j5594l2079J3755N0007J6269M2075K7346
3831E7521j8477K3217Q227M6735k7109k8810L3861j5242j031o2305n8185r008
3819e0606l4396r46l314m2234k4380P76J3214K1511j2556J2879L0308M1018j1031
3806e9757L357M1108M6467j4541J8142J6569J8834M32j6004K556o7315M193K9204
3793B3245n1844k6036j7461J7723m4410k2410k1219L9106m84J2052k519P4035
3781b0222R921j368p9077J3543N4639K413L4936K6926j5319j2520L5715k2718
3769B6869p0221J8442K9491O489o362k1909p794l5683p056J2116L797j323p2375
$$ plain form
3855 10688 52755 29688 6071 30710 24424 19585 -11722 -26215 -5767 -33454 -90169 -129610
3843 -129610 -139336 -105026 -91743 -96036 -44258 -59852 -91931 -78176 -28169 -11900 30175 57521
3831 57521 39044 62261 70488 117223 90114 61304 95165 79923 78892 16587 -41598 -50606
3819 -50606 -85002 -85948 -89262 -131496 -155876 -155100 -141886 -120375 -132931 -120052 -89744 -48726 -59757
3806 -59757 -56400 -15292 31175 16634 34776 51345 70179 70611 54607 57163 -10152 -5959 23245
3793 23245 -28599 -54635 -72096 -54373 -98783 -121193 -142412 -103306 -103790 -91738 -94257 -20222
3781 -20222 -10301 -11669 -90746 -77203 -22564 -20151 14785 41711 26392 13872 49587 26869
3769 26869 -43352 -24910 4581 11070 4708 -17201 -24995 -60678 -67734 -55618 -51821 -53144 -125519
3756a25519m3024Q7900L8213p05L601J3965L5897j9083O0289J8741k9040j1218
3744C0017N1212q946k6026p6266J428K5623j4182o457k4877J7847J53j6524k9348
3731g6346M4427q066m252m8937L2703K4958L9325J5883P798L4410k0166K2532
3719F4269J562l7721m772L458K1335J0258k1428j1373J5994k9757k9525j4899
3707c2599K8421l6548n708M8706J6463m7328J1781O09J6574N260j4340k6718K7014
3694h413K7007J4894k3892J3464K4436l2053l1464M1664M8417k3807m8385L0109
3682C1977j435k5839L739J6591J5034j4998k4093k4313m651J031K7477q296j082
3669h858L314J6619J1432l2981L2048R46l0311J6573J5083l5415K6999K5275J8296
$$ plain form
3756 -125519 -168543 -80643 -42430 -43135 -39534 -25569 10328 -8755 51534 70275 41235 30017
3744 30017 81229 72283 46257 -30009 -28581 -2958 -17140 -23597 -48474 -30627 -30474 -46998 -76346
3731 -76346 -31919 -39985 -44237 -93174 -60471 -35513 3812 19695 27493 61903 41737 64269
3719 64269 65831 28110 23338 26796 48131 58389 36961 25588 41582 11825 -17700 -32599
3707 -32599 -4178 -40726 -46434 2272 18735 -28593 -16812 -16203 371 5631 -8709 -35427 -8413
3694 -8413 18594 33488 9596 23060 47496 15443 -16021 25643 74060 50253 1868 31977
3682 31977 30542 4703 8442 25033 40067 25069 976 -23337 -27988 -26957 520 -7776 -8858
3669 -8858 -5544 11075 22507 -10474 21574 22520 -7791 8782 23865 -11550 15449 40724 59020
3656E9020k1952K3497M52j0809J6414j2070O4160J0073n8929m0749L4622K0725
3644H4454k7579m5283l2664K9706M7048k8653m1655J2277J0206k1182K4001O7194
3632G7870k276m0092P0370O2213l4808m0628K6176J0834n980p732j0609l3815
3620G1523l3177j8515K3069K8792J6596l1361l6199L6570M7387l33J2228q908
3608A07672K460M0362L9915j7829k7374N3566O4601J8831K606q023K2469j3860
3596B85396p68k2885k1255j2108j365j4142j0602k2315k6970j8120k6757L6649
3584A44758O367J1754K1091l5329J5413j8088P3946O2062N9197N1817L2986O4920
3572D90894P8586P5325M6725k2390n5641n6269q2368l7246k4052o2996j04684
$$ plain form
3656 59020 37068 60565 61017 50208 66622 54552 118712 128785 69856 29107 63729 84454
3644 84454 56875 11592 -21072 8634 55682 27029 -14626 -2349 7857 -13325 10676 77870
3632 77870 75594 35502 105872 168085 133277 92649 118825 129659 123679 115947 105338 71523
3620 71523 38346 19831 42900 71692 88288 56927 20728 57298 104685 104352 116580 107672
3608 107672 110132 150494 190409 172580 145206 198772 263373 282204 284810 276787 299256 285396
3596 285396 284628 261743 240488 228380 227015 212873 202271 179956 152986 134866 108109 144758
3584 144758 151125 162879 183970 148641 164054 145966 219912 281974 341171 392988 425974 490894
3572 490894 569480 644805 691530 669140 613499 557230 474862 437616 413564 350568 245884
3561B45884k0771Q8170J1061m2963L5135k5117k2704k2959k9299J05696L9091
3550C61224K8365L7899P5495K3665K3745L3942L8339J10826N0403J2935P003j8709
3538G85132q8414l2381o9875p7741j25226k0079j0367j9833l0246P263k3929J7908
3526C12212r3M4366K0174l1210O3897L7029M2680n7740r031M8457M3545O8650
3514E82936L5087M6388K3448j7522M7056k1652q0082m3682o6734j0657p1744l3739
3502C89103l746l5579J7911M6934j9646M519K1084L3267o48M554K6332q983J1798
3489D86900M531l5449K7331l0392o288J1906n8349N2880M058J5420j0734p2839
3477C88975j1951J4925K449k3481P539Q8459J0478J8448L3729L9631q95n628L5889
$$ plain form
3561 245884 225113 313283 324344 281381 316516 291399 268695 245736 216437 322133 361224
3550 361224 389589 427488 502983 526648 550393 584335 622674 733500 783903 796838 803841 785132
3538 785132 696718 664337 594462 516721 391495 371416 361049 341216 310970 318233 294304 312212
3526 312212 312119 356485 376659 345449 409346 446375 489055 431315 422284 470741 514286 582936
3514 582936 618023 664411 687859 670337 717393 695741 615659 571977 505243 494586 422842 389103
3502 389103 385357 349778 367689 414623 394977 399496 420580 453847 453199 457753 484085 475102 486900
3489 486900 491431 455982 483313 452921 446633 458539 400190 453070 457128 472548 461814 388975
3477 388975 377024 391949 394398 370917 378456 466915 477393 495841 529570 569201 568306 562678 598567
3464E98567M994m9143j4543J1829M998j1558k3531k1281K6814m5012j0805J721
3452D73050L4879K3302m3576j3673K8982n939m623J7732j6261k8003J0869O6740
3440E43479R5799j8860j6206J8797M199j579l1947K4995L5383P246n605J625K3886
3427F81212J6833q553J8839J3999J7913k012k2425j1660K0202J2791N3798M3885
3415H34822M206j3604K6384J868m629j6904K9061O50O2253K3815l9439l4438k2175
3402H51870M6136M1784K1376K3634l2371l3169j4924N6356J3702J8224M0204L9047
3390A071869M6439m8787m6053K6795N0426P0564K5397M2373L9923L9129J2690
3379A330765r250M0782O2868N2897k0755K9256j3035K4338L7131K9734j7981K6914
$$ plain form
3464 598567 603561 554418 539875 551704 556702 545144 521613 500332 527146 482134 471329 473050
3452 473050 507929 531231 487655 473982 502964 497025 492402 510134 493873 465870 476739 543479
3440 543479 639278 620418 604212 623009 627208 625629 593682 618677 654060 661306 655701 657326 681212
3427 681212 698045 689492 708331 722330 740243 738231 715806 704146 724348 737139 790937 834822
3415 834822 839028 825424 851808 853676 849047 832143 861204 861854 924107 947922 908483 874045 851870
3402 851870 898006 939790 961166 984800 952429 919260 904336 960692 974394 992618 1032822 1071869
3390 1071869 1118308 1069521 1023468 1050263 1100689 1171253 1196650 1239023 1278946 1318075 1330765
3379 1330765 1321515 1362297 1425165 1478062 1457307 1486563 1473528 1497866 1534997 1564731 1546750 1573664
3367A573664N3271J3234l4879N819J9629M9673K2530L7532R1994M2494R1838N2435
3355B019234L7287K6390R0906J37216L7839K4491J8986J5193P5181O1945O909
3344B551577L8452P0815P0260K0607M2817O1917R6377J08340P7621O1150P3615
3333C273548P9135J13684J11837Q4354J12922J23429J25941J73620J35252J36048
3323D469770J27111J35163J48043J73305J35311Q9009J51802J44579J58765J49995
3313E882853K18715J71134K41886K14278K30423K50506K70669K83518L25976L73566
3303H463524L97966M07050M67825M96246O10757P58977R58816R64371J024834
3294A4550366J236731J517308J860290K318741K813329L481930L327993J084766
$$ plain form
3367 1573664 1626935 1640169 1605290 1611109 1630738 1680411 1702941 1740473 1832467 1874961 1966799 2019234
3355 2019234 2056521 2082911 2173817 2311033 2348872 2373363 2392349 2407542 2482723 2544668 2551577
3344 2551577 2590029 2660844 2731104 2751711 2794528 2856445 2952822 3061162 3138783 3199933 3273548
3333 3273548 3352683 3466367 3578204 3662558 3775480 3898909 4024850 4198470 4333722 4469770
3323 4469770 4596881 4732044 4880087 5053392 5188703 5277712 5429514 5574093 5732858 5882853
3313 5882853 6101568 6272702 6514588 6728866 6959289 7209795 7480464 7763982 8089958 8463524
3303 8463524 8861490 9268540 9736365 10232611 10843368 11602345 12561161 13525532 14550366
3294 14550366 15787097 17304405 19164695 21483436 24296765 27778695 31106688 32191454
3286C2191454k025508l494691k735913j703339j101295q22163n91176l80578j27647
3277A9209144J35311K55627L89967M41720O16277Q61447J038358J311412J659354
3268B5918617K127317K601475K937580L217805L740709M840064O301591P873017
3260E9558175J0181058J2810675J0771858r31446j1242404j2861983j0358487
3253E7927446p342995n374403m069107l149091k197068j466925j005600p12277
3245C2609980m13937j00465K32650N55801R54074J447213K097102K586222L160412
3236D3129052L803758M452629N529001O917680R033816J1577779J3536816J2316306
3228A10296837Q082182k325729j2464516j5948293j4722505j1043545q216012
$$ plain form
3286 32191454 30165946 26671255 23935342 22232003 21130708 20308545 19717369 19336791 19209144
3277 19209144 19344455 19600082 19990049 20431769 21048046 21909493 22947851 24259263 25918617
3268 25918617 28045934 30647409 33584989 36802794 40543503 45383567 51685158 59558175
3260 59558175 69739233 82549908 93321766 92390320 81147916 68285933 57927446
3253 57927446 50584451 45210048 41140941 37991850 35794782 34327857 33322257 32609980
3245 32609980 32196043 32095578 32328228 32884029 33838103 35285316 37382418 39968640 43129052
3236 43129052 46932810 51385439 56914440 63832120 72865936 84443715 97980531 110296837
3228 110296837 118379019 116053290 103588774 87640481 72917976 61874431 53658419
3221E3658419o122253m774896l625047k721357k138583j763794j428919j053407
3213C0030163p22390l87703q824L42684P87127J286761J712466K099874K592646
3204C7732804L282352M171392N496289P365610R166412Q016240L033612k413785
3196G5850926r403072j1847178r434044o823793n033914l896673l066569k360527
3188B3985156j923419j636132j361821j166277r90835q22703o46217n04267l50459
3179A4583026j89221k2210J21739K17532L54552O20017Q29637J168340J494022
3170A9177434K013322K353646R45793j572412l348217l166372k219742j672338
3162A2511114j234174r59030q43534o76109n23014n10815m26463m10593l37025
$$ plain form
3221 53658419 47536166 42761270 39136223 36414866 34276283 32512489 31083570 30030163
3213 30030163 29307773 28920070 28911246 29253930 30041057 31327818 33040284 35140158 37732804
3204 37732804 41015156 45186548 50682837 58048447 67214859 75231099 78264711 75850926
3196 75850926 66447854 54600676 45166632 38342839 33308925 29412252 26345683 23985156
3188 23985156 22061737 20425605 19063784 17897507 16906672 16083969 15437752 14933485 14583026
3179 14583026 14393805 14371595 14493334 14710866 15065418 15685435 16515072 17683412 19177434
3170 19177434 21190756 23544402 24490195 22917783 19569566 16403194 14183452 12511114
3162 12511114 11276940 10317910 9474376 8798267 8275253 7764438 7337975 6927382 6590357
3153F590357l43947l18892k14198j94966k47417j69252j23126r7271j29580j11916
3143D639792n5185M0331o191J2131j44346k05149k37557j73965j98278j17051
3133C554532j08123q1494r6755o1987j01351n3676j37670l8249k9663q2278p3034
3122B690252l8376q0063r5171j4815j7928o6949j17142m6023l7905o9269o1657
3111B044954j9966o1362k3931k8266k2602j0273j08384k1972p7379J3800K3045
3100A707664r2217j0320k887J2243m5289p9063M738K3305L3712j9410j1524p463
3088A513489P414j3011m8562p326l783m8887m745j0065o0776p665l9270M253L908
3075A284974n4973J6366j2913n7594J532n481R04l4485j00712L4850k843l0875
$$ plain form
3153 6590357 6246410 5927518 5713320 5518354 5270937 5101685 4978559 4881288 4751708 4639792
3143 4639792 4584607 4624938 4618747 4630878 4486532 4281383 4043826 3869861 3671583 3554532
3133 3554532 3446409 3364915 3268160 3206173 3104822 3051146 2913476 2875227 2845564 2763286 2690252
3122 2690252 2651876 2571813 2476642 2461827 2443899 2376950 2259808 2213785 2175880 2106611 2044954
3111 2044954 2024988 1963626 1939695 1911429 1888827 1878554 1770170 1748198 1670819 1684619 1707664
3100 1707664 1615447 1605127 1602240 1614483 1569194 1490131 1494869 1518174 1551886 1532476 1520952 1513489
3088 1513489 1520903 1507892 1459330 1452004 1448221 1399334 1394589 1384524 1323748 1316083 1276813 1281066 1284974
3075 1284974 1230001 1246367 1233454 1175860 1177392 1171911 1172815 1138330 1037618 1072468 1069625 1038750
3063A038750o778l7159K6138k4448M1173J3698M1077M7401l6831j3244P217o5352
3051A031642L5623J6548r513k2752K241l156l4517l0292L1015O0625n526j9901
3039A052037J7176K3346N508k9321p5135j2315k727N539J2233l5593k5472j644
3027I33632L6405J1368k23j757r638j5805l1415r766J7084j733L4010R3932K3742
3014A079836k8699K3585P8653Q7311N9114K4490L976L2077o3672o8979q8359p1436
3002A067897n1969j8285k5827M956J3252j7170L5956o401n5262k9015J3326J4548
2990I46006n5358O3453N2776j449L6122N9535J15761Q2707L7642J03094N7763
2979A498052Q3340N5765m277n3125j14166j22509n0430l5087p6355l8377o2008
$$ plain form
3063 1038750 1031972 994813 1020951 996503 1037676 1051374 1092451 1139852 1103021 1089777 1096994 1031642
3051 1031642 1067265 1083813 1074300 1051548 1053789 1050633 1016116 985824 1016839 1077464 1071938 1052037
3039 1052037 1069213 1092559 1098067 1068746 993611 981296 978569 984108 996341 960748 935276 933632
3027 933632 970037 981405 981182 979425 969787 953982 922567 912801 929885 928152 962162 1056094 1079836
3014 1079836 1051137 1074722 1153375 1240686 1299800 1324290 1328266 1360343 1296671 1227692 1139333 1067897
3002 1067897 1015928 997643 971816 976772 990024 972854 1008810 1002409 947147 918132 931458 946006
2990 946006 890648 954101 1006877 1005428 1041550 1101085 1216846 1299553 1337195 1440289 1498052
2979 1498052 1581392 1637157 1632880 1579755 1465589 1343080 1292650 1257563 1181208 1142831 1080823
2968A080823K1562L834o731J8082l4598j4793K6832J1215Q326l2488J6914P5392
2956A174370K9538N706P2385R1804O8918J54065M6444O8601N3623J4935J6756
2945A797145l2281M9267K4539L7199Q6428L2607r862P7140J11646J72006J82143
2934B527977L20646L45992M13960O39515Q08461N29778l80583r79776q28640o40291
2924B757039l89498k61802k17414j85049j01077l2063r2056r3875j488k2623j5844
2913A344250O0070J2073n3350j15375j44370r5526n6204m1967m3065l1966l7453
2902G97117k3064o3147j4982l1775j1326o3392m4149k9528J6467Q932o3903j378
2890D75872K5813j63k4656K3761J0107M6686N1134P6024o948K722o7094j12566
$$ plain form
2968 1080823 1102385 1106219 1099488 1117570 1082972 1068179 1095011 1106226 1114552 1082064 1098978 1174370
2956 1174370 1203908 1209614 1281999 1373803 1442721 1596786 1643230 1711831 1765454 1780389 1797145
2945 1797145 1764864 1814131 1838670 1875869 1962297 1994904 1985042 2062182 2173828 2345834 2527977
2934 2527977 2848623 3194615 3608575 4248090 5056551 5586329 5205746 4225970 3397330 2757039
2924 2757039 2367541 2105739 1888325 1703276 1602199 1570136 1478080 1384205 1382717 1360094 1344250
2913 1344250 1404320 1416393 1363043 1247668 1103298 1007772 951568 909601 866536 834570 797117
2902 797117 774053 710906 695924 664149 652823 589431 545282 515754 532221 541153 477250 475872
2890 475872 501685 501522 476866 500627 510734 557420 608554 684578 677630 680352 613258 500692
2878E00692l2647p5793k0745N2383J996m3247m8145n3762L658j6424l5655L7193
2866B69504M5918m8458j5948J7158k4993o0585J1713R3437K1727m6266k7593O0603
2854B96217l2071j0825k3657j00L4342m3215j9709L5119l9827n2286k6061k6834
2842I1093M0587o7188l900M6909l6437j8852O848M0832q217j0739j0530M0468
2830A10874J213J1429l2589l0958P2579L9052l0914M0732j1001l1272j0289k314
2818A26542p180l9471J1461J4144n6272R953L4636J7496o4918r771L5975K1531
2806I4126l0785n606L8748k9579p459j3450K3309n6592J5420L8808p151l672p803
2793D8314L2446k1457K1576O467q233j2851j1360l382q699m54l6543J4524J6088
$$ plain form
2878 500692 468045 392252 371507 423890 425886 382639 334494 280732 284390 267966 232311 269504
2866 269504 315422 266964 251016 268174 243181 182596 194309 287746 309473 263207 235614 296217
2854 296217 264146 253321 229664 229564 263906 220691 200982 236101 196274 143988 117927 91093
2842 91093 131680 64492 60592 107501 71064 52212 59060 99892 91675 80936 70406 110874
2830 110874 112087 123516 90927 59969 132548 171600 140686 181418 170417 139145 128856 126542
2818 126542 119362 79891 91352 105496 49224 59177 93813 111309 46391 36620 72595 94126
2806 94126 63341 57735 96483 66904 59445 45995 69304 12712 28132 66940 59789 56117 48314
2793 48314 80760 59303 80879 87346 79113 66262 54902 51520 42821 42367 5824 20348 36436
2780C6436J5323j902N831L3712j6955j5853O356j3518j0299k5731P1705J6305
2768A01410j5423K5966k255L948k2710l3463K3920J0333R227l3672r109k0993
2756C7179J7266p530j4702o496k5403K5320N189q139j0524K310l236p942Q0951
2743H4243L8720J899k1218P304J5981l598J049m1930L051M9533Q050n510J9658
2730A57232P14m1168J2927J5077l7811k0513l5394J4353j8117J933J0217k1357
2718C8093k2721L8953J3199j9512k3803N629J5230M0615K2723k077n7173L0115
2706G9271L7616o747n75m3766k272j2946L6878j6826n1375P6009L6164q1305M3757
2693I3883N7384J3578n6811r800M8302K7237k0408j5435M5140L1580l0482j4201
$$ plain form
2780 36436 51759 49857 55688 89400 72445 56592 62948 49430 39131 13400 85105 101410
2768 101410 85987 111953 109698 113646 90936 57473 81393 91726 100953 67281 58172 37179
2756 37179 54445 46915 32213 25717 314 25634 30823 22684 12160 14470 11234 3292 84243
2743 84243 122963 124862 103644 110948 126929 123331 124380 82450 85501 135034 143084 137574 157232
2730 157232 157946 116778 129705 144782 106971 86458 51064 65417 47300 49233 59450 38093
2718 38093 15372 54325 67524 48012 24209 29838 45068 85683 108406 106329 49156 79271
2706 79271 116887 110140 109565 65799 63527 50581 87459 70633 19258 95267 131431 50126 93883
2693 93883 151267 164845 108034 98234 146536 173773 153365 137930 183070 214650 184168 169967
2681A69967M365k6286N981o3925j3014j1410j3827M8470l999m6347j8870K1590
2669E2695M5031M3987l3887L0059K5892n8152l571K3391K0997j9257q652J0881
2657A29414M4095m665o484K4238M5353j0615l1507k6431R643j7958M2437q694
2645A88826J752m0569j8807L8498j2383k460Q158K8795m3557L3109K0798J4040
2633B16200k9518j1374L7868M5382j4395q5095L9022L2151J0103k2064j7241K1048
2621B22087l1178j7329P194k2613k5469j6384M9047K6194l5722L282K8085M3842
2609B31036J0012N3254k1162n0118j745M9739J1347L497j4810M663J9567j389
2597B93891l4871j6663J7415j9842j7761M7859R4649k7463p3847o339O6573j9467
$$ plain form
2681 169967 174332 148046 154027 90102 77088 65678 51851 100321 96322 49975 31105 52695
2669 52695 97726 141713 107826 137885 163777 105625 102054 125445 146442 127185 118533 129414
2657 129414 173509 168844 162360 186598 231951 221336 189829 163398 173041 155083 197520 188826
2645 188826 190578 150009 131202 169700 157317 154857 163015 191810 148253 181362 202160 216200
2633 216200 186682 175308 213176 258558 244163 159068 198090 230241 240344 218280 201039 222087
2621 222087 190909 173580 180774 158161 132692 116308 165355 191549 155827 159109 187194 231036
2609 231036 241048 294302 273140 223022 221277 271016 282363 285860 271050 275713 295280 293891
2597 293891 259020 242357 259772 239930 222169 270028 364677 337214 263367 257028 323601 304134
2585C04134m2966N7778r098Q846m8766L223J9459l9323l2172M2972M7880r716
2573C02251m244j309R949N0699M504J9272O313k630K9226j9876m7631K5843K3998
2560C96365P832M7423J6941j5216J1988o5838J7054O6737l4369n242K8279K2453
2548D94407J1385k1627j0670L3936M3796J8306k5367j0167K895J7743k6983N1117
2536E78771m439J150L8201J8586J0364K226k41l368O852M4104L7088M634l5322
2523F98606L3322O5119j9291L003M7756N7157M5784k3452O211P5309j1215J4674
2511I92983P4642O0002L5347k6529J475L6727J8641N2793M2987l283O0044O5714
2499A411543P3356L5881M3406O7449N6743N8003Q5415N0860O2855L2840L1803
$$ plain form
2585 304134 261168 318946 309848 318694 269928 273151 292610 253287 221115 264087 311967 302251
2573 302251 298007 296698 306647 357346 361850 381122 387435 384805 414031 394155 346524 372367 396365
2560 396365 404197 451620 468561 453345 465333 399495 416549 483286 448917 443675 471954 494407
2548 494407 505792 484165 473495 507431 551227 569533 544166 533999 536894 554637 527654 578771
2536 578771 574332 575482 613683 632269 642633 644859 644618 641250 648102 692206 729294 733928 698606
2523 698606 731928 797047 777756 780759 828515 885672 931456 908004 914215 989524 978309 992983
2511 992983 1067625 1127627 1162974 1136445 1137920 1174647 1193288 1246081 1289068 1285785 1345829 1411543
2499 1411543 1484899 1520780 1564186 1631635 1688378 1746381 1831796 1882656 1945511 1978351 2010154
2488B010154N4762L4902m0277j5128m0515k885q9741r6928q7986k3927j5360o1129
2476A625942o1627n9209j21371o0448p6951j00088K6900l5850m1387l9401p0267
2465I86243m9264k1346k7785l5884l9904M849m7075j6412N85q986m1849k4831
2453F78341K7293R260m0966j3979j5364J5076o6942j9558M7361k3365n5202Q0240
2441F22195k1265l0169q239o6099o61N7208M1381l0068q0741r234M7570k8936
2429D92942L5137M5346m297m1656k2678j0418k3806j7800J878k4162l2965N534
2417D03055L766M094J8075K3517J5824q0030k1317L0711N4515O47j8870K7500
2405D61487j4646K5660k0226L9500K578j2170n0911o228M3987O5260n1039l7943
$$ plain form
2488 2010154 2064916 2099818 2059541 2044413 2003898 2001013 1911272 1814344 1726358 1702431 1687071 1625942
2476 1625942 1564315 1505106 1383735 1323287 1246336 1146248 1173148 1137298 1095911 1056510 986243
2465 986243 936979 915633 887848 851964 812060 816909 769834 753422 754007 745021 703172 678341
2453 678341 705634 714894 673928 659949 644585 659661 592719 573161 620522 597157 541955 622195
2441 622195 600930 570761 562522 496423 495762 552970 594351 564283 483542 474308 521878 492942
2429 492942 528079 573425 569128 527472 504794 494376 470570 452770 454648 430486 397521 403055
2417 403055 406821 410915 428990 452507 468331 388301 366984 397695 452210 452857 433987 461487
2405 461487 446841 472501 452275 491775 494353 482183 431272 425044 469031 534291 483252 445309
2393D45309K5980J6391k469j0221j7428J2799j9403k7264P923q726m704O419K469
2380D27075l345l1L8787l3856l9274N0381J9948k2108l9986R337L5709M370K6856
2367D73863k3157L8556J5229l1003l2127J4788N1153l649k7489P215O3491Q324
2355E55194j4987N7143J8364j2322L8242J7659j7322n9862K9224j1735J2159j3850
2343E97907K6011J4125N5355L1567m702J058j8114Q4104Q5791R9432J31602R4883
2331A199019J59407J59173m8608j82188j38051j13611j05199o3675k4179o5757
2321G76331J6364N730J1495k3856Q16Q140K1070n1379P357J8883L274J285k0961
2308G74549n1233k1878M902K2539J3569j0788l846o3636j3319O3589M5468l0049
$$ plain form
2393 445309 471289 487680 485211 474990 457562 470361 450958 423694 431617 422891 418187 424606 427075
2380 427075 423730 423699 462486 428630 389356 439737 459685 437577 397591 406928 442637 447007 473863
2367 473863 450706 489262 504491 473488 441361 456149 507302 503653 476164 483379 546870 555194
2355 555194 540207 597350 615714 603392 641634 659293 641971 582109 611333 599598 611757 597907
2343 597907 623918 638043 693398 724965 720263 721321 703207 787311 873102 972534 1104136 1199019
2331 1199019 1358426 1517599 1468991 1286803 1148752 1035141 929942 866267 842088 776331
2321 776331 792695 798425 809920 786064 786880 795020 816090 764711 772068 790951 794225 795510 774549
2308 774549 723316 701438 706340 728879 742448 731660 727814 664178 650859 714448 759916 729867
2296G29867j7030N8539N5381K9161n3233o587k6065M9358k0589J9755K7062r704
2284H35915L1047J0845j4120M9022P0791R839N3897M0346J3382j3667j006K6853
2272A113144M7374L7552K7490p966m378j2694O6272K2098K1112M0847R457l019
2260A357289M7450Q0791L3191p7365O6809J4561k5488K9810R0003M9694m7659
2249A619086R5O8288J424K5277J3589N4156J05823O5387k9008Q1867N6139N5948
2237B118071P1493O8632Q7161O5160M5482R7485O9796P2571M5190N7316J7299
2226B815656M8182J02809J15384J3185Q390P3933R9438Q3301J01172J32708R3203
2215C687361M6324P2652J09080J59455J28370J01092K00969K22166K22243K03711
$$ plain form
2296 729867 712837 771376 826757 855918 802685 796098 770033 819391 798802 818557 845619 835915
2284 835915 866962 877807 863687 912709 983500 993339 1047236 1087582 1100964 1087297 1086291 1113144
2272 1113144 1160518 1198070 1225560 1217594 1213216 1200522 1266794 1288892 1310004 1350851 1360308 1357289
2260 1357289 1404739 1485530 1518721 1441356 1508165 1522726 1497238 1527048 1617051 1666745 1619086
2249 1619086 1619181 1687469 1688893 1714170 1727759 1781915 1887738 1953125 1924117 2005984 2062123 2118071
2237 2118071 2189564 2258196 2345357 2410517 2455999 2553484 2623280 2695851 2741041 2798357 2815656
2226 2815656 2863838 2966647 3082031 3095216 3103606 3177539 3276977 3360278 3461450 3594158 3687361
2215 3687361 3733685 3806337 3915417 4074872 4203242 4304334 4505303 4727469 4949712 5153423
2205E153423K85490L59093Q1245j25723k3288j7724K2101N0450J17310Q2089Q8182
2194F072648J52619J90233J57392J54357J85509K25139K47446K62823L76628M32920
2184H457714L64272L77653L45652L80207L64520L75370L86006L20660K49522K16296
2174A1837872K45189L04485L05756M29162N85880L82484k62559m03381l48533
2165A3076355k93119l55729n25156o51149p41555p97310p69781o68490n46458
2156G727608n55004m73851l92884l29064l17651k67052k46110k41619j97134j95220
2146D512019j29698p6110q2149o3960p6101l0088m9014j9223L5704P0391J57068
2135D248839J36517j49212l51164k90663j91804j56580r7728j38264j53970r2077
$$ plain form
2205 5153423 5438913 5798006 5879251 5753528 5730240 5712516 5734617 5785067 5902377 5984466 6072648
2194 6072648 6225267 6415500 6572892 6727249 6912758 7137897 7385343 7648166 8024794 8457714
2184 8457714 8821986 9199639 9545291 9925498 10290018 10665388 11051394 11372054 11621576 11837872
2174 11837872 12083061 12387546 12693302 13122464 13708344 14090828 13828269 13424888 13076355
2165 13076355 12783236 12427507 11902351 11251202 10509647 9712337 8942556 8274066 7727608
2156 7727608 7172604 6698753 6305869 5976805 5659154 5392102 5145992 4904373 4707239 4512019
2146 4512019 4382321 4306211 4224062 4160102 4084001 4053913 4004899 3985676 4021380 4091771 4248839
2135 4248839 4385356 4236144 3884980 3594317 3402513 3245933 3148205 3009941 2855971 2763894
2125B763894j14539l8764k6610n8673q0126k3088o9928p3105o1406k7114K2932
2114B213473m6510q2484n1505N9367M4020m5110k1442j5022L362o3965k9119J0937
2102A976002k0809m143j6642j8457m849o5754M2526m0373k1998P176k6969o6849
2090A738861k1816l1801l1982K551k1776o4137k4111j3569j1671l5268K2487K7637
2078A535405J145j3826Q657O3778l604l1834l1086L6814l367q235J9559O374k3172
2065A556608O093J9840m1253K3133M855M3583j0165l1741k7243J3531R486K5225
2053A591952l3262l1793j5001L881k7473j6306L5253J2958l6216J6058M64l9842
2041A460673r321K0394M870j8302m8901N655N4100J2925L2083k1484K6719J9023
$$ plain form
2125 2763894 2649355 2610591 2583981 2525308 2445182 2422094 2352166 2279061 2217655 2190541 2213473
2114 2213473 2166963 2084479 2032974 2092341 2136361 2091251 2069809 2054787 2058149 1994184 1965065 1976002
2102 1976002 1955193 1951050 1934408 1915951 1911102 1845348 1887874 1847501 1825503 1832679 1805710 1738861
2090 1738861 1717045 1685244 1653262 1655813 1634037 1569900 1545789 1532220 1520549 1485281 1507768 1535405
2078 1535405 1536550 1522724 1531381 1595159 1591555 1559721 1528635 1565449 1562082 1553847 1573406 1579780 1556608
2065 1556608 1562701 1582541 1541288 1564421 1569276 1612859 1602694 1570953 1543710 1557241 1566727 1591952
2053 1591952 1558690 1526897 1511896 1515777 1488304 1471998 1507251 1520209 1483993 1500051 1500515 1460673
2041 1460673 1451352 1471746 1476616 1458314 1409413 1415068 1469168 1482093 1514176 1492692 1519411 1538434
2029A538434j1622N6382N3498P7921L1271j2588M8854l5839N2398J2648K3939
2018A835296J2210M984R5916L0519l0406M0001K2837j2005o4586L3581M9966K6967
2006B045280k9308R308J7111L2197M881J5999K8520K5574p910O1737j3005L3897
1994B224281K3170K1985N5884M9909N1498R061L1826M2864P9179J36370P7643
1983B803670N1415O1129Q7705R8321Q1215J13472P1472L9004O9662Q8331R2776
1972C658172M1997O5906J02774R3096O0525P2684R5443P2762R1647R7919Q5548
1961D538473J04452Q9506J42024J78330P0547J30474J57428Q4875J27262J75745
1951E799116J73147K56683J50407J55712J96262K59915K48436K11390L67619M19222
$$ plain form
2029 1538434 1526812 1583194 1636692 1714613 1745884 1733296 1782150 1746311 1798709 1811357 1835296
2018 1835296 1847506 1852490 1948406 1978925 1948519 1988520 2011357 1999352 1934766 1968347 2018313 2045280
2006 2045280 2015972 2025280 2042391 2074588 2079469 2095468 2123988 2149562 2141652 2203389 2190384 2224281
1994 2224281 2247451 2269436 2325320 2375229 2426727 2435788 2467614 2510478 2589657 2726027 2803670
1983 2803670 2855085 2916214 3003919 3102240 3183455 3296927 3368399 3407403 3477065 3565396 3658172
1972 3658172 3700169 3766075 3868849 3961945 4022470 4095154 4190597 4263359 4355006 4452925 4538473
1961 4538473 4642925 4732431 4874455 5052785 5123332 5253806 5411234 5496109 5623371 5799116
1951 5799116 5972263 6228946 6379353 6535065 6731327 6991242 7239678 7451068 7818687 8237909
1941H237909L02015L19901M11645M68236M24430M30325M74214N22484M10344M31606
1931A2433109M98557M75478L89859M77215N53151N59937N79735O22600P54398
1922A7344039P99162P36932Q44716R73472J088085J161728J248399J363649J521162
1913B7081344J706678J862370K021883K202732K290381K006746J714047J694699
1905D2580880J608679J069795L31024j67834n93138q23294p42658o77147p86673
1896D1799634q57751q32607q55930j023374j062969r95944p43457l88132j8149
1887C5021321L06753N14146O84849Q89709J090684J220173J358707J606164J932051
1878D4624557K242220K504767K856105L304938L612616L974021M237339M726305
$$ plain form
1941 8237909 8539924 8859825 9271470 9739706 10164136 10594461 11068675 11591159 12001503 12433109
1931 12433109 12931666 13407144 13797003 14274218 14827369 15387306 15967041 16589641 17344039
1922 17344039 18143201 18880133 19724849 20698321 21786406 22948134 24196533 25560182 27081344
1913 27081344 28788022 30650392 32672275 34875007 37165388 39172134 40886181 42580880
1905 42580880 44189559 45259354 45590378 45422544 44829406 44006112 43263454 42586307 41799634
1896 41799634 40941883 40109276 39253346 38229972 37167003 36171059 35427602 35039470 35021321
1887 35021321 35328074 35842220 36527069 37416778 38507462 39727635 41086342 42692506 44624557
1878 44624557 46866777 49371544 52227649 55532587 59145203 63119224 67356563 72082868
1870G2082868N158794N012950L801476K467278J966191J797616j197256n169217
1862H5920700n336102m157056l548960l027347k511116l654997m859752m581926
1854E4243444m681028m161380l126630k366308j797678j286474q51207n03199
1846C5469540l56951k46414o4452K12556N03356O63131P59224J076568J364718
1837C9381276J560208J756275J991333K176320K357825K520304K387068J889046
1829E6019655J242219K76307r65249j644757j846545k264413k583889k446945
1821D5786383k542096k856068k867667k808009k879774k792670k471468k143297
1813B4425334j814155j393380j063032q15088o64827m81161k83554m37490q30411
$$ plain form
1870 72082868 77241662 82254612 86056088 88523366 90489557 92287173 91089917 85920700
1862 85920700 80584598 76427542 72878582 69851235 67340119 63685122 58825370 54243444
1854 54243444 49562416 45401036 42274406 39908098 38110420 36823946 35972739 35469540
1846 35469540 35112589 34866175 34801723 35014279 35517635 36180766 36939990 38016558 39381276
1837 39381276 40941484 42697759 44689092 46865412 49223237 51743541 54130609 56019655
1829 56019655 57261874 57538181 56572932 54928175 53081630 50817217 48233328 45786383
1821 45786383 43244287 40388219 37520552 34712543 31832769 29040099 26568631 24425334
1813 24425334 22611179 21217799 20154767 19339679 18674852 18193691 17910137 17472647 16642236
1804A6642236r76525r43834q26346p48710p19685o37150n31413n07846m75171
1795A0275556l83273l22832k95224l24172l46147k25348k10954j94891j72992
1786G799723k07419j89970j14619p0317r6576j00192r0039l8517n6584j9534k6214
1775F789742l1652k3162q0850j63460j86808k11051k37949j49362j60467j80907
1765E364074j61499j92121j65221j23765j29085p1815j15508r5174j22969p9404
1755D107513j11553o4917r1830j04276q8030p0983q6625q6976n9706q7741p8127
1744C176749r7400p6974j05439n9540q9991o7734k1047o5282q2329m9932j2299
1733B448782K6346n9501o1548n4871k2060K0827l9501n1047K0325j299l4643m7959
$$ plain form
1804 16642236 15665711 14721877 13895531 13146821 12427136 11789986 11258573 10750727 10275556
1795 10275556 9892283 9569451 9274227 8950055 8603908 8378560 8167606 7972715 7799723
1786 7799723 7592304 7402334 7287715 7217398 7120822 7020630 6930591 6892074 6835490 6815956 6789742
1775 6789742 6758090 6734928 6654078 6490618 6303810 6092759 5854810 5705448 5544981 5364074
1765 5364074 5202575 5010454 4845233 4721468 4592383 4520568 4405060 4309886 4186917 4107513
1755 4107513 3995960 3931043 3839213 3734937 3646907 3575924 3489299 3402323 3342617 3254876 3176749
1744 3176749 3079349 3002375 2896936 2837396 2747405 2679671 2658624 2593342 2511013 2461081 2448782
1733 2448782 2475128 2415627 2354079 2299208 2277148 2297975 2258474 2207427 2227752 2226453 2191810 2143851
1721B143851j7968L0501m0394k8833k4020l6911n0457r8381J7232k4829l0171
1710A839620r4397k1422j9157q7249l0430J8191l3975j814l9314l1115k6663n9778
1698A412497P902j487k4463l9288K730j1402K6790r915j8619j331L1227j924j609
1685A371108K7127M4113m1947n0933N692O399l4164k494j1280m441p5002m9604
1673A184574O4787j1416n2026p1320J4549J2927p891k4383m1283K6236J7005L020
1661A114779m3078j8273P994k0463K0855K1830J6881K2006R881j7128j3120K943
1649A105107J4022k1534j676O499N5590J4169L1290O981L9397j3815l8800K1272
1637A218502L4245j1537j3802L367m5555j6409j1060K3381O03M8628J740j7805
$$ plain form
1721 2143851 2125883 2156384 2115990 2087157 2063137 2026226 1975769 1877388 1894620 1869791 1839620
1710 1839620 1745223 1723801 1704644 1617395 1586965 1605156 1571181 1569367 1530053 1498938 1472275 1412497
1698 1412497 1420399 1418912 1394449 1355161 1357891 1346489 1373279 1363364 1344745 1343414 1374641 1372717 1371108
1685 1371108 1398235 1442348 1400401 1349468 1355160 1361559 1327395 1324901 1313621 1309180 1234178 1184574
1673 1184574 1249361 1237945 1185919 1114599 1129148 1142075 1134184 1109801 1068518 1094754 1111759 1114779
1661 1114779 1071701 1053428 1061422 1040959 1061814 1083644 1100525 1122531 1132412 1115284 1102164 1105107
1649 1105107 1119129 1097595 1095919 1102418 1158008 1172177 1203467 1210448 1249845 1236030 1197230 1218502
1637 1218502 1252747 1241210 1227408 1230775 1185220 1168811 1157751 1181132 1181735 1230363 1232103 1214298
1625A214298k8228Q1733J2404j3989j0915M1889J3577M5613J2983L6697R988n622
1613A410428Q0687l3191J8055R0792j463L6244Q2123N4728L7038J4732P5437M2298
1601A907908N491j5890K6368J00474L8374P1709P2926K2165N9483J963j443R5878
1589B385406P7459N8184Q479K5766Q2696R5211P9742J6654P8497P8224P2826N2839
1577C111983R9086O9825M4258L6091J09813J74086M0852N0675J53861J90769R5259
1566D176558R9490J79060K12304J90457J31559J75765J78580J92231J38059P9355
1556E753418J48005J27746R6721J02554J66223K00774J29541J06233J88937K54896
1546G275048J73121K54138K97028L05591L12323L73023L49379L62732M01760N09756
$$ plain form
1625 1214298 1186070 1267803 1280207 1266218 1255303 1297192 1310769 1356382 1369365 1406062 1416050 1410428
1613 1410428 1491115 1457924 1475979 1566771 1565308 1601552 1683675 1738403 1775441 1790173 1865610 1907908
1601 1907908 1913399 1897509 1923877 2024351 2062725 2134434 2207360 2229525 2289008 2290971 2289528 2385406
1589 2385406 2462865 2521049 2529528 2555294 2637990 2733201 2812943 2829597 2908094 2986318 3059144 3111983
1577 3111983 3211069 3280894 3325152 3361243 3471056 3645142 3685994 3736669 3890530 4081299 4176558
1566 4176558 4276048 4455108 4667412 4857869 4989428 5165193 5343773 5536004 5674063 5753418
1556 5753418 5901423 6029169 6125890 6228444 6394667 6595441 6724982 6831215 7020152 7275048
1546 7275048 7448169 7702307 7999335 8304926 8617249 8990272 9339651 9702383 10104143 10613899
1536A0613899N26743N16822N79164O76445N36034K38246K11218L24409L78787
1527A4601767K60560Q5063j9146l6475R5736J98242K35761K13339J69692K08511
1517A6013050K65867L03552L17053L64922M90748N17513M65810M28087O13478
1508A9780080P66543P79357Q54891R34100Q62828O56022N75225N35137M80703
1499B6224886L57745L40789L03700M56913O79868N38482P1212m95472o34165l34967
1489B7508991j9539J38005Q2945p6654m1581M5938q227m7003n2329K5003O4203
1478B7619752R1574J48956L29790M69342O16659N96744N38430O50242Q38030J171776
1468C3071295J469635J630427J484813P38267j92417o96349p90039q54798q90492
$$ plain form
1536 10613899 11140642 11657464 12236628 12913073 13449107 13687353 13898571 14222980 14601767
1527 14601767 14862327 14947390 14928244 14891769 14987505 15185747 15421508 15634847 15804539 16013050
1517 16013050 16278917 16582469 16899522 17264444 17755192 18272705 18738515 19166602 19780080
1508 19780080 20546623 21325980 22180871 23114971 23977799 24633821 25209046 25744183 26224886
1499 26224886 26582631 26923420 27227120 27684033 28363901 28902383 28973595 28478123 27843958 27508991
1489 27508991 27489452 27627457 27710402 27633748 27592167 27638105 27629878 27582875 27530546 27555549 27619752
1478 27619752 27711326 27860282 28190072 28659414 29276073 29872817 30411247 31061489 31899519 33071295
1468 33071295 34540930 36171357 37656170 38394437 38202020 37505671 36715632 35860834 34970342
1459C4970342q95286p50875n74405n83975p25489r84531j053565r32323p25979
1450B7743914m93811k67369M4337J82063J38245j04900m84533o62663o60676n01806
1440B4932801l02400k19323k06813j26966k1825P0448J50008K10732L38224O14057
1430B5438943Q49606R92371R83415N07736k10341p86397j188704j405791j460275
1421B3720563j441796j214262j162640j120194j028109r93856p74334n55657l83423
1412A5046292l05188l10886j50195k7387M7177m2582l09747m83662o14190o01882
1402A2247750n43317m16140l61398m12065l61421k56137k30956j67812o3332L5620
1392I470792P9457N4922L2808q6106k43487k85578k23672k71945m17023m72990
$$ plain form
1459 34970342 34075056 33324181 32749776 32165801 31440312 30455781 29402216 28469893 27743914
1450 27743914 27250103 26982734 27027071 27209134 27347379 27242479 26757946 26095283 25434607 24932801
1440 24932801 24630401 24411078 24204265 24077299 24055474 24125922 24275930 24486662 24824886 25438943
1430 25438943 26288549 27280920 28264335 28772071 28561730 27775333 26586629 25180838 23720563
1421 23720563 22278767 21064505 19901865 18781671 17753562 16759706 15985372 15429715 15046292
1412 15046292 14741104 14430218 14280023 14252636 14299813 14257231 13947484 13463822 12849632 12247750
1402 12247750 11704433 11288293 10926895 10514830 10153409 9897272 9666316 9498504 9435172 9470792
1392 9470792 9550249 9605171 9637979 9551873 9308386 9022808 8799136 8527191 8110168 7637178
1382G637178n03409n77888n51108m33083l18867l06205k35968j88939j98233j43969
1372D179509l5960m1955o4348q3187j22261j79435j38992r3328j67797j34016
1362C118230k07834j58737j77394j38011q1592j17192j24084j1542l652q2126
1352B016066j05376l0691n5092j20534o0091m9804o1421p4965n021o447l0040
1341A416584r7432m4354k6494n8470r177k3898j0681n2050M8194n913j32949J1018
1329A014378J6579J2181k0322o8080n1583J0243K1772n3527m5090j7631l3890
1318G85030q101m1353o372k032n5380l5792M385K9153n4059N376K8036m2189m6410
1305E60292M9172N038m1327M841M177M520l1003l8049L1496J4127o228p9307n5365
$$ plain form
1382 7637178 7133769 6555881 6004773 5571690 5252823 4946618 4710650 4521711 4323478 4179509
1372 4179509 4143549 4101594 4037246 3954059 3831798 3652363 3513371 3420043 3252246 3118230
1362 3118230 2910396 2751659 2574265 2436254 2354662 2237470 2113386 2101844 2098192 2016066
1352 2016066 1910690 1879999 1824907 1704373 1644282 1594478 1533057 1458092 1453071 1446624 1416584
1341 1416584 1319152 1274798 1248304 1189834 1180657 1156759 1146078 1094028 1142222 1136309 1003360 1014378
1329 1014378 1030957 1043138 1022816 954736 903153 913396 935168 881641 836551 818920 785030
1318 785030 776929 735576 729204 727172 671792 636000 640385 669538 615479 620855 648891 606702 560292
1305 560292 609464 614502 573175 578016 582193 586713 555710 517661 549157 563284 557056 477749 422384
1292D22384O605l448L3502l4680j4693o243p408j7353l4141J619j7401J9575L251
1279C51569K3194N8389Q672p1817l4202K7929m0290L8446N577p152J0782m263
1267C66834P827p4594k1673L4354Q776J1264l8110j4722K4892j66o89j9360L5877
1254C20510q410J8094k6123l7698M4789k0708m5377K3886O8812j0913n8492J8652
1242B87022R160J9306K7229J3981j7231k8890p648L988m2474o2431K3320P16m0340
1229A85708L1474L1309k3213m9962K2323M687K1047L680n4577Q2253M3404k0464
1217B77669r699L1j0978p595L5369J0330m3400K0312o5450j4150N0035Q052p7707
$$ plain form
1292 422384 428989 425541 459043 424363 409670 403427 396019 378666 344525 346144 328743 348318 351569
1279 351569 374763 433152 441824 370007 335805 363734 323444 361890 367467 360315 371097 366834
1267 366834 374661 300067 278394 312748 321524 332788 294678 279956 304848 304682 303993 284633 320510
1254 320510 312100 330194 304071 266373 311162 290454 245077 268963 337775 326862 268370 287022
1242 287022 296182 315488 342717 356698 339467 310577 302929 306917 264443 202012 225332 226048 185708
1229 185708 217182 248491 225278 175316 197639 202326 223373 227053 172476 254729 298133 277669
1217 277669 267970 268001 257023 249428 284797 295127 251727 272039 206589 192439 242474 250526 172819
$$ [...]
##END NTUPLES=NMR SPECTRUM
##END=
