##TITLE=1H_EC-3239(32)
 CDCl3
 8 sc, 
 17.10.2022
##JCAMPDX= 6.0         $$ Bruker NMR JCAMP-DX V2.0
##DATA TYPE= NMR SPECTRUM
##DATA CLASS= NTUPLES
##ORIGIN= UXNMR, Bruker Analytische Messtechnik GmbH
##OWNER= root
$$ XWIN-NMR		Version 3.5
$$ Mon Oct 17 14:33:57 2022 Russian Standard Time (UT+4h)  she@DPX200
##.OBSERVE FREQUENCY= 200.1313499994
##.OBSERVE NUCLEUS= ^1H
##.ACQUISITION MODE= SIMULTANEOUS
##.ACQUISITION SCHEME= undefined
##.AVERAGES= 8
##.DIGITISER RES= 18
##SPECTROMETER/DATA SYSTEM= spect
##.PULSE SEQUENCE= zg30
##.SOLVENT NAME= CDCl3
##.SHIFT REFERENCE= (INTERNAL, CDCl3, 0, 15.7711)
##AUDIT TRAIL= $$ (NUMBER, WHEN, WHO, WHERE, WHAT)
$$ ##TITLE= Audit trail, XWIN-NMR		Version 3.5
$$ ##JCAMPDX= 5.01
$$ ##ORIGIN= Bruker BioSpin GmbH
$$ ##OWNER= she
$$ F:/spectra/data/she/nmr/H-F/1/pdata/1/auditp.txt
$$ ##AUDIT TRAIL=  $$ (NUMBER, WHEN, WHO, WHERE, WHAT)
(   1,<2022-10-17 14:32:21.93 +0400>,<she>,<DPX200>,
      <created by zg, POWCHK disabled, PULCHK disabled
       configuration hash MD5:
       00 E9 B6 7A A2 85 ED C7 34 08 36 98 17 FE 4E 26
       data hash MD5: 16K
       DD 53 72 E1 C8 26 F6 EC FD 6F 0C F2 BC 59 81 43>)
(   2,<2022-10-17 14:32:24.17 +0400>,<she>,<DPX200>,
      <Start of raw data processing
       efp BC_mod = 2 LB = 0.24 FT_mod = 6 PKNL = 1 PHC0 = -18040.42 PHC1 = 19.20069 SI = 16K 
       data hash MD5: 16K
       F5 BF 3E 64 7C C3 EC A1 C6 08 32 56 84 06 B7 3C>)
(   3,<2022-10-17 14:33:05.25 +0400>,<she>,<DPX200>,
      <pk PHC0 = 2.256531 PHC1 = -1.399997 
       data hash MD5: 16K
       82 D7 FF 96 97 12 35 BC 5B C4 1F 93 6C C7 6D 80>)
(   4,<2022-10-17 14:33:08.57 +0400>,<she>,<DPX200>,
      <abs ABSG = 5 
       data hash MD5: 16K
       42 29 C2 EE 94 63 BD 3C 61 6C 75 66 C4 2D BD 54>)
$$ ##END=
$$ 
$$ hash MD5
$$ 2D 3F 46 57 FC 4A C3 89 21 37 91 66 A9 56 C6 C1
##$RELAX= 
##$RELAX= 
##$RELAX= 
##$RELAX= 
##$RELAX= 
##$RELAX= 
$$ Bruker specific parameters
$$ --------------------------
##$DU= <F:/spectra>
##$EXPNO= 1
##$NAME= <H-F>
##$PROCNO= 1
##$TYPE= <nmr>
##$USER= <she>
##$AMP= (0..31)
100 100 100 100 100 100 100 100 100 100 100 100 100 100 100 100 100 100 
100 100 100 100 100 100 100 100 100 100 100 100 100 100 
##$AQSEQ= 0
##$AQ_mod= 1
##$AUNM= <au_zg>
##$AUTOPOS= <>
##$BF1= 200.13
##$BF2= 200.13
##$BF3= 200.13
##$BF4= 200.13
##$BF5= 200.13
##$BF6= 200.13
##$BF7= 200.13
##$BF8= 200.13
##$BYTORDA= 1
##$CFDGTYP= 0
##$CFRGTYP= 5
##$CHEMSTR= <none>
##$CNST= (0..31)
1 1 145 1 1 1 1 1 1 1 1 1 1 1 1 1 1 1 1 1 1 1 1 1 1 1 1 1 1 1 1 1 
##$CPDPRG= <>
##$CPDPRG1= <>
##$CPDPRG2= <>
##$CPDPRG3= <>
##$CPDPRG4= <mlev>
##$CPDPRG5= <mlev>
##$CPDPRG6= <mlev>
##$CPDPRG7= <mlev>
##$CPDPRG8= <mlev>
##$CPDPRGB= <>
##$CPDPRGT= <>
##$D= (0..31)
0 1.2 0 0 0 0 0 0 0 0.06 0 0.03 0 0 0 0 0.0002 0 0 0 0 0 0 0 0 0 0 0 0 
0 0 0 
##$DATE= 1666002741
##$DBL= (0..7)
120 120 120 120 120 120 120 120 
##$DBP= (0..7)
150 150 150 150 150 150 150 150 
##$DBP07= 0
##$DBPNAM0= <>
##$DBPNAM1= <>
##$DBPNAM2= <>
##$DBPNAM3= <>
$$ [...]
##$SUBNAM3= <"">
##$SUBNAM4= <"">
##$SUBNAM5= <"">
##$SUBNAM6= <"">
##$SUBNAM7= <"">
##$SUBNAM8= <"">
##$SUBNAM9= <"">
##$SW= 18.0517283424941
##$SWIBOX= (0..15)
0 0 2 0 0 0 0 0 0 0 0 0 0 0 0 0 
##$SW_h= 3612.71676300578
##$TD= 16384
##$TD0= 1
##$TE= 0
##$TE2= 300
##$TE3= 300
##$TEG= 300
##$TL= (0..7)
0 120 120 120 120 120 120 120 
##$TP= (0..7)
150 150 150 150 150 150 150 150 
##$TP07= 0
##$TPNAME0= <>
##$TPNAME1= <>
##$TPNAME2= <>
##$TPNAME3= <>
##$TPNAME4= <>
##$TPNAME5= <>
##$TPNAME6= <>
##$TPNAME7= <>
##$TPOAL= (0..7)
0.5 0.5 0.5 0.5 0.5 0.5 0.5 0.5 
##$TPOFFS= (0..7)
0 0 0 0 0 0 0 0 
##$TUNHIN= 0
##$TUNHOUT= 0
##$TUNXOUT= 0
##$USERA1= <user>
##$USERA2= <user>
##$USERA3= <user>
##$USERA4= <user>
##$USERA5= <user>
##$V9= 5
##$VALIST= <valist>
##$VCLIST= <CCCCCCCCCCCCCCC>
##$VD= 0
##$VDLIST= <DDDDDDDDDDDDDDD>
##$VPLIST= <PPPPPPPPPPPPPPP>
##$VTLIST= <TTTTTTTTTTTTTTT>
##$WBST= 1024
##$WBSW= 4
##$XGAIN= (0..3)
0 0 0 0 
##$XL= 0
##$YL= 0
##$YMAX_a= 515156
##$YMIN_a= -874532
##$ZGOPTNS= <>
##$ZL1= 120
##$ZL2= 120
##$ZL3= 120
##$ZL4= 120
##$ABSF1= 15.73587
##$ABSF2= -2.315979
##$ABSG= 5
##$ABSL= 3
##$ALPHA= 0
##$AQORDER= 0
##$ASSFAC= 0
##$ASSFACI= 0
##$ASSFACX= 0
##$ASSWID= 0
##$AUNMP= <proc_1d>
##$AZFE= 0.1
##$AZFW= 0.1
##$BCFW= 0
##$BC_mod= 2
##$BYTORDP= 0
##$COROFFS= 0
##$CY= -3
##$DATMOD= 1
##$DC= 0
##$DFILT= <>
##$DTYPP= 0
##$F1P= 0
##$F2P= 0
##$FCOR= 1
##$FTSIZE= 16384
##$FT_mod= 6
##$GAMMA= 0
##$GB= 0
##$INTBC= 1
##$INTSCL= 3.70164e-10
##$ISEN= 128
##$LB= 0.24
##$LEV0= 0
##$LPBIN= 0
##$MAXI= 10000
##$MC2= 0
##$MEAN= 0
##$ME_mod= 0
##$MI= 1.114404
##$NCOEF= 0
##$NC_proc= -5
##$NLEV= 6
##$NOISF1= 3.799351
##$NOISF2= 2.8
##$NSP= 0
##$NTH_PI= 0
##$NZP= 0
##$OFFSET= 15.77113
##$PC= 1
##$PHC0= -18038.16
##$PHC1= 17.80069
##$PH_mod= 1
##$PKNL= yes
##$PPARMOD= 0
##$PSCAL= 0
##$PSIGN= 0
##$REVERSE= no
##$SF= 200.130000081666
##$SI= 16384
##$SIGF1= 3
##$SIGF2= 2
##$SINO= 5.538805
##$SIOLD= 16384
##$SREGLST= <1H.CDCl3>
##$SSB= 0
##$STSI= 16384
##$STSR= 0
##$SW_p= 3612.71676300578
##$SYMM= 0
##$S_DEV= 0
##$TDeff= 16384
##$TDoff= 0
##$TI= <>
##$TILT= no
##$TM1= 0
##$TM2= 0
##$TOPLEV= 0
##$USERP1= <user>
##$USERP2= <user>
##$USERP3= <user>
##$USERP4= <user>
##$USERP5= <user>
##$WDW= 1
##$XDIM= 16384
##$YMAX_p= 352188945
##$YMIN_p= -174341
$$ End of Bruker specific parameters
$$ ---------------------------------
##NTUPLES= NMR SPECTRUM
##VAR_NAME=  FREQUENCY,     SPECTRUM/REAL,   SPECTRUM/IMAG
##SYMBOL=    X,             R,               I
##VAR_TYPE=  INDEPENDENT,   DEPENDENT,       DEPENDENT
##VAR_FORM=  AFFN,          ASDF,            ASDF
##VAR_DIM=   16384,         16384,           16384
##UNITS=     HZ,            ARBITRARY UNITS, ARBITRARY UNITS
##FACTOR=    0.220516191357247, 1,           1
##FIRST=     3156.27616976788, 0,            0
##LAST=      -456.440593237896, 0,           0
##MIN=       -456.440593237896, -174341,     0
##MAX=       3156.27616976788, 352188945,    0
$$ Real data points
##PAGE= N=1
##DATA TABLE= (X++(R..R)), XYDATA
$$ [...]
8912G9350n4457M8061p984J6773k2402n5228k4415l5214J4206L1372o479P2530
8900E6113J6348m2403k8760l6092M1369L5200j4056O462K853L3519o455O1966
8888A26064k2306l0405q7241N8325O3663k9802p2706k6557n212O836M1929j3333
8876I255o1428K7411M6316M0376Q613j9110L0296j8614m8489P7262M5830o8708
8864F9010J5680J5765j5408k1616k1377m2686N2271O6264n7060j3691l3643O7176
8852H0685l3540k4540j6219k4933J4620k9644K808L0520M3599l2711Q494n0924
8840c1785L6278L0673K5914J145Q514P818P9023n2395L1829k5818j5476q4649
8828A1071l3637L7550j146r424J4158L7866J64l2134l4116L8343k7026l4382J02745
$$ y = [79350, 24893, 72954, 64970, 81743, 59341, 4113, -20302, -55516, -41310, -9938, -16417, 56113, 72461, 30058, 1298, -34794, 6575, 41775, 27719, 34181, 37034, 70553, 64098, 126064, 103758, 73353, -13888, 44437, 108100, 78298, 5592, -20965, -26177, -19341, 22588, 9255, -52173, -24762, 21554, 61930, 70543, 51433, 81729, 63115, 14626, 91888, 137718, 69010, 84690, 100455, 85047, 63431, 42054, -632, 51639, 117903, 60843, 47152, 13509, 80685, 47145, 22605, 6386, -18547, -3927, -33571, -30763, -243, 43356, 10645, 19139, -31785, 4493, 35166, 61080, 62225, 70739, 78557, 157580, 105185, 137014, 111196, 95720, 11071, -22566, 14984, 13838, 4414, 18572, 56438, 56602, 24468, -9648, 28695, 1669, -32713, 70032]
8815G0032J7988R471j3128j97J3886K8107m242K5130k4197M2138p8356k9746J2554
8802F9440J4420O5279M0616N5252j38121J5617N2542q8165m14J9887Q171J0366
8790A24890l6294Q3115P3261k9403m6180J2159K1014o00l804K1271M9350l0330
8778B38449K8181K1946k6183J3983N4031o5765k5953n677L8523k1423M2831K7265
8766C20208M2602k8535N8311L0601K1845K1516L7456J17823Q2188J29741J42461
8755I76217J68457N8821j19565k46327q3806j44517q6078m8680k7666j0155p98
8744D35903q4011M2424O2238L4584k1029l3106o927O4058k7865K0690J8356P5236
8732E80551j865k0401J8534M4974j5679O3604N0512l5005k1339L2540j6288P4602
$$ y = [70032, 88020, 97491, 84363, 84166, 98052, 126159, 121917, 147047, 122850, 164988, 86632, 56886, 69440, 83860, 149139, 189755, 245007, 106886, 122503, 175045, 86880, 86466, 106353, 114524, 124890, 88596, 171711, 244972, 215569, 169389, 181548, 202562, 201962, 198158, 219429, 268779, 238449, 266630, 288576, 262393, 276376, 330407, 264642, 238689, 233012, 271535, 250112, 292943, 320208, 362810, 334275, 392586, 423187, 445032, 466548, 504004, 621827, 704015, 833756, 976217, 1144674, 1203495, 1083930, 837603, 753797, 609280, 523202, 474522, 446856, 436701, 435903, 351892, 394316, 456554, 491138, 470109, 437003, 430076, 494134, 466269, 486959, 505315, 580551, 578686, 558285, 576819, 621793, 606114, 669718, 720230, 685225, 663886, 696426, 680138, 754740]
8720G54740M6585M1653O7822M9136R1636k869P9576R6969O2781J31940J62409
8709A582378K59443K85319K46152L21407M30589N45065P69850J097173J584270
8700G121646J430856Q02689q21127j857614j534624j202596p61311o46993m31035
8691B099891k69524k14985k45142j51216r1968m5173j07456j11406q4567l0304
8681G48150k7308k2425m0442o2378o9660l2659j9079M2265q0382j6781N8886m3480
8669D34707j8132q9081j5583k4738j5773m128j6075J1784K100O0127q8988r3660
8657A42560n357J412P9408k297P820L5670K2674o5611m9767L29l8089Q3532l0746
8644A81538m0617K5378m1533l6155r75J795k3103M3945m4186K5630k3556n2798
$$ y = [754740, 801325, 842978, 910800, 959936, 1051572, 1048703, 1128279, 1225248, 1288029, 1419969, 1582378, 1841821, 2127140, 2373292, 2694699, 3125288, 3670353, 4440203, 5537376, 7121646, 8552502, 9355191, 8534064, 6676450, 5141826, 3939230, 3177919, 2530926, 2099891, 1830367, 1615382, 1370240, 1219024, 1127056, 1081883, 974427, 863021, 778454, 748150, 720842, 698417, 657975, 595597, 525937, 493278, 474199, 516464, 436082, 419301, 478187, 434707, 416575, 327494, 311911, 287173, 271400, 267272, 251197, 262981, 265081, 325208, 236220, 142560, 137203, 138615, 218023, 215726, 223546, 259216, 281890, 216279, 166512, 166841, 128752, 212284, 181538, 140921, 166299, 124766, 88611, 87636, 89431, 66328, 110273, 66087, 91717, 68161, 15363]
8632A5363l496N0005L7484l8207n8893l4746O3288J9179J5440m9065N4511j2217
8620E8646j8286R439M3360l5322o805m5128q986K5544k2868l1400L8908M8275
8608E5377O697M9065J3998n0847k7420J1639l2808K5668J1006k2388J763l4839
8596F911j9519K7321O2145L1031n2984o3434M1930J7597j8528l52L5336K9016
8584I6470k2617o8l6042k4469J6624n2453J2534J6711o2834Q6668J3387j1867
8572C2044L4743k2313P421l8880j3208K3787J600J4696m4237n7687P1641n2265
8560d2658L1984R9839k8672o4457n0536O0390m1896j9663J1717N2169M4933J4970
8548F8120k4307l1530l1045L0705Q0538n5220J6605J3519k4807j2262n6803L4776
$$ y = [15363, 11867, 61872, 99356, 61149, 2256, -32490, 30798, 49977, 65417, 16352, 70863, 58646, 40360, 49799, 93159, 57837, 51032, 5904, -3082, 22462, -406, -31806, 7102, 55377, 62074, 111139, 125137, 74290, 46870, 58509, 25701, 51369, 62375, 39987, 41750, 6911, -12608, 14713, 76858, 107889, 54905, -8529, 33401, 50998, 32470, 32118, 67454, 96470, 73853, 73785, 37743, 13274, 29898, -22555, -10021, 6690, -56144, 30524, 43911, 32044, 66787, 44474, 51895, 13015, -193, 23594, 25194, 39890, -4347, -62034, 9607, -42658, -10674, 89165, 60493, -3964, -54500, 5890, -36006, -55669, -43952, 8217, 53150, 68120, 43813, 12283, -18762, 11943, 92481, 37261, 53866, 67385, 42578, 30316, -26487, 8289]
8536H289l527m0276l7339K2433K8982K7990k9919N7183k9002J082l8583m5743
8524g8430J09430R938j4863j0092n651n974k3341K8369J4111j14727M1102O0114
8512I986M9631m8365L030K9090o0533J7022L9472K824M1514P946m3277k4637r846
8499A3857K415k4994j0304k879Q9804r543k9633Q582M1649K8515n6391k4988N7241
8486H3331m8412l283k4209j527j1598J0848k8093J6356k5128l83M781l3989K8167
8473c3139M1642o704p0984P0333N0962n4860L8245L3416l4962m1582j1986k015
8461b1634K8968j673L3427M5570p5773O1034n5193l6777r488k2472j9358O4500
8449h869j7757J6774O6286P232o762l72j8393j9883L870J928m4268k9135M1318
$$ y = [8289, 4762, -35514, -72853, -50420, -21438, 6552, -23367, 33816, 4814, 5896, -32687, -78430, 31000, 40938, 26075, 15983, 10332, 4358, -18983, 9386, 23497, -91230, -50128, 9986, 59617, 11252, 14282, 43372, -17161, -139, 39333, 42157, 83671, 91617, 48340, 23703, 13857, 16272, -8722, -19026, -21905, 67899, 58356, 28723, 37305, 78954, 107469, 51078, 26090, 83331, 34919, 31636, 7427, 5900, -5698, 5150, -22943, -6587, -31715, -32098, -27317, -61306, -33139, 8503, 1799, -69185, 1148, 52110, -2750, 35495, 68911, 33949, -7633, -19619, -21634, 7334, 5661, 39088, 84658, 8885, 69919, 14726, -22051, -31539, -54011, -73369, -8869, -26626, -9852, 56434, 63666, 56904, 56532, 38139, 18256, 22126, 24054, -20214, -49349, -8031]
8436h031p462N1018l499j4655J1234j1222k9670o3413J8262P5710K2299K939K1958
8423F5468j0769o5758k5435K0549N2081o210j7086L9996l5389o396k7729j6102
8411c2780l646O9721J090l7886J9842K5068k9278m3683K845o162L5826L1985o489
8398B6453M932j8351m2512N8015O431p976j4625k1878J4489L0393O18J1261L952
8385E1202r7375l6218P1376K6847m3468Q331k1067N6095L8856M7843r4655l6212
8373b8445J01291k5602l0809n7874Q084k8109M3853N7467J004J1746L9753r603
8361H2756n4162N4759k4807k1221N442R016r065L8837k8493j477N601j4833k1530
8348B0823R246J8810P053m7470o4268L193P4087O2744j5552J7185l6902k6023
$$ y = [-8031, -15493, 35525, 32026, 17371, 28605, 17383, -12287, -75700, -57438, 18272, 40571, 43510, 65468, 54699, -11059, -36494, -15945, 36136, 29926, 12840, 52836, 17447, 11051, -16678, -32780, -36426, 33295, 34385, -3501, 16341, 41409, 12131, -31552, -28707, -34869, 957, 32942, 26453, 31385, 13034, -29478, 28537, 34968, 26992, 12367, -9511, 4978, 35371, 35989, 47250, 51202, -46173, -82391, -11015, 15832, -27636, -19305, -40372, 15723, 54579, 102422, 7767, -28445, 72846, 47244, 16435, -41439, -33355, -61464, -17611, 39856, 40860, 52606, 92359, 82756, 28594, 83353, 58546, 37325, 42767, 51783, 42718, 81555, 53062, 51585, 57186, 42353, 20823, 30069, 48879, 55932, 8462, -55806, -52613, 21474, 84218, 68666, 85851, 48949, 22926]
8336B2926j3202P1680m1143p3646r251k2080K7342N1992J796p252k0615M3222
8324C1769p136k1505K2654m3070k0633K0979J2887k6835n1121J3568Q949P9795
8312B0301J9787k2117L594l3338r4890M4866J4830j7548M4261L1110p535K4188
8300B7509l0767o1995j2358P7066N1585n3380l7487P5086K2484R860k5199q6071
8288d3667M5941k0609L3118M8647O958j9115p4852j5864L6265m371M5245K0M212
8275D1928p7608K247n047k3529P45l0667L8006J02302L2876l7259L3744M464m719
8262G7483r164r6288o3677R5208N5239l2248o0653J8094J4742r487l0792K4255
8250a7288n720l9625J945K7510M0111K428j0513m967K2714K6766l9178q366P2234
$$ y = [22926, 9724, 81404, 40261, -33385, -42636, -64716, -37374, 14618, 16414, 9162, -11453, 31769, 24633, 3128, 25782, -17288, -37921, -16942, -4055, -30890, -82011, -68443, -59494, 20301, 40088, 17971, 21565, -11773, -106663, -61797, -46967, -64515, -20254, 10856, 3321, 27509, -3258, -65253, -77611, -545, 51040, -2340, -39827, 35259, 57743, 67603, 42404, -43667, 2274, -18335, 14783, 63430, 70388, 51273, -23579, -39443, -3178, -7549, 37696, 37716, 41928, -35680, -33433, -38480, -62009, -61264, -91931, -53925, 48377, 81253, 43994, 77738, 82202, 77483, 68319, -27969, -91646, 3562, 58801, 26553, -34100, -16006, -1264, -10751, -41543, -17288, -23008, -62633, -60688, -33178, 6933, 9361, -1152, -6119, 16595, 43361, 4183, -4183, 68051]
8237F8051l6866l8955j1049k4351N6732N0186o5816l1489J9432J7366k9980K7916
8225A177o469O2695r402j4399K5312J2537n4980P958k0362K8287k4068K7035M9068
8212H4389p6912M4375k6507o3233L1306P2523m2898J725K1310k4637k6496J2694
8200G639j9419l1848J9201N7714J422j9482J180O6306j27154l0382N7809J3252
8188c762j256j9196M6775k7694K5770R861r1893R6965j7035m9004j3383j6407
8176f0259L3124N3310j2997o7362L477K6292j0756M5110N7145J5488Q807p8962
8164A2417n108j8846K3840L7370n1861J7635M9540n5828k0973p876M1920l9205
8152a6975K1069M305l5757k4766j6849N5433K3643n8109O6352r159o7601L2639
$$ y = [68051, 31185, -7770, -18819, -43170, 13562, 63748, -2068, -33557, -14125, 3241, -26739, 1177, -5292, 57403, 48001, 33602, 58914, 71451, 16471, 24429, 4067, 32354, 8286, 35321, 84389, 7477, 51852, 25345, -37888, -6582, 65941, 23043, 24768, 46078, 21441, -5055, 7639, -11780, -43628, -24427, 33287, 34709, 15227, 16407, 82713, -44441, -74823, -17014, -3762, -5018, -24214, 22561, -5133, 20637, 30498, -61395, 35570, 18535, -30469, -43852, -60259, -27135, 26175, 13178, -54184, -50707, -24415, -35171, 9939, 67084, 82572, 91379, 12417, 7309, -11537, 12303, 49673, -2188, 15447, 64987, 9159, -11814, -19690, 22230, -16975, 4094, 8399, -27358, -52124, -68973, -13540, 10103, -48006, 18346, 9187, -58414, -25775]
8140b5775n29o6230M6202P2573O322p2390P1088m122j2050q122k2830m526k2796
8127d3185J1559o172N5580m9256J9460o458O6430p4727k3093k7859P0060K2422
8115A4761l7115O424P6171p704m6807J6534k7977n229j2635J7181k3756O2221
8103C2069j2523m2223K5827N2543q0609J6947k0197k3552L3532o6304N8890k3526
8091d9126k6354l1867K0162K8383J3430L3612Q066L9815k7641p9678J4488M2796
8079a3914M8809J7922O60K1710k6966j5659p0325j188l152J5844J6624m3886N2377
8066a144n843j0472j1056j639L2519L7231l8533J3531l9571K888K9427m3542m2099
8053g8303L417O6486J9286r6548J198Q2000j4083N187p4665J1846m6072J6758
$$ y = [-25775, -26304, -92534, -46332, 26241, 32563, -39827, 31261, 27139, 15089, 6967, -15863, -20389, -43185, -31626, -37798, 17782, -31474, -12014, -18472, 47958, -26769, -49862, -77721, -7661, 14761, -22354, -15930, 60241, 52537, 5730, 22264, -5713, -10942, -23577, -6396, -30152, 32069, 19546, -22677, 3150, 55693, -24916, -7969, -28166, -51718, -18186, -84490, -25600, -49126, -75480, -107347, -87185, -58802, -45372, -11760, -3694, 36121, 8480, -71198, -56710, -13914, 34895, 52817, 53477, 75187, 48221, 32562, -37763, -38951, -42103, -26259, -9635, -53521, -1144, -6987, -17459, -28515, -30154, 2365, 39596, 1063, 14594, -24977, -22089, 7338, -36204, -78303, -74886, -8400, 10886, -85662, -84464, -2464, -16547, -11360, -86025, -74179, -120251, -103493]
8041a03493j12M4907L5425K9091M116m95l6992K3285k6016q003K6153j7297l246
8028c2677j1283O6039k5068n5789K3296J3567K2493j0788q6100M7863J3466k1057
8016e6038P7102J0267o2823J8815k6965K5167L1111k4345k2781K2573l5941j1366
8004e5224N6712O997K8061K882n3333m0742P033J2763L1875J4335J3080J599Q359
7991C4397K3175o2317l683J6647j7827j7953L6603l9581j5931L5909k6943J11853
7979G4349p5769O64j5737k4393M2477m3891M8284l6288L2251K3652l4537k1549
7967c0487m7288M692L2010j5721r964M0203P0809p2877j2969N240O090j5548K0926
7954b4884L7572j9241j8280l0936r2795K0451J7475pN1014N9370j849j7548O0810
$$ y = [-103493, -103605, -58698, -23273, 5818, 9934, 9439, -27553, -4268, -30284, -38287, -12134, -29431, -32677, -43960, 22079, -2989, -58778, -35482, -21915, 578, -10210, -96310, -48447, -34981, -56038, 21064, 31331, -31492, -12677, -39642, -14475, 16636, -7709, -30490, -7917, -43858, -55224, 1488, 8485, 36546, 39428, -13905, -54647, -47614, -34851, -2976, 11359, 24439, 26038, 34397, 57572, -4745, -8428, 8219, -9608, -27561, 9042, -30539, -46470, -10561, -37504, 74349, -1420, -756, -16493, -40886, 1591, -42300, 5984, -30304, 1947, 25599, -8938, -30487, -77775, -73083, -41073, -56794, -66758, -26555, 44254, -28623, -41592, -36352, -30262, -45810, -24884, 12688, -6553, -24833, -55769, -148564, -128113, -110638, -110645, -59631, -261, -2110, -19658, 41152]
7941D1152j1201j8912k6238k8384j299J6010N3752L4293J9484p5157p5371N4044
7929a7827o196L3065l8221o996N063L4121j1331M5000J0647k1934j6370l7345
7917b8324J6003j3184j402k3012J0169O374N487P9748m6341k9243m7002j8490
7905h9217q744N0342M715q74R992n7908J15543m983K5220j4669l2320K1793j6079
7892B811j5969K1574K5695m0683L7748m03k8663k5871r94L2080J1420L2671j0274
7879D1142l7515n9400l0238r972L1623J6655K4569m5672Q602M0128N1382j209
7867C0095J448l8078N966j4087k439m5127l6122P7081l0206L8151k0297K248K3144
7854h223M4387k0563m2442O393j117M1591N1098j2425j1866l7749j7246j8908
$$ y = [41152, 29951, 11039, -15199, -43583, -44882, -28872, 24880, 59173, 78657, 3500, -71871, -17827, -24023, 9042, -29179, -36175, -31112, 3009, -8322, 36678, 47325, 25391, 9021, -28324, -12321, -25505, -26907, -49919, -39750, -33376, -27889, 51859, 5518, -23725, -70727, -89217, -97961, -47619, -42904, -43778, -33786, -91694, 23849, 18866, 44086, 29417, -2903, 18890, 2811, -13158, 8416, 34111, -6572, 31176, 30773, 2110, -23761, -24755, 7325, 18745, 51416, 41142, 3627, -55773, -86011, -95983, -64360, -47705, -23136, -68808, -60206, -20078, 31304, 30095, 31543, -6535, -569, -14656, -17095, -62222, -98344, -21263, -51469, -13318, -33615, -31367, -8223, 36164, 15601, -26841, -20448, -21565, 20026, 71124, 58699, 46833, 9084, -8162, -27070]
7842b7070O8192Q51P055M5450k6841n3355j9094k0675Q627k0302m7955K0000L971
7829f1146M1249M9538J2069k7854m0012l3584m129K5273L2257J8507m5915M609
7817b9138J4413k100r584j1383j8711L889m1093P7701J49504p3568n4607M4189
7805D9512o9697l513K4471m6813R0471l6923J4767k3749m057j0660J2874k0084
7793b3401j1924J3517J0133O517j0325j1009k1443K1801L7496j8610M5706L0965
7781F9423n1122q627k9781J8042P777l4846n3402K7985J8109n8159m0585Q8210
7769d6976O9865k808M2283k9609m6398j12938L7544J3597n435O4960k5977L6185
7757e707N5664j4425k7989p8576j0388R735J3934J0867K3991J5288k1338p70K1529
$$ y = [-27070, 41122, 41973, 49028, 94478, 67637, 14282, -4812, -25487, -16860, -37162, -85117, -65117, -61146, -19897, 29641, 41710, 13856, -26156, -59740, -63869, -38596, -6339, 12168, -33747, -29138, -14725, -16825, -26409, -37792, -56503, -52614, -93707, -16006, 133498, 59930, 5323, 49512, -20185, -23698, 773, -46040, 44431, 7508, 22275, -1474, -5531, -16191, -3317, -23401, -35325, -21808, -11675, -5158, -15483, -26492, -47935, -26134, 11362, -7248, 38458, 69423, 18301, 9674, -20107, -2065, 5712, -29134, -82536, -54551, -36442, -94601, -135186, -46976, 22889, 20081, 62364, 32755, -13643, -126581, -89037, -75440, -80875, -15915, -41892, -5707, 49957, 35532, 7543, -71033, -81421, -71686, -57752, -46885, -22894, -7606, -28944, -29714, -8185]
7744h185P9908N2446n6484p1202m9462j4004N1703l40P070M4057j7579J1294P046
7731C6268j7470J4248m1780J2388q8689J5879N3205M2566n0661J9973O344j0288
7719h017l5748L4600j6099K9730l6879j0638R963l3258J8192M6425n479k6620
7707c3828N8150p3181l311L1847K2698J8547n4206O960N051j4368L9144O0514
7695F4017n2161o1526R0463J0339l8513j7052l2581J0739M6341l8394L847M902
7683i579K8193k9222P803J8826N4526k9972p6266j9353Q204N3601m3205r315N2067
7670F308j4474j7395J1436K8672l5489n1948J5823N4439O766j1052l3634J4644
7658b5904N497k5899n4653L3021P9372k3059J9247p414m0062K1371N0620j4675
$$ y = [-8185, 71723, 124169, 67685, -3517, -52979, -66983, -15280, -15620, -8550, 35507, 17928, 29222, 36268, 18798, 33046, -8734, 3654, -85035, -69156, -15951, 26615, -24046, -4073, 2271, -8017, -43765, -9165, -25264, 4466, -32413, -43051, -33088, -66346, -48154, -1729, -7208, -33828, 24322, -48859, -52170, -20323, 2375, 20922, -33284, -26324, -21273, -35641, 3503, 64017, 11856, -49670, 40793, 51132, 12619, -4433, -37014, -26275, 20066, -18328, -14481, -9579, 18614, -10608, -2805, 16021, 70547, 40575, -35691, -55044, -46840, 6761, -36444, -45759, 6308, -8166, -25561, -14125, 14547, -20942, -72890, -57067, -2628, 4138, -6914, -40548, -25904, -20407, -46306, -100959, -67938, 11434, -11625, 7622, 208, -39854, -18483, 32137, 17462]
7646A7462L0148m1501o0631J8333L0040M4155j6368m2489J2436j5723k7972L6940
7634a5170n4600l8400P0691O6895q908k7104K865p181k6362R0073L3032j3085
7622G2746m1178k8093J1767J745J4984p859R285o839o425k5690j096K0492N0369
7609F4208o6322m2821k8538L6029J11978l8996n9381J7779k9977n691j6088L5730
7597b2090M9974j7717J2180J1900n6145j9490L1715o2546P5067M386m9075M6899
7585E058k4701k3114J4938j2310q040M0112n613l480K5304j9010L1422p0388N8450
7572H628l715P065k5660K9908M5058m2046q0407m253J02758r3609l81K2674O0029
7559B6049J565j1574N3973n287J0064m3193j1276P0796j7198m5150o2417m0996
$$ y = [17462, 47610, 6109, -54522, -36189, -6149, 38006, 21638, -20851, -8415, -24138, -52110, -15170, -69770, -108170, -37479, 29416, 20508, -6596, -3731, -10912, -37274, 52799, 85831, 72746, 31568, 3475, 15242, 16987, 31971, 24112, 33397, 26558, 20133, -5557, -6653, 13839, 64208, -2114, -44935, -73473, -37444, 74534, 35538, -23843, -6064, -36041, -41732, -57820, -22090, 27884, 10167, 22347, 34247, -21898, -41388, -9673, -72219, 2848, 7234, -41841, 5058, -19643, -42757, -27819, -40129, -48169, -8057, -13670, -17150, 8154, -10856, 20566, -49822, 8628, 4913, 11978, -13682, 16226, 61284, 19238, -61169, -65422, 37336, -56273, -56654, -33980, 26049, 27614, 16040, 70013, 64726, 74790, 31597, 20321, 91117, 73919, 28769, -33648, -74644]
7547g4644L3833O2211j2594j2450K3508L438l9446k3334J4593j3527j4962J9315
7535c4059j2840j1864o5360L7233P9853L8389J68K9460k8402n7749k0300K6837
7523a8634k7095K5968M5878m7770m9199K8937L400M6819Q6944j0191n9545O282
7511C1794m8537j8203J6611O4910L2929l5995j6028K7167J4287j1106m0782j0952
7499F095M6672p6702J3104k3487M072K5698l7828L3594N651l0180k183O41k778
7486c7631O3769l3653k5466K8366Q6850J0363n4249J3175M6478n733o7718O8407
7474I2958j1672j6266r413N2537l3434M301k9195k6481p1203J729m842M5900M9630
7461D4549N2458M764L5785n6211k929r199R295m2031k1201O4552K59j7173n0149
$$ y = [-74644, -40811, 21400, 8806, -3644, 19864, 23302, -16144, -39478, -24885, -38412, -53374, -34059, -46899, -58763, -124123, -86890, -7037, 31352, 31520, 60980, 32578, -25171, -45471, -18634, -45729, -19761, 26117, -21653, -70852, -41915, -38515, 8304, 95248, 85057, 25512, 31794, -16743, -34946, -18335, 46575, 79504, 43509, 27481, 54648, 68935, 57829, 17047, 6095, 52767, -23935, -10831, -34318, -30246, -4548, -42376, -8782, -3131, -33311, -35494, -34853, -37631, 26138, -7515, -32981, -4615, 82235, 92598, 38349, 51524, 98002, 92269, 24551, 92958, 81286, 65020, 55607, 108144, 74710, 79011, 49816, 23335, -47868, -46139, -50981, -5081, 44549, 97007, 101771, 137556, 81345, 78416, 69217, 78512, 36481, 15280, 79832, 80091, 62918, 12769]
7448A2769M9639j4892l870K1231L426r3099L6742j9296m221q904n8202L7380O3960
7435B2663r582o4992j6449J8777K046l0319J8111O5049k251L2215R645K5595j6253
7422E4255k2032j1155q86L4522l093L4059o3868m2929N4615J9372J278m5237k8620
7409a9719n574J7817m2060J9981L780L4505k9674J4118L0818m1307k072M8713
7397B9326R456m2628J2120L5760K9805p5047Q994P175M2796j8942j5034o393j068
7384A6320K953K3905n5069n159m842L4907N8263K0167p7766m9353q094J8046M8070
7371B2348p6894p424O9489m0184Q2876Q6639n7251p1366k9911L4994N3008M446
7359G0770m8013N0198m9734L0479m0517J1386K645p276k4267l3113l5874M2325
$$ y = [12769, 62408, 47516, 43646, 64877, 68303, -24796, 11946, -7350, -11571, -20475, -78677, -41297, 22663, 13081, -51911, -68360, -49583, -47537, -77856, -59745, 5304, 3053, 35268, 44913, 70508, 54255, 32223, 21068, 20182, 54704, 51611, 85670, 21802, -21127, 33488, 52860, 54138, 8901, -19719, -25293, -7476, -49536, -29555, -25775, 8730, -20944, -6826, 23992, -17315, -19387, 29326, 38782, -3846, 8274, 44034, 73839, -1208, 7786, 14961, 57757, 38815, 23781, 17388, 16320, 19273, 43178, -11891, -17050, -21892, 13015, 71278, 91445, 13679, -35674, -43768, -25722, 22348, -54546, -61970, 7519, -32665, 50211, 136850, 79599, 8233, -21678, 13316, 66324, 70770, 22757, 72955, 23221, 53700, 13183, 24569, 27214, 19938, -4329, -37442, -73316, -30991]
7347c0991M0403J303K8747N2236m9143k8771Q0763j6170m8645J4438n8218m1769
7335e5817L787Q1931P93l7246J5491m0085K1165n0163l3467L5272k6210L5619
7323d8930M5727M474l331n2519K307P529M550j0003l4832P0688M4826K2740J5702
7310F8928l8448M7930l3800n2056L3206k9240o4240R4653o118k1995Q7558K3993
7298A10371m3987o9947k5611r602K5767k6167K708N1893K2328J7605j0247m4749
7286C62n3739O6724L7781o2940l176k0416j1676L6306k6286N1027K5779k9906
7274I840M184N638j8739l686j235N3123k0432n1410J6443R100J8285N3257j6657
7261E7711n6249o455l4845N4400M1884J2270l193R397m047l2640m3258J5444p733
$$ y = [-30991, 9412, 10715, 39462, 91698, 42555, 13784, 94547, 78377, 29732, 44170, -14048, -55817, -52030, 29901, 30694, -6552, 8939, -31146, -9981, -60144, -93611, -58339, -84549, -48930, -3203, 1271, -2060, -54579, -52272, -44743, -40193, -50196, -85028, -14340, 30486, 53226, 68928, 30480, 78410, 44610, -7446, 25760, -3480, -67720, 26933, 20815, -1180, 86378, 110371, 66384, -3563, -29174, -38776, -13009, -39176, -36468, 15425, 37753, 55358, 45111, 362, -53377, 13347, 51128, -11812, -14988, -35404, -47080, -10774, -37060, 13967, 39746, 9840, 14024, 19662, 923, -2763, -3998, 49125, 28693, -22717, -6274, 2826, 21111, 74368, 57711, 1462, -4993, -39838, 14562, 56446, 68716, 65523, 74920, 70873, 38233, -5025, 10419, 2686]
7248B686K5667J4802k9497R117l1399J928p112K3476k7308k1918k0365J7993o0009
7235a01939Q3576O7395K1334n8356j7033k6568m043O6389j5714J5016j7114P888
7223B0831L854p118k2099O9665p7869K1683L4730K4170M4380o2769l0178j9302
7211b2j7687J2326M697L0890n1851k5491K9238K8930J7179j0732P1813l4093M0372
7198I5569o5231n7052L4014p2586J238J9230K8548K8629k6912m931o097M2409
7186A6828M546M9777l0381m1022L9766j8024k8946L2474O552o9934n6325j6884
7174a11573K4341N7245M526L0263L2229p7823m8003m495N2964m851P76r391N6438
7161B646O3881l2462k9699L6022m975l924R89K9813j500L793k5547m283r037j399
$$ y = [2686, 28353, 43155, 13658, 22775, -8624, -6696, -13808, 9668, -17640, -39558, -59923, -41930, -101939, -18363, 49032, 70366, 12010, -5023, -31591, -35634, 30755, 15041, 30057, 12943, 20831, 24685, 17567, -4532, 65133, -12736, 8947, 43677, 67847, 112227, 49458, 19280, -22, -17709, -5383, -686, 30204, -21647, -47138, -17900, 11030, 28209, 17477, 89290, 55197, 95569, 30338, -26714, 7300, -65286, -64048, -44818, -16270, 12359, -14553, -19484, -25581, 16828, 21374, 71151, 40770, -252, 39514, 21490, -7456, 25018, 31570, -38364, -94689, -111573, -87232, -29987, -25461, 4802, 37031, -40792, -88795, -93290, -40326, -45177, -44401, -53792, 2646, 66527, 34065, 4366, 40388, 35413, 31489, 32478, 62291, 60791, 64584, 39037, 34754, 25717, 24318]
7147B4318o692m9023k7250Q56l994J0445N0835l7956M5337j6467K567j7357J049
7134b3332L9810q314K928M6634J7662l0719L1214o142N564m7519m3895J0526M5221
7121C9638J1908o5817o7149j4460J04650K2120n5785k6979k1995L097J3229Q9489
7109C1946n2939j3543M0885k3014m5031P9490j8327K1601K6758k3589P209N0593
7097H2039m0303n6163J8900n0629m852N0753k0379K3252M3919k7892J9722R554
7085D7921l1647l3631J4628p382R2360p983j16364J1910L4922N1996K5879l8524
7073D4085R154l5284n2515K5207J1825m5436l6695K2257j2844J4138J1005K0875
7061b4228l7458R326O0127m2049k751k8453N5485L5443O2884K2664o5801n0939
$$ y = [24318, 17626, -31397, -58647, -57791, -61785, -51340, -505, -38461, 6876, -9591, -7024, -24381, -23332, 16478, 8164, 11092, 57726, 75388, 44669, 75883, 69741, 75305, 27786, -16109, -5583, 39638, 51546, -14271, -81420, -95880, 8770, 30890, -24895, -51874, -73869, -70772, -57543, 31946, -20993, -34536, 6349, -16665, -61696, 17794, -533, 21068, 47826, 24237, 31446, 82039, 41736, -14427, 4473, -46156, -51008, -255, -20634, 2618, 46537, 18645, 38367, 47921, 16274, -17357, -2729, -10111, 82249, 74266, -42098, -30188, 4734, 56730, 82609, 44085, 53239, 17955, -34560, -9353, 2472, -42964, -79659, -57402, -70246, -56108, -45103, -24228, -61686, -52360, 7767, -34282, -37033, -65486, -10001, 25442, 88326, 110990, 45189, -5750]
7049e750m1750l7945M948P4256J5535J5378K1242j5275N7369l9595K411k296j3620
7036C4908m8275L94N6277l2331J4411K6346n4920l8608O0960m996m9177j0900
7024d5911K1334N1974n1546K5882K1974l1992K8463l1232m0146Q2240J3620n638
7012C9022o0374K8611N6474m2377J5967K1011P858J7711q857j7676l7707k4684
7000e021J0280n2766j3641J28722l7977l1674l3643K6398k8055k0694L6375Q588
6988a3108M5211J7513q515M804N152j5344o0725N1021N355l0478L4122n2445m043
6975b1480j2966L4630K6096l9o0790L0358L5675m9557l0091L0840K3443N220K1904
6962C3243K7082l6480k5960L9021N0165n8074L8617K220k2826o9190K4792N0378
$$ y = [-5750, -47500, -85445, -80497, -6241, 9294, 24672, 45914, 30639, 88008, 48413, 50824, 48528, 34908, -13367, -12973, 43304, 10973, 25384, 51730, -3190, -41798, 19162, 14166, -35011, -45911, -24577, 27397, -24149, 1733, 23707, -8285, 20178, -11054, -51200, 31040, 44660, 39022, -21352, 7259, 63733, 21356, 37323, 58334, 66192, 83903, 75046, 57370, 19663, -5021, 5259, -47507, -61148, 67574, 29597, -2077, -35720, -9322, -37377, -58071, -21696, -13108, 32103, 49616, 41101, 45905, 51057, 35713, -25012, 26009, 31364, 886, 35008, -17437, -21480, -34446, 184, 26280, 26241, -34549, -4191, 31484, -18073, -48164, -17324, 6119, 11339, 33243, 60325, 23845, -2115, 36906, 87071, 28997, 67614, 69834, 47008, -22182, 2610, 52988]
6950E2988J7321P199j8837q962o777l6365L7043R2965j3153n4493O269J34k8884
6937D6448m9721M0081k3142M2988O0011n7493l6990r394L8203K6258m0337q780
6925B8132J4203K0342r333M9098K2937j30933l1869Q7796L8461l0642k8518J5383
6913D5057o2547O889N8145j8951k4624L6072l2278J4635j2473o578M1363j0031
6901C4679K4291k6619J3394M517l8806j4868J0543j3529J465K374j5204K0984
6889C221M691k800J2034J2111k8927k709M3193l1039M9339L0595L175p4924k159
6876A5801P1324k3402n2205M0977k8977m0485K3915P1658K47l8834l348P641k3564
6863B0748l7244j6533J1444P5346M9256K5617o580q0354L8831k2547j9636O2056
$$ y = [52988, 70309, 77508, 58671, 49709, 42932, 6567, 43610, 136575, 123422, 68929, 75198, 75332, 46448, -3273, 36808, 13666, 56654, 116665, 59172, 22182, 12788, 50991, 77249, 36912, 28132, 42335, 62677, 53344, 102442, 125379, -5554, -37423, 50373, 88834, 58192, 29674, 45057, -17490, -10601, 47544, 28593, 3969, 40041, 7763, 22398, 9925, 3347, 44710, 34679, 58970, 32351, 45745, 50262, 11456, -3412, 7131, -6398, -4933, -2559, -17763, 3221, 7912, 5112, 17146, 29257, 330, -2379, 40814, 9775, 59114, 89709, 92884, 17960, 15801, 87125, 63723, 11518, 52495, 23518, -16967, 6948, 78606, 78853, 40019, 36671, 44312, 20748, -16496, -33029, -21585, 53761, 103017, 128634, 122054, 41700, 80531, 57984, 38348, 100404]
6851A00404r436n8177L1796o894m1289L4948K3422r442L158O0005p4626n2118
6839A751J7488n8895K5590N0392J0983O3728l4360M4316P561k7334l099l6974
6827F1147k2893M8707j8638p0722j263P7424k7101L5135L8705j47807L0423O7458
6815G0575k3156L796L3009K7343J8399k9200k0903m8921L279q119L6323K3878
6803H6303q545m268j2676J4064K6902k8494j1956j0368l3070J554K2068n1713
6791a0199M4827L4662r777J0189j6603q8837J6746O8022N8341o4799J8150K3994
6779H4716m2734m6877R729O4776K9808J1313l753j6176K097J5110q0767o583J084
6766B1743k0188K7010L017k2179J4904k9917L1104l5586L2074K5200K1377m1568
$$ y = [100404, 90968, 32791, 64587, 57693, 16404, 51352, 74774, 65332, 68490, 128495, 53869, 1751, 19239, -39656, -14066, 36326, 47309, 111037, 76677, 120993, 128554, 101220, 98121, 61147, 38254, 86961, 68323, -2399, -3662, 73762, 46661, 81796, 120501, -27306, 3117, 70575, 47419, 51215, 84224, 111567, 129966, 100766, 79863, 30942, 34221, 26102, 62425, 86303, 77758, 73490, 60814, 74878, 101780, 73286, 61330, 50962, 17892, 19446, 41514, -10199, 34628, 69290, 59513, 69702, 53099, -35738, -18992, 49030, 107371, 42572, 60722, 84716, 41982, -4895, 4834, 69610, 99418, 110731, 106978, 90802, 92899, 108009, 27242, 20659, 21743, 1555, 28565, 31582, 9403, 24307, -5610, 25494, -10092, 21982, 47182, 68559, 26991]
6754B6991J6648K4418n2312M3359J5314K4860J6818n0283n2554L7732P937O0007
6742A18935m7061m3788J10783m1097o2480j6828K2682M4368J0638p0902L2908
6731E8158K7809p05l1463L4478l5880J59o178R08J2595O1674k59n6049N6838K8553
6717A50638o7836n606M1414k0929m6828L194M0594m0211r334J3931j3241L547
6705D9333J3891o169l2292J0750L7080M8482o2870j6292K2924k8899n4982J10632
6693I1588L7531j8380r094q852J8930j2721P78j9520p914j05227P0375K2652n437
6680E4709j1544k2871j6037L4464j1250j0401N4214j3544L6577l9795o524K2500
6668G0498M7864J6556p2540J2790J2039J5125n0071l108k5708r726K9500k9270
$$ y = [26991, 43639, 68057, 15745, 59104, 74418, 99278, 116096, 65813, 13259, 50991, 58928, 118935, 71874, 28086, 138869, 97772, 35292, 18464, 41146, 85514, 96152, 25250, 58158, 85967, 85262, 53799, 88277, 52397, 52556, 46378, 47286, 59881, 121555, 121296, 65247, 122085, 150638, 82802, 77196, 118610, 97681, 50853, 54047, 94641, 54430, 45096, 59027, 45786, 49333, 63224, 57055, 24763, 35513, 72593, 121075, 58205, 41913, 64837, 35938, -19044, 91588, 129119, 110739, 101645, 92793, 111723, 99002, 99780, 80260, 72346, -32881, 37494, 60146, 54709, 43165, 20294, 4257, 38721, 27471, 17070, 71284, 57740, 94317, 54522, 47998, 70498, 118362, 134918, 62378, 75168, 87207, 102332, 52261, 49153, 23445, 13719, 43219, 13949]
6656A3949J7079q667j034P971L4922L5308l8018m8765J6136N0042K7936p791o4785
6643C4283m509l4813M9632M6655M3816K2090O102k8802o5349O648l8162J3404
6631E0995P4300m2413J7698n8857m3763M0984j3541O8243L1002j6242k2597k4154
6619F1655N9458J800k921J1436M9032k8654p4049p36K116j4903M5663j5475n1642
6606D2780M5084n0116j2746J7286M88m339J6947O4834k7255K4227j420m1272J9568
6593I4066R708K2840L1710m438k7958j7653r6810K143J09967K8353n0448J1632
6581A13112P671p6218K3143M2013n3220J6928j4672M5702k3201l7254L8376q652
6569G3728m2293j3324L5304M0874k0599J3880K5533n3958m953L9743J0347l1463
$$ y = [13949, 31028, 22361, 21327, 29298, 64220, 99528, 61510, 12745, 28881, 78923, 106859, 99068, 34283, 29774, -5039, 44593, 91248, 135064, 157154, 163256, 134454, 69105, 75753, 37591, 50995, 125295, 82882, 100580, 41723, -2040, 38944, 25403, 93646, 124648, 108406, 85809, 61655, 121113, 122913, 119992, 131428, 180460, 151806, 77757, 77021, 79137, 64234, 109897, 94422, 42780, 87864, 37748, 25002, 42288, 42776, 38437, 55384, 120218, 92963, 117190, 115770, 74498, 94066, 103774, 126614, 158324, 153886, 125928, 108275, 11465, 13608, 123575, 151928, 101480, 113112, 120783, 44565, 67708, 109721, 56501, 73429, 58757, 104459, 81258, 44004, 82380, 73728, 31435, 18111, 53415, 94289, 73690, 87570, 113103, 59145, 54192, 93935, 104282, 72819]
6557G2819L0085l0051M7819J6939p0864m5630N9195J7855j593l4692k878J10348
6545A69352m3272p920o576O2013J5823n1982k2550q2058P4367Q2423j2859j5027
6533A61734l4976o0835P20m0873O3886K860K9913N3085p0824m1292M5514K2430
6521A31342j2895J1020p6408O9076l6341J2680Q008M5846j4777n9306M9308L0672
6509A58225j1950l3622k5536M3089J5542m9054j6069J1864R3907m4503n4568l471
6497H3854j5342K6564L9733k3279p4085K1438M8575J805j611K4532m4295L7389
6485A25278K0315k4002M3936k2091m4755L0805k2944j5649j8031L0266J1115N1641
6473A65884k4607q907j218n01o453l7744M8610j8756K9076q184K2924L2859k0449
$$ y = [72819, 102904, 72853, 120672, 137611, 66747, 21117, 80312, 98167, 96574, 61882, 59004, 169352, 126080, 118160, 111584, 173597, 189420, 137438, 114888, 32830, 107197, 189620, 176761, 161734, 126758, 65923, 66643, 25770, 89656, 92516, 122429, 175514, 104690, 63398, 108912, 131342, 118447, 129467, 53059, 122135, 85794, 98474, 106482, 152328, 137551, 78245, 127553, 158225, 146275, 112653, 87117, 130206, 145748, 96694, 80625, 92489, 186396, 141893, 87325, 83854, 68512, 95076, 134809, 111530, 37445, 58883, 107458, 109263, 107652, 132184, 87889, 125278, 145593, 121591, 165527, 143436, 98681, 129486, 106542, 90893, 72862, 103128, 114243, 165884, 141277, 132370, 131152, 130651, 124198, 86454, 135064, 116308, 145384, 137200, 160124, 192983, 172534]
6460A72534o751j3001k4363n4340L9036M1779r808m8065M1945Q9549M5265l4846
6448B38934m1596L1423n643L6439l4698q1625M803P4317N3383k9060q8389M8009
6436B06297O1241p1245m0997N5314q761P2636J1294l5439m994k7664R536j1684
6424B15534r167J1570J0890l4754j1750k5623k2679K8394O7801K1924r5594J8729
6412A75275O5727l741n7280L2248l6130M3969M8081m8374R823j2687K4865M1826
6400B83602l2022L093N1424k1102o699j8809K9865K6182j6075N7063N9595J6731
6388D32848k9584M6340L1811Q6212J05338P323M7882L3646L110K2858q1527j23335
6376E82922J7487n853q7403Q643k239q3402J1631R4839M3830j3804K4987O2427
$$ y = [172534, 165783, 152782, 128419, 74079, 113115, 154894, 145086, 97021, 138966, 228515, 273780, 238934, 197338, 228761, 223118, 259557, 224859, 143234, 148037, 222354, 275737, 246677, 158288, 206297, 267538, 196293, 155296, 210610, 201849, 274485, 285779, 250340, 245346, 217682, 227218, 215534, 206367, 217937, 228827, 194073, 182323, 156700, 134021, 162415, 230216, 252140, 156546, 175275, 241002, 237261, 179981, 212229, 176099, 220068, 268149, 219775, 229598, 216911, 241776, 283602, 251580, 254673, 306097, 284995, 278296, 259487, 289352, 315534, 299459, 356522, 416117, 432848, 403264, 449604, 481415, 567627, 672965, 680288, 728170, 761816, 764926, 787784, 706257, 582922, 600409, 594556, 507153, 515796, 513557, 430155, 441786, 536625, 580455, 566651, 591638, 654065]
6364F54065R7199N2141L3665J55816J02846J05442M6948M241j3477q8624j33905
6353A016357j32060j00675q0695M5651m9209l6221j4017o3106J1968K9956M5488
6342F73437L4038k2243k8046O4007R9333L5420J1983k9959n4176m6612k7942J7088
6330G26328o7949q2564K1445k8680l6677k1014O975j5208K205K6267k1620o42
6318E08866J3825K4608K48k2073J668q7326o7154l0142k984J295j420o3534M3270
6305C19147l2226J2787l3098k7320N7537j215M7297k1363K2877k5830Q4742K0316
6293D23651K4410l0115p2992R345j2319p6878m7081K8709m7184L7878K0657n9387
6281A98694O462k6908J7843k9035M9599J1440n3137l1777O0515L5812o7327q312
$$ y = [654065, 751264, 803405, 837070, 992886, 1095732, 1201174, 1248122, 1252363, 1238886, 1150262, 1016357, 884297, 783622, 702927, 748578, 699369, 663148, 649131, 586025, 597993, 627949, 673437, 707475, 685232, 657186, 721193, 820526, 855946, 867929, 837970, 783794, 737182, 709240, 726328, 658379, 575815, 597260, 568580, 531903, 510889, 517864, 502656, 504861, 531128, 509508, 508866, 522691, 547299, 547547, 525474, 527142, 439816, 372662, 342520, 339536, 340831, 339411, 275877, 319147, 286921, 299708, 266610, 239290, 296827, 295612, 342909, 321546, 344423, 318593, 403335, 423651, 448061, 417946, 344954, 354299, 341980, 265102, 218021, 246730, 199546, 237424, 258081, 198694, 205156, 178248, 196091, 167056, 216655, 228095, 174958, 143181, 203696, 239508, 172181, 163869]
6269A63869j7572L6127Q418K741L6221l3541q571O994k5359O579j4342J5118J6723
6256A93405L7532n559l7709l0235o775m392L4570k0013N351M280r039J7384N2630
6243B31430P460q1744j4195P2859k9470K9621l0634k5968L2744N0681o2662q2015
6231I8107N2058N3128J2312L2921m7342k3961Q256P1314l3022k1654l1854l2274
6219A37989K6860j4296M6383J4054M204k0476M58P0294k5900J8850N2693m5799
6207B65314j7381P489L3861m2921n330j1802k769q9332M5227J7380j1460L7078
6195B25354M5201l8023k5026N040O0264m3201R0413O0064p8580k8053m3590K466
6183B32329L1119K0816l4600M2396K4633q431K092o6477j0672K6556M2801j2139
$$ y = [163869, 146297, 182424, 190842, 193583, 229804, 196263, 187692, 194686, 169327, 175906, 161564, 176682, 193405, 230937, 225378, 187669, 157434, 150659, 146267, 180837, 160824, 166175, 170455, 161416, 178800, 231430, 238890, 157146, 142951, 215810, 186340, 215961, 185327, 159359, 192103, 242784, 180122, 98107, 150165, 203293, 215605, 248526, 201184, 177223, 185479, 256793, 223771, 202117, 170263, 137989, 164849, 150553, 196936, 210990, 215194, 194718, 195176, 265470, 239570, 258420, 311113, 265314, 247933, 255422, 289283, 246362, 241032, 229230, 226461, 137129, 182356, 199736, 188276, 225354, 270555, 232532, 207506, 212546, 272810, 229609, 320022, 380086, 301506, 273453, 229863, 232329, 263448, 284264, 249664, 292060, 316693, 308262, 310354, 243877, 233205, 259761, 302562, 290423]
6171B90423k1902l8259O035K9101K0274l4657M9414J15216K8962j18825l983P8937
6159D00736k7450K756M2974J5056k772n6246m5221J0096k8396k1322M740m1602
6147B53349M847J569M6873K3142k6197M6875j3681J6584l5824J4180Q9434j2415
6135D08736p977m0918j2826J9268r608P9620J5462P783O3775l7k6786m5027p6627
6122C74838k1325k3577M8495l1446r818N6613j3672j6998m8444n9351K8325K7424
6110C11064Q790k697N192J8580J8897j9685l4550m460R5688j2979k567j3170N3099
6097D21202R501k530j4744k9274J1515L3685P140o817p2496j9519l47j4544K6551
6084C49323q736J5737m1051n2671L4040P3993l5920m9874K7879J8017J3290L8631
$$ y = [290423, 268521, 230262, 236297, 265398, 285672, 251015, 300429, 415645, 444607, 325782, 321799, 400736, 373286, 376042, 419016, 434072, 431300, 375054, 329833, 339929, 311533, 290211, 294951, 253349, 258196, 259765, 306638, 329780, 303583, 350458, 336777, 353361, 317537, 331717, 421151, 408736, 400759, 359841, 347015, 366283, 356675, 436295, 451757, 459540, 523315, 523278, 496492, 451465, 374838, 353513, 329936, 378431, 346985, 337167, 393780, 380108, 363110, 314666, 255315, 283640, 311064, 319854, 317157, 322349, 340929, 359826, 340141, 305591, 301131, 396819, 383840, 381273, 368103, 421202, 430703, 428173, 413429, 384155, 395670, 429355, 436495, 429678, 357182, 337663, 337316, 322772, 349323, 340587, 356324, 315273, 262602, 296642, 370635, 334715, 284841, 312720, 330737, 344027, 382658]
6072C82658K2645p2422k1455L4756J8008q16K7420n413j2518R157J0909M033J0061
6059D07023m4319k5412P8115p412M005k1870k5714j9521R2276Q501k8455R429
6047D26646N8851n896m0569k2801k4412K5642L7527r730J7217O483o536n925K8647
6034D85144J4589m6144O720L1996Q308j7145O7500r249O111L7051k1240Q1452
6022F45093J755m1213K5860p1837k2146r565l2684J8977L827K3403k2662m4037
6010D74771N6794k1682q517Q4236J0498J1349j5427N7285k6184J11547M9747N6302
5998H40719J5404l7288m4821o756M8070j1873p3034n431M1134o1741k8924K3862
5986F99321J4024k4750L1521R847L8037J6741m0622N8823N4157l5122k6851K102
$$ y = [382658, 405303, 332881, 311426, 346182, 364190, 363374, 390794, 385381, 372863, 382020, 392929, 396962, 407023, 362704, 337292, 415407, 407995, 412000, 390130, 364416, 344895, 437171, 445672, 417217, 426646, 485497, 479601, 439032, 416231, 391819, 417461, 454988, 445258, 462475, 468958, 462422, 456497, 485144, 499733, 453589, 460309, 492305, 500613, 483468, 550968, 541719, 547830, 584881, 563641, 645093, 646848, 605635, 631495, 559658, 537512, 527947, 495263, 514240, 518067, 541470, 518808, 474771, 531565, 509883, 501366, 585602, 596100, 607449, 592022, 649307, 623123, 734670, 784417, 840719, 856123, 818835, 774014, 767258, 815328, 803455, 730421, 724990, 766124, 704383, 675459, 699321, 713345, 688595, 720116, 729963, 768000, 784741, 744119, 802942, 857099, 821977, 795126, 797228]
5974G97228M731L6394N4827k7831K9567K77M0822L5900K6519m959k7126k4538
5962I41811K1307J3346j3915J2940M4870j8151l6832k2280P944Q4345k3277L7068
5950A049176L9765K8312R7119K5514k7621l6858K0153k2015m1047L6467J4902
5939A183867j9296L721M3271O4257Q63M2939K3880k7290P18M0145r676M5176L4179
5926A426754P5027R183J6961r857L380L5748N2614M6137j6505j0557K2647O7871
5914A719403R6057J7716l048L4326Q8785j9256L5167N5627l4731O4529Q1164K7548
5902B163287Q4112J04585n2981J14902K9934j6222J40045L3657R0376J31826O6212
5891B889733R1280O2184O7608L9919O7422n253M2177R4369J31933J05729N3895
$$ y = [797228, 801959, 838353, 893180, 865349, 894916, 895193, 936015, 971915, 998434, 993475, 966349, 941811, 963118, 976464, 962549, 975489, 1020359, 1002208, 965376, 943096, 951040, 1035385, 1012108, 1049176, 1088941, 1117253, 1214372, 1239886, 1212265, 1175407, 1195560, 1173545, 1132498, 1168965, 1183867, 1164571, 1168292, 1211563, 1275820, 1276683, 1319622, 1343502, 1316212, 1316930, 1357075, 1347399, 1392575, 1426754, 1501781, 1510964, 1527925, 1518068, 1521448, 1557196, 1609810, 1655947, 1639442, 1628885, 1651532, 1719403, 1815460, 1833176, 1830128, 1864454, 1953239, 1933983, 1969150, 2024777, 1990046, 2054575, 2135739, 2163287, 2247399, 2351984, 2299003, 2413905, 2443839, 2427617, 2567662, 2601319, 2691695, 2823521, 2889733, 2981013, 3043197, 3110805, 3150724, 3218146, 3212893, 3255070, 3349439, 3481372, 3587101, 3640996]
5880C640996K5963J31413J61786J20863J02468K13597J97047K46022J87328K16346
5870E243829L62753M23988M70701N50952O20753P26727J020648J319122J626623
5861A2366096J954329J934224J097734l82839j558155j882492j486166r89258
5853A1053473n82925m38052l31099l09005k11923j39467j3284J05387J41460J40272
5843I414837K12208K43882L32083N11745N53691P51227Q32646J169953J369046
5834A5391318J580182J973957K465188L200188M355109N582105N998789M563331
5826D5110167P10043l965152o584436o275970m680165l292674k346548j768045
5818A6907220j296084r91769p38806n49384l87514l55027k89400j11762l749O6831
$$ y = [3640996, 3666959, 3798372, 3960158, 4081021, 4183489, 4397086, 4594133, 4840155, 5027483, 5243829, 5606582, 6030570, 6501271, 7052223, 7672976, 8399703, 9420351, 10739473, 12366096, 14320425, 16254649, 17352383, 16969544, 15411389, 13528897, 12042731, 11053473, 10470548, 10032496, 9701397, 9392392, 9180469, 9041002, 9027718, 9133105, 9274565, 9414837, 9627045, 9870927, 10203010, 10714755, 11268446, 12019673, 12852319, 14022272, 15391318, 16971500, 18945457, 21410645, 24610833, 28965942, 34548047, 40546836, 45110167, 45820210, 41855058, 35270622, 28994652, 24314487, 21021813, 18675265, 16907220, 15611136, 14619367, 13880561, 13331177, 12943663, 12588636, 12299236, 12187474, 12183725, 12250556]
5808A2250556K41730L13019M44220O84184R63202J207582J502880J761278K154365
5799B1523016K818462L817338M848485N760216N177055K110962k538728o302088
5791C7214718o812222n360413l819952k791087k128602j581728j211928q94639
5783A2614147p73887p70472n80204m69478l93171k88273j95233j88914o1491k8914
5773H864110O6119K03946K37507L23752M23971O16849P93820J036944J351252
5764A3918270J789151J821182J105387l49626j872571k474479k222555j663139
5756A0051620j213395q74830p26419n66374m24130m31019l03957k80182j98958
5747E032356j96277k08694j46454j65612j14786j89856j94107r5954L3719k4316
$$ y = [12250556, 12492286, 12805305, 13249525, 13933709, 14896911, 16104493, 17607373, 19368651, 21523016, 24341478, 28158816, 33007301, 38767517, 43944572, 46055534, 43516806, 37214718, 30402496, 25042083, 21222131, 18431044, 16302442, 14720714, 13508786, 12614147, 11840260, 11069788, 10489584, 10020106, 9626935, 9338662, 9143429, 8954515, 8893024, 8864110, 8930229, 9134175, 9371682, 9695434, 10119405, 10736254, 11530074, 12567018, 13918270, 15707421, 17528603, 18633990, 18284364, 16411793, 13937314, 11714759, 10051620, 8838225, 7963395, 7236976, 6670602, 6246472, 5815453, 5511496, 5231314, 5032356, 4836079, 4627385, 4480931, 4315319, 4200533, 4010677, 3816570, 3720616, 3754335, 3730019]
5737C730019j84606n3304l7811r9987m6308k3614p4760o4787o7561q4866K2569
5726C014984O506r2388L6663o0498k4991K9782l7695l032m5307o1444k7596k9098
5714B705886l7144k1804o112J6247n218N7825L05j1867L8589J5236L3030J7213
5702B802186J9934Q0271K791P3262n9224j2590N926n7689J5099R731k8529k44
5690B850924q2764r984M6290l4620M9103P3355J6119L6235P4601P7888P2700J20680
5678C290527J40477J65278J35338N8204j746J13589k061l5754K0448J3157R6317
5667C993774O3261p461L8704J09990J23664J62362J66068l3060j22973m5865n0683
5656D397781o2725j2777M8999K2350J09856Q6787J35953P7299Q6004K0865O2464
$$ y = [3730019, 3545413, 3492109, 3454298, 3354311, 3308003, 3284389, 3209629, 3144842, 3077281, 2992415, 3014984, 3021490, 2929102, 2965765, 2905267, 2880276, 2910058, 2872363, 2869331, 2824024, 2762580, 2734984, 2705886, 2668742, 2646938, 2640826, 2657073, 2651855, 2709680, 2709985, 2698118, 2736707, 2751943, 2784973, 2802186, 2822120, 2902391, 2905182, 2978444, 2919220, 2906630, 2912556, 2854867, 2869966, 2879697, 2851168, 2850924, 2768160, 2758176, 2804466, 2769846, 2818949, 2892304, 2908423, 2944658, 3019259, 3097147, 3169847, 3290527, 3431004, 3596282, 3731620, 3789824, 3788078, 3901667, 3899606, 3863852, 3884300, 3897457, 3993774, 4057035, 4049574, 4088278, 4198268, 4321932, 4484294, 4650362, 4617302, 4494329, 4448464, 4397781, 4335056, 4322279, 4371278, 4393628, 4503484, 4590271, 4726224, 4803523, 4889527, 4910392, 4972856]
5645D972856J16562P6718L7128K1529Q8548L8392L3726Q1732J69359J17569K17265
5634E971384K71829L28409L05385Q4933p1354j78032j73420j32636q0106o9271
5624F257121L2535N4059P9828P7176J49458J54555O9944J51914N6325R6438Q7822
5613G267175J43320J16969R5950J78896J33460K46385J90585J47974K40289L44980
5603I105983L31781K62201J14569N3183K9729P9423J13030Q0940J27621J34835
5593A0433295K45829K72289K54413K67928K96054K38371K63076K87618K65706
5584A2824579K50321L06839K81432L74441L34725K93783L63535L79425L83143
5575A5792223L04895M38130L50310M25595M48402M55970M70904N40651N80996
$$ y = [4972856, 5089418, 5166136, 5203264, 5224793, 5313341, 5351733, 5385459, 5467191, 5636550, 5754119, 5971384, 6243213, 6571622, 6877007, 6961940, 6890586, 6712554, 6539134, 6406498, 6326392, 6257121, 6289656, 6343715, 6423543, 6500719, 6650177, 6804732, 6874676, 7026590, 7082915, 7179353, 7267175, 7410495, 7527464, 7623414, 7802310, 7935770, 8182155, 8372740, 8520714, 8761003, 9105983, 9437764, 9699965, 9814534, 9867717, 9897446, 9976869, 10089899, 10170839, 10298460, 10433295, 10679124, 10951413, 11205826, 11473754, 11769808, 12008179, 12271255, 12558873, 12824579, 13074900, 13381739, 13663171, 14037612, 14372337, 14666120, 15029655, 15409080, 15792223, 16097118, 16535248, 16885558, 17311153, 17759555, 18215525, 18686429, 19227080, 19808076]
5566A9808076N67596N94521N85225P05905P46929P02054P31523P06228P92790
5557B5940847P86276Q45620Q31055R17506R66741J127766J157609J404782J468347
5548C5446549J578522J795849J979288K234960K528985K974839L578084M305733
5540E6422809N332350O344926P489799R087612J1436383J5069744J9326104K2667414
5532A53177141K1579748J3394199k841623k0029948k4998156j9539034j3371550
5525A07370777r027321o119517l891793k266952j165091j28428P19140J690378
5517H7181193K769907L909063N486147P502764R813390J1932419J4114914J6724809
5509A59434606K1312368K8693197L7304862M2366187L7600984J7788621j5870195
$$ y = [19808076, 20375672, 20970193, 21555418, 22261323, 23008252, 23710306, 24441829, 25148057, 25940847, 26727123, 27572743, 28403798, 29321304, 30288045, 31415811, 32573420, 33978202, 35446549, 37025071, 38820920, 40800208, 43035168, 45564153, 48538992, 52117076, 56422809, 61755159, 68100085, 75589884, 84677496, 96113879, 111183623, 130509727, 153177141, 174756889, 188151088, 185309465, 165279517, 140281361, 120742327, 107370777, 98343456, 92223939, 88332146, 86065194, 84900103, 84771675, 85490815, 87181193, 89951100, 93860163, 99346310, 106849074, 116662464, 128594883, 142709797, 159434606, 180746974, 209440171, 246745033, 289111220, 326712204, 344500825, 328630630]
5502C28630630m5793318n1640534m0824174k9195464k1363122j5947215j1727779
5495A12139024q550922o065458m232381k740008j494792m61229N01384J815973
5487I0911591L423855M627942N224641N274400O113233Q820848J3386953J8197655
5479A55981118K1054388J7300535N515050j4234136k9230183k8269096k1010558
5472A07107118j5311982j1708705r049141o960598n274453m200460l369028k778192
5464D8454559k240592j777583j411384j065315p53618p67406j031084j746133
5456C7661444k215617k122307j767738j570669j334781j076349r76329q75368
5448B5722286q87868p60235p84101p59430o57103o53893o10423o24513n72554
$$ y = [328630630, 282837312, 231196778, 190372604, 161177140, 139814018, 123866803, 112139024, 103588102, 97522644, 93290263, 90550255, 89055463, 88594234, 89095618, 90911591, 94335446, 98963388, 104188029, 109462429, 115575662, 124396510, 137783463, 155981118, 177035506, 194336041, 199851091, 185616955, 156386772, 128117676, 107107118, 91795136, 80086431, 71037290, 64076692, 58802239, 54601779, 51232751, 48454559, 46213967, 44436384, 43025000, 41959685, 41206067, 40438661, 39407577, 37661444, 35445827, 33323520, 31555782, 29985113, 28650332, 27573983, 26597654, 25722286, 24834418, 24074183, 23290082, 22530652, 21873549, 21219656, 20609233, 19984720, 19412166]
5439A9412166n26439m48283m70365l56314l56893k25416j90134k82967k01257
5430A6354098j42835j53505j69467j39255j52416k14487j58177j97483j32513
5421A4893960k18581j41290j02814j05775j24793o3355m8490j75404o3324q4330
5411A3765804j18817j243o1928k9230K0659O1202J12744Q9792K23999Q8133Q4854
5400A4235969J96869K23152K39489L64007L50629M64458N36938O69439R61662
5391A8242612J083325J024765L59320l03285q60367q91424n82661m19602k72519
5382A7380164j74803q88L7638J23923J50977K90369L61230L67844M26571M51235
5372A9414260N46986O90096Q06422R11875J100153J461811J777466K023900K039860
$$ y = [19412166, 18885727, 18437444, 17967079, 17610765, 17253872, 17028456, 16838322, 16555355, 16354098, 16211263, 16057758, 15888291, 15749036, 15596620, 15382133, 15223956, 15026473, 14893960, 14675379, 14534089, 14431275, 14325500, 14200707, 14137352, 14088862, 13913458, 13850134, 13765804, 13646987, 13645744, 13583816, 13554586, 13575245, 13636447, 13749191, 13838983, 14062982, 14151115, 14235969, 14432838, 14655990, 14895479, 15259486, 15610115, 16074573, 16611511, 17280950, 18242612, 19325937, 20350702, 20710022, 20406737, 19546370, 18654946, 18072285, 17652683, 17380164, 17205361, 17204473, 17242111, 17366034, 17517011, 17807380, 18168610, 18536454, 18963025, 19414260, 19961246, 20651342, 21457764, 22369639, 23469792, 24931603, 26709069, 28732969, 30772829]
5363C0772829J420617K34723q86340j347324j173371o48919k66092R8085K22377
5354B8426585N37636P67053J007384J380170J421870J242376Q22226J84360j365
5345C5788295K27015N91595R01476J232666J742177K218957K704728K960550K476037
5336E0843496J265737R320n02431K9726R54840J871969K746678L674314M564789
5327F5458438N587913O920539Q359583J0154868J2411088J5469198J8811554K2342666
5319A65515847K2066710J2917236m507073k1870620k5930017j9986651j3119750
5312A15085682q347719n089795l179245k845906l100745l380860k671176j557456
5304H4912780l16570Q67892K094315L632232N134186O810104Q806026J0875417
$$ y = [30772829, 32193446, 32428169, 31541829, 30194505, 29021134, 28372215, 28106123, 28204208, 28426585, 28964221, 29731274, 30738658, 32118828, 33540698, 34783074, 35605300, 35789660, 35788295, 36015310, 36606905, 37508381, 38741047, 40483224, 42702181, 45406909, 48367459, 50843496, 52109233, 52118553, 51616122, 51645848, 52600688, 54472657, 57219335, 60893649, 65458438, 71046351, 77966890, 86326473, 96481341, 108892429, 124361627, 143173181, 165515847, 187582557, 200499793, 195992720, 174122100, 148192083, 128205432, 115085682, 106737963, 101648168, 98468923, 95623017, 92522272, 89141412, 86470236, 84912780, 84596210, 85464102, 87558417, 91190649, 96324835, 103134939, 111940965, 122816382]
5296A22816382J3026449J5260688J8674159K4663636L3458086M3286249M6618843
5289C17804492L3225860J158593l5879069n3594824m7837961l4756318k4269420
5282A55851353j7440744j2927466j0097805p980538o331292n064762m712592m356141
5274H6940013l692662k646662j337190j20764J115771K378084L731206M932160
5266I1299956O238534P979260J1052351J5690281K1342855K4759170K0150693
5259A98513100N018398j6074909k9447308k8255605k1075097j5040480j0977072
5252H2661027p941392n481150l525394k378765k160941k846849m104425m568888
5244D9653223m168827l482353k817313k458027k137199j768073j495453j337341
$$ y = [122816382, 135842831, 151103519, 169777678, 194441314, 227899400, 271185649, 317804492, 351030352, 352188945, 316309876, 262715052, 214877091, 180120773, 155851353, 138410609, 125483143, 115385338, 107404800, 101073508, 96008746, 91296154, 86940013, 83247351, 80600689, 79263499, 79142735, 80258506, 82636590, 86367796, 91299956, 97538490, 105517750, 116570101, 132260382, 153603237, 178362407, 198513100, 203531498, 187456589, 158009281, 129753676, 108678579, 93638099, 82661027, 74719635, 69238485, 65713091, 63334326, 61173385, 58326536, 54222111, 49653223, 45484396, 42002043, 39184730, 36726703, 34589504, 32821431, 31325978, 29988637]
5236B9988637j175219j033300q71937p62638o53794n97974n07582m45350m09671
5227B3531172m91912m47917m46620m13333k58899L2561K66189N38498M83998P8172
5217B2871909p14608j222788j135672r28494p02316n99347p58851q81783q22024
5208A5106026o55955n08566m91182l92980m49993m92389m44666m04894l26776
5199A0938625k49747k55283k53936k61329l15576k86270k16927k16119j78503
5190H704935j68392r4864l4514k740m9863N5729J60362J42344J54982P6492L3040
5179H977511j58601l47381n02420n48799m09441l98717l29879k07585j89299j97037
5169E688352j00552k16673j12169l6336p3419j22253j29170k2542n6216j29706
$$ y = [29988637, 28813418, 27780118, 26908181, 26145543, 25491749, 24893775, 24386193, 23940843, 23531172, 23039260, 22591343, 22144723, 21731390, 21472491, 21505052, 21771241, 22309739, 22793737, 22871909, 22157301, 20934513, 19798841, 18870347, 18168031, 17568684, 16809833, 15928050, 15106026, 14450071, 13941505, 13450323, 13057343, 12607350, 12114961, 11670295, 11265401, 10938625, 10688878, 10433595, 10179659, 9918330, 9602754, 9316484, 9099557, 8883438, 8704935, 8536543, 8441679, 8407165, 8404425, 8354562, 8410291, 8570653, 8712997, 8867979, 8944471, 8977511, 8818910, 8471529, 7969109, 7420310, 7010869, 6612152, 6282273, 6074688, 5885389, 5688352, 5587800, 5371127, 5258958, 5222622, 5149203, 5026950, 4897780, 4875238, 4819022, 4689316]
5159D689316p5197L0438k6569o6403K5546j22J1753l561j29427k14697l66521
5148C874556k34883j68325j8468o7394n311q5472k2583P639m7391q7402o9841
5137C075125K9893n5913o9739p0911m4725q5458l9373n1644r5854l3236m8535
5126B509630p0499j23479j41511q4358r1258k6110l0759k7695m0559J9144k8997
5115A863549J17925J11619J34170O8041j5508o1088J2817l8139l4773p0784l4580
5104B053249j7952O597n6172p5315j3762k8787k6884l7494p9823l8988p780K1164
5092A698053n3397r0957l347j3087L5705L1022J3910l6893L4234M0072Q5893L909
5080A745117p3808o4177N745j7018r3096l6338M367M2284k5260n3740L3169P905
$$ y = [4689316, 4614119, 4644557, 4617988, 4551585, 4577131, 4577009, 4588762, 4585201, 4455774, 4241077, 3874556, 3639673, 3471348, 3452880, 3385486, 3380175, 3294703, 3272120, 3279759, 3232368, 3144966, 3075125, 3105018, 3049105, 2979366, 2908455, 2863730, 2778272, 2738899, 2687255, 2591401, 2558165, 2509630, 2439131, 2315652, 2174141, 2089783, 1998525, 1972415, 1941656, 1913961, 1873402, 1892546, 1863549, 1981474, 2093093, 2227263, 2295304, 2279796, 2218708, 2231525, 2193386, 2158613, 2087829, 2053249, 2035297, 2041894, 1985722, 1910407, 1896645, 1867858, 1840974, 1803480, 1723657, 1684669, 1676889, 1698053, 1644656, 1553699, 1550352, 1537265, 1572970, 1603992, 1617902, 1581009, 1615243, 1655315, 1741208, 1745117, 1671309, 1607132, 1612877, 1595859, 1502763, 1466425, 1470792, 1513076, 1487816, 1434076, 1467245, 1475150]
5068A475150K251j5209m52J5524q735j8879J4319j7480j4161l8623n2110n7748
5056A283847O2788j0094N032L347k6307j8280n5012n0452l3521j3612m22J3066
5044A160380k3272l2387J1537n7706L7125K5233k0098K4664m0857m6889L5474
5033A073204J9305l1367m9619O7652j3393l4401J4306k1765M0116l7455o5319
5022I61264J8024l2425q316k0408n1163q185M0329j2328k2178M4043L82M011n3296
5009H59754M3466J6339J6878rk918j9882O815L2859M0383k7747K2180n4063j1480
4996I22575J9285J9586l1895r3741K7158O6861K7312p3039J6856k4382J2074L8391
4984I27041n2784M3908o8776q487K1950N1785L9072R6408P1552P5122J23812Q0054
$$ y = [1475150, 1477401, 1462192, 1461740, 1477264, 1468529, 1449650, 1463969, 1446489, 1432328, 1393705, 1341595, 1283847, 1346635, 1336541, 1341573, 1344920, 1318613, 1300333, 1245321, 1194869, 1161348, 1147736, 1147314, 1160380, 1137108, 1104721, 1116258, 1058552, 1095677, 1120910, 1100812, 1125476, 1084619, 1037730, 1073204, 1092509, 1061142, 1011523, 1079175, 1065782, 1031381, 1045687, 1023922, 1064038, 1026583, 961264, 979288, 946863, 938547, 918139, 866976, 858791, 899120, 886792, 864614, 908657, 909039, 913050, 859754, 903220, 919559, 936437, 936428, 933510, 913628, 920443, 953302, 993685, 965938, 988118, 934055, 922575, 941860, 961446, 929551, 835810, 862968, 929829, 957141, 884102, 900958, 876576, 888650, 927041, 874257, 918165, 849389, 840902, 862852, 914637, 953709, 1050117, 1121669, 1196791, 1320603, 1400657]
4972A400657J08825L7699J1628j30334j15453p6132p3006n825m1434l1651K8q292
4960A076710p8879l6372M6573J8142n5399J1940R6343P206j0972j9879R6014O6686
4948A218113L3660N2898J59703K05881J97663K89003K00893j1563j18409l56289
4938A871553k48906j40606j59492o1417r2281j17744r5130k9849L3220r584o3631
4927H86133k1974o6125L1286M7649j9291O2808N5731k2205L0947K5663L0043O2937
4915A103602J46038J76002P3350o286j20477j81191j15466n8249p2009n8611m5392
4904H41311j00766k7943k3067m9123N0898J3676o4495l0481N392j4486j9737j5205
4892E65974J6975p5906L050K8514l5907n783L5457P866j5522j9129n4859M7510
$$ y = [1400657, 1509482, 1547181, 1558809, 1428475, 1313022, 1236890, 1163884, 1158059, 1116625, 1084974, 1085002, 1076710, 997831, 961459, 1008032, 1026174, 970775, 982715, 1079058, 1086264, 1075292, 1055413, 1151427, 1218113, 1251773, 1304671, 1464374, 1670255, 1867918, 2156921, 2357814, 2346251, 2227842, 1871553, 1622647, 1482041, 1322549, 1261132, 1168851, 1051107, 955977, 926128, 959348, 949764, 886133, 864159, 798034, 829320, 876969, 857678, 920486, 976217, 954012, 984959, 1010622, 1040665, 1103602, 1249640, 1425642, 1498992, 1492706, 1372229, 1191038, 1075572, 1017323, 945314, 886703, 841311, 740545, 712602, 689535, 640412, 691310, 704986, 640491, 610010, 615402, 600916, 581179, 565974, 582949, 507043, 510093, 538607, 502700, 496917, 532374, 540240, 524718, 505589, 450730, 498240]
4880D98240r597k0145j7310K7055O7756j7722l5628M7204l4692J1066k3852J2217
4868E04592K1654o021l2474l2544O441n5565J2366N9280K2962J6414m4862j9424
4856D52819P1719j4460L6061r6043Q500K3334L2675N453J7583l2078Q996j1590
4844E02969j7796J7533k0851J8561K6898j1468k7407m3801J1802J3376o10k6396
4832D42810J1650K9738l2632M655Q624L8147L7711K7574k1333n3273L2509M8634
4820E74814k2559K2424K6543J4333P060M669o0434j7793k1065j0674j577j6644
4808D99097L0995m900n976l4964m2831K8759r464o6063m0378K5551K2030K3967
4796D25823j4848O8674M8189L5112j06628m0690R146J1338k3741k6585K7046N737
$$ y = [498240, 488643, 468498, 451188, 478243, 545999, 528277, 492649, 539853, 505161, 516227, 492375, 504592, 526246, 520225, 487751, 455207, 461648, 406083, 418449, 477729, 500691, 517105, 472243, 452819, 524538, 510078, 546139, 450096, 458596, 481930, 514605, 520058, 537641, 505563, 514559, 502969, 485173, 502706, 481855, 500416, 527314, 515846, 488439, 444638, 456440, 469816, 469206, 442810, 454460, 484198, 451566, 456221, 464845, 502992, 540703, 568277, 546944, 493671, 526180, 574814, 552255, 574679, 601222, 615555, 622615, 627284, 566850, 549057, 527992, 517318, 515741, 499097, 530092, 525192, 519216, 484252, 441421, 470180, 460716, 394653, 354275, 379826, 401856, 425823, 410975, 479649, 527838, 562950, 456322, 415632, 424778, 436116, 412375, 385790, 412836, 418573]
4784D18573k8581o0398j6638K2572N9909M5925L1577l3122p6176Q4911j136q4235
4772C63181j5600M5407n016l2561N515j7429L5127M6972k7296L1325n333k0400
4760D03892l0939J3935K4496j0273M800J8681P193l1955J8266l3081O0584n2816
4748C92783k3416Q2598J2374M5313n79j7467J3700k6968l5561K150J2918L2796
4736D90641l7478k7936l9136k0730J01623l932J3497l9501Q825P2155l5956J3762
4724D95834m320M417J7480L0253O646r8155R3717J1932n0687l5426M1615m1425
4712D71881j2928M8285o2109O550M2836J9640O0137j6262k9747P256m9497Q6522
4700E72564o032q2564J7741n0916Q8228L3522K3152J0230K5497L2554j0851n1998
$$ y = [418573, 389992, 329594, 312956, 335528, 395437, 441362, 472939, 439817, 363641, 448552, 447416, 363181, 347581, 392988, 387972, 355411, 360926, 343497, 378624, 425596, 398300, 429625, 424292, 403892, 372953, 386888, 411384, 401111, 405911, 424592, 431785, 399830, 418096, 385015, 445599, 392783, 369367, 451965, 464339, 509652, 509073, 491606, 505306, 478338, 442777, 444927, 457845, 490641, 453163, 425227, 386091, 365361, 466984, 463052, 476549, 437048, 445873, 518028, 482072, 495834, 491514, 495931, 513411, 543664, 550310, 452155, 545872, 557804, 507117, 471691, 513306, 471881, 458953, 507238, 445129, 451679, 494515, 514155, 574292, 558030, 528283, 535539, 486042, 572564, 566532, 483968, 501709, 450793, 539021, 572543, 595695, 605925, 631422, 663976, 653125, 601127]
4688F01127l1087K7738j5791k5934n1892J6293M2068p936j2755J9565N6424K4911
4676F42731m3393j1433Q921o423K14R086L6592o341j063K4095n8404L6473K1790
4663F52845m926j5192P387M9678Q714K8275k6772J5624O6616J3734p8615J5550
4651G32918j3984P601N1532J72p3298m5431M8322N5348N19K0898l3051J5206K7235
4638G93987K6030k8884m7688Q2237L8391L9955p1009O4782m0967m2141m2080P3776
4626H46389J1281P1803m0813m5675R4246N5929O5850J4685K8587N5901L6449P4582
4614A269214N0534l4406P5243m465J12855P9047q3822J5460J8839M107P5048K6875
4602A604529n6220l3598K9724Q3796m1203M0443P401M0446q436K0423n1800P1107
$$ y = [601127, 570040, 597778, 581987, 556053, 504161, 520454, 562522, 554586, 541831, 561396, 617820, 642731, 599338, 587905, 596826, 590403, 590617, 599703, 636295, 629954, 628891, 652986, 594582, 631055, 652845, 647919, 632727, 640114, 689792, 698506, 726781, 700009, 715633, 782249, 795983, 717368, 732918, 718934, 726535, 778067, 778239, 704941, 659510, 707832, 763180, 763699, 784597, 751546, 766752, 793987, 820017, 791133, 743445, 825682, 864073, 904028, 833019, 897801, 856834, 814693, 772613, 846389, 857670, 929473, 888660, 842985, 937231, 993160, 1059010, 1073695, 1102282, 1158183, 1194632, 1269214, 1319748, 1285342, 1360585, 1356120, 1468975, 1548022, 1464200, 1479660, 1498499, 1502606, 1577654, 1604529, 1548309, 1514711, 1544435, 1628231, 1587028, 1627471, 1634872, 1675318, 1666882, 1687305, 1635505, 1706612]
4590A706612N9504M4049L0369N8843m201L1192Q9461K9698P1239M4366Q871p743
4578B162260M5498J16342m833r230J10834N9224o293J5425Q7652J0978Q892L7054
4566B633803R7811k3885M9589O3144J07357Q4148N8814J8833M1309L4696L4506
4555C200125J00745J17997L5035L2297L3200J6193K9436J04765M8903J37092m878
4544C850910J21529J13217R9269N5854K0105R7256J49254J36085O1128O2953R8400
4533D865960N1968J07005J10037J12137J46474J45369O6008J25644J99172J48279
4523F078053J20313Q7013J84229J95968K50907K03256K06509J99671J78643K20612
4513G925174J95390K27359K62806K50686K92732K82150K78297K58607L59854L86820
$$ y = [1706612, 1766116, 1810165, 1840534, 1899377, 1895176, 1926368, 2015829, 2045527, 2116766, 2161132, 2170003, 2162260, 2207758, 2324100, 2319267, 2310037, 2420871, 2480095, 2473802, 2489227, 2576879, 2587857, 2596749, 2633803, 2731614, 2707729, 2757318, 2820462, 2927819, 3011967, 3070781, 3089614, 3130923, 3165619, 3200125, 3300870, 3418867, 3453902, 3486199, 3519399, 3535592, 3565028, 3669793, 3718696, 3855788, 3850910, 3972439, 4085656, 4184925, 4240779, 4260884, 4358140, 4507394, 4643479, 4704607, 4767560, 4865960, 4917928, 5024933, 5134970, 5247107, 5393581, 5538950, 5604958, 5730602, 5929774, 6078053, 6198366, 6285379, 6469608, 6665576, 6916483, 7119739, 7326248, 7525919, 7704562, 7925174, 8120564, 8347923, 8610729, 8861415, 9154147, 9436297, 9714594, 9973201, 10333055, 10719875]
4503A0719875M31905L50959L89879M73609L74960M24417M30571M31404K89634
4494A4317213K77887K25125K29453K96459L05115K87371K42281K54820L21727
4485A6757451L89538M68502M13101M66899N37411N06045N73054N20156N53024
4476B1185181N30780N28002N35796N82258O43644O78189Q40085Q80368Q26147
4467B7230450J042928J196000J506450J646961J680017J684674J710504J695288
4459C9393272J881447K133316K389629K724980L122925L619423M351237N286439
4451F4902668O563259Q019335R651053J1125202J2046918J0198169O720766M370071
4443A33597441L131756L317181L883765L606883J602264k080869o808136r900244
$$ y = [10719875, 11151780, 11502739, 11892618, 12366227, 12741187, 13165604, 13596175, 14027579, 14317213, 14595100, 14820225, 15049678, 15346137, 15651252, 15938623, 16180904, 16435724, 16757451, 17146989, 17615491, 18028592, 18495491, 19032902, 19538947, 20112001, 20632157, 21185181, 21715961, 22243963, 22779759, 23362017, 24005661, 24683850, 25523935, 26404303, 27230450, 28273378, 29469378, 30975828, 32622789, 34302806, 35987480, 37697984, 39393272, 41274719, 43408035, 45797664, 48522644, 51645569, 55264992, 59616229, 64902668, 71465927, 79485262, 89136315, 100261517, 112308435, 122506604, 129227370, 133597441, 136729197, 140046378, 143930143, 147537026, 149139290, 147058421, 140250285, 130350041]
4435A30350041j0148531r495755q916056q255210p609833o822411n708626m788562
4427F8605057l903104l018633k346616j809990j529110j348651j258841j045267
4419E2344845p58925n91884m76227o75651p38605p25330q29996j061969j321078
4410D5165180j325434j115135p89895l64031j08063N1054O8831k27043j294018
4401D0061446k193939k409535k798828k767085k518579k215240j862127j550879
4393B1745234j383437j198895j054093j038376q83141q28605p61659o30584o19411
4384A3347033o18412n65153m67783m85696m40679m04466m31648k67559l57070
4375I308567l82806l22675l29682k22072l33552k73772k50739k26376k07863j55999
$$ y = [130350041, 120201510, 110705755, 101789699, 93534489, 85924656, 79102245, 73393619, 68605057, 64701953, 61683320, 59336704, 57526714, 55997604, 54648953, 53390112, 52344845, 51585920, 50994036, 50517809, 49842158, 49103553, 48378223, 47548227, 46486258, 45165180, 43839746, 42724611, 41934716, 41570685, 41462622, 41513676, 41582507, 41355464, 40061446, 37867507, 35457972, 32659144, 29892059, 27373480, 25158240, 23296113, 21745234, 20361797, 19162902, 18108809, 17070433, 16187292, 15358687, 14597028, 13966444, 13347033, 12728621, 12163468, 11695685, 11209989, 10769310, 10364844, 9933196, 9665637, 9308567, 8925761, 8603086, 8273404, 8051332, 7717780, 7444008, 7193269, 6966893, 6759030, 6603031]
4365F603031k28502k48339k05387r9482j59186q5890j17157j73312j55282j68129
4355D962365j60319q0717r5344j85829j53052j03659j05231j54783j18609k4490
4345C780332l7636j31212j13523r3123j09193j02023n8198q4465k4776j46346
4335B879837n0832o4322p1320k0031o8877q2005r6688l7650m6189q2551r3708
4324B165664n8302o0673j2286l1083l5579l1983J6419j0359k317L0805k6386n5477
4312A888443k5477n277M9889J6274l9454n1591k5355k0091o6846j5474o779k2939
4300A675323L578n772o8070J6610J1431K7454J6231k7594Q438P391j320K1929
4288A685629P1971P3426R3066J60151J2254Q2220P9556k3964j19083p0651j47497
$$ y = [6603031, 6374529, 6126190, 5920803, 5821321, 5662135, 5576245, 5459088, 5285776, 5130494, 4962365, 4802046, 4721329, 4625985, 4440156, 4287104, 4183445, 4078214, 3923431, 3804822, 3780332, 3742696, 3611484, 3497961, 3404838, 3295645, 3193622, 3135424, 3050959, 3026183, 2879837, 2829005, 2764683, 2693363, 2673332, 2604455, 2522450, 2425762, 2388112, 2341923, 2259372, 2165664, 2107362, 2046689, 2034403, 2003320, 1967741, 1935758, 1952177, 1941818, 1939501, 1970306, 1943920, 1888443, 1862966, 1857689, 1907578, 1923852, 1884398, 1832807, 1807452, 1787361, 1720515, 1705041, 1698262, 1675323, 1678901, 1673129, 1605059, 1621669, 1633100, 1660554, 1676785, 1649191, 1657629, 1665020, 1663700, 1685629, 1757600, 1831026, 1924092, 2084243, 2096497, 2178717, 2258273, 2234309, 2115226, 2044575, 1897078]
4277A897078q4686l9706l0009R8366k6417j6040P3781P5042P3378J47163K30964
4266B398914J48176Q7945j5200k2529m7931n0429P2356J16656J11011Q9539J47388
4255C035896Q8351p949o0843r9349j30800k7140p8228n2593K2804J33770J34348
4244B958267J07443J54690K06678L63344M80756N10252N19842J78953k41120m45692
4234D793413m92410l64969j32256q8284Q7858K8364J03543J29263l3602j09028
4224C921892k24466k12675j85921q3613j7184M0969Q6879Q4051K12106K91118
4214C913156L37157M09242N35814O70190M52819J66667l06533n94881p04686n82821
4204D296124m38535l17889j70625j13466j54588o3690q0741j06638n9044m3423
$$ y = [1897078, 1812392, 1772686, 1742677, 1841043, 1814626, 1798586, 1872367, 1947409, 2020787, 2167950, 2398914, 2547090, 2635035, 2619835, 2597306, 2549375, 2498946, 2571302, 2687958, 2798969, 2888508, 3035896, 3124247, 3116298, 3055455, 2956106, 2825306, 2798166, 2719938, 2667345, 2690149, 2823919, 2958267, 3065710, 3220400, 3427078, 3790422, 4271178, 4781430, 5301272, 5480225, 5239105, 4793413, 4301003, 3936034, 3803778, 3715494, 3803352, 3831716, 3935259, 4064522, 4030920, 3921892, 3697426, 3484751, 3298830, 3215217, 3198033, 3239002, 3325881, 3409932, 3622038, 3913156, 4250313, 4659555, 5195369, 5865559, 6318378, 6485045, 6178512, 5583631, 4878945, 4296124, 3857589, 3539700, 3369075, 3255609, 3101021, 3037331, 2956590, 2849952, 2790908, 2747485]
4194B747485K212r72J205J8804K4815P9126J66317J58870J54554L52959L66089
4183D071464M06140L30426P4535j61687m28070m80723l81785k87217k10903j80691
4173B751489j24466k8130k7214n801R817j4354J7577k2073K6645P6686n1471M7849
4161B656554L325n0200J6574J35171M1953K4435J80914J72186N7458q6273j39822
4150C012275j35299k6207q9687q5994o0235R104L7741Q4218M5583L3455M4578
4139B869532K2331P2396J10937J34240j8624J7068l2322p0128J0820M1354L5653
4128C193257K2676n9331N6799L9965J2091N6543K0219K9271j3347O556K9579J13348
4116C507626N6506P1996J39276J13169J14041P2164J20446J59951K28308Q9414
$$ y = [2747485, 2749697, 2748725, 2749930, 2768734, 2793549, 2872675, 3038992, 3197862, 3352416, 3705375, 4071464, 4477604, 4808030, 4882565, 4720878, 4292808, 3812085, 3430300, 3143083, 2932180, 2751489, 2627023, 2598893, 2571679, 2565878, 2575695, 2561341, 2578918, 2556845, 2583490, 2660176, 2608705, 2656554, 2659879, 2609679, 2626253, 2761424, 2803377, 2827812, 3008726, 3180912, 3238370, 3152097, 3012275, 2876976, 2850769, 2761082, 2675088, 2614853, 2623957, 2661698, 2745916, 2791499, 2824954, 2869532, 2891863, 2964259, 3075196, 3209436, 3190812, 3207880, 3175558, 3105430, 3116250, 3157604, 3193257, 3215933, 3156602, 3213401, 3253366, 3265457, 3322000, 3342219, 3371490, 3358143, 3364699, 3394278, 3507626, 3564132, 3636128, 3775404, 3888573, 4002614, 4074778, 4195224, 4355175, 4583483, 4672897]
4106D672897O1667J58625P7722L0168J8422N7149Q4432j5265K0067L5036O9397
4095E270317P0554J4118J10158J25174N3000J79193J23443N6833J02150J35607
4085F240547J45227J58046J41001J75831J87549M1772J21076J72624J59301J11350
4075G654324J74570K00225J75993R3415J32207K49768K56359J59363J93682J99158
4065I489064K42238K88780K32175K28237K68996L13275K93973L48577M03423M41932
4055A2550670M21514M23680L82197K58044L57355L69636M04304M60994M00458
4046A6028852M45027M99737O39205O55252Q04093Q36685Q99686P43414N79672
4037B2131623O15787P33203R03301J138807J383304J603263J887623K148613K290610
$$ y = [4672897, 4734564, 4893189, 4970911, 5001079, 5019501, 5076650, 5161082, 5145817, 5165884, 5200920, 5270317, 5340871, 5354989, 5465147, 5590321, 5643321, 5822514, 5945957, 6002790, 6104940, 6240547, 6385774, 6543820, 6684821, 6860652, 7048201, 7089973, 7211049, 7383673, 7542974, 7654324, 7828894, 8029119, 8205112, 8298527, 8430734, 8680502, 8936861, 9096224, 9289906, 9489064, 9731302, 10020082, 10252257, 10480494, 10749490, 11062765, 11356738, 11705315, 12108738, 12550670, 12972184, 13395864, 13778061, 14036105, 14393460, 14763096, 15167400, 15628394, 16028852, 16473879, 16973616, 17612821, 18268073, 19072166, 19908851, 20808537, 21551951, 22131623, 22747410, 23480613, 24383914, 25522721, 26906025, 28509288, 30396911, 32545524, 34836134]
4028C4836134K710339L655904M706406O066103P279271O790105L877294j068760
4020F8852796n284404n912050m266533k560336j282455k76811M61375Q10291P88434
4011E1330307O56592O33937O33161R89294J514599K298211L327082M183959N212642
4002G0779784O208944P620818R352033J2170686J5781390J9785513K0536273J6584935
3994A78820376O517252m908883j2801950j9276744j9378300j4866891j0229119
3987A03875741o805745m297632k698122j760915j374583j211223q38979k44883
3979H4643659P56290J946239L302239M637479O163940P898858J0102271J3042296
3971A32493271J7068252K1669862K5049410K4619236J8941054P318302m767177
$$ y = [34836134, 37546473, 41202377, 45908783, 51974886, 59254157, 66044262, 69921556, 68852796, 63568392, 57656342, 53389809, 50829473, 49547018, 49270207, 49731582, 50541873, 51330307, 51986899, 52620836, 53253997, 54243291, 55757890, 58056101, 61383183, 65567142, 70779784, 76988728, 84609546, 93961579, 106132265, 121913655, 141699168, 162235441, 178820376, 185337628, 180428745, 167626795, 148350051, 128971751, 114104860, 103875741, 97069996, 92772364, 90074242, 88313327, 86938744, 85727521, 84888542, 84643659, 85399949, 87346188, 90648427, 95285906, 101449846, 109348704, 119450975, 132493271, 149561523, 171231385, 196280795, 220900031, 239841085, 247159387, 242392210]
3964B42392210j8124305k5909226k6171469k2724908j6933105j2346834q562403
3957A11619960n986679m225724l309009k601759k055540j285123m26458Q32244
3949I2561912K093271L345426M654140O330926Q246187J1082236J4402166J8545501
3941A61261765K2402112K5213591K4649263K1901210J8354350J4991655N461223
3934B94235169j4252595l5859967m4027181l6769159k6606424j8993601j4208372
3927A03517870j0798454q452080o728495n602194m503706l498778k708895k087305
3919E9137963j510420j317860r79141m63619K63984J341359K709336L780136L704575
3910F6666313J450742k391695o211468p333137n997406m633414l635122k956407
$$ y = [242392210, 224267905, 198358679, 172187210, 149462302, 132529197, 120182363, 111619960, 105633281, 101407557, 98098548, 95496789, 93441249, 92156126, 91729668, 92561912, 94655183, 98000609, 102654749, 108985675, 117231862, 128314098, 142716264, 161261765, 183663877, 208877468, 233526731, 255427941, 273782291, 288773946, 294235169, 279982574, 244122607, 200095426, 163326267, 136719843, 117726242, 103517870, 92719416, 84267336, 77538841, 71936647, 67432941, 63934163, 61225268, 59137963, 57627543, 56309683, 55330542, 54866923, 55130907, 56472266, 59181602, 62961738, 66666313, 68117055, 65725360, 59513892, 52180755, 46183349, 41549935, 37914813, 34958406]
3902C4958406k450110k035666j759393j454304j431952j295468j073998r55607
3894B2501908q56498p67966p47439o39768n38569o27406n55766n16858n36595
3885A6715043m98163m71046m61879m44677m32589l71830l35589k81780l68454
3876A3049036l52265k95113k52308k44745l32287l39875l23385k88973k24348
3867A0395737k64315k11735j75493j16947j50965k74053j97190k28724k82545
3858H493770k21079j86696j56555j73933j65550j48598j27872j83388j45569j33822
3848F850708j21137o6890r0544j26006r0726p3347j16391r0512j19668j16382
3838E839105j39048j26385r1308j23752j1501o3232j75950j40643l5732n5257
$$ y = [34958406, 32508296, 30472630, 28713237, 27258933, 25826981, 24531513, 23457515, 22501908, 21645410, 20877444, 20130005, 19490237, 18951668, 18324262, 17768496, 17251638, 16715043, 16216880, 15745834, 15283955, 14839278, 14406689, 14034859, 13699270, 13417490, 13049036, 12696771, 12401658, 12149350, 11904605, 11572318, 11232443, 10909058, 10620085, 10395737, 10131422, 9919687, 9744194, 9627247, 9476282, 9202229, 9005039, 8776315, 8493770, 8272691, 8085995, 7929440, 7755507, 7589957, 7441359, 7313487, 7130099, 6984530, 6850708, 6729571, 6662681, 6572137, 6446131, 6355405, 6282058, 6165667, 6075155, 5955487, 5839105, 5700057, 5573672, 5482364, 5358612, 5347111, 5283879, 5107929, 4967286, 4931554, 4876297]
3828D876297j01742p6523p7539p2068m7917m8540r2771q1449P8560K3673m0315
3817D339666r066r643k3260q7294M1445k0599K0221q887j5986L1867n6288L2695
3805D234871l352K1780J3879K0882K5090k9471N6463J15385M5882J50809K73286
3794D925504K77229K01718M9415n0415k16372k00595j36658n9102p3415n7437
3784D659872M9057J3682K8253j1733J1051J18846R2024J43747J42546K21084L58535
3773E826964L60205L02245M74509N97689P48578P07098N59202J38141m33855p64196
3763H516580q48631n77585m54645k75678j12247j68640j28276n9515o2879m2724
3753E785760P1267Q9521J99021K64278L20652K92146L78910M85553O61432Q45719
$$ y = [4876297, 4774555, 4698032, 4620493, 4548425, 4500508, 4451968, 4359197, 4277748, 4356308, 4379981, 4339666, 4330600, 4320957, 4297697, 4210403, 4251848, 4231249, 4251470, 4242583, 4226597, 4258464, 4202176, 4234871, 4231519, 4253299, 4267178, 4288060, 4313150, 4283679, 4340142, 4455527, 4501409, 4652218, 4925504, 5202733, 5404451, 5453866, 5403451, 5187079, 4986484, 4849826, 4790724, 4717309, 4659872, 4708929, 4722611, 4750864, 4739131, 4750182, 4869028, 4961052, 5104799, 5247345, 5468429, 5826964, 6187169, 6489414, 6963923, 7561612, 8310190, 9017288, 9576490, 9714631, 9280776, 8516580, 7667949, 7090364, 6635719, 6360041, 6247794, 6079154, 5950878, 5891363, 5828484, 5785760, 5857027, 5946548, 6145569, 6409847, 6730499, 7022645, 7401555, 7887108, 8548540, 9394259]
3743I394259Q94914Q97908O55961K54416k93322o74290j017644j069508q52509
3734H190185p31776n34657l29051l54417l04826k82309k09387j20628n2377q215
3724E262542k3014M2581J43085K20274K49750L85833M68714N34085O02924N79665
3714H466439L32047o6994m19038o39698q03626p10251m65746l63217k98197j84344
3704D847375j54363j41072j77528j56410j62045j87992j60809j34041j27270n8113
3694C387732o674j1313R2304J10065M8049Q6351J84575m960r1857j56534j96420
3683C441318k23993j36777r3850r9025j9357P2162M4616J8264Q6835N660q3613
3672C012240j63165j88032j59878k18536j41731j71948q8601m214l2153j961j9657
$$ y = [9394259, 10289173, 11187081, 11843042, 12097458, 11804136, 11129846, 10112202, 9042694, 8190185, 7458409, 6923752, 6594701, 6240284, 5935458, 5653149, 5443762, 5323134, 5270757, 5262542, 5239528, 5282109, 5425194, 5645468, 5895218, 6281051, 6749765, 7283850, 7886774, 8466439, 8798486, 8731492, 8312454, 7672756, 6869130, 6158879, 5693133, 5329916, 5031719, 4847375, 4693012, 4551940, 4374412, 4218002, 4055957, 3867965, 3707156, 3573115, 3445845, 3387732, 3381058, 3369745, 3462049, 3572114, 3620163, 3706514, 3891089, 3886129, 3794272, 3637738, 3441318, 3217325, 3080548, 2986698, 2887673, 2868316, 2940478, 2985094, 3003358, 3090193, 3095853, 3012240, 2849075, 2661043, 2501165, 2282629, 2140898, 1968950, 1880349, 1876135, 1843982, 1842021, 1822364]
3661A822364n4862l5661k5012l2370L1587J6181K7148L7287m4156M8550O3153
3650A854209M0897J27293N9129K0404N4185M1557k4448J2568L4727M1143M3068
3639B304732j10496j31998j71633j78691j45505o8231j16831l7677q3086k3493
3629A237091j6851j8267m272o7842j6616q1264P7607K9624m4279J3432M2452J6728
3617A167543o2670j4536p8552j9927q814m3769J0142l5470o0368o373N1328k5980
3605H72554k6572l0855M6080o399o9111q4967p332K4609M0647p547J0499l4056
3593G27550l1300M8370J9872L125l9700n4766K7005j6867l1617r102J2332K5366
3581F80268k4169k3662n545M561l0436K1900o71N524n962K6817l8414m409M6069
$$ y = [1822364, 1767502, 1731841, 1706829, 1674459, 1706046, 1722227, 1749375, 1786662, 1742506, 1791056, 1854209, 1895106, 2022399, 2081528, 2101932, 2156117, 2197674, 2173226, 2185794, 2220521, 2261664, 2304732, 2194236, 2062238, 1890605, 1711914, 1566409, 1498178, 1381347, 1343670, 1260584, 1237091, 1220240, 1201973, 1197701, 1129859, 1113243, 1031979, 1109586, 1139210, 1094931, 1108363, 1150815, 1167543, 1104873, 1090337, 1011785, 991858, 983044, 939275, 949417, 913947, 853579, 847206, 898534, 872554, 845982, 815127, 861207, 854808, 785697, 700730, 693398, 718007, 758654, 751107, 761606, 727550, 696250, 744620, 764492, 767617, 727917, 673151, 700156, 683289, 651672, 642570, 654902, 680268, 656099, 632437, 626892, 631453, 601017, 622917, 622246, 627770, 621808, 648625, 610211, 605802, 651871]
3568F51871l5721j0886j8099O90k1491j61J9726j6236M0524M6341J708m3227m2002
3555E73037L0538K1385j0712l6228J8604J2563M4445J8359k3998O175r318N8787
3543G03637o555n239K7613n4732J2565j4804N5517M3462Q101K8428l6325m6522
3531G15146m3658l7286j4038l245R728L5526n575m6767K4673k1550J5380j0582
3519F17752P4954L158k0599k9543k6257O1109N2438j2343L6435j0363q463O0118
3507G98396J0024L0623R1789R8365L3164o7444n5206k8374o7759q9756J9214j5952
3495G57084K6000k7406p0581M1523p3383j3723N332Q9444k7620J7803k9257R03
3483F96119K4976j02995J1730M6048k1883J3475o1260n097L9101N5045L6286J3797
$$ y = [651871, 616150, 605264, 587165, 587855, 566364, 566203, 585929, 569693, 610217, 656558, 658266, 615039, 573037, 603575, 624960, 614248, 578020, 596624, 609187, 653632, 671991, 647993, 654168, 644850, 703637, 697082, 691843, 719456, 664724, 677289, 662485, 718002, 761464, 769565, 797993, 761668, 715146, 671488, 634202, 620164, 616919, 626647, 662173, 656598, 609831, 634504, 612954, 628334, 617752, 692706, 695864, 675265, 645722, 619465, 680574, 733012, 720669, 757104, 746741, 738278, 798396, 808420, 839043, 930832, 1029197, 1062361, 994917, 939711, 911337, 843578, 753822, 773036, 757084, 783084, 755678, 685097, 726620, 653237, 639514, 644846, 734290, 706670, 724473, 695216, 696119, 721095, 618100, 629830, 675878, 653995, 667470, 606210, 601113, 640214, 695259, 731545, 745342]
3471G45342R6640n9133r5594l5084K9906k0827j1740M3412o6470K3906P892J3927
3459F72177m6579j08896K1857P9308l7447k1607J5172k3595m3740K1846j8821
3448E09675K2229J2278M4515K019J3478j5570r826O06R756l3602l4116L7754O4711
3435F23907l8905K5189L9015j5633m7249J239j2878J797K6754J8755M3915O552
3423F72458P5012l2350j2438K145j115k5631o821J1413j2117k8936M1338J3974
3411F96932k9240j8099K8417M393l721K642J6898n702k2451O490K2430p672K1319
3398G12636J2985q31L7119O6035l5360L8647q540K0192R5281K3122L5517L244
3386A000047m4831L4445N5647L202P435M4612N1513l5147o3790J3840L1125J51
$$ y = [745342, 841982, 782849, 687255, 652171, 682077, 661250, 649510, 692922, 626452, 650358, 658250, 672177, 625598, 516702, 538559, 617867, 580420, 558813, 573985, 550390, 506650, 528496, 509675, 531904, 544182, 588697, 590716, 604194, 588624, 578798, 579404, 589160, 555558, 521442, 559196, 623907, 585002, 610191, 649206, 633573, 586324, 587563, 574685, 576482, 603236, 621991, 665906, 672458, 747470, 715120, 702682, 704827, 703712, 678081, 671260, 682673, 670556, 641620, 682958, 696932, 667692, 649593, 678010, 682403, 678682, 681324, 698222, 692520, 670069, 676559, 698989, 691317, 712636, 725621, 724790, 761909, 827944, 792584, 831231, 822691, 842883, 938164, 961286, 996803, 1000047, 955216, 989661, 1045308, 1048510, 1055945, 1100557, 1152070, 1116923, 1053133, 1066973, 1098098, 1098249]
3374A098249Q7425J2250K7620M8598J22640P129P131K8083J56368N5039O7505
3363A718037J00680n3509p710J9429J7542j3978M9701K269q07Q1568N3559k2346
3351A944435Q318m0733O9008j2707J2109J0971J2465j3976k7671L5613P4781O7927
3339B140540l0927L4873j0868O7970J0834q7103J510J6547q6482P7972O1386l9641
3327B156611K2035k9254L4299L4314K6742n296M1521M6842J8690J3492P3795L7786
3315B471577M1907l9002J666R1996O8804p062o173R4708J18341J00798J42631
3304C080191P3955L4182P8395J25388L5287J11535J65583J40924J08535J18008
3294D071983M9561O6001K22287J68615J3158R8572P9273J42918J76139J29537
$$ y = [1098249, 1185674, 1197924, 1225544, 1274142, 1396782, 1403911, 1411042, 1439125, 1595493, 1650532, 1718037, 1818717, 1765208, 1757498, 1776927, 1794469, 1780491, 1830192, 1832461, 1831654, 1913222, 1966781, 1944435, 1952753, 1912020, 1981028, 1968321, 1980430, 1991401, 2003866, 1989890, 1962219, 1997832, 2072613, 2140540, 2109613, 2144486, 2133618, 2201588, 2212422, 2125319, 2126829, 2143376, 2056894, 2134866, 2196252, 2156611, 2178646, 2149392, 2183691, 2218005, 2244747, 2239451, 2280972, 2327814, 2346504, 2359996, 2433791, 2471577, 2513484, 2474482, 2476148, 2568144, 2636948, 2629886, 2623713, 2718421, 2836762, 2937560, 3080191, 3154146, 3188328, 3266723, 3392111, 3427398, 3538933, 3704516, 3845440, 3953975, 4071983, 4121544, 4187545, 4409832, 4578447, 4591605, 4690177, 4769450, 4912368, 5088507, 5218044]
3284E218044J18871J41580N4282J76939J75340J61537J11959J44728J97118L01900
3274F802298K01812K11381J66537J93532K50587L13576K70193L35733K85929M18895
3264I450473M08757M78346O90000P41385R07948J115686J313903J496446J630644
3255A8233588K034191K657648L623717N075468O784792P652917N283762k33414
3247E1112669o656581p851523o001376m022937k668428j994606j377320r25692
3239A9614206o37377l95654k35404j47562M7438J84417K59159L68757N06466Q58070
3229B0422516J104486J501606J815286K290131K585522L050570L482037M358350
3221D0610504N928605Q560219J1400221J4732953J2720219M312377r660539j6851359
$$ y = [5218044, 5336915, 5478495, 5532777, 5709716, 5885056, 6046593, 6158552, 6303280, 6500398, 6802298, 7004110, 7215491, 7382028, 7575560, 7826147, 8139723, 8409916, 8745649, 9031578, 9450473, 9859230, 10337576, 11027576, 11768961, 12676909, 13792595, 15106498, 16602944, 18233588, 20267779, 22925427, 26549144, 31624612, 38409404, 46062321, 51346083, 51112669, 44456088, 36604565, 30603189, 26580252, 23911824, 21917218, 20539898, 19614206, 18976829, 18581175, 18345771, 18198209, 18245647, 18430064, 18689223, 19057980, 19564446, 20422516, 21527002, 23028608, 24843894, 27134025, 29719547, 32770117, 36252154, 40610504, 46539109, 55099328, 66499549, 81232502, 93952721, 98265098, 88604559, 71753200]
3213G1753200j3804792r968967o806085n146964l713243k818722k080398j811533
3205B5602496j548834j426464j174506j067446q60941p31309n26519l56855j98375
3196A7711247P9568K30757M86390P47648R44025J162777J542839K207105L189661
3187B8302017M528255O203615O623451L745767j965800p614018p799635n891606
3179B6132046m104234l026875k280161j749518j312723j042810q43462q28023
3171A0944240o75668o15698n71288m26948m52241l73564k60079k98617l16487
3162F953650k09535k12432j96829j45484k08888k42136j80230j61536j74697j38725
3152E083158k42848k05349j57947j29729j15012r6837n7234j12848j07626j53156
$$ y = [71753200, 57948408, 47979441, 41173356, 36026392, 32313149, 29494427, 27414029, 25602496, 24053662, 22627198, 21452692, 20385246, 19524305, 18792996, 18266477, 17909622, 17711247, 17790815, 18021572, 18507962, 19255610, 20199635, 21362412, 22905251, 25112356, 28302017, 32830272, 39033887, 45657338, 49403105, 47437305, 39823287, 32023652, 26132046, 22027812, 19000937, 16720776, 14971258, 13658535, 12615725, 11772263, 10944240, 10268572, 9652874, 9081586, 8654638, 8202397, 7828833, 7568754, 7270137, 6953650, 6744115, 6531683, 6334854, 6189370, 5980482, 5738346, 5558116, 5396580, 5221883, 5083158, 4840310, 4634961, 4477014, 4347285, 4232273, 4135436, 4078202, 3965354, 3857728, 3704572]
3142C704572r9812r8325j53342p0837j03829n4936l5389m2345m8765r7319n1309
3131B848364p4431p9876R397n6501j25131l3451r793k3961j7615j01404n3948
3120B281650m4171q4231p2738l3184M3997j1217r3081j06529r440l3364j011j5408
3108A821273q2928P802n3856k6583k5327k3318M425k5578N621o9098J067q6836
3096A446664j5410j150L3105k0867r1376m7772o3026J0644K5909j9184J5585m5087
3084A228035l5340M866q192o0634L6365p2407o6704j7784M7797N9593j9275q9206
3072A007114n0693Q3524k6982m0400J1505m4327K1871N4205j4311p8901M7244
3061I69849p5121R065j5874J6041o2986n5074P8606j1292j2480m4108K0484j8432
$$ y = [3704572, 3604760, 3506435, 3353093, 3282256, 3178427, 3123491, 3088102, 3045757, 2996992, 2899673, 2848364, 2773933, 2694057, 2703454, 2646953, 2521822, 2488371, 2478578, 2454617, 2437002, 2335598, 2281650, 2237479, 2153248, 2080510, 2047326, 2091323, 2080106, 1987025, 1880496, 1871056, 1837692, 1836681, 1821273, 1738345, 1746147, 1692291, 1665708, 1640381, 1617063, 1621488, 1595910, 1601531, 1532433, 1533500, 1446664, 1431254, 1430104, 1463209, 1442342, 1350966, 1303194, 1240168, 1250812, 1276721, 1257537, 1273122, 1228035, 1192695, 1197561, 1189369, 1128735, 1165100, 1092693, 1025989, 1008205, 1056002, 1115595, 1096320, 1007114, 956421, 1039945, 1012963, 972563, 984068, 939741, 961612, 1015817, 1001506, 922605, 969849, 894728, 903793, 887919, 903960, 840974, 785900, 864506, 853214, 840734, 796626, 817110, 798678]
3049G98678o3855O6218Q411o385r21K8417j0765K2525N401o681M931M0807L9917
3036I26698j02768k0901L036n6500K2477o1484R530p303M8850J3893k7605k3223
3024G24700l6638J7886M1762N4819l3294m3366K6337Q365p3155n1234K1476J4924
3012F72582L2555j7306K1389M2111l8909j3619j5101q57l9661L7071O058N2362
3000G38675k5498o9185K3395M6677o173J6658o6259n587m273k9948k3735k5206
2988E69541Q538N9941k4410O2851l0191k36J4500M0564K438L4381l3376j0654
2976F93887J8765L271q691M6085R855l6700K7514M5089K8313N0411K5921m4810
2964H58910M5264L6848O0331K7550J162K8358k7624j10031o0921j7420J8521R1234
$$ y = [798678, 734823, 801041, 809452, 803067, 802146, 830563, 819798, 842323, 847724, 841043, 845974, 886781, 926698, 823930, 803029, 806065, 749565, 772042, 710558, 720088, 712785, 761635, 775528, 747923, 724700, 688062, 705948, 747710, 802529, 769235, 725869, 752206, 760571, 687416, 636182, 657658, 672582, 705137, 687831, 709220, 751331, 712422, 698803, 683702, 682845, 643184, 680255, 686313, 738675, 713177, 643992, 667387, 714064, 707891, 724549, 658290, 652703, 648430, 618482, 594747, 569541, 578079, 638020, 613610, 676461, 646270, 646034, 660534, 701098, 703536, 737917, 704541, 693887, 712652, 715923, 707232, 753317, 763172, 726472, 753986, 799075, 827388, 877799, 903720, 858910, 904174, 941022, 1001353, 1028903, 1030065, 1058423, 1030799, 920768, 859847, 842427, 860948, 952182]
2952I52182q2723m5349J5466Q4364l902j3425j1790k663Q5134m623L8008m5473
2940I65206l9146L0861N4505J726M3392k0204O3320J8798J29783Q6349O4906J7161
2928A416657J01056M2105j2386M026j02863l8961Q814k7660q2446L6719M156M0554
2916A389771J2435l2521J52J55904M6030k3983M6659M8957J957J01134J02287
2905A848782J34544N1749L6877O9076J30143Q2268O1765J17153j8960K4819N9601
2894B597817l3342m6319K5264m0714l0637M585K3304O559R3210o6592l9527m297
2882B489311K9480m195M6875P9969J51527J32442J26444J85152J65167K26642
2872C628814L69238L09924J73428j69671l11769l06811l31303k48444j68843j74207
$$ y = [952182, 869459, 824110, 839576, 923940, 920038, 906613, 894823, 892160, 977294, 972671, 1010679, 965206, 926060, 956921, 1011426, 1013152, 1056544, 1036340, 1099660, 1118458, 1248241, 1334590, 1399496, 1416657, 1517713, 1559818, 1547432, 1551458, 1448595, 1409634, 1418448, 1390788, 1308342, 1345061, 1349217, 1389771, 1402206, 1369685, 1369837, 1525741, 1571771, 1547788, 1594447, 1643404, 1645361, 1746495, 1848782, 1983326, 2035075, 2071952, 2141028, 2271171, 2353439, 2415204, 2532357, 2513397, 2538216, 2597817, 2564475, 2518156, 2543420, 2502706, 2472069, 2476654, 2499958, 2506517, 2599727, 2533135, 2493608, 2489311, 2518791, 2514596, 2561471, 2641440, 2792967, 2925409, 3051853, 3237005, 3402172, 3628814, 3998052, 4307976, 4481404, 4311733, 3999964, 3693153, 3361850, 3113406, 2944563, 2770356]
2862B770356k16392o9106o0551q4302o7194J4173k8158l6324q3391L7978l4667
2851B142422k392m5741J9865R760j0156J20870K7292j5209L913J28259K7556j6519
2839B389920J8027r8959j26924j42159j54935p3919o8214j54795j15128n9741
2829A413173r023j38510N883Q1201q7799j3926p7399l9166k3656m9753L0101L8587
2817A129713n6467p5958J5056K9728m5673q9606j2980L1198n0542j02129k4446
2806G47894k6915R762n089O279j00075r8286O2736K2576o04L6770k9999m3455
2794E81594l3980j1876M6569R369K4601n4311K6669k4229N939n3921m2918J013
2782D74519n3356J7359j6029p0479N3417J6048K1778k2952m2075l7469N1711q59
$$ y = [2770356, 2553964, 2484858, 2424307, 2340005, 2272811, 2286984, 2258826, 2222502, 2139111, 2177089, 2142422, 2140030, 2094289, 2114154, 2123914, 2113758, 2234628, 2261920, 2246711, 2250624, 2378883, 2406439, 2389920, 2407947, 2308988, 2182064, 2039905, 1884970, 1811051, 1742837, 1588042, 1472914, 1413173, 1404150, 1265640, 1271523, 1352724, 1264925, 1250999, 1173600, 1134434, 1110778, 1061025, 1091126, 1129713, 1073246, 997288, 1012344, 1042072, 996399, 906793, 893813, 925011, 874469, 772340, 747894, 720979, 730741, 725652, 731931, 631856, 533570, 596306, 618882, 618278, 655048, 625049, 581594, 547614, 535738, 582307, 591676, 616277, 561966, 588635, 564406, 570345, 516424, 473506, 474519, 421163, 438522, 422493, 352014, 405431, 421479, 443257, 420305, 378230, 340761, 392472, 391613]
2770C91613K631j1802l5652l7827j3950M2402J5649k245k632J0138l383j4300
2758C40642j13211L6771k7013k6154M3628K6349q2776L3701L9657k8179J4901
2747B58316o0308o284p596k501k064m363j5671j1705L1686J4642l990p761r743
2734A72658J2778K976P7018P407q0109j0255l6726J9041n2186P6962k212j2768
2722A74584k8749m4026O887o884N1389K4122n1926J4494M6020J6058L5051o4179
2710A72841k428j7472q784L8812j4945N515m4463j5802J6656J7728m8904j3060
2698H5694R6795p3912n5358m1773J7115Q625O1895m2948p4514N3837K8944m0599
2686B3801N0422K3385j9011R4725l4805j6883K806m5581q490j1960k748Q2147
$$ y = [391613, 394244, 382442, 346790, 308963, 295013, 337415, 353064, 350819, 348187, 358325, 354942, 340642, 227431, 264202, 237189, 211035, 254663, 281012, 198236, 231937, 271594, 243415, 258316, 198008, 191724, 184128, 181627, 179563, 175200, 159529, 147824, 179510, 194152, 190162, 182401, 172658, 185436, 188412, 265430, 272837, 192728, 182473, 145747, 164788, 112602, 189564, 187352, 174584, 145835, 101809, 108696, 101812, 153201, 177323, 125397, 139891, 185911, 201969, 237020, 172841, 170413, 152941, 144157, 182969, 168024, 173539, 129076, 113274, 129930, 147658, 98754, 85694, 182489, 108577, 53219, 11446, 28561, 37186, 99081, 56133, -18381, 35456, 64400, 23801, 74223, 97608, 78597, 173322, 138517, 121634, 124440, 78859, 70369, 58409, 55661, 137808]
2674A37808J8680k8386J4176m5945j0870P835l024N0476n1211n653k6249m1646
2662A5991J9508K9842l183N5078l0485j2943J3698Q937j410K4905k3874l3091
2650F2973l119J4732K0898K3242n197j6884j2276k6292K0977J5095q728n4665
2638C0756J2702m521M2586K7504n6836p407K8071Q2103k8719p0973j9300L0078
2626F6044J7913k942M4961j160m3093M5734M1592r6881j7566j1128P8917K2820
2614A45211n4060L048j7930K2620J9709n8495K1460K3921j5816J4365j7846k3189
2602F2998Q1577k1091j4130j5519O864J374k0652J1278n1812L150K9875L4111
2590A08023k8431j3507O2082l0503j7250k3421K6269P064q2419J7575R2406p417
$$ y = [137808, 156488, 128102, 142278, 96333, 85463, 93298, 90274, 140750, 89539, 83886, 57637, 15991, 35499, 65341, 62158, 117236, 86751, 73808, 87506, 96443, 95033, 119938, 96064, 62973, 59854, 74586, 95484, 118726, 113529, 96645, 84369, 58077, 79054, 94149, 85421, 30756, 43458, 38937, 81523, 109027, 52191, 44784, 72855, 154958, 126239, 55266, 35966, 66044, 83957, 81015, 125976, 124816, 81723, 127457, 169049, 72168, 54602, 43474, 122391, 145211, 91151, 94199, 76269, 98889, 118598, 60103, 81563, 105484, 89668, 104033, 86187, 62998, 144575, 123484, 109354, 93835, 100699, 102073, 81421, 92699, 40887, 44037, 73912, 108023, 79592, 66085, 128167, 97664, 80414, 56993, 83262, 90326, 7907, 25482, 117888, 110471]
2578A10471l4664j1594N107M0060j7959n576L7737P851j6098k8578K5585N383
2566A17725n4185l176M7055J3304j4977j8679J2753J7647m1198O308N703K5790
2554A14070M424j861J9412l2553L8629M9838l3399L0623j1746o2446P2467l2174
2542A55284l5057m5725l2020J4389j7664o424j779L4255j8062J0040J1282p935
2530F0584n1174L2761P009q0120M6765K6034R622n2986K0807K1366L5634L1208
2518A07510q499p5286K7264l0619K1795O01l0843K7299m5982M4994k2911L5693
2506E1016J0578k1682L2189J4298k5188q01k7129J2591k661R583p9551q48O5931
2493C8326J4771L5644l3862l9304M3389j7325N828l4656j2943P0681j3586m9124
$$ y = [110471, 75807, 64213, 69320, 109380, 91421, 85845, 123582, 131433, 115335, 86757, 112342, 117725, 63540, 60364, 107419, 120723, 105746, 87067, 99820, 117467, 76269, 82577, 88280, 114070, 118494, 116633, 136045, 103492, 142121, 191959, 158560, 189183, 177437, 114991, 187458, 155284, 120227, 74502, 42482, 56871, 39207, 32783, 31004, 65259, 47197, 57237, 68519, 60584, 9410, 42171, 49180, -30940, 15825, 41859, 51481, -1505, 19302, 40668, 76302, 107510, 99011, 23725, 50989, 20370, 42165, 42766, 11923, 39222, -6760, 38234, 15323, 51016, 61594, 39912, 72101, 86399, 61211, 60410, 33281, 45872, 43211, 52794, -26757, -27605, 38326, 53097, 88741, 54879, 15575, 58964, 41639, 47467, 12811, -132, 70549, 56963, 7839]
2481G839K231M7444K5535l8404l0779j2124l0037n1809J31802L1002m7375j1437
2469B3888M1580k1132n8290J7586J0950j903K4003n0493K3015n6149J7818K0721
$$ y = [7839, 10070, 57514, 83049, 44645, 13866, 1742, -28295, -80104, 51698, 82700, 35325, 23888, 65468, 44336, -13954, 3632, 14582, 12679, 36682, -13811, 9204, -46945, -29127, -8406]
$$ [...]
##END NTUPLES=NMR SPECTRUM
##END=
