##TITLE=1H_EC-3239(31)
 CDCl3
 8 sc, 
 17.10.2022
##JCAMPDX= 6.0         $$ Bruker NMR JCAMP-DX V2.0
##DATA TYPE= NMR SPECTRUM
##DATA CLASS= NTUPLES
##ORIGIN= UXNMR, Bruker Analytische Messtechnik GmbH
##OWNER= root
$$ XWIN-NMR		Version 3.5
$$ Mon Oct 17 14:43:24 2022 Russian Standard Time (UT+4h)  she@DPX200
##.OBSERVE FREQUENCY= 200.1313499994
##.OBSERVE NUCLEUS= ^1H
##.ACQUISITION MODE= SIMULTANEOUS
##.ACQUISITION SCHEME= undefined
##.AVERAGES= 8
##.DIGITISER RES= 18
##SPECTROMETER/DATA SYSTEM= spect
##.PULSE SEQUENCE= zg30
##.SOLVENT NAME= CDCl3
##.SHIFT REFERENCE= (INTERNAL, CDCl3, 0, 15.8196)
##AUDIT TRAIL= $$ (NUMBER, WHEN, WHO, WHERE, WHAT)
$$ ##TITLE= Audit trail, XWIN-NMR		Version 3.5
$$ ##JCAMPDX= 5.01
$$ ##ORIGIN= Bruker BioSpin GmbH
$$ ##OWNER= she
$$ F:/spectra/data/she/nmr/H-F/1/pdata/1/auditp.txt
$$ ##AUDIT TRAIL=  $$ (NUMBER, WHEN, WHO, WHERE, WHAT)
(   1,<2022-10-17 14:40:59.96 +0400>,<she>,<DPX200>,
      <created by zg, POWCHK disabled, PULCHK disabled
       configuration hash MD5:
       00 E9 B6 7A A2 85 ED C7 34 08 36 98 17 FE 4E 26
       data hash MD5: 16K
       18 B8 7C 7D F6 F0 80 C8 AA C3 9D 63 7F B8 DA 50>)
(   2,<2022-10-17 14:41:02.57 +0400>,<she>,<DPX200>,
      <Start of raw data processing
       efp BC_mod = 2 LB = 0.24 FT_mod = 6 PKNL = 1 PHC0 = -18038.16 PHC1 = 17.80069 SI = 16K 
       data hash MD5: 16K
       CA C6 63 97 0F 07 7A B7 09 E3 62 C8 E9 E3 31 0C>)
(   3,<2022-10-17 14:42:13.18 +0400>,<she>,<DPX200>,
      <pk PHC0 = -150.2702 PHC1 = -11 
       data hash MD5: 16K
       86 43 DE FD BF 83 7A 30 60 84 F8 3B 67 B8 EF 95>)
(   4,<2022-10-17 14:42:16.20 +0400>,<she>,<DPX200>,
      <abs ABSG = 5 
       data hash MD5: 16K
       A9 78 75 1D DE 1E E6 18 36 26 DC 9F 38 B4 80 AF>)
$$ ##END=
$$ 
$$ hash MD5
$$ 40 7D D1 38 29 8F B5 F0 A0 B9 D4 18 33 13 11 CA
##$RELAX= 
##$RELAX= 
##$RELAX= 
##$RELAX= 
##$RELAX= 
##$RELAX= 
$$ Bruker specific parameters
$$ --------------------------
##$DU= <F:/spectra>
##$EXPNO= 1
##$NAME= <H-F>
##$PROCNO= 1
##$TYPE= <nmr>
##$USER= <she>
##$AMP= (0..31)
100 100 100 100 100 100 100 100 100 100 100 100 100 100 100 100 100 100 
100 100 100 100 100 100 100 100 100 100 100 100 100 100 
##$AQSEQ= 0
##$AQ_mod= 1
##$AUNM= <au_zg>
##$AUTOPOS= <>
##$BF1= 200.13
##$BF2= 200.13
##$BF3= 200.13
##$BF4= 200.13
##$BF5= 200.13
##$BF6= 200.13
##$BF7= 200.13
##$BF8= 200.13
##$BYTORDA= 1
##$CFDGTYP= 0
##$CFRGTYP= 5
##$CHEMSTR= <none>
##$CNST= (0..31)
1 1 145 1 1 1 1 1 1 1 1 1 1 1 1 1 1 1 1 1 1 1 1 1 1 1 1 1 1 1 1 1 
##$CPDPRG= <>
##$CPDPRG1= <>
##$CPDPRG2= <>
##$CPDPRG3= <>
##$CPDPRG4= <mlev>
##$CPDPRG5= <mlev>
##$CPDPRG6= <mlev>
##$CPDPRG7= <mlev>
##$CPDPRG8= <mlev>
##$CPDPRGB= <>
##$CPDPRGT= <>
##$D= (0..31)
0 1.2 0 0 0 0 0 0 0 0.06 0 0.03 0 0 0 0 0.0002 0 0 0 0 0 0 0 0 0 0 0 0 
0 0 0 
##$DATE= 1666003259
##$DBL= (0..7)
120 120 120 120 120 120 120 120 
##$DBP= (0..7)
150 150 150 150 150 150 150 150 
##$DBP07= 0
##$DBPNAM0= <>
##$DBPNAM1= <>
##$DBPNAM2= <>
##$DBPNAM3= <>
##$DBPNAM4= <>
$$ [...]
##$SUBNAM3= <"">
##$SUBNAM4= <"">
##$SUBNAM5= <"">
##$SUBNAM6= <"">
##$SUBNAM7= <"">
##$SUBNAM8= <"">
##$SUBNAM9= <"">
##$SW= 18.0517283424941
##$SWIBOX= (0..15)
0 0 2 0 0 0 0 0 0 0 0 0 0 0 0 0 
##$SW_h= 3612.71676300578
##$TD= 16384
##$TD0= 1
##$TE= 0
##$TE2= 300
##$TE3= 300
##$TEG= 300
##$TL= (0..7)
0 120 120 120 120 120 120 120 
##$TP= (0..7)
150 150 150 150 150 150 150 150 
##$TP07= 0
##$TPNAME0= <>
##$TPNAME1= <>
##$TPNAME2= <>
##$TPNAME3= <>
##$TPNAME4= <>
##$TPNAME5= <>
##$TPNAME6= <>
##$TPNAME7= <>
##$TPOAL= (0..7)
0.5 0.5 0.5 0.5 0.5 0.5 0.5 0.5 
##$TPOFFS= (0..7)
0 0 0 0 0 0 0 0 
##$TUNHIN= 0
##$TUNHOUT= 0
##$TUNXOUT= 0
##$USERA1= <user>
##$USERA2= <user>
##$USERA3= <user>
##$USERA4= <user>
##$USERA5= <user>
##$V9= 5
##$VALIST= <valist>
##$VCLIST= <CCCCCCCCCCCCCCC>
##$VD= 0
##$VDLIST= <DDDDDDDDDDDDDDD>
##$VPLIST= <PPPPPPPPPPPPPPP>
##$VTLIST= <TTTTTTTTTTTTTTT>
##$WBST= 1024
##$WBSW= 4
##$XGAIN= (0..3)
0 0 0 0 
##$XL= 0
##$YL= 0
##$YMAX_a= 921385
##$YMIN_a= -615823
##$ZGOPTNS= <>
##$ZL1= 120
##$ZL2= 120
##$ZL3= 120
##$ZL4= 120
##$ABSF1= 15.77113
##$ABSF2= -2.28072
##$ABSG= 5
##$ABSL= 3
##$ALPHA= 0
##$AQORDER= 0
##$ASSFAC= 0
##$ASSFACI= 0
##$ASSFACX= 0
##$ASSWID= 0
##$AUNMP= <proc_1d>
##$AZFE= 0.1
##$AZFW= 0.1
##$BCFW= 0
##$BC_mod= 2
##$BYTORDP= 0
##$COROFFS= 0
##$CY= -3
##$DATMOD= 1
##$DC= 0
##$DFILT= <>
##$DTYPP= 0
##$F1P= 0
##$F2P= 0
##$FCOR= 1
##$FTSIZE= 16384
##$FT_mod= 6
##$GAMMA= 0
##$GB= 0
##$INTBC= 1
##$INTSCL= 3.70164e-10
##$ISEN= 128
##$LB= 0.24
##$LEV0= 0
##$LPBIN= 0
##$MAXI= 10000
##$MC2= 0
##$MEAN= 0
##$ME_mod= 0
##$MI= 1.114404
##$NCOEF= 0
##$NC_proc= -5
##$NLEV= 6
##$NOISF1= 3.799351
##$NOISF2= 2.8
##$NSP= 0
##$NTH_PI= 0
##$NZP= 0
##$OFFSET= 15.81961
##$PC= 1
##$PHC0= -18188.43
##$PHC1= 6.80069
##$PH_mod= 1
##$PKNL= yes
##$PPARMOD= 0
##$PSCAL= 0
##$PSIGN= 0
##$REVERSE= no
##$SF= 200.129990379608
##$SI= 16384
##$SIGF1= 3
##$SIGF2= 2
##$SINO= 5.538805
##$SIOLD= 16384
##$SREGLST= <1H.CDCl3>
##$SSB= 0
##$STSI= 16384
##$STSR= 0
##$SW_p= 3612.71676300578
##$SYMM= 0
##$S_DEV= 0
##$TDeff= 16384
##$TDoff= 0
##$TI= <>
##$TILT= no
##$TM1= 0
##$TM2= 0
##$TOPLEV= 0
##$USERP1= <user>
##$USERP2= <user>
##$USERP3= <user>
##$USERP4= <user>
##$USERP5= <user>
##$WDW= 1
##$XDIM= 16384
##$YMAX_p= 390459558
##$YMIN_p= -254823
$$ End of Bruker specific parameters
$$ ---------------------------------
##NTUPLES= NMR SPECTRUM
##VAR_NAME=  FREQUENCY,     SPECTRUM/REAL,   SPECTRUM/IMAG
##SYMBOL=    X,             R,               I
##VAR_TYPE=  INDEPENDENT,   DEPENDENT,       DEPENDENT
##VAR_FORM=  AFFN,          ASDF,            ASDF
##VAR_DIM=   16384,         16384,           16384
##UNITS=     HZ,            ARBITRARY UNITS, ARBITRARY UNITS
##FACTOR=    0.220516191357247, 1,           1
##FIRST=     3165.97832546838, 0,            0
##LAST=      -446.738437537401, 0,           0
##MIN=       -446.738437537401, -254823,     0
##MAX=       3165.97832546838, 390459558,    0
$$ Real data points
##PAGE= N=1
##DATA TABLE= (X++(R..R)), XYDATA
$$ [...]
8646A68880J2399k4310J6879j2094j164j0688L929j4192o117K814L0809p78m7275
8633A19092j1552n333M994K140j6389j1656J0992K1377j8337j1118J7796j0392
8621I1614j0937J9996l4156L020M970K1696m132k3414P333J243j4509j221n339
8608E6164J7486K3257l7126j8414j7178L1922P227k2021Q581Q459m5132r867K5556
8595B8914R748p062j870L338r676J5655p694q318l642p04J5280R508P161l3174
8581A7464J5580q340j5395p727m494j4889Q2620L2624m7051l6453J4842K3212
8569E1993k7214O215j9588N523O841M0722j470k9100m498l6086P66R241J8103
8556B1448J2778m901J820J969j0007n83K7993j3994j4182K106J2147K609K3919
$$ y = [168880, 181279, 156969, 173848, 161754, 160590, 149902, 153831, 139639, 133522, 136336, 167145, 166367, 119092, 107540, 102207, 107201, 109341, 92952, 81296, 92288, 113665, 95328, 84210, 102006, 91614, 80677, 100673, 66517, 69537, 74507, 96203, 92071, 68657, 75990, 77233, 62724, 61503, 56164, 73650, 96907, 59781, 41367, 24189, 56111, 63338, 41317, 49898, 58357, 13225, 3358, 28914, 38662, 31600, 29730, 33068, 23392, 39047, 31353, 23035, 19393, 18689, 33969, 43477, 50638, 17464, 33044, 24704, 9309, 1582, -2912, -17801, 64819, 97443, 50392, 13939, 28781, 51993, 24779, 30994, 11406, 16929, 23770, 64492, 63022, 33922, 29424, -6662, -5896, 3345, 21448, 34226, 29325, 31145, 33114, 23107, 22524, 50517, 36523, 22341, 24447, 36594, 39203, 63122]
8543F3122l7430J510J3687j7935q58N86J077k8805q139j0035n111j6039P908J8822
8529a7640M9292K0164m4183j2810K5373j5857n896N151K4154o119k9932n844J1107
8516c040J1705K0811j7777n714p412K5192J2030l6717k284J8717r935J1304o269
8503A0611j7022L0251j1931n954J6771m434K6367j8849l7417J7141k0719J4922
8491b63P607O730j8626o000M0689l7059q569P630M4201N44K85N783m8084J5084
8477I952j0724n154j3447M114J407L2465L052L150r305P066R888k3011J5535m429
8463B0559k8980l6796J7956J8576j3766m0475K6990Q108k6996K8185L4345o456
8451A250l48J210j7740K6721M145l1702P311L051J0337K172Q259R312k1462J9494
$$ y = [63122, 25692, 27202, 40889, 22954, 22096, 22682, 23759, -5046, -13185, -23220, -28331, -44370, -36462, -17640, 31652, 51816, 7633, -5177, 20196, 4339, -1557, 3594, 27748, 21629, -8303, -14147, -3040, 8665, 29476, 11699, 5985, -1427, 23765, 35795, -922, -3206, 15511, 5576, 16880, 10611, -6411, 23840, 11909, 5955, 22726, 18292, 44659, 25810, -11607, 5534, -15185, -263, 7344, 14074, -4552, -10552, 30137, -6922, -15491, -7861, 36340, 36884, 37169, 42952, -5132, 9952, -772, -5926, -19373, -15259, -13852, 18613, 21665, 24815, 15510, 22576, 32464, 9453, 24988, 20559, -8421, -45217, -27261, -8685, -22451, -62926, -35936, -27828, -54824, -26639, 7706, 1250, 902, 2112, -15628, 11093, 15238, -16464, -9153, -6102, 4235, 6407, 14666, 23978, 2516, 22010]
8437B2010j4475L36j0465J123o631j0919J1941M661J0772R89l8348K0950k6678
8424c4734K2091P549L06J7324m1651L2970J8351l6775J5843L461K4001j1711O317
8411B3342J1377K3290k3316k4627K3466K8673j8869l1706J0646j6601K080j411
8399F344Q71J775K692J6964o32k8248J4696M3760n129k8939J9414r203K1162m6612
8385H915r350R305l4125J3135M3285J0671J9876m6532j0361j3072k3626L4148
8373B269L2178J3739j5964j2585K231K4721l3888k3530R452L972j2732J8937L2452
8360D1252J879k7835l0134J7576l568J2299p750M009J6852j4079m7042J7723J8538
8347b80M970k2615l3198J3020N4074R535k2555K9193L2744j9044l4284k789J3582
$$ y = [22010, 7535, 7871, -2594, -1471, -8102, -19021, -7080, -2419, 8353, 9342, -29006, -8056, -34734, -12643, -5094, -4788, 12536, -29115, 3855, 22206, -14569, 1274, 4735, 28736, 17025, 23342, 34719, 58009, 34693, 10066, 33532, 62205, 43336, 11630, 22276, 5675, 7755, 6344, 7215, 8990, 11682, 28646, 28014, -234, 14462, 58222, 53093, 24154, 43568, 34365, 55527, 8915, -435, 8870, -25255, -12120, 31165, 41836, 61712, 15180, 4819, -8253, -31879, 2269, 34447, 48186, 32222, 19637, 21868, 46589, 12701, -10829, -1377, 2595, -10137, 8800, 41252, 43131, 15296, -14838, 2738, -830, 11469, 3719, 7728, 24580, 10501, -36541, -18818, -280, 4690, -17925, -51123, -38103, 15971, 25506, 2951, 32144, 64888, 45844, 11560, 8771, 22353]
8334B2353j6476p217K8491J0387k8163j4898K1361O901m87k597m78K5864q649
8321C6392l8580Q049J4820Q446j2521r596K4118k7131m4286M0977K0063j9465
8309A286j6304K9912M988J021k3904M514l1987k706N2103O549l7235q461O3859
8296D3635J9978l2156k166k1342k4361k5159j4898K4409N668o222N033R378l0189
8283d8392J2058J4990J4359N022N841k0237m5828M4966M0942k1080l830J5019
8271A3830j9350N141j2716j8046N3329j5481j086j6899R90R520j6145J4228k208
8258d893J902m298j0710O378j5588M0173o893k6536J3177n057j4337K223K0639
8245c820J4455R828k3187N252k564M030j3528k3685j8481L2351j1665R184O866
$$ y = [22353, 5877, -1340, 27151, 37538, 9375, -5523, 15838, 22739, 22252, 19655, 19177, 45041, 36392, -2188, 5861, 20681, 29127, 16606, 7010, 31128, 3997, -40289, 688, 20751, 1286, -15018, 14894, 19882, 20903, -3001, 1513, -30474, -33180, 18923, 25472, -11763, -20224, 43635, 63613, 31457, 29291, 7949, -16412, -41571, -56469, -32060, -26392, -32614, -27581, -18203, -48392, -36334, -21344, -6985, -1963, 3878, -16359, -62187, -17221, 23721, 2641, -1189, 13830, -5520, -379, -13095, -31141, 22188, 6707, 5621, -11278, -10288, -768, -16913, -2685, -4893, -2991, -7289, -17999, -11621, -27209, 12964, 6071, -20465, -7288, -12345, -26682, -24459, -3820, 10635, 20463, -2724, 2528, -36, 3994, -9534, -33219, -51700, -19349, -31014, -21830, -14964]
8232a4964k0643K5861J0406L289K681m99J5072j6672k2196L0738J3969K1754j4107
8219C4689j3172K6614k8485m5993j0654L2174p247o54m6695l6P115L7779J3986
8206e79m1116j8370k0499L0776j0826J8580Q609N278J8671j3655Q709m616j6912
8193c5950j2888k8573M9568J8150L3363k0386r650M0947l8149N327J6084j2689
8181E154k5244J0907J2678M0526j3345l3588k7839j7798N128j3188R814J4755
8169c2040n988K72j2513m149k015J9202J1663j4346O362J24j7750m4957K7068
8156f9067N899J3849J6705L9184L043l5971q849k036L5739J1725j183j4588L253
8143b297n070j5850r681r393q127K128P931j4718M294N047K492J6432j4360k568
$$ y = [-14964, -35607, -9746, 660, 3949, 6630, 6131, 21203, 4531, -17665, 13073, 27042, 48796, 34689, 21517, 48131, 19646, -26347, -37001, -4827, -12074, -12728, -59423, -59459, -52344, -14565, -579, -41695, -60065, -80564, -49788, -60614, -42034, -33425, -28147, -9476, -23131, -14422, -19038, -35950, -48838, -77411, -27843, -9693, 23670, 3284, -6366, 34581, -3568, 1759, 17843, 5154, -20090, -9183, 3495, 44021, 30676, -2912, -30751, -48549, -43421, -56609, -46795, -32040, -38028, -37756, -50269, -54418, -56433, -37231, -25568, -39914, -33552, -33428, -51178, -96135, -69067, -63168, -49319, -32614, 6570, 9613, -26358, -35207, -37243, -1504, 10221, 9038, -5550, -2297, -7367, -23217, -32898, -42291, -50418, -48290, -40359, -55077, -50783, -45736, -43244, -26812, -41172, -43740]
8129d3740j0681J7946M217j0223r917L4444J1961j6366K1131k921j1453k546k1408
8116c9556L237J7297K8084R163k0266J1624k1934K378m041m8474m136L9503J6188
8103a0933J655J8494M309k2309M339j0573k3287j2923M0218K2397m171P444J2464
8090B7124K803J1644j0002o04k5482p660q525M42K588M608j8990K958J5413Q125
8076D442l6890M254J7643k3748L5965j8342j5590J478L4734J6621m4252o446N99
8063b9532M831m54Q289l3824J409J8658j2298Q2L5756L992l934R840l9230j4917
8049e1332K6991K6876r50k3800o679l476J4429M290k4648j146K4408J1016k5452
8036b9473j6540R77o851k00J8070k2545j178K013J5862Q39K6473j8537k6699L4627
$$ y = [-43740, -54421, -36475, -32258, -42481, -52398, -17954, -5993, -22359, -1228, -4149, -15602, -18148, -39556, -36319, -19022, 9062, 18225, -2041, 9583, -12351, -9973, -14014, -62488, -66624, -27121, -10933, -9278, 9216, 13525, -8784, -4445, -15018, -38305, -51228, -11010, 11387, 7216, 14660, 27124, 29927, 41571, 31569, 30965, 5483, -2177, -10702, -10260, -7672, -3064, -22054, -19096, -3683, 4442, -32448, -28194, -10551, -34299, 1666, -16676, -32266, -30788, 3946, 20567, -23685, -30131, -29532, -24701, -25155, -16866, -50690, -49281, -30623, -42921, -42839, -7083, -3091, -7025, 2815, -36415, -51332, -24341, 2535, 1585, -22215, -28894, -32370, -17941, -13651, -38299, -39445, -15037, -4021, -29473, -46013, -45036, -51887, -52087, -34017, -56562, -57740, -55727, -39865, -39026, -12553, -31090, -57789, -23162]
8022b3162Q482l2922j7599K9666K4661q152J5948k9045N602M0218L803J2745k3894
8009F351j6140j5669k813O537N790o094j2369K6101j4173N467m440J9852j2293
7996a3893j1415K7800Q336j1077j8023j1220L136j0271K7255N029k2314N925R916
7983a0816k6905R506K505N757M5O923j0122n738j1361J8774J399p185J6264l3113
7969d4067o827M112o818J9341K9422j7597l1045J0339J9625q580k0983L550r805
7956e9333K6966k5093L612L7075J0369r006l2417L2246j3368K6826K358n898l4708
7943d0371j660K8629j2783P794n912K2476K6483j165q512m7084J7984J3109j2719
7930a3731J104m598j9323K2907J071r89n466j5956K1741M65L092J3842j7942l0430
$$ y = [-23162, -14680, -47602, -65201, -35535, -10874, -19026, -3078, -32123, -26521, 13697, 17500, 30245, 6351, -9789, -25458, -28271, -21734, -15944, -22038, -34407, -8306, -22479, -17012, -21452, -1600, -13893, -25308, 2492, 10828, -249, -18272, -29492, -26356, -36627, -9372, -4343, -26657, -20732, -10816, -37721, -28215, -25710, -19953, -19908, -12985, -23107, -28845, -40206, -21432, -20033, -27218, -10954, -44067, -50894, -46782, -53600, -34259, -4837, -22434, -53479, -43140, -23515, -32095, -53078, -49528, -59333, -32367, -57460, -53848, -16773, -6404, -15410, -47827, -15581, -28949, -2123, 235, -5663, -40371, -42031, -13402, -26185, -18391, -24303, -1827, 24656, 23491, 14979, -32105, -14121, -1012, -13731, -12627, -17225, -36548, -13641, -12570, -13559, -19025, -34981, -13240, -12775, -9683, 4159, -13783, -44213]
7916d4213j8903N439k7948j0678K7696L4116o405K3236o895O521n816J4068j2975
7903b2757j4380j4985J5405K5449j1915K1339m1632k3270K6151k6707K1167J6011
7891c0124M688L2394n219m4669k0814R061J6264K0830J804k665k1383n330k205
7878d7368M3293k8238m294L8270l8137k2818M992L1582j7885k271j048N853k610
7865d0679O970J902j5582Q543Q520J9314j0077o973J0212j716K45J1121j0102
7852a8302J9849j7048q881K1773J0858J363n398j9254j5861k461M681O384J3056
7839i241j0745j9501P966P160O670j1721k5509N541J1389J9908l380j0015r391
7826d0869l4226K8454K7504l401Q92m320K54K3567K44k4918j9541j9293L217J166
$$ y = [-44213, -63116, -57677, -85625, -96303, -68607, -34491, -40896, -17660, -24555, -18034, -23850, -9782, -22757, -37137, -52122, -36717, -11268, -23183, -1844, -43476, -66746, -40595, -67302, -46135, -30124, -25436, 6958, 1739, -42930, -63744, -54683, -38419, -17589, -15785, -18450, -39833, -45163, -47368, -4075, -32313, -36607, 1663, -36474, -59292, -54300, -22718, -40603, -42874, -43922, -38069, -40679, -33709, -31807, -47389, -38846, -30326, -11012, -21089, -28062, -17850, -19566, -19321, -8200, -18302, 1547, -15501, -24382, -2609, 8249, 9612, 4214, -15040, -30901, -33362, -28681, -22297, -9241, -19986, -39487, -31521, -24361, -17691, -29412, -54921, -49380, -37991, -18083, -21463, -31478, -40869, -75095, -46641, -19137, -22538, -21646, -25966, -25712, -2145, -1901, -26819, -46360, -65653, -62436, -61270]
7812f1270l8091J554p1150q5866K41943N6891k7828m032J5818j906l5241J7867
7800H689j8265l4980N90J2896L1068M077o090J0037j6110J2789k3882j7072j002
7787c7255l856l205K400J4673J2058k844M840J0784j0810L575Q737P344m097j2486
7773a0142K7624j4994j2581n908J4394k561p776k842j9775P064q708k6769O0446
7760b528n340j9090L2262J4878J1455k1313j5277k6292N020J4710R485m543j46
7747f719j0960j942q482j2022L8555n867k7272o941K216J1261q155n611J8344
7734b3595J7336r803l3361K687J112J4927j822N213j3662Q875J2179l071J4390
7721h595p872R19j7626K6186K89j1619l4646K3976M255l2595K2740P825r204j1045
$$ y = [-61270, -99361, -97807, -168957, -254823, -12880, 44011, 16183, 12151, 27969, 26063, -9178, 8689, -9576, -44556, -43966, -31070, -2, 4075, -2015, 8022, -8088, 4701, -19181, -36253, -37255, -41111, -44316, -41916, -27243, -15185, -18029, -13189, -2405, -13215, -9640, -903, 6441, 2344, -10142, 17482, 2488, -10093, -16001, -1607, -4168, -11944, -14786, -34561, -27497, -36205, -62974, -2528, -7868, -26958, 5304, 20182, 31637, 10324, -4953, -31245, -26225, -11515, -2030, -6573, -6719, -17679, -19621, -28103, -40125, -1570, -7437, -34709, -41650, -39434, -28173, -36328, -41939, -23595, -6259, -16062, -49423, -46736, -45624, -30697, -32519, -27306, -40968, -32093, -19914, -22985, -8595, -16467, -15548, -33174, -6988, -6699, -18318, -52964, -28988, -24733, -57328, -34588, -26763, -35967, -47012]
7707d7012l640j984M6870j7421r800k160K066J9244J6352K3628k4684k0415K2819
7694C863J800k1092l5347J1045Q822J8828q543l4198J4864n221K5476K1856j5810
7681a3657k0926R213N084K2908p390J542r049p460L2345j2413j3613k5804k5485
7668f4705J6688J5904J0859j3407k5767L1533K8282K204l0391L5993K059r548
7656b96n837j4013J4437L699l7996M835L0767J2986k0598J765k8856k206j3279
7643e4592K014L9842O539J1782k843j9810k2707k7093q929J7294M1231P812q366
7630a7826K1448j5158L850L769j0311j0988J947K6300K306K4845k1262m6702J9950
7617a7832J0345J8176J5442j3174l4463M028q448l2499R443L7864j0329R705Q33
$$ y = [-47012, -50652, -52636, -5766, -23187, -32987, -35147, -33081, -13837, 2515, 26143, 1459, -18956, 3863, 5663, -15429, -50776, -39731, -30909, -12081, -20624, -54822, -39958, -45179, -19703, 2153, -13657, -34583, -25370, -20286, 2622, -4768, -3226, -12275, -19735, 12610, 197, -13416, -39220, -64705, -48017, -32113, -21254, -34661, -60428, -28895, -613, 1591, -28800, 7193, 9252, -296, -6133, -20146, -5709, -2010, -40006, -35171, -4404, 8582, -12016, -10251, -39107, -41313, -54592, -52578, -12736, -6197, 5585, 2742, -17068, -39775, -66868, -75797, -58503, -17272, -9460, -17826, 3622, -11536, -7686, -3917, -14228, -25216, -23269, 3031, 5337, 30182, 8920, -37782, -17832, -7487, 10689, 26131, 12957, -21506, -17478, -25926, -58425, -48982, -11118, -21447, -11742, -10909]
7604a0909J5234l553J6123R53l341j8816m050J8023J75n906J8295j3411J2306
7591B1123k30o248O005l685J5693j9500q150j6063j1335k4561J0273j1387J0964
7578c7101K1515M485K3185J1818L855q290J5736m6084r752j4811J2793j0615j4356
7565d7622Q598P139o176N6404l189m2421L525J8339L419k3049P752K0011k4070
7552b1340r170K6072N408n915k6616l060K635k548o361K3943k2929o799K5367
7539b1313P389J4671k5678J305k268k3551j8590K0454N6392k6671q904j2806J8488
7526b1082J0385j3069k0913O532J3681L338k958j9761j0444M9724j0718K7483
7514A2198J4450k0007n5893l1696Q48L8979J1060j0973J9823P356K300L438K94
$$ y = [-10909, 4325, 772, 16895, 17848, 14507, -4309, -8359, 9664, 9839, 3933, 22228, 8817, 21123, 20893, 14645, 20650, 16965, 32658, 13158, 5008, -11055, -22390, -46951, -36678, -48065, -37101, -15586, -11101, 12084, 23902, 27757, 19467, 35203, -10881, -20633, -35444, -22651, -33266, -47622, -39024, -31885, -38061, 18343, 15154, -27267, -23742, -5403, -1984, -25033, -17281, 2730, -21340, -30510, -4438, 970, -4945, -31561, -34621, -31986, -34534, -40895, -16952, -39881, -46680, -21313, -13924, 747, -24931, -23626, -25894, -49445, -68035, -47581, 8811, -17860, -26764, -39570, -21082, -10697, -23766, -44679, -38147, -24466, -21128, -24086, -43847, -54291, -4567, -15285, 12198, 26648, 6641, -49252, -80948, -80100, -41121, -30061, -41034, -21211, -13855, -11555, -8117, -7823]
7501g823r201K2415j0007N587k3732n436r466k8279J0211k124K2895K5776m331
7488a3515J575n813K1928k0180k5016K2845J0967j4797J7361j5230J0116k0664
7476c0423k6441K185L1598K3028k1972k0367J2056P833K42J2704p550K041q925
7463b3991M343R846k4912j704L0302o332j5726j8334L4072J6822j6049O66L0169
7450A9172Q177j3423j1718r18m0940m0475M3880K8966j4108K5541J4672j9805
7438i79l485R2l3199m916J8747K3424J0831j7777K553k6116k7468K1099L645N932
7424b7617n35M930j2635o564K7538q396k1758L5741M769J6326l4787N678j9004
7411c6314J2646L5029l1355K9328k647k169k5567k8744p376K3578O158l981L5680
$$ y = [-7823, -17024, 5391, -4616, 971, -22761, -28197, -37663, -65942, -55731, -57855, -34960, -9184, -13515, -11940, -17753, 4175, -16005, -41021, -18176, -7209, -22006, -4645, -19875, -9759, -30423, -56864, -54679, -23081, -53, -22025, -42392, -30336, -22503, -22261, -9557, -17107, -15066, -23991, -19648, -9802, -34714, -36418, -6116, -12448, -28174, -46508, -12436, 4386, -11663, -10997, 19172, 27349, 13926, 2208, 1290, -39650, -80125, -36245, -7279, -21387, 4154, 18826, -979, -4464, -4372, -37571, -42487, -23740, -316, 10515, -7262, -4709, -30825, -58293, -37194, -33549, -27617, -28152, -23222, -35857, -42421, -14883, -23279, -45037, -9296, -4527, 11799, -22988, -17310, -36314, -23668, 11361, -19994, 9334, 6687, 4518, -21049, -49793, -57169, -33591, -27433, -31414, 4266]
7398D266k9313j593K1354R899l074l5216j7270J5178J2012k3599K3381P898R451
7385f626K4966k5095j5202k4429n303K7301m240J540k3992N5345l697k0953P376
7372a3009K0167P009j1951K751o199k8464r462M7K3597K9930j4523j5274j1664
7359b7045K7035J5392k0003O804j0407k3709j2140J4081k2023J1709O396J0763
7347b3147j2108j0779K2003m160j9287K7544N644P310M515K0437q02J5455n382
7334B7243k8231k9863N862P161j4844q135l701M5136J7055N218m3731j0278J3231
7321a7877R454M895J1796N438l5087M359j1244q762K3981L1507k1546O665L4707
7308C8286j825m2624k7146L0615n000j3531j1893L2255N31m5423J1547N4287q77
$$ y = [4266, -25047, -26640, -5286, 4613, 1539, -33677, -50947, -35769, -23757, -47356, -23975, -16077, -6626, 18340, -6755, -21957, -46386, -51689, -24388, -28628, -27088, -51080, 4265, 568, -20385, -13009, 7158, 14167, 2216, 4967, -1232, -29696, -39158, -39111, -15514, 14416, -107, -15381, -27045, -10, 15382, -4621, 2183, -8224, -31933, -44073, -29992, -52015, -40306, -33910, -23147, -35255, -46034, -24031, -28191, -47478, -19934, -14290, -6980, -2465, 17972, 17170, 32625, 27243, -988, -30851, -24989, -17828, -32672, -40807, -44508, 628, 17683, 22901, -20830, -31108, -17877, -8423, -3528, 8268, 13706, -21381, -17022, -28266, -37028, -13047, 18460, -3086, 3579, 38286, 36461, -6163, -33309, -2694, -7694, -21225, -33118, -863, -332, -45755, -34208, 20079, 19202]
7295A9202k0228l6473K8662j1773q276L3695n873l000J1758k2407k2379R053K7824
7282b15k9892J391p699k264l5916K8880K8901j8598k7603O459J7763L8701j3428
7269a3520J2480J8929j0982j2256J6356k2150J3175r161l2334J7133K460j1167
7257c1037Q37L378J6579Q431l0448J2070j4279J9956m885J9098M520l636p52K6283
7243B6115k9871l216k3961R49K8334N51r990o594J6336N177r072k2770k5199K5980
7229b7231K6837k4099k9975J3791L0913R823l040J09k0924L6259l725l9324r016
7216c9602k4610J4164N7848J4877j1750R400j1039K443k1575j860M740M319j4128
7203a6773j2342L925K071n038K9665L0187k7084k0920k3381k333j2197K8809M669
$$ y = [19202, -1026, -37499, -8837, -20610, -28886, 4809, -1064, -4064, 7694, -14713, -37092, -28039, -215, -30107, -28716, -36415, -38679, -74595, -45715, -16814, -35412, -63015, -56556, -38793, -92, -13520, -1040, 17889, 6907, -5349, 11007, -11143, 2032, -7129, -39463, -22330, -19870, -31037, -30200, -26822, -10243, -1812, -32260, -20190, -34469, -14513, -19398, -300, 4220, 584, -168, 26115, -3756, -6972, -30933, -29984, -1650, -1099, -11089, -17683, -1347, 3830, -5242, -28012, -53211, -27231, -394, -24493, -54468, -40677, -9764, 59, -2981, -2872, -23796, 12463, 8738, -30586, -39602, -64212, -50048, 7800, 22677, 10927, 20327, 9288, 11731, -9844, -11704, -6964, -2645, -16773, -29115, -25190, -23119, -28157, 1508, 31695, 4611, -16309, -39690, -42023, -54220, -25411, -20742]
7190b0742j3019j953j3975J9019K4562o532j4579n460m112L555Q783L9655K2j8788
7176c564j1588p747J8772P700Q973m293l5037j634l4750L2270j719L4651K7130
7163B9164j3280j2248k7077l1363O901K5544k7921L1473L0011n315n6517L0267
7151b0361j016M410J7867N506l635q285L2581m4n1664m085M3092k9031j6758L2454
7137A031r127l143k8665M237M4772K7762m031j1732l8117L898J2635m605q837
7124a3922q543j0296J7558J1995l242l4574L4361l772k0784J3073l4528K3812
7112b8862J9292j8272K4678M233j9814J3255J6721K904k9728J608q651J0820j9339
7099c1155L192O062l363l762k4770K3551l317L10J3558k0995K4836n179K2925
$$ y = [-20742, -33761, -35714, -49689, -30670, -6108, -12640, -27219, -32679, -36791, -33236, -24453, 15202, 15224, -3564, -15152, -22899, -4127, 3573, 12546, 8253, -26784, -28418, -63168, -30898, -32617, 2034, 29164, 15884, 3636, -23441, -54804, -47903, -22359, -50280, -18807, 11204, 5889, -50628, -20361, -21377, -16967, 900, 6406, 2771, -5514, 27067, 27023, -24641, -28726, 14366, -14665, -31423, 1031, -8096, -11239, -39904, -35667, 9105, 36867, 32836, 21104, -17013, -13115, -480, -5085, -13922, -22465, -32761, -15203, -3208, -6450, -41024, -6663, -10435, -31219, -18146, -52674, -28862, -9570, -27842, -3164, 1069, -18745, -5490, 11231, 14135, -15593, -13985, -22636, -11816, -31155, -27963, -21901, -25264, -29026, -53796, -30245, -33562, -33252, -19694, -40689, -15853, -21032, 1893]
7086A893j3773J4434k7242k100J3258K3550K507j0970o38J0819M157k1085j2919
7073a8109m318m257K0012o399J2475J2587l4000q104J623K9932j0919j7031j4383
7060d0891O302R165P767J9900q230k455K6836l0703o504m940o268K8852R388J499
7046I718l0887p717K0679m044j1916K8329J4205L204l599q311j4643M931J2128
7033A2077j3211O216j054k8126L610j047j3211J3345J0248J2099M270j7940j0876
7020b3600P636J300o366j1637N136J5993j7773k0601K1740p969Q458p365M7416
7007A2368P510j8083j7317j5969o216N197J1740R434K3176q669n175K3249M775
6994B6020J62k1205j1848n562J2155J2242j0059m2590J1743O1815j7036J1247
$$ y = [1893, -11880, 2554, -24688, -26788, -13530, 10020, 12527, 1557, 919, 11738, 15895, -5190, -18109, -22427, -26684, -6672, -13071, -596, 11991, -22009, -30113, -28490, 1442, -9477, -26508, -40891, -34589, -25424, -17657, 2243, -5987, -8442, 18394, -12309, -18813, -23753, -30021, -1169, 8219, 9718, -21169, -28886, -8207, -12251, -24167, 4162, 18367, 21571, 17972, 9661, -4982, -51, 12077, -1134, 5082, 4028, -24098, -20488, -21535, -34746, -21401, -11153, 946, 5216, -12724, -23600, -15964, -14664, -21030, -32667, -27531, -11538, -29311, -49912, -28172, -36141, -27683, -35048, 12368, 19878, 1795, -15522, -31491, -37707, -32510, -20770, -11336, 11840, 3171, -2004, 21245, 26020, 26182, 4977, -6871, -12433, -278, 11964, 1905, -40685, -28942, 32873, 15837, 27084]
6982B7084K0557k1100J2809j5730j2217L27P732p119j3994j0530P734K2841j2083
6969F311K31k263j452K3124O537j2021K518j8707O010j1286N156j4678N199J4681
6955I360J5574k4733l1041M512R014J2194P053K0678O275j6664N380l1169K681
6942a0886J8551n2298J9850M7638l158j4939j5393J6099j6924j8535O145J2363
6930a1487l299m0230o452L6870L133P028K6299Q385m310k3035P446J2393K7212
6917C9953k8330k5767L2599j4004N354J4818m8832K7642J5287k1733l509J1172
6905D650j4177k1345Q396L6939N201j8864L977J1602o782J6603q819j1748L5263
6892D0896m1536q479J6093m237j615l414l0940K8075q102J1091J3102j4014K302
$$ y = [27084, 47641, 26541, 39350, 23620, 11403, 11730, 19462, 12343, -1651, -12181, -4447, 18394, 6311, 6542, 4279, 2827, 25951, 32488, 20467, 22985, 4278, 10288, -998, 4158, -10520, -5321, 9360, 24934, 201, -30840, -26328, -17314, -5120, 1933, 22611, 28886, 12222, 17602, -13567, -10886, 7665, -44633, -24783, 22855, 19697, 4758, -10635, 5464, -11460, -29995, -23850, -11487, -14786, -55016, -61468, -24598, -21465, -14437, 11862, 20247, 15937, -7098, 348, 12741, 39953, 11623, -14144, 18455, 4451, 9805, 24623, -24209, 3433, 18720, -3013, -6522, 4650, -9527, -30872, -22476, 14463, 19664, 800, 4777, 16379, 9597, 26200, 17381, 5633, 40896, -640, -9119, 6974, 2737, 1122, -2292, -33232, -5157, -13259, -2168, 10934, -3080, -778]
6879g78j4327J7579P887L399p733O274N0155k7195m7020j1617R992K4298l0454
6866a9540l0599K9969R550J6736K6311q56q332j2334m057j7615n753P983K0338
6853A1801J117m838l4983J3329L0277N243j7297j2498R957j6300q779N088L2344
6840A4461r65k1377M960L2226k8007k5145M592l741K0373q286N887j3794R526
6827i290l068J9883J6456k174k3654N249K0151m57k4122r246N973r227K1356N320
6813A3150j2578K0591K3197q133q284j0466k856J1012P475m6417j5491J5982L2203
6800A9385o492K807p133k808L932m177J2028J7493l0673k0494J9955m1081J8501
6787a8757L3679P750j2427k2787J013J8465J2506J1923l0863J175k3819L9366
$$ y = [-778, -15105, 2474, 10361, 13760, 6027, 12301, 62456, 35261, -11759, -23376, -13384, 10914, -19540, -50139, -20170, -10620, 6116, 32427, 31571, 23239, 10905, 6848, -10767, -16520, -8537, 11801, 12918, 8080, -26903, -13574, 16703, 21946, 4649, -7849, 2108, -14192, -22971, -17883, 14461, 13496, -7881, -2921, 29305, 1298, -23847, -19255, -22996, -2623, -10909, -5022, -18816, -9290, -12358, 7525, 23981, 21807, -1847, 3402, 23553, 23096, -1026, -10272, -4299, -13526, 7830, 13150, 572, 21163, 44360, 36227, 27943, 17477, 14621, 25633, 33108, -13309, -28800, -12818, 19385, 12893, 15700, 8567, 5759, 9691, 5514, 17542, 35035, 4362, -16132, 3823, -37258, -18757, 14922, 22672, 10245, -12542, -11529, 6936, 19442, 31365, 502, 1677, -22142, 17224]
6775A7224R261k1757j5719k8203o77M0316K6479q18j9220j5879P118j5291J4852
6762b314M1930k57R615j0530j8421K4962j0053l240m5602p136J221J3567j3011
6749a9269R296q312J6428m9377L2462J7920Q648K7461L762R867k0163m652j8651
6736E420k0160J8072J6858J2041j5389j8262K7404l831P857O38l9279k123L9742
6723B8988k24l1712m447Q446J3772J3252K0362j7564l0957J6225n357K158M5628
6710E8570k2763l7824n488J043J2872o992n135L7674K6908n7836k1757L2851M1581
6697E3704l2752K9854o401o161q971m6926K2992K0984L7018q961n1254q586M6939
6684D1479p583l8555J353q00K3196j5404R58P589j8543J0255L8759j1314J4112
$$ y = [17224, 26485, 4728, -10991, -39194, -39871, 445, 26924, 26106, 6886, -8993, -1875, -17166, -2314, 39616, 39359, 48974, 38444, 20023, 44985, 34932, 31692, -13910, -21046, -19825, -6258, -19269, -9973, -18285, -1857, -51234, -18772, -852, 7796, 35257, 39019, 48886, 28723, 24071, 5420, -14740, 3332, 20190, 32231, 16842, -1420, 25984, 22153, 30010, 30648, -8631, -10754, 28988, 28764, -2948, -7395, 1051, 14823, 28075, 48437, 30873, -84, 16141, 10784, 12942, 58570, 35807, -2017, -7505, -6462, 6410, -582, -5717, 31957, 58865, 1029, -20728, 12123, 53704, 20952, 50806, 44405, 38244, 29273, -17653, 5339, 26323, 63341, 54380, 3126, -5460, 41479, 33896, -4659, -3306, -4106, 19090, 3686, 4644, 12233, -6310, 3945, 42704, 31390, 45502]
6671D5502J1670j6553m615k0602L748n7J47K6585J0565l795k1699L967p686M233
6657C1410n023O105k011l3845J2060J9289P164R776l6146j335J2524P866J964
6644B9798K250j6576j4264n26J9487K3325j9927K5231J7729j0477k2667J1045
6632D4428N562j4568L2098J5142l8459J8157m202k1508m9028O265N1746n347j593
6619C8693K6219j2979j9666k624l786k963J6362j9631K803j8562j4527P855n152
6606g958J8350M892J8420K9465J1476j2998k8688J8582N883Q467l778M501l471
6593F3143j5574J4461j2335L57J7654p276r927Q267l693J6147n1580j2021J3053
6580B0676l260J0404M01K9530J9558k8441j1490O509q858J301K6050l3466j473
$$ y = [45502, 57172, 40619, 36004, 15402, 19150, 19093, 19240, 45825, 56390, 52595, 30896, 34863, 27177, 31410, 26387, 32492, 30481, -3364, 8696, 27985, 35149, 44925, 8779, 7444, 19968, 27834, 29798, 32048, 15472, 1208, 682, 20169, 43494, 23567, 48798, 66527, 56050, 33383, 44428, 49990, 35422, 67520, 82662, 44203, 62360, 58158, 36650, -12378, -6113, 45633, 40286, 38693, 64912, 51933, 32267, 29643, 25857, 22894, 39256, 19625, 22428, 3866, -10661, -2806, -7958, 10392, 15284, 33704, 63169, 74645, 61647, 32959, 51541, 57424, 65891, 62113, 66614, 63143, 47569, 62030, 49695, 50052, 67706, 60430, 50503, 58770, 55077, 71224, 19644, 7623, 20676, 17416, 27820, 28221, 57751, 77309, 48868, 37378, 43887, 35029, 36330, 62380, 28914, 27441]
6567B7441J4695K7078K5147j5216j7115j5170N870K06J618k177J979l668J3435
6554F4123l4453k6702M005j681N199L8420n357j8916M187K4927j5265m5719J6666
6541I434M6324J8477M045J1244j344j4461O817j3364l8566k3288R982R668j2044
6528A2924J5932L4811L953k1843P936j9573N613J9480J5790k0547p51P730n940
6515E5515k0275k1299P302K6288R129P604k296k49j0321K085m29L3124k1386l6057
6501B8735J7995K0450n706j1813N210q988O786L7923r352k9392r292r844J7712
6488E0424j5843K8287j5605r846n464L8116K6341k4768R07L558K2103k2039n293
6475G0878P033j1939J2515l120J995L854q663J4402K9170l5795j0673k3457Q586
$$ y = [27441, 42136, 69214, 94361, 79145, 62030, 46860, 52730, 52936, 54554, 52377, 54356, 50688, 64123, 29670, 2968, 6973, 5292, 10491, 48911, 43554, 24638, 28825, 53752, 38487, -7232, 9434, 55758, 74235, 78280, 89524, 88180, 73719, 80536, 67172, 28606, 5318, 15300, 24968, 12924, 28856, 63667, 67620, 45777, 53713, 34140, 39753, 59233, 75023, 54476, 53725, 61455, 55515, 35240, 13941, 21243, 47531, 56660, 64264, 61968, 61719, 51398, 53483, 53054, 86178, 64792, 28735, 46730, 67180, 61474, 49661, 54871, 45883, 52669, 90592, 81240, 51848, 42556, 32712, 50424, 34581, 62868, 47263, 37417, 31953, 70069, 96410, 71642, 72549, 76107, 98210, 76171, 70878, 77911, 65972, 78487, 75367, 77362, 81216, 72553, 86955, 116125, 80330, 69657, 46200, 54786]
6462E4786N368L3066L231K975j6966l7557K6040j5844J0733J0856k250J8158N599
6449I8195O697L2573J1314l6584M737k2670r422Q430K8357p913j3495K6223o315
6436A20127k8360J026J4049k4677P070P832J2405j0062J0505J844k537p902l2945
6423F8375L4377J1924q782J0344q734J4081r387k0003k5230J1873M063j211J5469
6410I7159K3247j604L7172K3005k2289k393K8161m2802j8887L1671J1162j4443
6398A49159o397J084R411j8221K158R740M6633j3966O485K9481k6163L535j5262
6385A77677l9304J1932K4645k9208j3759K2574L2284q953n637j3039r069K5060
6373A75203j0983J0133j575L7991k8666q925K306J0780K0720k818L8470L53j3646
$$ y = [54786, 60154, 93220, 96451, 99426, 82460, 44903, 70943, 55099, 65832, 76688, 74438, 92596, 98195, 104892, 137465, 148779, 112195, 116932, 94262, 84840, 93270, 121627, 113714, 100219, 126442, 120127, 91767, 92793, 106842, 82165, 89235, 97067, 109472, 99410, 109915, 111759, 109222, 101320, 68375, 102752, 114676, 105894, 116238, 107504, 121585, 112198, 92195, 66965, 78838, 82901, 81690, 97159, 120406, 118802, 155974, 178979, 156690, 154297, 182458, 139656, 120769, 152440, 163602, 149159, 142762, 143846, 153257, 135036, 137194, 146934, 193567, 179601, 186086, 215567, 189404, 192939, 177677, 138373, 150305, 174950, 145742, 131983, 154557, 186841, 177888, 172251, 159212, 150143, 175203, 164220, 174353, 172778, 210769, 182103, 173178, 175484, 186264, 206984, 204166, 242636, 242989, 229343]
6360B29343q213L2564L541O326M218N282k4479L5415r295M0035L6165N732L1996
6347C88630M7081Q1230P5308Q7621P7600R5665O4836L1286Q254m3854q2067q0370
6335G51220n7535l0692l1897m9034L6274J74O068j2259M5949K8980L2126Q1789
6323H01163J01701R1069J41270J79959J84927J88672P4579k292j11280j80245
6313A469523j42952j49528j23798j19262n3807p9410m5634L1298M204K8455M2825
6302H61914J1653k5257p646J5676L0286R1956Q2570M2653O3066l2261o5369r6932
6290I72309p0006p7176p9062l0188l3529r785O057J0425J7197J933N1237J9714
6278G79126l0594k9051l1586q1069n4312m6539k5992p631k9667l6831q004k4567
$$ y = [229343, 221130, 253694, 257235, 263561, 267779, 273061, 248582, 283997, 274702, 314737, 350902, 356634, 388630, 435711, 516941, 592249, 679870, 757470, 853135, 917971, 949257, 957511, 913657, 831590, 751220, 693685, 662993, 631096, 582062, 618336, 618510, 624578, 612319, 658268, 687248, 719374, 801163, 902864, 993933, 1135203, 1315162, 1500089, 1688761, 1763340, 1761048, 1649768, 1469523, 1326571, 1177043, 1053245, 933983, 880176, 800766, 755132, 786430, 790634, 819089, 861914, 873567, 848310, 840664, 856340, 886626, 978582, 1061152, 1103805, 1166871, 1134610, 1069241, 972309, 902303, 825127, 746065, 715877, 682348, 672563, 678620, 689045, 706242, 708175, 759412, 779126, 748532, 719481, 687895, 606826, 552514, 505975, 479983, 472352, 442685, 405854, 397850, 373283]
6266C73283k753k6148k7159L3049K8990J2141l2816l021J6932L0867J4858J1307
6254D29530M974q720k0734l9671k2113k4945k7031J9683l9502j6103j8560o456
6242B30352O415j4729K1397j2976j9410r166j12k3526r115J823J0637j7259J0279
6229A74610j9815L5994l8371k6273J8464L9761K083J0523o21m2467l83j2467o883
6216A34155R360J6442k1438j947p483M0618n856j9170k06O666k1002M446M826
6203A39411J4169K1725j933k2175j2531K768k7495P852o639L436J9520n757J7277
6190A49628J0579o583k7990j3555L8503N468O04J4069j1162J3974j5772r815K1189
6177A69137r051j7019p18k4150k387N0187n329k1185Q081K7491K8675J2807l5700
$$ y = [373283, 370530, 344382, 317223, 350272, 379262, 391403, 358587, 355566, 372498, 403365, 418223, 429530, 434504, 425784, 405050, 365379, 343266, 318321, 291290, 310973, 271471, 255368, 236808, 230352, 236767, 222038, 243435, 230459, 211049, 201883, 201771, 178245, 169130, 170953, 181590, 164331, 174610, 154795, 190789, 152418, 126145, 144609, 184370, 186453, 196976, 196355, 153888, 153505, 141038, 134155, 143515, 159957, 138519, 136572, 129089, 169707, 163851, 144681, 144475, 151141, 130139, 134585, 139411, 153580, 175305, 173372, 151197, 138666, 141434, 113939, 121791, 115152, 118588, 138108, 132351, 149628, 160207, 153624, 125634, 112079, 150582, 156050, 156654, 170723, 159561, 173535, 157763, 147948, 169137, 160086, 143067, 142349, 118199, 115812, 165999, 160670, 139485, 147566, 175057, 203732, 216539, 180839]
6164A80839O900L297o746K2578k8533J7184p734q391O490J1452K1926r98K7970
6151B46234L495j4598K1572J9323O690L8918J1400j723l6079m2538K1191j4796
6139B59089j5132j4439K3655j3430k2326Q65J4068Q924K341K9584r385j1735L1430
6126B83509J2624n826k3398K0372M1288R984J8718K6692L1444Q2247K8428K3573
6114E49655L5171k6760m3571o0874m8425k5102K2543k1438k1637k2303q309l4160
6102B94790o786j80l522L8350R186k3275Q03Q013J0541J631j706j5254K2011M9991
6088C84593J5107K3081L7025J2021K7111O6184L4486J0528k7585n5034p9279l2219
6076D16019k2406O59q068k0715P807j6614l6786L0516j2307N236J6643k0893j015
$$ y = [180839, 187739, 191036, 184290, 206868, 178335, 195519, 187785, 179394, 185884, 197336, 219262, 218264, 246234, 249729, 235131, 256703, 276026, 282716, 321634, 333034, 331311, 295232, 252694, 273885, 259089, 243957, 229518, 253173, 239743, 217417, 218282, 232350, 241274, 243615, 273199, 263814, 252079, 283509, 296133, 290307, 266909, 287281, 328569, 338553, 357271, 383963, 415407, 497654, 526082, 549655, 584826, 558066, 514495, 453621, 405196, 380094, 402637, 381199, 359562, 337259, 328950, 294790, 288004, 287824, 284302, 322652, 331838, 308563, 309366, 317379, 327920, 329551, 327845, 312591, 334602, 384593, 399700, 422781, 459806, 471827, 498938, 565122, 599608, 610136, 582551, 527517, 448238, 416019, 393613, 394272, 386204, 365489, 373296, 356682, 319896, 350412, 338105, 343341, 359984, 339091, 338076]
6063C38076l259p205o997M3657k0097J723q697j198J7028n003K6419K9885J3605
6050D17937K2940J5787j7831k5149j8169j8694O83n331k0621q087K5098q950k3713
6037C35900M681j7949K5381J2985L3122J481j7282k9986k620j1545K8658K5532
6025C88358o869J4746l2543k1848J2922j867j2597L6294L1247k0546r89J9215
6013D05523j3847N351J0699L338j0228j4270q567L3809n341N104m089L7944M76
6000D45902l3546J4828J325L1968J485j1527L7090J9274K2760j5073J939j3948
5988E02477l7754m9j3107K7186L3377K0510M6591L66j3575j3174J2800L248p083
5975E61813l029J6485K520j0035K088N535L3568J6292Q546K9901J4216J864M1064
$$ y = [338076, 334817, 327612, 320615, 364272, 344175, 345898, 337201, 336003, 353031, 348028, 374447, 404332, 417937, 440877, 456664, 438833, 413684, 395515, 376821, 377504, 372173, 351552, 343465, 368563, 359613, 335900, 340581, 322632, 348013, 360998, 394120, 395601, 378319, 348333, 345713, 334168, 362826, 388358, 381489, 396235, 363692, 341844, 354766, 352899, 340302, 376596, 407843, 387297, 386308, 405523, 391676, 397027, 407726, 411064, 400836, 386566, 377999, 411808, 406467, 411571, 407482, 445426, 445902, 412356, 427184, 428509, 460477, 461962, 450435, 487525, 506799, 529559, 514486, 516425, 502477, 464723, 464674, 451567, 478753, 512130, 532640, 579231, 579597, 566022, 552848, 565648, 568896, 561813, 558784, 575269, 577789, 567754, 569842, 575377, 608945, 625237, 633783, 663684, 677900, 679764, 720828]
5962G20828R057R578j9211J6349O6607K3431J5662j4303L284j4134k8281L8962
5950H27829J4598k1843q601J4317l3817l191k1141j3943J4900J5556k1441k1525
5938G41698L0378M5078K1952j0508R823L7205M4907L3748K2205J9754M0650N072
5926A041962j4355J6548K4456m3314l3833M1587j8104j685J4048J5727k138j523
5914A039376L4765K9377j979J8976J7352J437K4870n988K9239K2495J3481J3232
5902A236633K3752J6492J2853j2008j0828L5891M4210N5267J1793K9537M3425
5891A487017J2348j0911O940L3355J9072L6239K9801L9942N4486J4167N1365J3707
5879A787528N9016M1798L201N0801N0626M1623M3151M1568K2740M0999M7245M0904
$$ y = [720828, 729885, 739463, 720252, 736601, 803208, 826639, 842301, 827998, 831282, 817148, 788867, 827829, 842427, 820584, 811983, 826300, 792483, 789292, 768151, 754208, 769108, 784664, 763223, 741698, 772076, 817154, 839106, 828598, 838421, 875626, 920533, 954281, 976486, 996240, 1036890, 1041962, 1027607, 1044155, 1068611, 1025297, 991464, 1033051, 1014947, 1013262, 1027310, 1043037, 1040899, 1039376, 1074141, 1103518, 1101539, 1120515, 1137867, 1139304, 1164174, 1158186, 1187425, 1209920, 1223401, 1236633, 1260385, 1276877, 1289730, 1277722, 1266894, 1302785, 1346995, 1402262, 1414055, 1443592, 1487017, 1499365, 1488454, 1495394, 1528749, 1547821, 1584060, 1613861, 1653803, 1708289, 1722456, 1773821, 1787528, 1846544, 1888342, 1891543, 1942344, 1992970, 2034593, 2077744, 2119312, 2142052, 2183051, 2230296, 2271200]
5867B271200N039L4859K6968K4270M6515P1519N7900Q3285P1382K4511O4326P8824
5855B860598R0814P4145Q0554R9133Q1619J09969Q5693J03936J35870J51321J16338
5844C989990J04481J23398J44003J32685J40094J45941J30492J62685J54978J36270
5834E365017J57649J78265K09771K20061K63209K98551L40453M43229N10197O80859
5824H667261P52577Q75366J030654J285652J749552K365354K958415L367723L078724
5815B6131278J782223m33792k436176l113652k645276j888479j325098q41354
5807A5229674n96776l90311k46998j36314M057J27765J61266K64912L40397M16256
5797A5173928N62754P39713R40907J189969J448821J818407K143298K568273L257730
$$ y = [2271200, 2276239, 2311098, 2338066, 2362336, 2408851, 2480370, 2538270, 2621555, 2692937, 2717448, 2781774, 2860598, 2951412, 3025557, 3106111, 3205244, 3286863, 3396832, 3482525, 3586461, 3722331, 3873652, 3989990, 4094471, 4217869, 4361872, 4494557, 4634651, 4780592, 4911084, 5073769, 5228747, 5365017, 5522666, 5700931, 5910702, 6130763, 6393972, 6692523, 7032976, 7476205, 7986402, 8667261, 9419838, 10295204, 11325858, 12611510, 14361062, 16726416, 19684831, 23052554, 26131278, 27913501, 27479709, 25043533, 21929881, 19284605, 17396126, 16071028, 15229674, 14632898, 14242587, 13995589, 13859275, 13863332, 13991097, 14152363, 14417275, 14757672, 15173928, 15736682, 16476395, 17417302, 18607271, 20056092, 21874499, 24017797, 26586070, 29843800]
5788B9843800M272584N811067P829706R553121R725864P110001J218379n899032
5780F9465490j0148092r873569p521646n389070l925451k952993k318300j819740
5772B5516629j413211j125744q90053o75290m97949l33694j64061J6501J97369
5763B0630497L82406O63684J012344J423381J859259K271317K796786L684012
5755C4723686N089213P013663Q960134R905339Q512708L794061l379213r443448
5747F5176143j0912813r056800o687105m902329l723138k939528k401529j990406
5739B2562495j640106j378243j154208r18622p66977n96558m92774l84344k53870
5730A4976793j04114J917J33618L73975N65778P90634J043762J351324J879262
$$ y = [29843800, 34116384, 39927451, 47757157, 57310278, 67036142, 74146143, 75364522, 69465490, 59317398, 49443829, 41922183, 36533113, 32607662, 29654669, 27336369, 25516629, 24103418, 22977674, 22087621, 21412331, 20914382, 20580688, 20416627, 20433128, 20630497, 21012903, 21676587, 22688931, 24112312, 25971571, 28242888, 31039674, 34723686, 39812899, 46826562, 55786696, 65692035, 74204743, 77998804, 74619591, 65176143, 54263330, 45206530, 38519425, 33617096, 29893958, 26954430, 24552901, 22562495, 20922389, 19544146, 18389938, 17471316, 16704339, 16107781, 15615007, 15230663, 14976793, 14872679, 14874596, 15008214, 15382189, 15947967, 16738601, 17782363, 19133687, 21012949]
5721B1012949K524795L069881K948763J762321m36102k770965l942340l678873
5713B0490429k842401k128877j614354j313576j148053r35664p75136o25156n68336
5704H538876n04867m09171l72930l39400k82420k77019k63763k35230k23807j99798
5694E430471j50887q5209j51078j11877j31708j02740p0579r3222j00328j02036
5684D330807o4535q4720j07727j02093j07814n8070n8366n9201r1472p5313q3112
5673C438384m6756l2454m5501n0711n7857k6158q754k1401m7954l4833p1293k7118
5661B967594k1884l2400P576m3446K494L4560j7537m510O132k893m0571j6263
5649B838852M612J7203K9784j1270j0456j5284n449L7355K0271k0746k437K0940
$$ y = [21012949, 23537744, 26607625, 29556388, 31318709, 30882607, 28111642, 24169302, 20490429, 17648028, 15519151, 13904797, 12591221, 11443168, 10507504, 9732368, 9107212, 8538876, 8034009, 7624838, 7251908, 6912508, 6630088, 6353069, 6089306, 5854076, 5630269, 5430471, 5279584, 5194375, 5043297, 4931420, 4799712, 4696972, 4626393, 4533171, 4432843, 4330807, 4266272, 4181552, 4073825, 3971732, 3863918, 3805848, 3747482, 3688281, 3596809, 3521496, 3438384, 3391628, 3359174, 3313673, 3262962, 3205105, 3178947, 3170193, 3148792, 3100838, 3066005, 2994712, 2967594, 2945710, 2913310, 2920886, 2877440, 2879934, 2914494, 2896957, 2892447, 2898579, 2895686, 2855115, 2838852, 2843464, 2860667, 2890451, 2879181, 2868725, 2853441, 2847992, 2885347, 2905618, 2884872, 2882435, 2903375]
5637B903375J738l051K9091n244N903m3107j842K9588J7391O3300P7035M0840
5625C115017O2216N2471J7045L4791M2637R3439L5132L5268R9184J97898J53063
5614C938161J74964J36621P8422k9106j01315j36217r8767p5541o7077j945O726
5603C824926K085o053O601M1432Q0175L4139J4833K7571R0257P4902N4934J33477
5591D379279R5677J12841J39932J44996K48160K64816L02310L05219J65901J2554
5581F171685j86503k87633k16432j60993j07469o2290n3483r904r70J0666M5394
5570E142068M8388Q5165J19293Q3986O9293R0411R0396J30278R6304P2800J34634
5559F163016J44112J98708K13126K16915K23382K21460J12423J1043k1409r455
$$ y = [2903375, 2905113, 2902062, 2931153, 2925909, 2931812, 2888705, 2886863, 2916451, 2933842, 2997142, 3074177, 3115017, 3177233, 3229704, 3246749, 3281540, 3324177, 3417616, 3452748, 3488016, 3587200, 3785098, 3938161, 4113125, 4249746, 4328168, 4299062, 4197747, 4061530, 3962763, 3887222, 3820145, 3818200, 3824926, 3827011, 3820958, 3827559, 3868991, 3949166, 3983305, 3998138, 4025709, 4115966, 4190868, 4245802, 4379279, 4474956, 4587797, 4727729, 4872725, 5120885, 5385701, 5688011, 5993230, 6159131, 6171685, 5985182, 5697549, 5481117, 5320124, 5212655, 5150365, 5096882, 5086978, 5086008, 5096674, 5142068, 5190456, 5275621, 5394914, 5478900, 5548193, 5638604, 5729000, 5859278, 5955582, 6028382, 6163016, 6307128, 6505836, 6718962, 6935877, 7159259, 7380719, 7493142, 7504185, 7482776, 7473321]
5549G473321O6239N3346J12843J37742J21317J72161J48135J84162K19684K34395
5539H923345K21613J91575J99906J46831J41566K12377K28700K19981K72871K56302
5529A1015067K38607K71996K77696K35303K07063K01531K04906K44459K54353
5520A3150981K63771K94388K70129K96402L32809L13091L58373L95944L99835
5511A6075723M03858M39088N04900N19337N40964N61007O12004O27976O68579
5502B0953436P31935P79391Q61412Q84043R31193J017149J089190J218636J313685
5493B9780070J446499J544472J685933J887970K081204K272391K500048K834907
5485D6033494L117056L417284L669755L936105M192650M340958M456524M495794
$$ y = [7473321, 7539560, 7592906, 7705749, 7843491, 7964808, 8136969, 8285104, 8469266, 8688950, 8923345, 9144958, 9336533, 9536439, 9683270, 9824836, 10037213, 10265913, 10485894, 10758765, 11015067, 11253674, 11525670, 11803366, 12038669, 12245732, 12447263, 12652169, 12896628, 13150981, 13414752, 13709140, 13979269, 14275671, 14608480, 14921571, 15279944, 15675888, 16075723, 16479581, 16918669, 17423569, 17942906, 18483870, 19044877, 19656881, 20284857, 20953436, 21685371, 22464762, 23326174, 24210217, 25141410, 26158559, 27247749, 28466385, 29780070, 31226569, 32771041, 34456974, 36344944, 38426148, 40698539, 43198587, 46033494, 49150550, 52567834, 56237589, 60173694, 64366344, 68707302, 73163826, 77659620]
5477G7659620M362712M117068L783178L429634L117366K789549K532876K340367
5469A04132370K158382K123134K208603K394908K561700K652699K769081K807926
5461A23808803K841848K760108K715084K722102K744008K871968L149167L508947
5453A47122035L851394M103755M279072M156765L778660L268960K690359J976951
5445A75227951J412843R24001N97614M67100M34782M91267N20689O14771O01259
5436A81292277M11324N0369n05318j217290j988469k808912l471986l967473m255924
5427A63538598m248376m110857l749717l382806l048093k824406k741400k619779
5419A36813164k617888k556046k484892k418972k416468k315856k271354k203528
$$ y = [77659620, 82022332, 86139400, 89922578, 93352212, 96469578, 99259127, 101792003, 104132370, 106290752, 108413886, 110622489, 113017397, 115579097, 118231796, 121000877, 123808803, 126650651, 129410759, 132125843, 134847945, 137591953, 140463921, 143613088, 147122035, 150973429, 155077184, 159356256, 163513021, 167291681, 170560641, 173251000, 175227951, 176640794, 177564795, 178162409, 178629509, 179064291, 179555558, 180076247, 180691018, 181292277, 181703601, 181753970, 181248652, 180031362, 178042893, 175233981, 171761995, 167794522, 163538598, 159290222, 155179365, 151429648, 148046842, 144998749, 142174343, 139432943, 136813164, 134195276, 131639230, 129154338, 126735366, 124318898, 122003042, 119731688, 117528160]
5411A17528160k046953k059524k108249k192982k456105k879667l348242l868983
5403I6567455m294092m661656m900717m930414m868419m680968m390167m085367
5395E9755655l697941l355077l064269k789464k553293k310316k116495j913894
5387C7954906j717885j602652j529730j382494j291513j157299j069892r62748
5379B7240693r38097q27858p75175p37146o61866o28263n84746n78431m59989
5370B1049122n06117m70790m32133m40916l67550l61297l09998l11830k70850
5361A7577641l22469l03789k80725k58655k46144k55596k38841j53330j45313
5352A5372779j37714j20509j03318j00248r3367p9485o387J1725K770J5779J6923
$$ y = [117528160, 115481207, 113421683, 111313434, 109120452, 106664347, 103784680, 100436438, 96567455, 92273363, 87611707, 82710990, 77780576, 72912157, 68231189, 63841022, 59755655, 56057714, 52702637, 49638368, 46848904, 44295611, 41985295, 39868800, 37954906, 36237021, 34634369, 33104639, 31722145, 30430632, 29273333, 28203441, 27240693, 26302596, 25474738, 24699563, 23962417, 23300551, 22672288, 22087542, 21509111, 21049122, 20543005, 20072215, 19640082, 19199166, 18831616, 18470319, 18160321, 17848491, 17577641, 17255172, 16951383, 16670658, 16412003, 16165859, 15910263, 15671422, 15518092, 15372779, 15235065, 15114556, 15011238, 14910990, 14817623, 14738138, 14731751, 14743476, 14746246, 14762025, 14778948]
5341A4778948O5390Q9774R7682J02944J60662J82427K01703K02146J63952N0057
5331A6095685k0814p989j9281J8315N3741O1231Q1440J33858J75715J59246K35844
5320A6966991K68581K87617L50534L68765L54251L77378M33672M44519M91802
5311B0344110N80595P34798R00088R30255R68203Q43310P36540O26655O20614
5302B7285168P29736R48727J274918J598689J783240J722591J315318N53718j30803
5293C7081302k14405J11767M06662O25157P88399R99003J181934J456831J832369
5284D4269019K291171K805715L415104M148941M962658N795742O533179P474541
5276H1696070R136739J2043181J6375193K1696555K6205552K6874392J9988052
$$ y = [14778948, 14844338, 14934112, 15031794, 15134738, 15295400, 15477827, 15679530, 15881676, 16045628, 16095685, 16074871, 16066882, 16047601, 16065916, 16119657, 16180888, 16262328, 16396186, 16571901, 16731147, 16966991, 17235572, 17523189, 17873723, 18242488, 18596739, 18974117, 19407789, 19852308, 20344110, 20924705, 21659503, 22559591, 23489846, 24458049, 25301359, 26037899, 26664554, 27285168, 28014904, 28963631, 30238549, 31837238, 33620478, 35343069, 36658387, 37212105, 37081302, 36866897, 36978664, 37385326, 38010483, 38798882, 39797885, 40979819, 42436650, 44269019, 46560190, 49365905, 52781009, 56929950, 61892608, 67688350, 74221529, 81696070, 90832809, 102875990, 119251183, 140947738, 167153290, 194027682, 214015734]
5269B14015734M529271j4672959k5525579k4816950j9391798j4009330j0136694
5262A09991695p447562n741702m409996l232504k118359j156508q7686J172105
5254H6969483K408762L596409M887794O332684Q140420J0025942J2131269J5146409
5246A49639172K0092865K7535191L7182492M6568101N0561236M2015933J6864568
5239C90459558j9826309m8648828n4002222m4195246l2795661k4385427j8690542
5232A47915323j4743671j1795113r411240p449709n984638m787153l507418k265832
5224H7970549j264344k58842O93571J903513L141251M363166N796092P982854
5216A10327810J1445719J6249490K1606953K5277844K3587261J3386092m888723
$$ y = [214015734, 218545005, 203872046, 178346467, 153529517, 134137719, 120128389, 109991695, 102544133, 96802431, 92392435, 89159931, 87041572, 85885064, 85797378, 86969483, 89378245, 92974654, 97862448, 104195132, 112335552, 122361494, 134492763, 149639172, 169732037, 197267228, 234449720, 281017821, 331579057, 373594990, 390459558, 370633249, 321984421, 267982199, 223786953, 190991292, 166605865, 147915323, 133171652, 121376539, 111965299, 104515590, 98530952, 93743799, 90236381, 87970549, 86706205, 86447363, 87140934, 89044447, 92185698, 96548864, 102344956, 110327810, 121773529, 138023019, 159629972, 184907816, 208495077, 221881169, 216992446]
5209B16992446k3034408k9759259k5977970j9765851j4908824j1659668r409472
5202H2476994p678262o291010n112052m240837l740571l368834k992305k730700
5194D6322423k436487k160181j948540j691293j430439j259655j042309r24839
5186C3428680p78965p50689p70026p75396p57571p56867n81265m54834l48747
5177B7454320k77729k99805l88733m77351m38592k90658j87442m6578O7540M4484
5167B5159456o3018k85130n46861o48917o61945n35523l53070l02890k54233j62356
5157B1345513j35894j01930m9979j3061n1079K4331J00560J54791K03994K79896
5147B1757142L31719L61552L79554L67160M43298N39279N93815O78728P29716
$$ y = [216992446, 193958038, 164198779, 138220809, 118454958, 103546134, 91886466, 82476994, 74798732, 68507722, 63395670, 59154833, 55414262, 52045428, 49053123, 46322423, 43885936, 41725755, 39777215, 38085922, 36655483, 35395828, 34353519, 33428680, 32649715, 31899026, 31129000, 30353604, 29596033, 28839166, 28257901, 27803067, 27454320, 27176591, 26876786, 26488053, 26010702, 25572110, 25281452, 25094010, 25047432, 25114972, 25159456, 25096438, 24811308, 24264447, 23615530, 22953585, 22418062, 22064992, 21762102, 21507869, 21345513, 21209619, 21107689, 21057710, 21044649, 20993570, 21017901, 21118461, 21273252, 21477246, 21757142, 22088861, 22450413, 22829967, 23197127, 23640425, 24179704, 24773519, 25452247, 26181963]
5138B6181963Q05958R23186R00912Q43286P50014P81936Q86577J049920J227552
5129C4351304J398910J527681J699791J818440J952629K118438K229876K362777
5121D9459846K509128K664181K733449K767592K817022K814310K809752K698632
5113G1273912K599581K564498K500481K477282K486436K541144K678155K734754
5105I1856243K949651L132541L332381L514631L650803L679559L590746L380337
5097A19086892K955562K396844J705281R12236N6667q73987j727393k578452l255239
5088A18678411l753518m094506m265392m328482m247062m132464l950537l671742
5080H6234708l489747l271689l126502k976518k816019k720640k671676k565220
$$ y = [26181963, 26987921, 27911107, 28812019, 29655305, 30405319, 31187255, 32073832, 33123752, 34351304, 35750214, 37277895, 38977686, 40796126, 42748755, 44867193, 47097069, 49459846, 51968974, 54633155, 57366604, 60134196, 62951218, 65765528, 68575280, 71273912, 73873493, 76437991, 78938472, 81415754, 83902190, 86443334, 89121489, 91856243, 94805894, 97938435, 101270816, 104785447, 108436250, 112115809, 115706555, 119086892, 122042454, 124439298, 126144579, 127056815, 127113482, 126239495, 124512102, 121933650, 118678411, 114924893, 110830387, 106564995, 102236513, 97989451, 93856987, 89906450, 86234708, 82744961, 79473272, 76346770, 73370252, 70554233, 67833593, 65161917, 62596697]
5072F2596697k589729k582173k595259k600409k607376k565508k495703k422611
5064D2137929k313784k181833k027524j895648j830686j695931j541234j415255
5056B7236034j320291j209653j129671j055238j022710r89698q67975q03902p87746
5047A8049150p39287o81080n94703n81858n78703m63806m79977m99603m93988
5038A2936145m72786m61457m27837l99509l53366l09029l21478l13749k92475
5029I584459k37928k04650k45532k07151k01604j93782k15197k05387j89921j58540
5019G524767k02888j72744j25462j50844j84250j39854j57905j73052j36600r5484
5009E985684j49119r8873j69497j49395j20728j04386j48773j04163p3837p2459
$$ y = [62596697, 60006968, 57424795, 54829536, 52229127, 49621751, 47056243, 44560540, 42137929, 39824145, 37642312, 35614788, 33719140, 31888454, 30192523, 28651289, 27236034, 25915743, 24706090, 23576419, 22521181, 21498471, 20508773, 19640798, 18836896, 18049150, 17309863, 16628783, 16034080, 15452222, 14873519, 14409713, 13929736, 13430133, 12936145, 12463359, 12001902, 11574065, 11174556, 10821190, 10512161, 10190683, 9876934, 9584459, 9346531, 9141881, 8896349, 8689198, 8487594, 8293812, 8078615, 7873228, 7683307, 7524767, 7321879, 7149135, 7023673, 6872829, 6688579, 6548725, 6390820, 6217768, 6081168, 5985684, 5836565, 5737692, 5568195, 5418800, 5298072, 5193686, 5044913, 4940750, 4866913, 4794454]
4999D794454j03933r6783q8513p8772j05159o4960p3408q7700k2843j08940p6963
4988C886480l5625k8959p2291p2781n8336o2070n7142n1309l5425k4789j624n9270
4976C326859m8190k4082l1428p7618o7578k6632o8401o7534j9661m9858l2162
4965B813715n0986m2949q299o2693j7038l5497n4747j8979p107k4933J0124k4072
4953B476539n3211k675l8539j5693J2342o4634l2464m3883j7798m2890m5784l9833
4941B091477j2788q468k7207k2896m6735j3422K763n5999J8899q152k642O248
4929A921078N0896N2612P696P3665J19083J38640Q6771J0078q1927j27264j36447
4918B114881j60643j21110m9956o3351m5229k7677k782K2481k9701k780M86j283
$$ y = [4794454, 4690521, 4593738, 4505225, 4426453, 4321294, 4256334, 4182926, 4095226, 4072383, 3963443, 3886480, 3850855, 3821896, 3749605, 3676824, 3618488, 3556418, 3499276, 3447967, 3412542, 3387753, 3386129, 3326859, 3278669, 3254587, 3223159, 3145541, 3077963, 3051331, 2982930, 2915396, 2895735, 2845877, 2813715, 2762729, 2719780, 2711481, 2648788, 2631750, 2596253, 2541506, 2522527, 2515420, 2490487, 2500611, 2476539, 2423328, 2420653, 2382114, 2366421, 2378763, 2314129, 2281665, 2237782, 2219984, 2177094, 2131310, 2091477, 2078689, 2070221, 2043014, 2020118, 1973383, 1959961, 1962724, 1906725, 1925624, 1917472, 1914830, 1921078, 1971974, 2024586, 2032282, 2105947, 2225030, 2363670, 2450441, 2460519, 2378592, 2251328, 2114881, 1954238, 1833128, 1783172, 1719821, 1674592, 1646915, 1644133, 1666614, 1636913, 1634133, 1634619, 1633336]
4906A633336L915o504M0624K8658M1191O7029P6183R0710J34481J75729K46127
4895B531479K43540K18647R7122r5756k22859k87108k44721j97652j18130j55208
4885A769354p8745m1747p5968l8686m7086l6361k0443l3964P662k0844J6060K8051
4873A427283k6678k043K6566K129N3087R6057J14163J33601J14351O9970n5049
4862A953437j38050j13240j30262j15852j07387o7374m2444l4908l6186n6460
4852A111274L946l8564l7928j4478l0330k4767p637j0337o5536K4160L447l0334
4840H82916M861j8739n817J8593R837n254q603p500m541p674j6361K5000Q449
4827H75167m3921m2532n3938J1660M020P425k8640K3737J4554K4308m113q764
$$ y = [1633336, 1637251, 1630747, 1671371, 1700029, 1741220, 1808249, 1884432, 1975142, 2109623, 2285352, 2531479, 2775019, 2993666, 3090788, 2995032, 2772173, 2485065, 2240344, 2042692, 1924562, 1769354, 1690609, 1648862, 1572894, 1534208, 1487122, 1450761, 1430318, 1396354, 1404016, 1383172, 1399232, 1427283, 1400605, 1398562, 1425128, 1427257, 1480344, 1576401, 1690564, 1824165, 1938516, 2008486, 1953437, 1815387, 1702147, 1571885, 1456033, 1348646, 1281272, 1238828, 1203920, 1167734, 1111274, 1115220, 1076656, 1038728, 1024250, 993920, 969153, 961516, 951179, 885643, 909803, 913250, 882916, 887777, 869038, 863221, 881814, 891651, 886397, 877794, 870294, 865753, 858079, 841718, 866718, 875167, 831246, 788714, 734776, 746436, 750456, 757881, 729241, 752978, 767532, 791840, 787727, 778963]
4815G78963m121n325q909n536K682j2642J0605j2520k104M1902L077P790j7270
4802G76592j3198j7000M3825K2189k0757m6567k5322m821J9652R275p069L8433
4790G75232K6244l5690l273J2821j3112K4796p633J1428P704k6288r2J0214J3623
4777G95974O923J1173L7542q051p191k0189L2691o055k495q302k0741K0909o147
4764H26041k8113J1631L0825L0612k4035n25K8915J660q334J6220M1469J5967
4752I42333j3002l020M2991L5164l0739j1058l252R679M075M8003N4387k3113
4740A052448n870J0565K8428K5373K2113O741j7957J4606K0498M1046J9634l3413
4728A184212P584J9569K1567Q031L5223j3043K6576L0100K6375J5337P080K0141
$$ y = [778963, 774842, 769517, 760608, 755072, 757754, 745112, 755717, 743197, 741093, 782995, 786072, 793862, 776592, 763394, 746394, 790219, 812408, 791651, 745084, 719762, 714941, 734593, 743868, 736799, 775232, 801476, 765786, 762513, 775334, 762222, 787018, 779385, 790813, 798517, 772229, 772137, 782351, 795974, 802897, 814070, 851612, 843561, 836370, 816181, 848872, 842817, 840322, 832020, 811279, 832188, 826041, 797928, 809559, 840384, 870996, 846961, 846436, 875351, 877011, 868677, 884897, 926366, 942333, 929331, 926311, 969302, 1004466, 973727, 962669, 959417, 969096, 973171, 1021174, 1075561, 1052448, 1046578, 1057143, 1085571, 1110944, 1133057, 1139798, 1121841, 1136447, 1156945, 1197991, 1217625, 1184212, 1191796, 1211365, 1232932, 1240963, 1276186, 1263143, 1289719, 1319819, 1346194, 1361531, 1368611, 1388752]
4716A388752J1275K9096N2694J5516K6060N5268o89Q526J6072K876K5194J0865
4704A641505Q957M832J6277J4960K2816l668J9297M81N2246L9296M326n386p466
4691A808473J5479M621J2559n1967K5967m557k7454k81j2292j5378n169m3315
4679A706686K0597l2994K351l8778m8136j3328l4678k5141l6655J2704J2201m8789
4667A476040m1344k8073n2336m1652l6850l0536P892p926q6685M003j0572m2326
4655A109635l240k638k6907j5967l3400l8516j0596l1248j0881k6387k5651p5967
4643H08237j6601j5197m0591J8418k6630q707q036j1384p852k2950k1494l755
4631F43458J1351k2662j0218k5161r619l1836L297P652k171k3445k01L656Q221
$$ y = [1388752, 1400027, 1429123, 1481817, 1497333, 1523393, 1578661, 1577972, 1586498, 1602570, 1605446, 1630640, 1641505, 1650462, 1655294, 1671571, 1686531, 1709347, 1705679, 1724976, 1725457, 1777703, 1816999, 1821325, 1815939, 1808473, 1823952, 1828573, 1841132, 1789165, 1815132, 1810575, 1783121, 1782840, 1770548, 1755170, 1750001, 1706686, 1727283, 1694289, 1696640, 1657862, 1609726, 1596398, 1561720, 1536579, 1499924, 1512628, 1524829, 1476040, 1434696, 1406623, 1354287, 1312635, 1275785, 1245249, 1253141, 1245215, 1158530, 1162533, 1151961, 1109635, 1106395, 1103757, 1076850, 1060883, 1027483, 988967, 978371, 947123, 936242, 909855, 884204, 808237, 791636, 776439, 735848, 754266, 727636, 718929, 710893, 699509, 691657, 668707, 647213, 643458, 654809, 632147, 621929, 596768, 587149, 555313, 558610, 566262, 564091, 540646, 540445, 544101, 552322]
4618E52322j9700n7780K8928J506j1271j8247p935N472J4702m4568l6902k530
4606D03997l3865K5518K130k2060j0662k3512K6286K9093J580l4016K274m1794
4594C24969j5184Q361L571J3136j1011p521K489k7445j4484J099L656j513k2667
4581B57456J9517M9240r911m9350K2831J7324k6975n322j651J3943q752o564L981
4568B75767l842J3893k4144Q75j3669M597k343m159K7452j660m0134j0854k1239
4555B00540J3393L4256j0643J3298o368n569l249n796k1366M108k1507R603M9547
4542B50247k2323k617j7153o990L3785J2046J3365o2046J2514N4863r281J5605
4530B72015k5324m6479n398J9266K8127j4250O064J6751J2647j2834j7518J4278
$$ y = [552322, 532622, 474842, 503770, 505276, 494005, 475758, 467823, 473295, 487997, 443429, 406527, 403997, 370132, 395650, 397780, 375720, 365058, 341546, 367832, 396925, 398505, 364489, 366763, 324969, 309785, 318146, 321717, 334853, 323842, 316321, 318810, 291365, 276881, 277980, 281636, 280123, 257456, 276973, 326213, 316302, 266952, 289783, 307107, 280132, 274810, 273159, 287102, 278350, 271786, 275767, 271925, 285818, 261674, 262549, 248880, 253477, 251134, 246975, 274427, 272767, 232633, 221779, 200540, 213933, 248189, 237546, 250844, 244476, 238907, 235658, 229862, 208496, 212604, 191097, 200700, 250247, 227924, 225307, 208154, 201164, 234949, 246995, 260360, 198314, 210828, 265691, 256410, 272015, 246691, 200212, 194814, 214080, 242207, 227957, 234021, 250772, 263419, 250585, 233067, 247345]
4518B47345q933k2027J7355j1661J6124j7689N078m4369j0548J442L022Q828k755
4505A81212J9193j9111N616k0616R557k49K995J5769p391l0399o062L628J3027
4492A67169K5953k6706o3L4899J4617k091k5M545m1288m519j6238J8162J1775
4479A86190j3332K5708r416k7882j511j8089n629M9771J3037k2099L4792K3811
4467B35351k5263m1808M105J6083q103K6011l802m2200K4115j0224K3860Q39r682
4454A89282p172j482k0835M8097n436p104r659J3650j3470L499K0207l3856q928
4441A66793J9919k645J6836Q034N556K2933o814j5702k7374K2377p759K013K170
4428B06337l2959K7173L3757O817j4357j1414n675l7213J162o838J9598R918k1464
$$ y = [247345, 238412, 216385, 233740, 222079, 238203, 220514, 225592, 181223, 170675, 172117, 175139, 183967, 181212, 200405, 181294, 186910, 166294, 175851, 175602, 178597, 194366, 186975, 156576, 150514, 154142, 167169, 193122, 166416, 166353, 201252, 215869, 213778, 213753, 218298, 177010, 172491, 156253, 174415, 186190, 172858, 198566, 189150, 161268, 159757, 141668, 136039, 185810, 198847, 176748, 211540, 235351, 210088, 168280, 172385, 188468, 180365, 206376, 202574, 160374, 184489, 174265, 198125, 198964, 189282, 182110, 180628, 159793, 207890, 202454, 195350, 185691, 199341, 185871, 189370, 209577, 175721, 166793, 186712, 184067, 200903, 208937, 214493, 237426, 230612, 214910, 187536, 209913, 202154, 204167, 206337, 173378, 200551, 234308, 241125, 226768, 215354, 209679, 172466, 173628, 166790, 186388, 196306, 174842]
4415A74842k3330N4959l412J7216r953J4405K2313M274l0405L4733R181k62k6962
4402B37599j3680n676J1854J0422o364j1061K2289J457j9430L4252O439j3403
4390B54698J9580k607k255j1372J1599o079k0486o882j386l174K1306j1778l8329
4377B02835L5272J9975R572q487j2605k260L6449J5214Q663P512n262l5414N113
4364B76577m25J6091k5029M2351n219j5791j0499J0283j0693Q316q986K73j0200
4351B67049O907J5787L5355R716p406K6681j6489l877P436k6839K627J8817L1039
4338C66803K2588j5305k5195Q738L334j6238m946J9782R958j9984L3036k9075
4326C53496J621J475O922L0037J0192l3468j9979K3219K7250J5289K131K9504
$$ y = [174842, 151512, 206471, 203059, 220275, 210322, 224727, 247040, 251314, 220909, 255642, 264823, 264561, 237599, 223919, 218243, 230097, 240519, 234155, 223094, 245383, 246840, 227410, 261662, 268101, 254698, 274278, 271671, 269416, 258044, 269643, 263564, 243078, 236196, 234810, 231636, 252942, 241164, 202835, 238107, 258082, 267654, 259167, 246562, 244302, 280751, 295965, 304628, 312140, 306878, 271464, 276577, 276152, 292243, 267214, 309565, 304346, 288555, 278056, 288339, 277646, 285962, 276976, 277249, 267049, 273956, 289743, 325098, 334814, 327408, 354089, 337600, 333723, 341159, 314320, 316947, 335764, 366803, 389391, 374086, 348891, 357629, 360963, 344725, 339779, 359561, 369519, 349535, 382571, 353496, 355117, 356592, 363514, 393551, 403743, 370275, 350296, 373515, 400765, 416054, 418185, 447689]
4314D47689j8768J3915K0929l5244O176o108r88j3796Q914j888O600q463J4297
4301D33265J3371K5287q406K8135M7916J9098k455j3770J978L038O684K971J4224
4288E71336J6349Q163l8888J795j8399j2650M6741J0735m1229K3801L0990J3767
4276F12511P868J7420N7855m217J9433m394n008P8850K4246K9072N9481M0268
4264I33385L5302K8953O3570M3804j2849l5439m7338m9479k2512L501K7513n661
4252I62750Q279K1988r068r195L2931M6992K5287K5073L9781J0854P6051Q5720
4240A317443M4934O0299R8161Q9977J10415J57358J59869J28145Q0279K0946k7309
4229B240517l3487l2881p174M4819J32062J50779J05141L3798p5448j19865j38716
$$ y = [447689, 428921, 442836, 463765, 428521, 434697, 428589, 427601, 413805, 422719, 420831, 427431, 418968, 433265, 446636, 471923, 463517, 491652, 539568, 558666, 556211, 542441, 544419, 547457, 554141, 557112, 571336, 587685, 595848, 556960, 558755, 540356, 527706, 574447, 585182, 543953, 567754, 598744, 612511, 620379, 637799, 695654, 691437, 710870, 706476, 701468, 780318, 804564, 833636, 893117, 933385, 968687, 997640, 1061210, 1105014, 1092165, 1056726, 1009388, 959909, 937397, 940898, 968411, 962750, 971029, 993017, 983949, 974754, 1007685, 1054677, 1079964, 1105037, 1144818, 1155672, 1231723, 1317443, 1362377, 1422676, 1520837, 1610814, 1721229, 1878587, 2038456, 2166601, 2246880, 2267826, 2240517, 2207030, 2174149, 2166975, 2211794, 2343856, 2494635, 2599776, 2633574, 2558126, 2438261, 2299545]
4218B299545r5516k2524p898J4760J2339L2663K2484P3188J04436J51594J88031
4207B773102K13476K27606K10173J92384J15602M8533P3884R5089K67446L77872
4197D595167N06683N78735L64271P1992l11733n26993l97658k44711j31625K4701
4187D528829R3546M1421q0804k45501k81742k30398p5005k6395O5511J18723J31906
4176D040091J50270J00107J35109J68065K31137L63394N13206O29543O41160L91915
4166G363997r311m04793o58614p28516o01633m88659l58499k57293j81385j49987
4156C525307j35860q0509p9483j8915L7818j9801K7332N5511R6495R3823N4644
4145C556362J09122J55534K28293L71551M69303M27985L32431P0738k31577m47513
$$ y = [2299545, 2204029, 2181505, 2173607, 2188367, 2200706, 2233369, 2255853, 2329041, 2433477, 2585071, 2773102, 2986578, 3214184, 3424357, 3616741, 3732343, 3780876, 3854760, 3949849, 4217295, 4595167, 5101850, 5680585, 6044856, 6116848, 5805115, 5278122, 4880464, 4635753, 4504128, 4528829, 4622375, 4663796, 4582992, 4337491, 4055749, 3825351, 3750346, 3723951, 3789462, 3908185, 4040091, 4190361, 4290468, 4425577, 4593642, 4824779, 5188173, 5701379, 6330922, 6972082, 7363997, 7354686, 6949893, 6291279, 5562763, 4961130, 4472471, 4113972, 3856679, 3675294, 3525307, 3389447, 3308938, 3229455, 3210540, 3248358, 3228557, 3255889, 3311400, 3407895, 3501718, 3556362, 3665484, 3821018, 4049311, 4420862, 4890165, 5318150, 5650581, 5721319, 5489742, 5042229]
4135E042229m96438l90879l13599k19464j23870j63854r4440n0093l1726j1019
4125C146847j8621j4096J0586k118o126j1441M420J090k4373K9045L9427N2908
4113C207548J11573J51681J09171J8377o7406j14627j01784p1486o0832l5242
4103C146973k4074o17J0594K619N0754L1124K3566L1107J9865K4405J5017K2585
4091C353918O498l9665o086J5299j2728j0037M2314R2448K3737M9401Q5900R2486
4079C693485O9476Q8364Q7324J15443R9021R1848Q2126R3958P0925J00061L5000
4068D627031R511L1007j8954L712M4741O0568N5912M3969K7334K9631K0104l1465
4056D903101O8949O3432L8493P4437P4414Q8018O4110J22580J49185J04956R2907
$$ y = [5042229, 4545791, 4154912, 3841313, 3621849, 3497979, 3334125, 3239685, 3189592, 3157866, 3146847, 3128226, 3114130, 3124716, 3122598, 3116472, 3105031, 3109451, 3110541, 3086168, 3115213, 3154640, 3207548, 3319121, 3470802, 3579973, 3598350, 3530944, 3416317, 3314533, 3243047, 3182215, 3146973, 3122899, 3122282, 3132876, 3135495, 3186249, 3217373, 3240939, 3272046, 3291911, 3316316, 3331333, 3353918, 3360416, 3320751, 3314665, 3329964, 3317236, 3307199, 3349513, 3441961, 3465698, 3515099, 3600999, 3693485, 3762961, 3851325, 3938649, 4054092, 4153113, 4244961, 4327087, 4421045, 4491970, 4592031, 4627031, 4636542, 4667549, 4648595, 4652307, 4697048, 4757616, 4813528, 4857497, 4884831, 4914462, 4934566, 4903101, 4972050, 5035482, 5073975, 5148412, 5222826, 5310844, 5374954, 5497534, 5646719, 5751675, 5844582]
4045E844582J06199R3258Q6143J04371J43524O1377J19564J17536J39823J24236
4035F940613P5835R8465J23024J05971J27739J69025J77430K00694J52385K02383
4025H373564J95150K12014J91065K07433K23723K25373K97108K58958K39942K53436
4015A0677766K80842K46941K16320K70837K85592L27295M39087L92289M09967
4006A3546936L80175K62995K63800K90970L24706L34109M18015M28723M66153
3997A6716582N27986N52738O02134N99214O04412O33514O50125O86461P01344
3988B2274510P41160Q93371J059961J222300J322895J458554J704201K012106
3980C2689058K338789K791398L379697M261255N388378O549039P281961O812786
$$ y = [5844582, 5950781, 6044039, 6130182, 6234553, 6378077, 6439454, 6559018, 6676554, 6816377, 6940613, 7016448, 7114913, 7237937, 7343908, 7471647, 7640672, 7818102, 8018796, 8171181, 8373564, 8568714, 8780728, 8971793, 9179226, 9402949, 9628322, 9925430, 10184388, 10424330, 10677766, 10958608, 11205549, 11421869, 11692706, 11978298, 12305593, 12744680, 13136969, 13546936, 13927111, 14190106, 14453906, 14744876, 15069582, 15403691, 15821706, 16250429, 16716582, 17244568, 17797306, 18399440, 18998654, 19603066, 20236580, 20886705, 21573166, 22274510, 23015670, 23909041, 24969002, 26191302, 27514197, 28972751, 30676952, 32689058, 35027847, 37819245, 41198942, 45460197, 50848575, 57397614, 64679575, 71492361]
3972G1492361M331769q0131m377003n856013m915825l465823k238217j391152
3964E3499966p73240l59987m0029K05488N97000J118025J703906K439371L191940
3955F1582440M032642M819737N666784O558865P954567J0191132J3535637J7594345
3947A31936149K1409273K2606352J9234476J0012832k012271j1235294j8400932
3940A73550585k0557328j7323987j3071646r585986p151936n257673l830174k716532
3932I4055323j755169o42143N31384J744771K999776M266650N521223O972750
3924A13694565Q717034J1025345J4183687J8526082K3403454K7738305K8890735
3917B46179207K4750914J4305878O91036j3680973k4357983k6843750k4809773
$$ y = [71492361, 75824130, 75743999, 71366996, 65510983, 60595158, 57129335, 54891118, 53499966, 52726726, 52366739, 52326710, 52532198, 53129198, 54247223, 55951129, 58390500, 61582440, 65615082, 70434819, 76101603, 82660468, 90615035, 100806167, 114341804, 131936149, 153345422, 175951774, 195186250, 205199082, 203186811, 191951517, 173550585, 152993257, 135669270, 122597624, 113011638, 105859702, 100602029, 96771855, 94055323, 92300154, 91658011, 92189395, 93934166, 96933942, 101200592, 106721815, 113694565, 122411599, 133436944, 147620631, 166146713, 189550167, 217288472, 246179207, 270930121, 285235999, 285927035, 272246062, 247888079, 221044329, 196234556]
3910A96234556j9815224j4543088j0267667o960702m171472j485419J212628L859347
3902A44062959O262613Q887045J3184274J9831860K9247337L9859130M7974199
3895C09309417M6754536L0718423K30870k8916073l3808348k1777627j1887402
3888B90623796j0152201j4780394k1288838k5784470k7587679k5120239k0191857
3881A45718118j5805944j2350254r888553q213990p258505o467680n684785m787355
3873G5261052m001507l315609k657140k011193j479137j069926q09514m79582
3865E9437444J38623J179781K483163L652641M051373L005356O707m073240o909733
3856F2972115p111921n844641m524093l589982k968486k487030k177770j938573
$$ y = [196234556, 176419332, 161876244, 151608577, 144647875, 140476403, 138990984, 140203612, 144062959, 150325572, 159212617, 172396891, 192228751, 221476088, 261335218, 309309417, 356063953, 386782376, 387013246, 358097173, 324288825, 302511198, 290623796, 280471595, 265691201, 244402363, 218617893, 191030214, 165909975, 145718118, 129912174, 117561920, 107673367, 99459377, 92200872, 85733192, 80048407, 75261052, 71259545, 67943936, 65286796, 63275603, 61796466, 60726540, 59917026, 59437444, 59576067, 60755848, 63239011, 66891652, 70943025, 73948381, 73955088, 69881848, 62972115, 55860194, 50015553, 45491460, 41901478, 38932992, 36445962, 34268192, 32329619]
3848C2329619j692998j535130j408229j190109j063619j040455r70999r53902
3840B2474178q76299q13981q08954p50453o76957n90695n95593n17552m61201
3831A6382493m80151m91127m61090l98189m24069l80903l45675l45948l25678
3822A2729663l32520l73550l28029l05132k93034l28321l11159l01439l55071
3813I801408l35573k93791l13686k60390k89315k38031k23440k02661k32149j49812
3803G262560j22079j47372j23723j73205j58689j63084j83268j84534r7780r9433
3793E809393j32982j15626j06708j27551j24547j01441j07853j19651j22722j27697
3783D622615p0649m8273n3398l8235l6789j12174r6630q4117p7819r9163j26756
$$ y = [32329619, 30636621, 29101491, 27693262, 26503153, 25439534, 24399079, 23428080, 22474178, 21597879, 20783898, 19974944, 19224491, 18547534, 17956839, 17361246, 16843694, 16382493, 15902342, 15411215, 14950125, 14551936, 14127867, 13746964, 13401289, 13055341, 12729663, 12397143, 12023593, 11695564, 11390432, 11097398, 10769077, 10457918, 10156479, 9801408, 9465835, 9172044, 8858358, 8597968, 8308653, 8070622, 7847182, 7644521, 7412372, 7262560, 7140481, 6993109, 6869386, 6696181, 6537492, 6374408, 6191140, 6006606, 5908826, 5809393, 5676411, 5560785, 5454077, 5326526, 5201979, 5100538, 4992685, 4873034, 4750312, 4622615, 4551966, 4503693, 4450295, 4412060, 4375271, 4263097, 4166467, 4082350, 4004531, 3905368, 3778612]
3772C778612j02619j11647q5125q6402j27745o5418l5352p5463r920j422m0221
3761C037278j3556N2223P1394J9806M5559M5328j1266o575k4758p3931n7203m3919
3749C040380p59L4721k5122l3705p6795q2909j09504j19030j14084p4112k2890
3738B416191Q800j4593l5860J7684J9845M2963L8279N3472M8838K6265M7850M7544
3726B717278N9159Q7043J5805K8381M5892J6542l5378k2212q9446j58109k01288
3715B463667j49107r1618j20634o1703j5038Q37L8354N0334O215M3357P0442P3128
3703B308234J24898J11227J25972Q3867K3472O3879J17174J03584Q9873J31734
3693C283914J03884l44p7465k02335k44740j95910j88226j55779n3841l8172n1185
$$ y = [3778612, 3675993, 3564346, 3479221, 3392819, 3265074, 3199656, 3164304, 3088841, 3078921, 3077499, 3037278, 3023722, 3075945, 3147339, 3167145, 3212704, 3258032, 3246766, 3240191, 3215433, 3141502, 3084299, 3040380, 3039621, 3074342, 3049220, 3015515, 2938720, 2855811, 2746307, 2627277, 2513193, 2439081, 2416191, 2424991, 2410398, 2374538, 2392222, 2412067, 2455030, 2493309, 2546781, 2595619, 2621884, 2669734, 2717278, 2776437, 2863480, 2879285, 2907666, 2953558, 2970100, 2934722, 2912510, 2823064, 2664955, 2463667, 2314560, 2222942, 2102308, 2040605, 2025567, 2026404, 2064758, 2115092, 2121307, 2164664, 2235106, 2308234, 2433132, 2544359, 2670331, 2754198, 2777670, 2841549, 2958723, 3062307, 3152180, 3283914, 3387798, 3387454, 3309989, 3107654, 2862914, 2667004, 2478778, 2322999, 2269158, 2230986, 2179801]
3682B179801j7971l301m065k9563j5250n0168m4243j282k385M0531j7039O5468
3670B100533K8488O0727Q7215O6940M5813L253n1906q3514j13476q6965n7709
3659A999399r380k4837r733R5159P0184R6855R1709O0892o2282q8356j36400j41955
3647A941255j12267j11710p3207o9297m5454j156J9612L6432K2398J641m4211
3636A564036k7924m0974k1264M155M4055N5329Q7661R7884J14476J32643J59047
3625B169124J37027O5782j1279j22542j48343j77337j82753r8310o9105r3612
3615A468652o8620m8049j2460r31k0537K5254J499N4807M4087M9294J10929J56521
3603A760446J77529K19035K81820L32988K06051M1463j48631k29270k52000k00148
$$ y = [2179801, 2161830, 2158529, 2154464, 2124901, 2109651, 2059483, 2015240, 2013958, 2011573, 2052104, 2035065, 2100533, 2129021, 2189748, 2276963, 2343903, 2389716, 2392969, 2341063, 2257549, 2144073, 2057108, 1999399, 1990019, 1965182, 1955449, 2050608, 2120792, 2217647, 2309356, 2370248, 2307966, 2219610, 2083210, 1941255, 1828988, 1717278, 1644071, 1574774, 1529320, 1528164, 1547776, 1584208, 1606606, 1608247, 1564036, 1536112, 1495138, 1473874, 1478029, 1522084, 1577413, 1665074, 1762958, 1877434, 2010077, 2169124, 2306151, 2371933, 2360654, 2238112, 2089769, 1912432, 1729679, 1631369, 1562264, 1468652, 1400032, 1351983, 1339523, 1338592, 1318055, 1343309, 1344808, 1399615, 1443702, 1492996, 1603925, 1760446, 1937975, 2157010, 2438830, 2771818, 2977869, 3019332, 2870701, 2641431, 2389431, 2189283]
3593B189283k18601k06434j81570j63934r8402o1482p4110p3879k6410l0669m9139
3582A004653k3316k4043k7063N230k5302k3702j2053o2803k7452o303j9322K6942
3570G85466L8969L5723n1689J6236p411o4551j881k0684o8839m508J6978n962
3558F67847m0059J9316K7617n0546l5925N920j7782l8311j5809k469j3414L239
3546E09624K3664j1949j9739N317J995j9184L0720l841k6055J5168K7663N690
3534E39073m7610j4359K5258L0418M587j4163j255K4540l6354j5985k7514J5943
3522D82579q244j1316j1946J7756J110m192K4965J8445j5k1578O146m330L4256
3509E23636j4105j6548m600M1283K0430l6723K2423k341k268J7491M3439N1299
$$ y = [2189283, 1970682, 1764248, 1582678, 1418744, 1320342, 1258860, 1184750, 1110871, 1084461, 1053792, 1004653, 981337, 957294, 930231, 935461, 910159, 886457, 874404, 811601, 784149, 777846, 758524, 785466, 824435, 860158, 808469, 824705, 817294, 752743, 750862, 730178, 661339, 656831, 673809, 667847, 627788, 647104, 674721, 624175, 588250, 594170, 576388, 538077, 522268, 519799, 506385, 509624, 533288, 521339, 501600, 506917, 508912, 489728, 520448, 516607, 490552, 505720, 533383, 539073, 491463, 477104, 502362, 532780, 537367, 523204, 521949, 546489, 510135, 494150, 466636, 482579, 474335, 463019, 451073, 468829, 469939, 465747, 490712, 509157, 509142, 487564, 493710, 489380, 523636, 509531, 492983, 488383, 529666, 550096, 513373, 535796, 533455, 531187, 548678, 592117, 643416]
3497F43416N3951Q8701O6228K6439L0379l2931j02664n0931m0215m7164j4377
3486F20832j0342j801J0155J0227j9708r346Q900l9727m825r348J8186m687K0516
3473E89032M7160j6569J9115K7071K7821L4381j1014O4240J01789J05877J48321
3462A137224J27010P2145m0815j46471j39315q0738m9764m0833n7746m8779n71
3451G31347P210l9131K243l7926R66k5387o711l5714L5818K651q213J9923l0574
3438F16502L4194L4057Q26K4940K5746N193M2418P5993N4425L6580K2015m5103
3426I27786l7826m2888o8349j8778k3518k8973l579j1127n546J1860j5196l896
3414F79970j7392k2402p48n6671K2223J4800M9137n592j7614J6485L115Q465O477
$$ y = [643416, 697367, 786068, 852296, 878735, 909114, 876183, 773519, 722588, 682373, 635209, 620832, 610490, 608689, 618844, 629071, 609363, 600017, 608917, 569190, 564365, 555017, 573203, 568516, 589032, 636192, 619623, 638738, 665809, 693630, 728011, 716997, 781237, 883026, 988903, 1137224, 1264234, 1336379, 1295564, 1149093, 1009778, 929040, 879276, 838443, 780697, 731918, 731347, 738557, 699426, 701669, 663743, 664709, 639322, 632611, 596897, 632715, 635366, 627153, 647076, 616502, 650696, 684753, 685579, 710519, 736265, 741458, 783876, 859869, 914294, 950874, 972889, 927786, 889960, 847072, 778723, 759945, 736427, 707454, 703875, 692748, 687202, 699062, 683866, 679970, 662578, 640176, 639428, 582757, 604980, 619780, 668917, 663325, 645711, 662196, 665311, 673776, 680253]
3401F80253J2706j9387J944J1721J4039q960N544K1270j5071J1355L6833M3292
3389G95539J0235j5365K4762R0L9726J0723J4171m5215J3752j032m1897N614m1927
3376G69176J6473J60j1347K9799L3393r805K1513N556M4036M0809o60j5232K2052
3363I45923n894L0358k5864P6719J8168K6275O8690O1062L8666K543L0153Q658
3351A275457N608J4678K0010p1856l4674o273j2746N9230L4979K7549P2387M2342
3339A426691k443L3690K9095K0923Q406N6930M8465M8014M8905Q4848N8666O5793
3327A927983L7692O9780J11022J59183J18001J38368J25893J18809J17058l106
3317B920683o9506o6692o6829J6316j1227K7240K1302J9219J7538k0282L1738
$$ y = [680253, 692959, 673572, 675516, 687237, 701276, 692316, 697860, 719130, 704059, 715414, 752247, 795539, 805774, 790409, 815171, 815261, 854987, 865710, 879881, 834666, 848418, 847386, 805489, 811103, 769176, 785649, 785809, 774462, 804261, 837654, 827849, 849362, 854918, 898954, 939763, 939103, 923871, 945923, 940029, 970387, 944523, 1021242, 1039410, 1065685, 1134375, 1195437, 1234103, 1236646, 1266799, 1275457, 1281065, 1295743, 1315753, 1243897, 1209223, 1202950, 1190204, 1249434, 1284413, 1311962, 1384349, 1426691, 1424248, 1457938, 1487033, 1507956, 1516362, 1573292, 1621757, 1669771, 1718676, 1803524, 1862190, 1927983, 1965675, 2035455, 2146477, 2305660, 2423661, 2562029, 2687922, 2806731, 2923789, 2920683, 2851177, 2784485, 2717656, 2733972, 2722745, 2749985, 2771287, 2790506, 2808044, 2787762, 2819500]
3306B819500L1144R909k3761j2466j8698j7876q730M1273q505J1195Q635J4600
3294B846220j3679l4840l5557m2119n29o613N646M4269K9137O1677L9305M2948
3282B935865K6573M2126O1758O2133o711Q1694Q6161R7112O0741O8695P0833Q3932
3270C670912P8699J03845J13145J12256J18425J29480J39295J58858N9506J01359
3260D785780Q4423J07791J05196J59768J16978J25842J16639J68366J82969J69533
3250F123285J68525J47249J05384J49996J28390J56584K18707K37814K01245K42184
3240G879363K37413K53987K21051K84915L03535K78037L32811L69101L64564M20840
3230A0945617L69703L50791L52182L86652L71802M61048M87097O19337P46045
$$ y = [2819500, 2850644, 2860553, 2836792, 2824326, 2805628, 2787752, 2779022, 2820295, 2811790, 2822985, 2831620, 2846220, 2832541, 2797701, 2762144, 2720025, 2719496, 2712883, 2718529, 2762798, 2791935, 2853612, 2892917, 2935865, 2962438, 3004564, 3066322, 3128455, 3121744, 3203438, 3289599, 3386711, 3447452, 3516147, 3586980, 3670912, 3749611, 3853456, 3966601, 4078857, 4197282, 4326762, 4466057, 4624915, 4684421, 4785780, 4870203, 4977994, 5083190, 5242958, 5359936, 5485778, 5602417, 5770783, 5953752, 6123285, 6291810, 6439059, 6544443, 6694439, 6822829, 6979413, 7198120, 7435934, 7637179, 7879363, 8116776, 8370763, 8591814, 8876729, 9180264, 9458301, 9791112, 10160213, 10524777, 10945617, 11315320, 11666111, 12018293, 12404945, 12776747, 13237795, 13724892, 14344229, 15090274]
3221A5090274Q85135J076651J330166J572232J928982K274707K575675L025079
3213B9758901M039569N620911P969591J0412953J2163278J0783139N350471m223911
3205H1874902j2280775j1974665q812116o083297m202052k995251k191237j626838
3197C1708671j168732q35237o39717m45646j94182N7527K83642O05010R30958
3188C0302294J261425J748757K308803L024798L853321M383784M995342O453560
3180E8332084R007928J2966866J7879586K2271788K2579499J5035396p11677k0827637
3172A36533833k6208786k0418778j4786749j0424553p798757n941717m759674
3165D6194819l839263l123330k619453k358585j899908j556402j213490r63342
$$ y = [15090274, 15975409, 17052060, 18382226, 19954458, 21883440, 24158147, 26733822, 29758901, 33798470, 39419381, 47388972, 57801925, 69965203, 80748342, 86098813, 81874902, 69594127, 57619462, 48807346, 42724049, 38521997, 35526746, 33335509, 31708671, 30539939, 29704702, 29064985, 28619339, 28425157, 28482684, 28766326, 29371336, 30302294, 31563719, 33312476, 35621279, 38646077, 42499398, 46883182, 51878524, 58332084, 67340012, 80306878, 98186464, 120458252, 143037751, 158073147, 157361470, 136533833, 110325047, 89906269, 75119520, 64694967, 56896210, 50954493, 46194819, 42355556, 39232226, 36612773, 34254188, 32354280, 30797878, 29584388, 28621046]
3157B8621046o92795n06809j76293J91517N57297R79263J480675J800131K270636
3148C4524668L338494M921087P145039R471832J0796460Q761936K869760o503955
3140G5325321j3066566j1711077q660537o156854m672299l597363k894544k317300
3132B2248781j934800j618017j450152j230476j035911q63891q06954p13292o96613
3123A1898675o12274n78335m95570m44470l75035l59770k97643l12953k83961
3114H138664k68271k87335k57730k37299k29113j71909k47797k00771j86291j86255
3104E865893j68679k06049k54089j91938j69060j72691j61630j27210j46983j20321
3094D147243j41976r8873j25560j22301j36146j22925r8111j04591p6376n4566
$$ y = [28621046, 27928251, 27421442, 27245149, 27436666, 27993963, 28973226, 30453901, 32254032, 34524668, 37863162, 42784249, 49929288, 59401120, 70197580, 78959516, 81829276, 75325321, 62258755, 50547678, 41887141, 35730287, 31057988, 27460625, 24566081, 22248781, 20313981, 18695964, 17245812, 16015336, 14979425, 14115534, 13308580, 12595288, 11898675, 11286401, 10708066, 10212496, 9768026, 9392991, 9033221, 8735578, 8422625, 8138664, 7870393, 7583058, 7325328, 7088029, 6858916, 6687007, 6439210, 6238439, 6052148, 5865893, 5697214, 5491165, 5237076, 5045138, 4876078, 4703387, 4541757, 4414547, 4267564, 4147243, 4005267, 3906394, 3780834, 3658533, 3522387, 3399462, 3301351, 3196760, 3120384, 3065818]
3084C065818o6769o6624p1256q6577m3318k5445n0138q4716n1456o5203m1478
3073B412838l3290n6500n1270o7815m7176p2247p8358n1229l2639o2246N649l1471
3061A834246n2212n7259p0131k3703n2163p2523o5486l6715o6456o976L1704Q981
3049A371307n5260k1285l8661j5285o9795p972n964l1955j683K26K043n050m484
3036A116182l4751j5991k5083n4468k7383k0066k5641m461K364k6530j3847k1820
3024H48505j0566K169L1625m918l369M776P837O861L0839o571k7011k4217l5072
3011H20888q5065k5346r149o188K0960L818j2640k0757n2759k2836o3424k0590
2999E26912n9317k4570r347L1937K9725M0723l0500L760M5139L8049j1611O351
$$ y = [3065818, 2999049, 2932425, 2861169, 2774592, 2731274, 2705829, 2655691, 2570975, 2519519, 2454316, 2412838, 2379548, 2323048, 2271778, 2203963, 2156787, 2084540, 2006182, 1954953, 1922314, 1860068, 1865717, 1834246, 1782034, 1724775, 1654644, 1630941, 1578778, 1506255, 1440769, 1404054, 1337598, 1330622, 1362326, 1371307, 1316047, 1294762, 1256101, 1240816, 1171021, 1163049, 1157085, 1125130, 1123447, 1123673, 1125716, 1120666, 1116182, 1081431, 1065440, 1040357, 985889, 958506, 938440, 912799, 908338, 910702, 884172, 870325, 848505, 837939, 840108, 871733, 866815, 863446, 868222, 876059, 882920, 913759, 907188, 880177, 855960, 820888, 735823, 710477, 701328, 695140, 716100, 719918, 707278, 686521, 633762, 610926, 547502, 526912, 467595, 443025, 433678, 465615, 495340, 536063, 505563, 509323, 554462, 592511, 580900, 587251]
2987E87251J8550K202K7000R116O3185N7375k4382m6351m2341m269m9940l7567
2975E59829j1394k171M999n8l5134o5250l2973k6143o621o336J3830j9068l0108
2962C43402J9792L4215K0979J0697J026m306M3230j0909J8128J1547n003O334
2950D89132j4296M4P339L783K4475L3334j7241k7529l6478j3361K1519Q913k458
2937D77176l281o564j5654j7787J3656j6324L8376k1135L0517K2362R056M971
2925E15369M3730j779M787K1769J05787Q3568L5451M4831L4422p1561m8601o6486
2913G01287n0746l0610r786K3841j1568j7449r66K3169o513J3147P221N5451k0350
2900F76128m995q331J7883K8114J1143K2206K3126N9367L3280L0932L8744J31597
$$ y = [587251, 605801, 608003, 635003, 644119, 707304, 764679, 740297, 693946, 651605, 647336, 597396, 559829, 548435, 546264, 551263, 551205, 516071, 450821, 417848, 391705, 385084, 378748, 392578, 373510, 343402, 363194, 397409, 418388, 429085, 430111, 425805, 469035, 458126, 476254, 487801, 482798, 489132, 474836, 474880, 482219, 486002, 510477, 543811, 526570, 499041, 462563, 449202, 470721, 479634, 477176, 473895, 467331, 451677, 433890, 447546, 431222, 469598, 448463, 478980, 501342, 510398, 515369, 559099, 557320, 562107, 583876, 689663, 773231, 808682, 853513, 887935, 816374, 767773, 701287, 650541, 619931, 610145, 633986, 622418, 604969, 604003, 627172, 620659, 633806, 641027, 696478, 676128, 671133, 662802, 680685, 708799, 719942, 742148, 765274, 824641, 857921, 888853, 927597, 1059194]
2888A059194J51822J52680P3291K9489m0997j25980j10661j04758p4146p0178
2878I39756m0401o490q608J0198j7583k1122L2304O8259Q503M0825L6442M3828
2866A085911N0944L4602L5411Q4210P9229L7430L8136J2957N1009R4359O9240
2855A673438Q0372P8557K9262k199p1765m7819l0863o2955j4145l8764k0547k3230
2843A549342K67K9472J146k7977J5037N0043K0029M1630P3307M3085Q3773J37482
2831B016636J37489J61132J93439J48284M2647q3790j93237j70696j47059j28073
2821A976772j40677j30594q1267p5038n1417o2732r3397j0962j9180k9413m7995
2810A234100j9136K2788L871P016j6960j4970Q032J0361K4045K9363M7516j2759
$$ y = [1059194, 1211016, 1363696, 1436987, 1466476, 1425479, 1299499, 1188838, 1084080, 1009934, 939756, 899355, 892865, 884257, 894455, 876872, 855750, 888054, 956313, 964816, 1005641, 1042083, 1085911, 1136855, 1171457, 1206868, 1291078, 1370307, 1407737, 1445873, 1458830, 1509839, 1604198, 1673438, 1753810, 1832367, 1861629, 1859430, 1787665, 1739846, 1708983, 1646028, 1631883, 1593119, 1572572, 1549342, 1549609, 1579081, 1580227, 1552250, 1567287, 1617330, 1637359, 1678989, 1752296, 1795381, 1879154, 2016636, 2154125, 2315257, 2508696, 2656980, 2699627, 2615837, 2422600, 2251904, 2104845, 1976772, 1836095, 1705501, 1624234, 1549196, 1497779, 1435047, 1341650, 1330688, 1311508, 1282095, 1234100, 1214964, 1237752, 1241623, 1248639, 1231679, 1216709, 1224741, 1235102, 1259147, 1288510, 1336026, 1323267]
2798A323267M6752R053m5510o6370m6964k9261o3402q7233n6469n9716n1846l9227
2786H33074o3244l2417K0014l8456r904j0857l2466n3995l4800k978l793q15m6441
2773E22922j9591j1450m4501j8857p468j2185J860l2424Q82N338n4084J0239R548
2760C50229j9284k0345n2926Q445L616q0j6811j7607m316j9852k0619L3467J0384
2747B34301j0828k3372k1854N416J4944J2769j3103J3411k6053j2768l2546M229
2735A44546J9000j5842j6425p724O71j3064L0648J1301n4904j0777N41j4902L4067
2722A07136M381k8462J7826r120N381j8479o865K474O200K2448l4802m900k275
2709F0943j0171L68K2537K1311q829j999j7714j1203j8442K674J7481k2622K2627
$$ y = [1323267, 1370019, 1379072, 1333562, 1267192, 1220228, 1190967, 1127565, 1040332, 983863, 924147, 872301, 833074, 769830, 737413, 757427, 718971, 709067, 698210, 665744, 611749, 576949, 573971, 570178, 569363, 522922, 503331, 491881, 447380, 428523, 421055, 408870, 410730, 378306, 379188, 384526, 330442, 340681, 350229, 330945, 310600, 257674, 266119, 269735, 269655, 252844, 235237, 230921, 211069, 190450, 223917, 234301, 223473, 200101, 178247, 183663, 198607, 211376, 198273, 211684, 185631, 172863, 140317, 144546, 163546, 147704, 131279, 123555, 124226, 111162, 141810, 153111, 98207, 87430, 87971, 73069, 107136, 111517, 83055, 100881, 91761, 97142, 78663, 71798, 74272, 80472, 102920, 68118, 63218, 60943, 50772, 51140, 73677, 94988, 86159, 84160, 66446, 55243, 36801, 39475, 56956, 34334, 56961]
2696E6961J9682k878j4792m9503J8425j5417p314M5818j0202l8809L0733O889
2684C9593j8081O344j3533O349J9652k0595r099K1768K0448l6227J6741J0599
2672D3959k8032j2955k2409Q282J2389m806j2452N815r406j5968L7896p057l9869
2659d4613J4897k4096K463j8807L7087j7867K7780N829K819J6194L3791l0810
2647D667J3335k5211l5522L4208P773j9464j3206j1027J9388p13J1641K2807M0773
2634D9449n397k1449k0718l0340r756L5923k078l3782j3067K5825L8237j3367
2622e20j1384L503J7240L85L797k4842m2474J0767J7912J0284P519Q079k1032
2609b0766n256J7300l7934J4663p348L352J8147j2632J1492k416O032K9052k9959
$$ y = [56961, 76643, 73765, 58973, 9470, 27895, 12478, 5164, 50982, 40780, 1971, 32704, 39593, 21512, 27856, 14323, 20672, 40324, 19729, 10630, 32398, 52846, 16619, 33360, 43959, 15927, 2972, -19437, -11155, 1234, -3572, -16024, -10209, -19615, -35583, 2313, -4744, -44613, -29716, -53812, -51349, -70156, -33069, -50936, -23156, -17327, -14508, 1686, 35477, 4667, 18002, -7209, -42731, -8523, -750, -20214, -33420, -44447, -25059, -25772, -14131, 8676, 49449, 44052, 22603, 1885, -28455, -38211, -2288, -4366, -38148, -51215, -25390, 12847, -520, -11904, -8401, 8839, 9224, 13021, -11821, -54295, -43528, -25616, -15332, -7813, 266, -20766, -26022, -8722, -46656, -31993, -39341, -35989, -17842, -30474, -18982, -21398, -15366, 13686, -16273]
2596a6273j6317K5632J4894N934K333k7390n918J7326p597l378L324J036r272
2583a5666n1880J1598M1663k110j6680O167j2220l028n311J8946K4587j1214J1834
2570c314M663J5393q874k9415k1592Q585L1734R02q28j1278J0564j1851O727l0287
2556c8871J535P264k4878J5531K0262J444J2255p441K7060j9582j1464j483L147
2543a5221k5294j4926L310L0873K1014j9835k2065J4001J106j7706Q019j1610
2531d8334K4351q903l7088N7396J3344m559K3374o496k5863l969j9073L7715m3116
2518d1221L583J4175j827J6756l665j2799L4088p821p499Q978k1150O754k354
2505a4002j2029J7100K3957m2636J8826N165j6331j2959K8570K355j1551J0873
$$ y = [-16273, -32590, -6958, 7936, 13870, 16203, -11187, -17105, 221, -7376, -10754, -7430, -6394, -15666, -67546, -55948, -14285, -16395, -33075, -26908, -39128, -42156, -47467, -28521, -3934, -15148, -3314, 1349, 16742, 7868, -21547, -43139, -34554, -2820, -1918, -2746, -14024, -3460, -15311, -8584, -38871, -37336, -30072, -54950, -39419, -19157, -17713, -5458, -12899, 14161, -5421, -16885, -18368, -15221, -40515, -55441, -52131, -21258, -244, -20079, -42144, -28143, -27037, -44743, -36724, -48334, -23983, -32886, -69974, -12578, 766, -3793, 19581, 13085, -12778, -16747, -35820, 1895, -41221, -37638, -23463, -25290, -8534, -12199, -24998, 9090, 1269, -6230, 2748, -18402, -11648, -14002, -26031, -8931, 15026, -27610, -8784, -3619, -19950, -32909, -4339, -1984, -13535, -2662]
2493b662r49o264J6833k1999K6951l0111p916p895O574L5687K771k7421J6873
2480D72k9264J2779J8159k8149k3251j4277L7522R309j3599k2850J2466K465O081
2467c2137L936j8955R933j8911j4299j0660K5282M0949j0627J3874k6535q269
2455d6419O607j2535k7742k701P209j1593K6566M5551L0392k5384k7956l3455
2443g1460L5335n739k497K8744j5905k0197J2613K4472m0029j061K4137m5870
2431g7457o361n719O52K8540j1347k1161O906J909L1052N525O615j9037L5760
2418b4123J2k6996j0807k092J9597K1375n1240P386M034L5236J6803m5480j0772
2405f7067J9147n156k2843O070Q967k8249k5007L8477n086J6260J131l123M112
$$ y = [-2662, -3611, -9875, 6958, -15041, 11910, -18201, -26117, -34012, -27438, 8249, 11020, -16401, 472, -28792, -16013, 2146, -26003, -49254, -63531, -26009, -16700, -30299, -53149, -40683, -38218, -32137, -28201, -47156, -37223, -56134, -70433, -81093, -55811, -14862, -25489, -11615, -38150, -46419, -39812, -52347, -80089, -82790, -75581, -87174, -60608, -15057, 15335, -10049, -38005, -71460, -36125, -41864, -44361, -15617, -31522, -51719, -39106, -14634, -54663, -55724, -31587, -77457, -83818, -89537, -88885, -60345, -71692, -92853, -85947, -84038, -52986, -47461, -40846, -59883, -24123, -24111, -51107, -61914, -64006, -44409, -23034, -74274, -66888, -62854, -27618, -10815, -56295, -67067, -47920, -53076, -75919, -69849, -60882, -89131, -114138, -75661, -80747, -64487, -63356, -66479, -62367]
2392f2367k748P119J0172k2960O962r35L15ml817Q404j1899l06m025j1873K6724
2377f1238p621J1816Q287j4606k1693N996L3763J8172Q219l3390j3560l4051j7498
2364a17404P2532J2265k149p924J5014M56n965k453J085R599m786k3834j0867
2351f4431J687R018n910O897L084K0043l3474J8289R962l0285P197k962M187j9946
2337g6644l618L0933j8264K3407j8270L259P210r154o904L4927j3321k5251n510
2324g7200J0247L2324O364m5756j9864K8353L2135j1247j3980Q39o635K9451J139
2311c3830q491k8445J5797n750l6151L3075K5849j9274L940L088l77L4751J1737
2298d081j8121k277K6136m91K0287M5014n4914k2906l1253N027J4098J0753k350
$$ y = [-62367, -65115, -57996, -47824, -70784, -63822, -64757, -64442, -64446, -68263, -59859, -71758, -72064, -76089, -87962, -61238, -68859, -57043, -48756, -63362, -85055, -79059, -45296, -27124, -18905, -52295, -65855, -99906, -117404, -44872, -32607, -34756, -42680, -27666, -27210, -33175, -35628, -34543, -24944, -29730, -53564, -64431, -62744, -53726, -59636, -52739, -49655, -29612, -63086, -44797, -34835, -65120, -57923, -60885, -56698, -76644, -80262, -49329, -67593, -44186, -62456, -59197, -51987, -61141, -68045, -33118, -46439, -71690, -77200, -66953, -34629, -28265, -74021, -93885, -65532, -33397, -44644, -58624, -57785, -64420, -34969, -33830, -42321, -70766, -54969, -60719, -96870, -63795, -37946, -57220, -53280, -50192, -50569, -15818, -4081, -22202, -24479, 1657, 1166, 21453, 66467, 11553, -11353, -42606, -37579, -23481, -12728, -15078]
2285a5078K5773k2875m4338l706K8477L688P181m450j1596k252k3420j281j4835
2272g8712j3353J0962J2409K0996Q024J9589K8875l9717l3937L2043K972J1127
2260a8722O125k1293j844m930R53j1467J209J4464q735j2058M8009L171l5344
2247d0462R690n381K2227K1184k7024l223J2437J9129l6832k5542R103l3950P871
2234g0773J7912j4201Q314K8618k2557J8353M8022J326k1450Q674k086O9l5958
2221c5737J0012k0600J427M6816r949j9390M89p657j5382M6091N3293l0837m3655
2208b5079l557J7545L3937l4172j3248j553N663j0430m6944m11J5097J4714L2457
2195a5981J4119m3730L4734J5758Q550m7794j048R305p010j6525K3328M5574o218
$$ y = [-15078, 10695, -12180, -56518, -60224, -31747, -28059, -20878, -25328, -36924, -39176, -62596, -63877, -78712, -92065, -81103, -68694, -47698, -39674, -20085, 8790, -30927, -64864, -32821, -29849, -18722, -12597, -33890, -35734, -40664, -39711, -51178, -49969, -35505, -44240, -56298, -8289, -5118, -40462, -30772, -36153, -13926, 7258, -19766, -22989, -10552, 8577, -28255, -53797, -44694, -78644, -70773, -52861, -67062, -58748, -30130, -52687, -34334, 13688, 15014, -6436, 2238, 152, 221, -35737, -25725, -46325, -44898, 1918, -8031, -27421, -26932, -34589, -49971, -3880, 49413, 18576, -25079, -28636, -11091, 22846, -11326, -24574, -26127, -20464, -30894, -77838, -78249, -63152, -48438, -15981, -1862, -45592, -10858, 4900, 13450, -34344, -35392, -26087, -33097, -49622, -26294, 19280, 13062]
2182A3062l8524k5516K1452Q179m810J963O448k0022P724n27K4826J091M370k2082
2168b2366J663k955k647N536M6354Q778l9520p04J9780k3994J2487l881J4191
2155A2722L349L262m0627j9234K7284J7584J9434m508K7419j5928k0488Q725n195
2142A3799q90k4274L7576J7518n646K400n747O604K35p687K875J8743m4030J2605
2128B4081N178k84K93p411R603j8088N508K0394k501j8932K3577J8845L6527k8098
2114F8692M995K1205j9037M14j8867n289n738J1762K0397k537J0737J1909J3979
2101A12622O072K0212J4565q486j5501L704L0718Q395N670M602j4355L8592j904
2088B04906j0319j8021P984k6965K1327K6719K0508L8701k3301J780K768K5196
$$ y = [13062, -25462, -50978, -29526, -21347, -26157, -24194, -17746, -37768, -30044, -30571, -5745, -4654, -284, -22366, -20703, -23658, -26305, -20769, 25585, 34363, -5157, -5861, 13919, -10075, 2412, -1469, 12722, 16071, 19333, -21294, -40528, -13244, 4340, 23774, 19266, 46685, 30757, 10269, 18994, 13799, 12909, -11365, 26211, 43729, 38083, 40483, 34736, 41340, 41575, 33888, 36763, 55506, 11476, 24081, 29259, 28975, 29268, 21857, 31460, 13372, 18880, 39274, 36773, 17841, 41418, 60263, 96790, 68692, 73687, 94892, 75855, 76269, 57402, 52113, 46375, 58137, 78534, 75997, 86734, 98643, 112622, 118694, 138906, 153471, 144985, 129484, 133188, 163906, 172301, 177971, 182573, 168218, 206810, 204906, 194587, 176566, 184550, 157585, 178912, 205631, 226139, 264840, 241539, 243319, 246087, 271283]
2076B71283O008K0014J8284K0299o829J3683k3115P541P737R130J5154L3429N335
$$ y = [271283, 277291, 297305, 315589, 335888, 329059, 342742, 319627, 327168, 334905, 344035, 359189, 392618, 397953]
$$ [...]
##END NTUPLES=NMR SPECTRUM
##END=
