##TITLE=1H_EC-3239(22)
 CDCl3, 8 sc, 
 23.12.2020
##JCAMPDX= 6.0         $$ Bruker NMR JCAMP-DX V2.0
##DATA TYPE= NMR SPECTRUM
##DATA CLASS= NTUPLES
##ORIGIN= UXNMR, Bruker Analytische Messtechnik GmbH
##OWNER= root
$$ XWIN-NMR		Version 3.5
$$ Wed Dec 23 10:37:47 2020 Russian Standard Time (UT+4h)  she@DPX200
##.OBSERVE FREQUENCY= 200.1315066352
##.OBSERVE NUCLEUS= ^1H
##.ACQUISITION MODE= SIMULTANEOUS
##.ACQUISITION SCHEME= undefined
##.AVERAGES= 8
##.DIGITISER RES= 18
##SPECTROMETER/DATA SYSTEM= spect
##.PULSE SEQUENCE= zg30
##.SOLVENT NAME= CDCl3
##.SHIFT REFERENCE= (INTERNAL, CDCl3, 0, 16.0196)
##AUDIT TRAIL= $$ (NUMBER, WHEN, WHO, WHERE, WHAT)
$$ ##TITLE= Audit trail, XWIN-NMR		Version 3.5
$$ ##JCAMPDX= 5.01
$$ ##ORIGIN= Bruker BioSpin GmbH
$$ ##OWNER= she
$$ F:/spectra/data/she/nmr/H-F/1/pdata/1/auditp.txt
$$ ##AUDIT TRAIL=  $$ (NUMBER, WHEN, WHO, WHERE, WHAT)
(   1,<2020-12-23 10:35:44.48 +0400>,<she>,<DPX200>,
      <created by zg, POWCHK disabled, PULCHK disabled
       configuration hash MD5:
       00 E9 B6 7A A2 85 ED C7 34 08 36 98 17 FE 4E 26
       data hash MD5: 16K
       4C 40 D2 F2 81 1B FB 60 3E B3 DF F8 35 34 FC 6D>)
(   2,<2020-12-23 10:35:46.81 +0400>,<she>,<DPX200>,
      <Start of raw data processing
       efp BC_mod = 2 LB = 0.24 FT_mod = 6 PKNL = 1 PHC0 = -10761.58 PHC1 = 12.00095 SI = 16K 
       data hash MD5: 16K
       85 63 EB DE F4 B8 2F DC DD 91 32 EC F6 10 A9 66>)
(   3,<2020-12-23 10:36:09.25 +0400>,<she>,<DPX200>,
      <pk PHC0 = -9.371829 PHC1 = 11.4 
       data hash MD5: 16K
       5B 99 2E 37 87 4B D0 A2 95 21 1E 90 14 D6 E8 B0>)
(   4,<2020-12-23 10:36:12.70 +0400>,<she>,<DPX200>,
      <abs ABSG = 5 
       data hash MD5: 16K
       28 5B A8 69 97 9D 9B 57 D6 E2 E2 16 42 A0 54 9C>)
$$ ##END=
$$ 
$$ hash MD5
$$ 07 C7 20 9C 0E E4 F3 E6 7C 2B B9 88 FF 3F 16 E0
##$RELAX= 
##$RELAX= 
##$RELAX= 
##$RELAX= 
##$RELAX= 
##$RELAX= 
$$ Bruker specific parameters
$$ --------------------------
##$DU= <F:/spectra>
##$EXPNO= 1
##$NAME= <H-F>
##$PROCNO= 1
##$TYPE= <nmr>
##$USER= <she>
##$AMP= (0..31)
100 100 100 100 100 100 100 100 100 100 100 100 100 100 100 100 100 100 
100 100 100 100 100 100 100 100 100 100 100 100 100 100 
##$AQSEQ= 0
##$AQ_mod= 1
##$AUNM= <au_zg>
##$AUTOPOS= <>
##$BF1= 200.13
##$BF2= 200.13
##$BF3= 200.13
##$BF4= 200.13
##$BF5= 200.13
##$BF6= 200.13
##$BF7= 200.13
##$BF8= 200.13
##$BYTORDA= 1
##$CFDGTYP= 0
##$CFRGTYP= 5
##$CHEMSTR= <none>
##$CNST= (0..31)
1 1 145 1 1 1 1 1 1 1 1 1 1 1 1 1 1 1 1 1 1 1 1 1 1 1 1 1 1 1 1 1 
##$CPDPRG= <>
##$CPDPRG1= <>
##$CPDPRG2= <>
##$CPDPRG3= <>
##$CPDPRG4= <mlev>
##$CPDPRG5= <mlev>
##$CPDPRG6= <mlev>
##$CPDPRG7= <mlev>
##$CPDPRG8= <mlev>
##$CPDPRGB= <>
##$CPDPRGT= <>
##$D= (0..31)
0 1.2 0 0 0 0 0 0 0 0.06 0 0.03 0 0 0 0 0.0002 0 0 0 0 0 0 0 0 0 0 0 0 
0 0 0 
##$DATE= 1608705343
##$DBL= (0..7)
120 120 120 120 120 120 120 120 
##$DBP= (0..7)
150 150 150 150 150 150 150 150 
##$DBP07= 0
##$DBPNAM0= <>
##$DBPNAM1= <>
##$DBPNAM2= <>
##$DBPNAM3= <>
##$DBPNAM4= <>
$$ [...]
##$SUBNAM3= <"">
##$SUBNAM4= <"">
##$SUBNAM5= <"">
##$SUBNAM6= <"">
##$SUBNAM7= <"">
##$SUBNAM8= <"">
##$SUBNAM9= <"">
##$SW= 16.9725356469052
##$SWIBOX= (0..15)
0 0 2 0 0 0 0 0 0 0 0 0 0 0 0 0 
##$SW_h= 3396.73913043478
##$TD= 16384
##$TD0= 1
##$TE= 0
##$TE2= 300
##$TE3= 300
##$TEG= 300
##$TL= (0..7)
0 120 120 120 120 120 120 120 
##$TP= (0..7)
150 150 150 150 150 150 150 150 
##$TP07= 0
##$TPNAME0= <>
##$TPNAME1= <>
##$TPNAME2= <>
##$TPNAME3= <>
##$TPNAME4= <>
##$TPNAME5= <>
##$TPNAME6= <>
##$TPNAME7= <>
##$TPOAL= (0..7)
0.5 0.5 0.5 0.5 0.5 0.5 0.5 0.5 
##$TPOFFS= (0..7)
0 0 0 0 0 0 0 0 
##$TUNHIN= 0
##$TUNHOUT= 0
##$TUNXOUT= 0
##$USERA1= <user>
##$USERA2= <user>
##$USERA3= <user>
##$USERA4= <user>
##$USERA5= <user>
##$V9= 5
##$VALIST= <valist>
##$VCLIST= <CCCCCCCCCCCCCCC>
##$VD= 0
##$VDLIST= <DDDDDDDDDDDDDDD>
##$VPLIST= <PPPPPPPPPPPPPPP>
##$VTLIST= <TTTTTTTTTTTTTTT>
##$WBST= 1024
##$WBSW= 4
##$XGAIN= (0..3)
0 0 0 0 
##$XL= 0
##$YL= 0
##$YMAX_a= 695278
##$YMIN_a= -657139
##$ZGOPTNS= <>
##$ZL1= 120
##$ZL2= 120
##$ZL3= 120
##$ZL4= 120
##$ABSF1= 15.99682
##$ABSF2= -0.9758434
##$ABSG= 5
##$ABSL= 3
##$ALPHA= 0
##$AQORDER= 0
##$ASSFAC= 0
##$ASSFACI= 0
##$ASSFACX= 0
##$ASSWID= 0
##$AUNMP= <proc_1d>
##$AZFE= 0.1
##$AZFW= 0.1
##$BCFW= 0
##$BC_mod= 2
##$BYTORDP= 0
##$COROFFS= 0
##$CY= -3
##$DATMOD= 1
##$DC= 0
##$DFILT= <>
##$DTYPP= 0
##$F1P= 0
##$F2P= 0
##$FCOR= 1
##$FTSIZE= 16384
##$FT_mod= 6
##$GAMMA= 0
##$GB= 0
##$INTBC= 1
##$INTSCL= 2.992141e-10
##$ISEN= 128
##$LB= 0.24
##$LEV0= 0
##$LPBIN= 0
##$MAXI= 10000
##$MC2= 0
##$MEAN= 0
##$ME_mod= 0
##$MI= 1.114404
##$NCOEF= 0
##$NC_proc= -5
##$NLEV= 6
##$NOISF1= 3.799351
##$NOISF2= 2.8
##$NSP= 0
##$NTH_PI= 0
##$NZP= 0
##$OFFSET= 16.01961
##$PC= 1
##$PHC0= -10770.95
##$PHC1= 23.40095
##$PH_mod= 1
##$PKNL= yes
##$PPARMOD= 0
##$PSCAL= 0
##$PSIGN= 0
##$REVERSE= no
##$SF= 200.129999001297
##$SI= 16384
##$SIGF1= 3
##$SIGF2= 2
##$SINO= 5.538805
##$SIOLD= 16384
##$SREGLST= <1H.CDCl3>
##$SSB= 0
##$STSI= 16384
##$STSR= 0
##$SW_p= 3396.73913043478
##$SYMM= 0
##$S_DEV= 0
##$TDeff= 16384
##$TDoff= 0
##$TI= <>
##$TILT= no
##$TM1= 0
##$TM2= 0
##$TOPLEV= 0
##$USERP1= <user>
##$USERP2= <user>
##$USERP3= <user>
##$USERP4= <user>
##$USERP5= <user>
##$WDW= 1
##$XDIM= 16384
##$YMAX_p= 379917525
##$YMIN_p= -181307
$$ End of Bruker specific parameters
$$ ---------------------------------
##NTUPLES= NMR SPECTRUM
##VAR_NAME=  FREQUENCY,     SPECTRUM/REAL,   SPECTRUM/IMAG
##SYMBOL=    X,             R,               I
##VAR_TYPE=  INDEPENDENT,   DEPENDENT,       DEPENDENT
##VAR_FORM=  AFFN,          ASDF,            ASDF
##VAR_DIM=   16384,         16384,           16384
##UNITS=     HZ,            ARBITRARY UNITS, ARBITRARY UNITS
##FACTOR=    0.207333158178281, 1,           1
##FIRST=     3206.00442348862, 0,            0
##LAST=      -190.734706946155, 0,           0
##MIN=       -190.734706946155, -181307,     0
##MAX=       3206.00442348862, 379917525,    0
$$ Real data points
##PAGE= N=1
##DATA TABLE= (X++(R..R)), XYDATA
$$ [...]
7969C034764o29699m40644l29677l17912j18796k15819r4669k3999j68390n8654
7959F36505o6907K1215k5009n3002m021N143j29417o322K8229j1067m1054n3237
7947C01056J174k6215m2036m1454P1480L2571o3613k5585j6985l8363l6855q391
7935A06784J5015P4794m8317p4800O2231J7388o598K970L0802r448J7759m7014
7923A41566k4600P48l6391k686J13241l2339l2508M4497k2015K0808k2668o3399
7911H4254L8651q5335P573L7901k4221m5574M4210l018P71j4737p715O065l3945
7898D880M3133o3826M4357k8712L765N3876j4300L3613N2728l3620N5017q8664
7886F2247M6962J663l3330k006N385l89K4497j591l4092n970p5443j7302M5030
$$ y = [3034764, 2405065, 1964421, 1634744, 1316832, 1198036, 982217, 887548, 863549, 695159, 636505, 569598, 590813, 565804, 512802, 508781, 513924, 384507, 378185, 406414, 395347, 354293, 301056, 302230, 276015, 233979, 192525, 264005, 296576, 232963, 207378, 190393, 152030, 115175, 106784, 121799, 196593, 148276, 73476, 135707, 153095, 146497, 149467, 180269, 170821, 188580, 141566, 116966, 117714, 81323, 78637, 191878, 159539, 127031, 171528, 149513, 170321, 147653, 84254, 122905, 37570, 45143, 83044, 58823, 13249, 57459, 54441, 55212, 40475, 32760, 38825, 4880, 48013, -15813, 28544, -168, 3597, 57473, 43173, 76786, 129514, 95894, 150911, 62247, 109209, 110872, 77542, 75536, 80921, 80532, 105029, 103438, 69346, 63376, -12067, -29369, 15661]
7873A5661Q712j0528m7637K2298l5040K2724J0405P7771O1059p9794L4103n2073
7861B7661P441r737K7681m8543M0825k2149M4253o736n2400M5634k339m1324n7219
7848d6952N5125K722k4773J3528l2568M3303o9436N6104L5731j9342k7393P3968
7836F0017l570j4894m6297m7556Q3181J530K2513k6929O1415l2283q5545P221
7824b1197m2166P3605k251N0610k8156p558m3720j810K2541m8181N1096n8114
7812e5301L1035O0028l9878l5267J49450j5634j8561K6373m8486M3236K7261n0420
7800G3836L291l8348m1198R992R4798o673j7177k8483K6640o98M113n4995N9397
7787H4495j9423o3318N3318K4770J48791j19482o0128j1144o647m7373P6327R076
$$ y = [15661, 24373, 13845, -33792, -11494, -46534, -23810, -13405, 64366, 125425, 45631, 79734, 27661, 35102, 25365, 53046, 4503, 45328, 23179, 67432, 60696, 8296, 53930, 51591, 10267, -46952, 8173, 10895, -13878, -350, -32918, 10385, -59051, -2947, 32784, 13442, -13951, 60017, 56447, 41553, -4744, -52300, 30881, 32411, 54924, 27995, 89410, 57127, -28418, -21197, -63363, 10242, 7991, 58601, 30445, 22887, -20833, -22643, -102, -48283, 2813, -55301, -24266, 35762, -4116, -39383, 110067, 94433, 75872, 102245, 53759, 96995, 124256, 73836, 77127, 38779, -2419, 7573, 102371, 95698, 78521, 50038, 76678, 75980, 80093, 25098, 84495, 65072, 1754, 55072, 79842, 228633, 109151, 49023, 37879, 31232, -16141, 60186, 69262]
7775F9262p2216k992J3708J637m3170O336L7683o3495K0643R6042j435j0544l7546
7762A3913j7722J7848K3687J4404l0098N8243l9149o6573k3442M1290J8796q5233
7750g4036J3170o126O3170l1055J1381n0479J9085j7534L9299M3329P228m5853
7738b8421O0933k4035k3073K1230m1596m9193N4277M246M7476k4561n5412M4274
7726a3855J1543m1716L1665k2062N1380L5438j4061m1481m5237J39494n9357Q759
7714D0510K3444o1048l3170l6913j0255J10912M8997j1178j4321q1131M353j8757
7702c8557J5631N4632l3161L2722m6984M150j8065J8055j5727k6591O251J3375
7690c4269l2345L2526k252J9377J5444q2635O1508K6676N341N4481p1951J6981
$$ y = [69262, -2954, -5946, 7762, 9399, -33771, -27435, 10248, -53247, -32604, 63438, 62003, 51459, 13913, -3809, 14039, 37726, 52130, 22032, 80275, 41126, -25447, -48889, -7599, 11197, -74036, -60866, -66992, -3822, -34877, -23496, -73975, -54890, -72424, -33125, 10204, 17432, -28421, 32512, 8477, -14596, 6634, -34962, -84155, -29878, -25632, 21844, -2717, -58129, -13855, -2312, -44028, -12363, -34425, 16955, 52393, 38332, -3149, -48386, 91108, 31751, 40510, 63954, 2906, -30264, -67177, -77432, 33480, 82477, 71299, 56978, -24153, -19800, -38557, -22926, 31706, -1455, 31267, -15717, -11567, -29632, -11577, -27304, -53895, -47644, -34269, -66614, -34088, -36340, -16963, -1519, -84154, -22646, 4030, 9371, 63852, -8099, 8882]
7678H882m8224J4812O9210n642k1976M625R377k5367o480j567K5085p6309L6791
7665a6783J0364K1479l333r4094O5962m0731j6901P8543j9093n5736K8717K9444
7653a2162J6350m2664J5867K4485N487P2124j09075L8637O847j9003R4564n7472
7641C3985j10756j9231M22K692o188l2482M4073n5748N3271J5627Q973n17n59
7628f6438N5985O6518l3001o356k1294n0160P7596p061M137M7967j3157l2511
7616B2225m5946q063j692R3647J2535o5592J1297p5750j939J3329m388K0419L6302
7603F384p3554m6372Q5884L869m8383N3982k6189m412M573j0308N5808l5173M9185
7590A5294L6693m0022j1000r386J7296o0195O5862l8691j3882J1540L408k6963
$$ y = [8882, -39342, -24530, 44680, 39038, 17062, 21687, 31064, 5697, -783, -2350, 22735, -53574, -16783, -6419, 15060, 11727, -82367, -16405, -57136, -74037, 4506, -14587, -70323, -41606, -12162, 4188, -38476, -22609, 1876, 7363, 79487, -29588, 9049, 15896, -3107, 91457, 33985, -76771, -96002, -95580, -92888, -99076, -131558, -87485, -143233, -89962, -74335, -65362, -65879, -66438, -10453, 56065, 23064, 16708, -4586, -54746, 22850, 15789, 19926, 67893, 54736, 22225, -23721, -31784, -33476, 60171, 72706, 7114, 18411, -57339, -59278, -45949, -50337, -29918, 6384, -67170, -113542, -27658, -23789, -72172, -18190, -44379, -48791, -44218, -54526, 1282, -33891, 15294, 51987, 11965, 965, -8421, 8875, -51320, 14542, -24149, -38031, -26491, -23083, -50046]
7578e0046P1708k5585n2231N4312r0833K8742M2074K1398J3572k12m0549M4425
7566A6775J0203n8729l156r714K8185r341K1139l0789Q9178K9559l9515K8045
7554G1840j36421M853m6918K3702L3062M0698K7233k0752n0827M2610p647m050
7542b2617K8811p9109J1701J2836J7320N4562k5198l6520N110k5059K2665r424
7530d4922M551n954k2771M2641k7740m1538O9140m2422R1876k2948j7618J0754
7518f951n2718l616J0194J0320R207k0666N4410j8135j9804M4374k584J00034
7506A04065n0418j0341r444p7198k3985N0593n0422O0590J694o9334J02506m7304
7494a8998L2877j5826o8521O6988j0472m6606K7862M4909R031k0849q489K315
$$ y = [-50046, 21662, -3923, -56154, -1842, -92675, -63933, -21859, -461, 13111, 12899, -27650, 16775, 26978, -31751, -34907, -44621, -16436, -25777, -4638, -35427, 53751, 83310, 43795, 71840, -64581, -59728, -106646, -82944, -49882, -9184, 18049, -2703, -53530, -10920, -18567, -22617, 6194, -72915, -61214, -48378, -31058, 23504, -1694, -38214, -33104, -58163, -35498, -44922, -40371, -46325, -69096, -26455, -54195, -95733, -26593, -69015, 22861, -87, -17705, -6951, -59669, -63285, -53091, -42771, -33564, -54230, 180, -17955, -37759, 6615, 4031, 104065, 53647, 43306, 33862, -43336, -67321, -16728, -67150, -6560, -4866, -74200, 28306, -18998, 13879, -1947, -70468, -3480, -13952, -60558, -32696, 12213, 21244, 395, -8094, -5779]
7482e779k584o059k8203j5642Q2338K515o228M4366j6583J1290n0664m9932j2345
7469e3510k3765K2113l0476J7836P4745m535m904j6257k484k6503j5695N1586
7457a1849m4221K7207k5613M0830m945m6220O1151j0554l29m4454k4599Q6670
7445C074j7516L7810m3858J4959O7299k9391j67K7624o5579Q164M5808j7208K0326
7432E1345p9431Q4768l8830%j0996M422n2573p129P914K8863n0626P3890l0654
7419a9037m3379M4117n4660M4949L2484L1051J076k1479j0002j2008p913j1864
7407b6665J1177J6904l0453q6954P6372k1302K3219k6586J0348O8030n8280M8575
7395D385n50J7708j8145M5927m4033j6066K4287k4512j7919K3195J3108k1602
$$ y = [-5779, -8363, -14422, -42625, -58267, 24071, 26586, 20358, 64724, 48141, 59431, 8767, -41165, -53510, -77275, -55162, -85638, -67802, 6943, 2408, -2496, -18753, -21237, -47740, -63435, -11849, -56070, -28863, -54476, -13646, -18591, -64811, -3660, -14214, -14543, -58997, -83596, 3074, -14442, 23368, -20490, -5531, 61768, 32377, 32210, 59834, -5745, 2419, 48227, 31019, 51345, -28086, 56682, 17852, 17852, 6856, 11278, -41295, -48424, -40510, -11647, -62273, 11617, -19037, -62416, -18299, -72959, -28010, 4474, 35525, 36601, 15122, 5120, -6888, -14801, -26665, -15488, 1416, -29037, -115991, -39619, -60921, -37702, -64288, -53940, 14090, -44190, 4385, 3835, 21543, 3398, 49325, 5292, -10774, 13513, -10999, -28918, -5723, 7385, -14217]
7383a4217O8763L319k0331p6068q3335Q2910m6426p294L0935K8275K4658o403
7371a5214J4515p179m8683K5906M1515l4835J8730l4513N1043J3137p8815M5114
7359i279k2891j7195l0568N3340K2675Q597l1314K7528k3141k4358J1456k5834
7347f0984k33k7915J9095L877M0196k2028R120j383L9773k1425j1672K6563N3987
7334D6971m6758l8412N7803K1964M1213q0143l7175n895J303P9636M5019l8368
7322D7158o1698K0001j549j23392J32789j9809q3585K1293J9238K9517j3613N
7310c3645N8710O639p1180K1801j6802R2567m6587k2424Q405L9146N0492l3929
7298E3193m1793P198l6181J2599k3569l6250O3184j2457N5941Q35r8773J9887
$$ y = [-14217, 54546, 57865, 37534, -38534, -121869, -38959, -85385, -92679, -61744, -33469, -8811, -15214, -699, -7878, -56561, -30655, 10860, -23975, -5245, -39758, 11285, 24422, -54393, -9279, -32170, -49365, -79933, -26593, -3918, 4679, -26635, 893, -22248, -46606, -35150, -60984, -61217, -89132, -70037, -66160, -25964, -47992, -38872, -40255, -482, -21907, -33579, -7016, 46971, 213, -38199, 19604, 41568, 82781, 2638, -34537, -40432, -39129, 40507, 85526, 47158, -14540, 5461, 3912, -119480, 13309, -6500, -90085, -68792, -49554, -20037, -33650, -33645, 25065, 31704, -39476, -17675, -34477, 58090, 11503, -10921, -2516, 36630, 87122, 53193, 11400, 18598, -17583, -4984, -28553, -64803, -1619, -14076, 41865, 42700, -56073, -36186]
7286c6186k8718j5800L7143J0730M1064n3895m0335M3714l3066j5994j4328N0066
7274e5605R0131q6883J0898j7603R2986m1938l1438K685O756j4528k2373N1310
7262a5602K2443q6075L016N50k2100m603O5143l7624j172N4447q195M701J3564
7249a1507L3264k6230J5190m2713K4339L6872l0537J9502k256k5760K3720l4258
7237b0374K6458p0444M0619M8184k7567q402L356L553M3456o4316q1832O1345
7225d5964Q3439K2002J5892l6821m0505M763M5919k4124n3321j6579l1300K9202
7213d7397K8665K6490L8841K2354o5934k0944k2348K468P2679j6312j2324K7302
7201C3540m0760k2469M6242r4089J08538J6814n6362r216o456K4299o9424M0847
$$ y = [-36186, -64904, -80704, -43561, -32831, 8233, -45662, -85997, -42283, -75349, -91343, -105671, -55605, 34526, -52357, -41459, -59062, 33924, -8014, -39452, -36767, -30011, -44539, -66912, -15602, 6841, -79234, -76218, -75668, -97768, -102371, -37228, -74852, -76024, -21577, -29772, -25071, -11507, 21757, -4473, 10717, -31996, -7657, 29215, -1322, 18180, 15924, -9836, 13884, -20374, 6084, -64360, -23741, 24443, -3124, -11526, -8170, -4617, 38839, -25477, -107309, -45964, 37475, 59477, 75369, 38548, -1957, 2806, 48725, 24601, -28720, -45299, -76599, -47397, -18732, 7758, 46599, 68953, 3019, -17925, -40273, -37805, 34874, 18562, 6238, 33540, -7220, -29689, 16553, -77536, 31002, 47816, -8546, -17762, -24218, 81, -69343, -28496]
7189b8496J3445K8556R44k4318K4576L9307J1239M0033n9287j7692J5403q0074
7177c6364O4911K2648k4926o6067o530J4068L8913k8099J5985q390p47j2795l9577
7164f6970M6015m8833j9779P6365k7558O4649M1304k2640j0330o8723J6186q533
7152b8847L3518J7770K417j7084j2396n4826M9919p3902L0920Q2556j1951j2088
7140F006K1539l0789q757L9232k4115J1867o7752M631m2544j0673K7242k1062
7128i5175R3128l5099l2130J5401L8854M0288m6045n1067K4055K7131m0636N3924
7116g371K57J616p834n8783q871L0939M262O212N9752k7382j9510n550j917j7168
7102e1348J22Q124r338M2827k5988j0490j7136K3495P0393J8654m6427o7847L3691
$$ y = [-28496, -15051, 13505, 14449, -9869, 14707, 54014, 65253, 105286, 45999, 28307, 43710, -36364, 28547, 51195, 26269, -39798, -46328, -32260, 6653, -21446, -5461, -13851, -14598, -27393, -66970, -20955, -69788, -89567, -13202, -40760, 23889, 65193, 42553, 32223, -36500, -20314, -28847, 4671, 22441, 24858, 7774, -4622, -59448, -9529, -83431, -52511, 30045, 18094, 6006, 27545, -3244, -12001, 27231, 3116, 14983, -52769, -48138, -90682, -101355, -74113, -95175, -2047, -37146, -69276, -53875, -15021, 25267, -20778, -71845, -47790, -20659, -61295, -7371, -7114, -5498, -13332, -72115, -80986, -50047, -45785, -39573, 20179, -7203, -26713, -32263, -34180, -51348, -51226, -43102, -52440, -9613, -35601, -46091, -63227, -39732, 30661, 49315, 2888, -64959, -31268]
7089c1268K6289J9829k8437k639m7297j3499n454M3332n71m2515j959n0812Q003
7076a26998k250N0374n712K5015j2165K3106n447J9612M8837p0105q24J7995R8612
7063F0050Q861p0508M7968k9057p1206p708N7506K5528l4190K1111l2632k1324
7051d5601k5344K7397M6286K654k7676N9060K5383l4544J0403l2004O5107K0377
7039I1498n0429j5306q2346N0486R3772m0194J0974p1094K8758l1781n6464R5595
7027B3469j9864J205k915P434L7313l1235p2471J0981O9480k0612l2693M6302
7015A6394o7013J4951L0540j8820l740K3674m2346O9713L2887n0507m1652J9819
7003a6100K0140L1161M9996j1126J5231p2149l6534N6355k8930r9495Q3780q186
$$ y = [-31268, -4979, 14850, -13587, -16226, -63523, -77022, -82476, -39144, -39715, -82230, -84189, -135001, -126998, -129248, -78874, -84586, -59571, -71736, -48630, -54077, -34465, 14372, -55733, -56557, -38562, 60050, 68911, -1597, 46371, 17314, -53892, -61600, -4094, 21434, -12756, 8355, -24277, -45601, -70945, -43548, 2738, 5392, -22284, 36776, 62159, 27615, 38018, 6014, 71121, 91498, 41069, 25763, -56583, -6097, 87675, 47481, 58455, -12639, 16119, -15662, -72126, 23469, 3605, 4810, 1895, 9329, 46642, 15407, -57064, -46083, 23397, 2785, -29908, 16394, -50619, -35668, -5128, -23948, -27688, -4014, -46360, 23353, 56240, 5733, -35919, -16100, 4040, 35201, 85197, 74071, 89302, 17153, -19381, 36974, 8044, -91451, -7671, -15857]
6991a5857Q9753j772R264l0083m1067r2209k7070P5010J8021l9210L6296m0395
6979e9319q504N3906l6617P880L5105l4978K2702O015P597K030J4473M800l7890
6966b2800Q0230n3020M0640k8981m2463l670K2312K642K3416q0431l4729Q1507
6954a5347l5662N3003j0972r410L406L6755K4576q0653J2906K4038l883k3246
6942b4489l0532J5808K0802J8866P7127J8982j18916Q2093j7913k4617m9290j0845
6930d2924Q7234m9984J1316n5839Q6280p2206n47j1320J2971L345N4304J8569
6918D1199L893M611L1423k0516o0849j3301k7755N1797M6758k1297j00576L5193
6906b9420j0421n424m870J8104k1268M260M092K377L3274m6m8641M9216k0434
$$ y = [-15857, 73896, 72124, 81388, 51305, 10238, -81971, -109041, -34031, -16010, -55220, -18924, -59319, -67823, -13917, -50534, -42654, -7549, -42527, -19825, -13810, -6213, -4183, 10290, 15090, -22800, 57430, 4410, 45050, 16069, -26394, -30064, -7752, -5110, 18306, -62125, -96854, -15347, -51009, 1994, -8978, -18388, -14982, 21773, 46349, -34304, -21398, 2640, -1243, -24489, -55021, -39213, -18411, 455, 77582, 96564, -22352, 59741, 41828, 17211, -32079, -42924, 44310, -5674, 5642, -50197, 36083, -36123, -36670, -47990, -35019, -31674, 22630, 41199, 45092, 49703, 81126, 60610, -239, -13540, -41295, 10502, 57260, 35963, -64613, -29420, -39841, -45265, -50135, -32031, -53299, -49039, -44947, -42570, -9296, -9342, -57983, -8767, -29201]
6893b9201M9443l8318k3088J1818j7313O3099R49Q22L7898n4298o6827O0556O6881
6880F2421j8183m9491K6997m6839k1514Q5614J967J9239l4329j4417m342K9138
6868C6261k5892J6922Q924K9059k6481j8222Q6859j09441M4829K9815M053R487
6856H6173l7991K7364o9850j6338O7461n4915j0934L2676N946N047l0853P0478
6844G4264M2732p3957j2829n0907J7236K1272J7780r2206N8506n0388M7602R580
6832H685l322O4065m5867k1207n2779L7597k3913j2832N9345n4661N1408K600
6820I119j5508N2007k1134j1913P7211k2833m2814l54k6562k13o3603R468k0295
6807g7424M3360K932J9893J3544L6072j7424k5138K3028n8216M9102j4091M919
$$ y = [-29201, 20242, -18076, -41164, -29346, -46659, 16440, 17389, 18211, 56109, 1811, -65016, -4460, 62421, 44238, -5253, 21744, -25095, -46609, 39005, 40972, 60211, 25882, 11465, 7123, 36261, 10369, 27291, 36215, 65274, 38793, 20571, 107430, -2011, 42818, 72633, 76686, 86173, 48182, 75546, 5696, -10642, 56819, 1904, -9030, 23646, 29592, 34639, 3786, 74264, 116996, 43039, 30210, -20697, -3461, 17811, 35591, -56615, 1891, -48497, -895, 8685, 5363, 69428, 23561, 2354, -50425, -12828, -36741, -49573, 9772, -44889, 6519, 9119, -6389, 45618, 24484, 12571, 89782, 66949, 24135, 23781, -2781, -2994, -66597, -57129, -77424, -34064, -31132, -11239, 2305, 38377, 20953, -4185, 18843, -39373, 9729, -4362, 557]
6795E57M9664n2280m1486K8619J3850K5150J0938n9908M1568l165o07J6063M3469
6782G2432k8873m3428Q2356k4262j5088j7077k4378N907O4314m4632K9691q411
6770D8551o1775J14494q4271J3123Q817K2829j1900m4902L6864k1549O520l682
6758B3119n5617O9423K5328m2393P3080p8202l6414L9345J4810N0607o1470K8174
6746D9790l8928k2921j3336k5991j4214P6175K6118L1282m6243j9626R7022l6889
6734F2239n2843k5759M9706K156k9555k8938k2014P916R1651N9918q2320r750
6722B2407n3797K580P3289j2230l94J1059K328l1698l1122K0855K1029k1784L8704
6709D1226j0248M3433k0184o6256M7148L3112m651n3516N595k5701j8025K4114
$$ y = [557, 50221, -2059, -43545, -14926, -1076, 24074, 35012, -24896, 16672, 13507, 12900, 28963, 72432, 43559, 131, 82487, 58225, 43137, 26060, 1682, 7589, 71903, 27271, 56962, 48551, -13224, 101270, 16999, 30122, 38939, 61768, 49868, 4966, 41830, 20281, 26801, 23119, -32498, 36925, 62253, 19860, 92940, 14738, -21676, 17669, 32479, 83086, 21616, 49790, 10862, -12059, -25395, -51386, -65600, 10575, 36693, 67975, 21732, 2106, 99128, 62239, 9396, -16363, 33343, 35499, 5944, -22994, -45008, -37092, 54559, 114477, 32157, 22407, -31390, -28810, 44479, 32249, 31855, 42914, 45242, 13544, -17578, 3277, 24306, 2522, 41226, 30978, 74411, 54227, -12029, 35119, 68231, 63580, 10064, 15659, -10042, -28067, -3953]
6697c953p185O4256k4268l7310j0038M6980L2136m8260K7733m104k5307m01M5215
6684E5494p323j9357M2852K2415m4211j8491q551M9138p1036K5633j4283l8349
6672b6069N6676N160M7169j1082l5400O999j0850m143M7234j04976L0748l7291
6660c5825j9849N4326J11919k9436n7513L7327o967o9897K2910j9757k10L479
6648i493M999K3716k5365n8459P1688P9167m1126K4453k2703m7254N3157k8214
6636B4566l2832k4043L0904J9443O422M1016k5694L9363p972n4698l2725N3876
6624C7626m8597K3860k2325l8056Q0377j9238j90O823k7665R522J5028j9816J8570
6611A5919j8564J3823L6822P609j7043l8904R8574o3179m042j5944o0380Q3355
$$ y = [-3953, -11138, 53118, 28850, -8460, -18498, 28482, 60618, 12358, 40091, 35987, 10680, 10279, 55494, 48171, 28814, 71666, 94081, 49870, 31379, 22828, 71966, 930, 26563, 12280, -26069, 30607, 35767, 82936, 71854, 36454, 43453, 32603, 28460, 75694, -29282, 1466, -35825, -55674, -1348, 110571, 81135, 23622, 60949, 53982, -15915, 6995, -12762, -12972, -9493, -4494, 19222, -6143, -64602, 7086, 86253, 45127, 69580, 46877, -377, 52780, 24566, -8266, -32309, -1405, 18038, 24460, 65476, 39782, 79145, 71173, 16475, -16250, 37626, -10971, 12889, -9436, -47492, 32885, 13647, 13457, 20280, -7385, 2137, 17165, -2651, 15919, -2645, 11178, 48000, 55609, 38566, -338, 98236, 35057, 31015, 15071, -45309, 38046]
6599C8046J5165m5498L346J4544m6099Q4849k6170l1446J2817L1151L1382n7812
6587B4275M0906j8566q010o425m6655M2650P8659k6298N990q0815k6319N5298
6575C4690k9648L0472n6698L5366Q2184k2263n5703l3082P316o906N6217J5854
6563E7799J1916n8831M5485K590M2093J2406p5964q858l549K7427m3886P720n241
6550A1107Q184L2125K5821l1239o1507l547L8025L9620p2762q695J0011M5156
6538C2299N840M2008M000K4311J654j02294L5556L1104J5050l3930K1352N1191
6526A28141m2139l0519J2287k4281J3046n1744k2913N4516O0838l4835L4438l9492
6514E7343m493K4827k6477k3201m202J3098l4109R952M9436m552n0085P111o483
$$ y = [38046, 53211, 7713, 11059, 25603, -20496, 64353, 38183, 6737, 19554, 50705, 82087, 24275, 65181, 46615, 38605, 32180, -14475, 28175, 106834, 80536, 86526, 5711, -20608, 34690, 5042, 35514, -21184, 14182, 96366, 74103, 18400, -14682, -7366, -14272, 41945, 57799, 69715, 10884, 56369, 58959, 101052, 113458, 37494, 28636, 25087, 52514, 8628, 16348, 11107, 19291, 51416, 77237, 45998, -15509, -19056, 18969, 58589, -14173, -22868, -12857, 32299, 38139, 80147, 84147, 108458, 110112, 7818, 43374, 74478, 89528, 55598, 76950, 128141, 86002, 55483, 67770, 43489, 56535, 4791, -18122, 36394, 97232, 62397, 96835, 57343, 52850, 77677, 51200, 27999, 23797, 36895, 2786, 12738, 62174, 57622, 7537, 14648, 8165]
6501H165P5840o2503k1616K8L5301N2514n2027m1660N067n3493L0415J0153K9539
6488A5723M2252l2525k9844k0040K2320P423k4746Q6802J4072j19309J7497l341
6476b3716M6394J2531K8275l7049k3624K6551k8628M735M9055o4557J8333M591
6464A2891L286O3756n6538L1081P3993m9478o3265j5994L6641L7101l5238M5607
6452H3843m8331p820j9259k8281K0887l1256K6147k6791J9634R396m0394O2713
6440B0488j0586j6384J08868n6252L684Q120j8722K4455m5401n641M5279M6552
6428A04460m593n1427r124L6628l2602K0830k1102p615K1774q3119K715j5602
6416c8777Q6398L7857o3102K47L6588J1385K970l8516j8995O695o0537M6780k2579
$$ y = [8165, 84005, 21502, -114, -86, 35215, 87729, 35702, -5958, -891, -54384, -23969, -13816, 15723, 57975, 25450, -4394, -24434, -2114, 5309, -19437, 67365, 81437, -37872, -20375, -23716, 22678, 35209, 63484, 26435, 2811, 29362, 734, 5469, 54524, -10033, 8300, 12891, 16177, 79933, 23395, 54476, 128469, 78991, 15726, -268, 36373, 73474, 38236, 83843, 35512, 27692, 8433, -19848, 1039, -30217, -4070, -30861, -11227, -1831, -42225, 20488, 9902, -6482, 102386, 46134, 49818, 57938, 39216, 63671, 18270, 12629, 57908, 104460, 99867, 48440, 39316, 75944, 43342, 64172, 43070, 35455, 57229, -25890, -23175, -38777, 47621, 85478, 22376, 22623, 59211, 70596, 73566, 35050, 16055, 22750, -37787, 8993, -13586]
6403a3586M6757K410J3652J6721J3270L6647j6964N699o3272m2714N207O4654
6391F8481p7893M6632R434j7102K597r4724N3622M9013k8307j0309j6545K2360
6379G259m128j7366k3993P101J1537L860M6560n52L3089L8912l4786q4574o6231
6366h3312L7501L7268N1383J0525l0755K5625o859M635K4846J10134n2301m0651
6354H8039j0170j4053m0249l8468L7467j5420j6351J0815K244L454O9433N896
6342H2637k1532m7506M3778P0005j06096L6276m402K6450j5004m4980N5549j5481
6330E9694J2657J5743m2501N7552K0041m6278j8489J5806K8053j4645q5453K116
6318D296M7410m2261j5517P1846P895r6526o7110O6525J133j6647P4623k5569
$$ y = [-13586, 33171, 35581, 49233, 65954, 79224, 115871, 98907, 104606, 41334, -1380, 3827, 68481, -9412, 37220, 46654, 29552, 32149, -62575, -8953, 40060, 11753, 1444, -15101, 7259, 3131, -14235, -38228, -31127, -19590, -15730, 30830, 30278, 63367, 102279, 67493, -17081, -83312, -45811, -8543, 42840, 53365, 22610, 48235, 41376, 46011, 70857, 180991, 128690, 88039, 77869, 63816, 23567, -14901, 22566, 7146, -9205, 1610, 3854, 7308, 76741, 82637, 61105, 13599, 57377, 127382, 21286, 57562, 53160, 79610, 64606, 19626, 75175, 59694, 72351, 88094, 45593, 103145, 123186, 76908, 58419, 74225, 102278, 87633, 2180, 4296, 51706, 9445, -6072, 65774, 73669, -22857, -89967, -23442, -22309, -38956, 35667, 10098]
6306A0098O0011j3839j5502M0819K051l0193N1331r571l1878j9652n1083M6620
6294C9212Q9191j7642k3845k7442n597J1912k6731N4712k66p624m2898j2426m340
6281B6216m4511J5377Q262J5840L2533o240J5272L6591n5088K1674K7854p8305
6269A5475P3335J3136j06085J8922M5701Q363l3760k2704J5013K9181k9827Q2204
6257A08954q8004j318j9029j3937R3832l3796M9380k8803N2426j9816l1504o3600
6245D785K4983K3425Q976J0353j0079L7674o4899M5037k0479m7170O6723k4232
6233E5097O682j2210p0006m3490J18404k0072J0632o8876K6555N5406n1496R8384
6221A05010n0502K5895k7872L0370o3185K174j8067L7017l5047l0788Q3101l585
$$ y = [10098, 70109, 56270, 40768, 81587, 83638, 53445, 104776, 95205, 63327, 43675, -7408, 39212, 128403, 110761, 86916, 59474, 53877, 65789, 39058, 93770, 93504, 85880, 42982, 30556, 26216, -18295, -2918, 5344, 21184, 53717, 47477, 62749, 99340, 44252, 65926, 93780, 15475, 88810, 101946, -4139, 14783, 60484, 68847, 35087, 12383, 27396, 56577, 26750, 108954, 20950, 19632, 603, -13334, 80498, 46702, 96082, 67279, 119705, 99889, 68385, 4785, 29768, 53193, 62169, 72522, 62443, 100117, 35218, 80255, 59776, 12606, 79329, 55097, 61779, 49569, -20437, -63927, 54477, 34405, 45037, -23839, 2716, 58122, 6626, 105010, 54508, 80403, 52531, 82901, 19716, 21890, 3823, 40840, 5793, -24995, 58106, 54521]
6209E4521J00878o1608O5394n3773j00727M2910k6942O6555q581j8254n6519m6824
6197d2970K7172O5078j04480o948Q3553m0225L6304K0056N4551q664K1973L8804
6185A44204k6913m4905k7451L5254j3254N030k4152P6603K4291p1686q7216O216
6173c979l560L9694K4000j4369M7667m7305j6662M157J3098R9798n4997p1883
6161A5659O6399p2303p570L0765k4402M8954J9243p5894N4749J4447p861n3373
6149H813N2570k0537N157J6295K9701Q330j3344j3328J2234j3098P547N4625m6329
6136H8636K1466m0647M4964N161q036l0129K2295r945n442j1061n4143N4220K8428
6123A05767N0582l9860n798k0399n1442L726L6179N2451q7838O7975j0105K3652
$$ y = [54521, 155399, 93791, 159185, 105412, 4685, 47595, 20653, 87208, 78627, 60373, 3854, -42970, -15798, 49280, -55200, -62148, 21405, -18820, 17484, 37540, 92091, 83427, 105400, 144204, 117291, 72386, 44935, 80189, 66935, 71965, 47813, 124416, 148707, 77021, -10195, -3979, -7539, 32155, 56155, 41786, 89453, 42148, 25486, 29643, 42741, 142539, 87542, 15659, 82058, 9755, 2185, 32950, 8548, 57502, 76745, 851, 55600, 70047, 62186, 8813, 61383, 40846, 46003, 62298, 91999, 100329, 86985, 73657, 85891, 72793, 80340, 134965, 88636, 110102, 69455, 114419, 119580, 111544, 81415, 103710, 93765, 88323, 77262, 23119, 77339, 105767, 156349, 116489, 110691, 90292, 38850, 42576, 78755, 131206, 43368, 111343, 101238, 124890]
6111A24890J7331j32082K5590J5050M5307l7646k0700N879k8015J9005R9162n8508
6099G5263Q052Q9226o7036J8573p7604J8154Q6007l2108J1468p7245k615M0547
6087I0682j978k3746K5336P874M0050J5391m3650k7291m8197M3278o7836Q7938
6075I7851K9554n4623P6827r0062j7609L9268R246m0634M2073P561O709r599k4328
6062G2234L6412q5048K3362p746L0962m5490M5296k2667p4693L1341K818Q738
6050A5519R280k671k4324K3416n6492K1762K7796L1669L9760n1259N0943p04N9131
6037A43826k2327K1457L8667o6935N9816m7978K5080l834o7248J1053K136J6234
6025A09947n877m5919l6658m3012k930K3808l3169L3073L253n2701K6693Q7729
$$ y = [124890, 142221, 10139, 35729, 50779, 96086, 58440, 37740, 43619, 15604, 34609, 133771, 75263, 83315, 172541, 105505, 124078, 46474, 64628, 150635, 118527, 129995, 52750, 50135, 90682, 88704, 64958, 90294, 98168, 138218, 153609, 109959, 82668, 34471, 77749, 9913, 97851, 127405, 72782, 149609, 59547, 41938, 81206, 90452, 49818, 91891, 99452, 106161, 96562, 72234, 108646, 23598, 46960, 39214, 70176, 24686, 69982, 47315, -27378, 3963, 6781, 15519, 24799, 22128, -2196, 21220, -35272, -13510, 14286, 45955, 85715, 34456, 85399, 84695, 143826, 121499, 142956, 181623, 114688, 174504, 126526, 151606, 147772, 80524, 91577, 93713, 109947, 104070, 58151, 21493, -21519, -24449, -641, -33810, -737, 2516, -50185, -23492, 64237]
6013F4237J4175l4064J6715j0803N181K246O0088k0501n746J0975k2081L9763
6001A20185m0772j5858L8357p5984k0976J7077j3716L3886k5257l2716J1652Q1771
5989G7649n7695j0192j6510o8465M0777J7172O6161P170K222P162J2667O2095
5977A40213N178m4920M6005N874o6473n988l2635O3512n8345J7466k5357p696
5965C6834K0932k4433L9132n9507k3487k4868R5945k1457P6185j2425p0920M0597
5953G2528p0573K2839k421Q9350K2015p3967K0862P1986J472n9009k1175k9769
5941D4138n62M459J18937n1045J6917q5091o1733R7391K7547K0463m6318l7689
5929D7414l236M9366l1275j1258N7185M0463N537l747k9619k7029M0542j7861
$$ y = [64237, 78412, 44348, 61063, 50260, 55441, 57687, 117775, 97274, 91528, 102503, 80422, 120185, 79413, 63555, 101912, 25928, 4952, 22029, 8313, 42199, 16942, -15774, -4122, 77649, 19954, 9762, -6748, -75213, -34436, -17264, 48897, 56067, 58289, 65451, 78118, 140213, 145391, 100471, 146476, 152350, 85877, 79889, 47254, 110766, 52421, 69887, 44530, 36834, 57766, 33333, 72465, 12958, -10529, -35397, 60548, 39091, 115276, 102851, 31931, 72528, 1955, 24794, 22373, 111723, 133738, 59771, 80633, 152619, 154091, 95082, 73907, 44138, 43576, 48035, 166972, 115927, 132844, 47753, -13980, 83411, 110958, 131421, 85103, 47414, 44178, 93544, 62269, 51011, 108196, 148659, 154196, 150449, 120830, 93801, 134343, 116482]
5917A16482M1747K2869m5005K021l6852J9929r821K613l4698J1658K0477m7883
5905F3537l4478k5488R71K8158k0835M739M464o2560R6029J9465k8894L5749L1252
5892A12109M6781M586L4530K003n1509k3065M4899p4142L5916n955R270k7973
5880A07450o0102M4467q2100M6124k4035J0163L4244q939J4558o2765r937J3839
5868B2967P356K0923L3898n0533J05434j3494L6010l3178M367M6076o06J1131
5856A90351j16126R6555K49R610l0079J1226n0881o0782m992l3549Q2767n8097
5844C6252j4580L7194k9379L9869l8086N1921K580M6453o4506L700J1847n2120
5832C1145K3013K2777q429K737O6857j085N8449k6544r460l0864m2094O83m1796
$$ y = [116482, 158229, 181098, 136093, 138114, 101262, 121191, 111370, 113983, 79285, 90943, 111420, 63537, 29059, 3571, 4542, 32700, 11865, 16604, 21068, -41492, 54537, 74002, 45108, 80857, 112109, 158890, 163476, 198006, 200009, 148500, 125435, 170334, 96192, 132108, 126153, 135423, 107450, 47348, 91815, 9715, 55839, 31804, 41967, 76211, 67272, 81830, 19065, 9128, 22967, 30323, 51246, 85144, 34611, 140045, 126551, 162561, 129383, 133750, 179826, 179220, 190351, 74225, 170780, 171029, 180639, 150560, 161786, 110905, 50123, 45131, 11582, 94349, 36252, 21672, 58866, 29487, 69356, 31270, 83191, 85771, 132224, 67718, 71418, 83265, 31145, 54158, 76935, 68506, 71243, 138100, 137015, 195464, 168920, 159460, 128596, 86502, 87185, 45389]
5819D5389L7948j0139O39J8789o2712N2689O691l7199J528M0935K9454K0345l1907
5806A12450K5002m4386j5359O1510l298Q683o6069N1654N8342n2834M5486l8078
5794A43103L9664j880l7891l8833j9536J6351j5327k9994j00406J36022n7006
5783C4267L2053m08K4594n30n8406N1216n7234L5707O3951J474l2073L2114k3118
5770A03607P748L3635K1335L285k1557J0911K9293m7368l0931j4599k8665m0617
5758B6077M3759m8447O685j356L5198L1697k8573K700p143Q1102k2524k2762Q5494
5745A81907N366q6474N54J5641o994M121o105K9078J9151l2952K2224q490k9979
5732A07048j2744k4460K2501J0432J2825k2534m7224M8417n7782j3408P4273o9591
$$ y = [45389, 83337, 73198, 73837, 92626, 29914, 82603, 89294, 52095, 53623, 94558, 124012, 144357, 112450, 137452, 93066, 77707, 139217, 135919, 144602, 78533, 130187, 188529, 135695, 181181, 143103, 182767, 180887, 142996, 104163, 84627, 100978, 85651, 55657, -44749, 91273, 34267, 66320, 65912, 90506, 89976, 31570, 82786, 25552, 61259, 125210, 126684, 94611, 126725, 103607, 111355, 144990, 166325, 169610, 148053, 158964, 188257, 140889, 109958, 95359, 66694, 26077, 69836, 21389, 28074, 26718, 61916, 93613, 65040, 67740, 60597, 141699, 119175, 96413, 181907, 187273, 100799, 101353, 116994, 110000, 114121, 108016, 137094, 156245, 123293, 145517, 137027, 107048, 94304, 69844, 92345, 102777, 115602, 93068, 45844, 94261, 36479, 23071, 97344, 27753]
5720B7753K3123M9622l8519q886L8987P5819m9550k9671J504K0269N4829M1204
5708B06484o5208J5996l177j3669M7295n5423J2004l1712q5605J1984L626j8200
5696B4395P633K429j798L5742p432N155O992R658J5236M2559K6620m6104N0262
5683A71347O966l5340P6105l9753j5600L4748m9556k3759K7366j7469k751j8468
5671A13836J6111N0637n9550p124o5525J2056L8341j8498J6831K0505Q878K3766
5659A50264j9141L2031J6148O793J8541R637o1192L4605K4023k9884M8261J2675
5647B42761r5493o8664O5113N1421J6199l0264k7242k2722m0039l3817M5954N5168
5635A58375o9866r392o052L736R709n303K1558n547k2703K5352Q6122j3528P1151
$$ y = [27753, 50876, 100498, 61979, 53093, 92080, 167899, 118349, 88678, 90182, 110451, 165280, 206484, 141276, 157272, 154095, 140426, 187721, 132298, 144302, 112590, 26985, 38969, 42595, 24395, 32028, 34457, 32659, 68401, 60969, 66124, 73116, 82774, 98010, 140569, 167189, 121085, 171347, 178313, 142973, 219078, 179325, 163725, 198473, 148917, 125158, 152524, 135055, 132304, 113836, 129947, 180584, 121034, 113910, 48385, 60441, 98782, 80284, 97115, 117620, 126498, 150264, 131123, 163154, 179302, 186095, 204636, 214273, 153081, 187686, 211709, 181825, 230086, 242761, 147268, 78604, 143717, 195138, 211337, 181073, 153831, 131109, 91070, 57253, 103207, 158375, 88509, 79117, 73065, 76801, 86510, 81207, 102765, 97218, 74515, 99867, 185989, 172461, 243612]
5622B43612n7119K5745K418o4064p245J2166M9124k961j8114l4933P497k7227
5610A28899o210n0792J9404K9566l5772K5130N919p663N025M0362l6161j7425
5598A00282R6457J0167M742m8364k7792j0466N3527k6096O359M2972j4402M4870
5586B32256l6804k1427k4848k5276m4318M8076L1446K4550K0589o9701Q30k5493
5574A09880J7744N5626J1590j7924L9789q523q1596j3765K2928K8838K1450J5896
5562B01933l1337K9748N6339m8235N7741J3741o7994l0899j403o9797M9309q5147
5550G3999o329J498l4816P7987k8978Q7207l8482M130J3678q551K2051L8888K6743
5537B29025K7120r7549N7473L7759j0994M7566m9011l7073j7137l9173M4604l4932
$$ y = [243612, 186493, 212238, 214656, 150592, 143347, 155513, 204637, 201676, 183562, 148629, 156126, 128899, 122689, 71897, 91301, 120867, 85095, 110225, 116144, 108481, 113506, 153868, 117707, 100282, 196739, 206906, 211648, 163284, 135492, 125026, 178553, 152457, 158816, 201788, 187386, 232256, 195452, 174025, 149177, 123901, 79583, 127659, 159105, 183655, 204244, 134543, 135373, 109880, 127624, 183250, 194840, 176916, 216705, 208182, 126586, 112821, 135749, 164587, 186037, 201933, 170596, 200344, 256683, 208448, 266189, 279930, 211936, 181037, 179634, 109837, 159146, 73999, 67670, 69168, 34352, 112339, 83361, 170568, 132086, 136216, 149894, 141343, 163394, 202282, 229025, 256145, 158596, 216069, 253828, 242834, 290400, 241389, 204316, 187179, 148006, 192610, 157678]
5525A57678K5857L5136o1903M33M6588k7907k8101n0J876j7647q7483Q0402L2505
5512A57384l5445M4506L0779M1620k2258l817K8713K3479l5857j2562j5937M9386
5500B49991N331k5057l453m1411M5251J7041m3155l15j6715m5018K6872J7120
5488A86482o6419n653M0480j9962L2572m2733L4176R182L4602j1413L8293O645
5476B36252O308K5913k790P089O481j7600n9485j9468j4489j4147N0620k9275
5464A75409p8246l906Q7072M4834m4292p6436m709p409K0372N9274N4447k0204
5452B06206k9370L1060J9290l680k8811k3990L4640O1640J6116K0094m5098m6753
5440B11344j1640m995n1733L8869r618n8855Q2047j9060k8903j007L4885m1052
$$ y = [157678, 183535, 218671, 156768, 157201, 203789, 175882, 147781, 147731, 149607, 131960, 44477, 124879, 157384, 121939, 166445, 197224, 238844, 216586, 212769, 241482, 264961, 229104, 216542, 200605, 249991, 255322, 230265, 226812, 185401, 230652, 247693, 204538, 204223, 187508, 142490, 169362, 186482, 120063, 114410, 154890, 134928, 167500, 124767, 158943, 168125, 202727, 191314, 229607, 236252, 242560, 268473, 265683, 272772, 279253, 261653, 202168, 182700, 168211, 154064, 204684, 175409, 97163, 93257, 180329, 225163, 180871, 104435, 99726, 92317, 112689, 171963, 226410, 206206, 176836, 207896, 227186, 223506, 194695, 170705, 205345, 266985, 283101, 303195, 258097, 211344, 199704, 194709, 142976, 181845, 172227, 113372, 195419, 176359, 147456, 146449, 181334, 140282]
5428A40282J3655K7371P5370N464n7355K0214L949Q0499p9306M3189k0807n449
5416B47076l0291L98P8043m791l1030N151rl0975P094j12394M3014j9290o0850
5403I1146P2148j19668N5694n8350j2585j7801N3198M8880j0664J1373K8363M9948
5391A91682n537J02993j33536N0702L0935m8661R5013p855J6091o2210K3635Q725
5379B61977p015m2016L8135K226p7707n2182J3380P2943o5927K0641l4008K4789
5367A55236r856o7808J4625R3276N1923L369K2895j9590K0801M2046l6959L6980
5355C06938J7008j8304k5754j8577l3226L4381m5894j6380j7873o723k4777R66
5343A51785M9690r275K2927r664k9388J4017L396L9829k8231R759L6862M0815
$$ y = [140282, 153937, 181308, 256678, 262142, 204787, 225001, 228950, 309449, 230143, 273332, 252525, 247076, 216785, 217183, 295226, 290435, 259405, 264556, 264547, 233572, 240666, 128272, 171286, 151996, 91146, 163294, 43626, 99320, 40970, 28385, 10584, 63782, 112662, 101998, 113371, 141734, 191682, 186145, 289138, 155602, 206304, 237239, 188578, 283591, 275736, 291827, 229617, 253252, 261977, 254962, 212946, 251081, 253307, 175600, 123418, 136798, 209741, 143814, 164455, 130447, 155236, 145380, 77572, 92197, 185473, 237396, 240765, 263660, 244070, 264871, 306917, 269958, 306938, 323946, 305642, 279888, 261311, 228085, 262466, 216572, 200192, 182319, 175596, 150819, 151785, 201475, 192200, 215127, 205463, 176075, 190092, 193488, 233317, 205086, 214845, 251707, 292522]
5331B92522m5834J5758J9160l4561L8498K0393L6685m9646J6727m7694J3269K162
5319B77439l2746m98L3666o1897N047M8150r6943j3260O2125K2390m8757j5078
5307A79638N0001K5249R3283q2111J5405j7871L8200k200P4639O6313n8682o102
5295C75762m3347M2893Q195k2843k6847J2019m5519O1293j0619m8612L0086m243
5283C28218M763L8668k984M9995J7184l8789j1337P912l7044P8562R881M9107
5271D94136L9989K4687L723o3725J9618l3426j1272O1347m3898r8003l6489r729
5259C46958J17413k7629m8535K4091q740L8908l0174O7841O5702q6870n0251j2961
5247C95753O3357o6061L7958J7542J0149m2902P1614J7379O707M2028r9045J01570
$$ y = [292522, 246688, 262446, 281606, 247045, 285543, 305936, 342621, 292975, 309702, 262008, 275277, 277439, 244693, 244195, 277861, 215964, 221011, 269161, 172218, 158958, 221083, 243473, 194716, 179638, 229639, 254888, 348171, 266060, 281465, 263594, 301794, 299594, 374233, 440546, 381864, 375762, 332415, 375308, 383503, 360660, 333813, 345832, 300313, 361606, 350987, 302375, 332461, 328218, 332981, 371649, 368665, 418660, 435844, 397055, 385718, 393630, 356586, 435148, 445029, 494136, 534125, 558812, 562535, 498810, 518428, 485002, 473730, 535077, 491179, 393176, 356687, 346958, 464371, 436742, 388207, 412298, 403558, 442466, 412292, 480133, 545835, 458965, 408714, 395753, 459110, 393049, 431007, 448549, 458698, 415796, 487410, 504789, 511496, 553524, 454479, 556049]
5235E56049J8328l0725Q35j15079K5151J269l5805o317m3369o362k936K2527n71
5222C82995L3888m871o7813K545P3035j7934m262Q154j3205O4030P9926q991k8418
5209D99079k7322j1661J5456J2731p0889l0732k830J8604k9398k292j6491K2395
5197C76650l3112K5609k1574p093M1991k3944j2272J2375j7172k2528J5599L4899
5185C69428L4748j2133k2815J2062j7754M679R757k4368L9023p262L7496J553
5173D24414L1593K5369k6582J3532m0398m1626r2409N471N2835m0493K1414q204
5161C24916K4758m8964j0160O7616L8864Q980J3322j1922m2041l013M8383N9666
5149D70405l7181L4672N2934p321K8224l7064n7605J6102N195n5564Q451K5303
$$ y = [556049, 574377, 543652, 544487, 429408, 454559, 455828, 420023, 413706, 370337, 363975, 361039, 383566, 382995, 416883, 412012, 344199, 346744, 419779, 401845, 397583, 405737, 392532, 456562, 536488, 527497, 499079, 471757, 460096, 475552, 488283, 417394, 386662, 383832, 402436, 373038, 370746, 354255, 376650, 343538, 369147, 347573, 340480, 382471, 358527, 346255, 358630, 341458, 318930, 334529, 369428, 404176, 392043, 369228, 381290, 363536, 368215, 377972, 353604, 392627, 385365, 422861, 424414, 456007, 481376, 454794, 468326, 427928, 386302, 293893, 299364, 352199, 311706, 333120, 324916, 349674, 300710, 290550, 358166, 397030, 406010, 419332, 407410, 365369, 362356, 410739, 470405, 433224, 467896, 520830, 513509, 541733, 504669, 447064, 463166, 468361, 412797, 421248, 446551]
5137D46551j7148L4790m8348n4986j477K338K5138N1914j9487o6157o906K4062
5125C70284J08837J4921m231N9070N8558R465l4859Q854K4397n5155p334L6775
5113E89582m0363J7811l3822m2352L3539p9967N4066k4397k2682L4438K1333K5397
5101E32583k6000k6164O7465K1888J5412j14j3551M0731K7970M4614m4007k4009
5089F16818J6347m823q520K0169j9763k6018L9372q188M9591p8440k5246m180
5077E67119k4174P742p4266Q7527J0809j3100K9178J6030K3647K8779o3470L8392
5065F34213L3196L3654j6647j2521k1375N0142L6717J106K4101k4362k01j9515
5053G18508m075k7068m8604M2735L3976p82M1395p8791j2348P8438k5320N0025
$$ y = [446551, 429403, 464193, 415845, 360859, 359382, 361720, 386858, 438772, 419285, 353128, 346222, 370284, 479121, 494042, 489811, 548881, 607439, 616904, 582045, 590899, 615296, 560141, 552807, 589582, 549219, 567030, 533208, 490856, 524395, 444428, 498494, 474097, 451415, 485853, 507186, 532583, 506583, 480419, 547884, 569772, 585184, 585070, 571519, 612250, 640220, 684834, 640827, 616818, 633165, 628342, 619822, 639991, 620228, 594210, 633582, 625394, 674985, 596545, 571299, 567119, 542945, 550687, 476421, 563948, 574757, 561657, 590835, 606865, 630512, 659291, 595821, 634213, 667409, 701063, 684416, 671895, 650520, 700662, 737379, 738485, 762586, 738224, 738023, 718508, 714433, 687365, 638761, 681496, 715472, 714690, 756085, 677294, 664946, 743384, 718064, 768089]
5041G68089R081K571L1980K3408R2659k1345J4676k7908M3073M2952O123L4323
5029A019682n9921L7194J8715O99k9324Q582n298Q546l280P589O8077j9427P5885
5016A127719j3507K9815J4441k913K0364N3661j2080P1948K1462m7141J03771
5005A367540r5334J03088j2587O552L4026K3900N8315m6824O8401q154L9055O0033
4993A598011l3753L7703Q8594L0366N0729J3075m6203O4076k858J36334J0406
4982A946480O7096P3993M0243J50502O4198Q3841L4897R0171L6511N2081L5303
4971B675316J57272k2257O0062J48866L4984J27811J55953J41520K07950K87133
4961C974610K69327L33798L42972L77294M70774N46126P05732Q91035J087424
$$ y = [768089, 777170, 779741, 811721, 835129, 927788, 906443, 921119, 893211, 936284, 979236, 985359, 1019682, 959761, 996955, 1015670, 1016369, 987045, 995627, 990329, 998875, 995595, 1003184, 1071261, 1051834, 1127719, 1114212, 1144027, 1158468, 1155555, 1175919, 1229580, 1217500, 1289448, 1310910, 1263769, 1367540, 1272206, 1375294, 1362707, 1369259, 1403285, 1427185, 1485500, 1438676, 1507077, 1498923, 1537978, 1598011, 1564258, 1601961, 1690555, 1720921, 1771650, 1784725, 1738522, 1802598, 1799740, 1936074, 1946480, 2013576, 2087569, 2127812, 2278314, 2342512, 2426353, 2461250, 2551421, 2587932, 2640013, 2675316, 2832588, 2810331, 2870393, 3019259, 3054243, 3182054, 3338007, 3479527, 3687477, 3974610, 4243937, 4577735, 4920707, 5298001, 5768775, 6314901, 7020633, 7911668, 8999092]
4952H999092J208324Q51355J28262m42342q93650j018849r05096n46078l04381
4943G076637j73257j24785n4392n6698j23313o6632j9024o6495j500M5737J33310
4932F569588K00511K33950L36980M12642M91750P18371P97422Q57250J000103
4923A1618567J140723J418032J773709K358397L083184L701827L165573J289663
4915B9549675r43549k438074l343644l370662k722360k031095j504711j331369
4907A1864211j086687p31501o82964l56129l56445k91829j09766m6852j1725K2774
4897H213087M9043J94611K77194L82700O23925O60477Q22264Q96276J052100J281548
4887A4453225J564967K066154K667522L403139L457926K073538k47132k319712
$$ y = [8999092, 10207416, 11058771, 11187033, 10744691, 9851041, 8832192, 7927096, 7381018, 7076637, 6903380, 6778595, 6724203, 6667505, 6544192, 6477560, 6458536, 6392041, 6390541, 6436278, 6569588, 6770099, 7004049, 7341029, 7753671, 8245421, 8963792, 9761214, 10618464, 11618567, 12759290, 14177322, 15951031, 18309428, 21392612, 25094439, 28260012, 29549675, 28606126, 26168052, 22824408, 19453746, 16731386, 14700291, 13195580, 11864211, 10777524, 10046023, 9363059, 9006930, 8650485, 8358656, 8248890, 8202038, 8190313, 8213087, 8262130, 8456741, 8733935, 9116635, 9740560, 10401037, 11223301, 12119577, 13171677, 14453225, 16018192, 18084346, 20751868, 24155007, 27612933, 29686471, 29439339, 27119627]
4879B7119627l581142l901043l371118k484745j707539j442702j100820r04727
4871H625791o61152n19859m53449l21944l16631j57028j83363j14908o6642q0961
4861E749854q2519P7611R2464J34210K46507R8879L08582L71926L62050M75963
4851G835527O18359J031916J163442R15720K51080n63047j097808j269231j200107
4842G685851r56178p16089n90799m40342l41685k80718l10224j20858j95550j19316
4832C614092q8217o0558m9792q5340n124m7151j17099l6352r1546k4851m3791
4821B964271q6256m6693o8528K6766k491k3210n6403p5658k0923j1700J0048m147
4809B605076n9391J9728Q458l0261J25793L9661p543Q0216m8698M134p345P3918
$$ y = [27119627, 23538485, 19637442, 16266324, 13781579, 12074040, 10631338, 9530518, 8625791, 7964639, 7444780, 6991331, 6669387, 6352756, 6195728, 6012365, 5897457, 5830815, 5749854, 5667335, 5744946, 5837410, 5971620, 6218127, 6317006, 6625588, 6997514, 7359564, 7835527, 8453886, 9485802, 10649244, 11564964, 11816044, 11252997, 10155189, 8885958, 7685851, 6729673, 6013584, 5422785, 4982443, 4640758, 4360040, 4049816, 3928958, 3733408, 3614092, 3525875, 3465317, 3415525, 3330185, 3325061, 3277910, 3160811, 3124459, 3032913, 3008062, 2964271, 2878015, 2831322, 2762794, 2789560, 2787069, 2763859, 2707456, 2631798, 2610875, 2599175, 2609223, 2605076, 2545685, 2565413, 2573871, 2543610, 2669403, 2709064, 2701521, 2781737, 2733039, 2737173, 2729828, 2803746]
4797B803746J4584o1666J580p8439k4804k995k7152o0683p551j0812J186m2465
4785B504529l4106K2335l8750J8599L388J57304l0723Q4477Q0592J1645R8253
4774B877543j5218J2734P9333M4198n2537J7335Q4441R0565o0963K5277j5250
4763C087458o4448J20660q303L6017k5894o0576M965l0153j18M5222R4706N0962
4751C250498O3175K2951J36546Q2085J16734O7881r362J42549M9134J87740J49236
4740D259167J04235K31295J49598O4711N724j05164l6467r2047r4587l7138p4193
4729D375134j0242J6462l8822M101M7135J29861O6L0292Q3312K267J19840O9590
4717D828996J09914J25420J69763J01156K30760J98878K01549K95473K51925L51176
$$ y = [2803746, 2818330, 2756664, 2758244, 2679805, 2655001, 2652006, 2624854, 2564171, 2556620, 2545808, 2546994, 2504529, 2470423, 2492758, 2454008, 2472607, 2475995, 2633299, 2602576, 2687053, 2767645, 2779290, 2877543, 2862325, 2875059, 2954392, 2998590, 2946053, 2963388, 3047829, 3138394, 3077431, 3102708, 3087458, 3023010, 3143670, 3135367, 3171384, 3145490, 3084914, 3089879, 3059726, 3059608, 3104830, 3199536, 3250498, 3313673, 3336624, 3473170, 3555255, 3671989, 3739870, 3730508, 3873057, 3922191, 4109931, 4259167, 4363402, 4594697, 4744295, 4809006, 4814730, 4709566, 4673099, 4581052, 4486465, 4449327, 4375134, 4364892, 4381354, 4342532, 4346633, 4393768, 4523629, 4523695, 4553987, 4637299, 4639566, 4759406, 4828996, 4938910, 5064330, 5234093, 5335249, 5566009, 5764887, 5966436, 6261909, 6513834, 6865010]
4707F865010K19370J27115J2986k35524j79357j99684j49216j36397m0831r981
4697F273491M4450L0290P4186P0365O3818J88359Q036J00669J09059K4184J69730
4686G156637K05551J59452K00480J13575K37332K97510J85056K43204K54833L11994
4676I365624L32319J92793J38730O9976P0994J05810J4886J13184J14597J42253
4666A0661166K63055J66487K19543J77803J37598J89967K46507L37676K51332
4657A2651134K24928K43170K33000K77570K49655K80057L46098L38571L14004
4648A5158187M57069K82149M18670M41625L72483M05497M44398L89466L39422
4639A8708966M33724M56038O08498N03721O13660N81284O77503O94229P75822
$$ y = [6865010, 7084380, 7211495, 7224481, 6988957, 6809600, 6609916, 6460700, 6324303, 6283472, 6273491, 6317941, 6348231, 6422417, 6492782, 6556600, 6744959, 6752995, 6853664, 6962723, 6986907, 7156637, 7362188, 7521640, 7722120, 7835695, 8073027, 8370537, 8555593, 8798797, 9053630, 9365624, 9697943, 9890736, 10029466, 10099442, 10170436, 10276246, 10291132, 10404316, 10518913, 10661166, 10924221, 11090708, 11310251, 11488054, 11625652, 11815619, 12062126, 12399802, 12651134, 12876062, 13119232, 13352232, 13629802, 13879457, 14159514, 14505612, 14844183, 15158187, 15615256, 15897405, 16316075, 16757700, 17130183, 17535680, 17980078, 18369544, 18708966, 19142690, 19598728, 20207226, 20710947, 21324607, 21905891, 22583394, 23277623, 24053445]
4630B4053445Q22022Q23253Q93144P63471R71783J024001J078487J179288J282218
4621C2891112J411473J458740J699079J746082J872115K089982K321521K458135
4613D7948239K941281L554185M255819N033071N604502O314085P218721Q554069
4605I1423972J0369563J2923760J6452154K1373665K3873556J5897417R90755
4598A93304842o426291n987114r310645j6518779j8340723j4064110r547882o714991
4590A06394307m604762k855086j306599j55555R70101K082094L520337N279724
4582A09324561O901311Q471937R916326J1374420J3382690J6455809K0399369
4575A96226423K6299788L4934887M3482287L9389127J5656895q996702j5933638
$$ y = [24053445, 24875467, 25698720, 26591864, 27355335, 28327118, 29351119, 30429606, 31608894, 32891112, 34302585, 35761325, 37460404, 39206486, 41078601, 43168583, 45490104, 47948239, 50889520, 54443705, 58699524, 63732595, 69337097, 75651182, 82869903, 91423972, 101793535, 114717295, 131169449, 152543114, 176416670, 192314087, 193304842, 186878551, 180891437, 171580792, 155062013, 136721290, 122657180, 113109298, 106394307, 101789545, 98934459, 97627860, 97472305, 98442406, 100524500, 104044837, 109324561, 116225872, 124697809, 134614135, 145988555, 159371245, 175827054, 196226423, 222526211, 257461098, 300943385, 340332512, 355989407, 346992705, 331059067]
4568C31059067j7399937k8560024l9650953l8153385k9115958k1503406j6390543
4561A40284861j2499352r420006o893190m884622l320246j885875o59566P96807
4553A01518811K228180K902214L245226M092165N443509P330663R552341J3310681
4545A49623790J8640563K2311281J5638545j088986j0344016r335745j1861649
4538A73583783k0307917k3488452j9240638j4336350j1092879q857251p097497
4531F9162799n701699m514374l916567l154750k721124k410024k131914j826882
4523D2785465j747959j896465j828185j600470j476828j569286j322676j275289
4515C0068307j143522j054959r80242p62126q42575p00131o43499o31447n70956
$$ y = [331059067, 313659130, 285099106, 245448153, 207294768, 178178810, 156675404, 140284861, 127785509, 118365503, 111472313, 106587691, 103267445, 101381570, 100722004, 101518811, 103746991, 106649205, 109894431, 113986596, 119430105, 126760768, 136313109, 149623790, 168264353, 190575634, 206214179, 205125193, 194781177, 185445432, 173583783, 153275866, 129787414, 110546776, 96210426, 85117547, 76260296, 69162799, 63461100, 58946726, 55030159, 51875409, 49154285, 46744261, 44612347, 42785465, 41037506, 39141041, 37312856, 35712386, 34235558, 32666272, 31343596, 30068307, 28924785, 27869826, 26889584, 26127458, 25284883, 24584752, 23941253, 23309806, 22738850]
4506B2738850n16381m62542n06405m50681l79104m58150m77902l34994l43271
4497A8809420l69452l41781l69425l26755k25781l14042j93974k05189k75499
4488A6187522k15452k62702k19005j44586k25890j73630j07512j80881j02511
4479A4555353j43906j15515j31735j07266o3709m1670p4371j3837n5632p361J8898
4468A3819249j14201r6892m3680m700O4176j3762j1025k4419Q8886R4876R1460
4457A3849968J80851J39893J47529L19988L28703L85732M96385L91113K05353
4448A6445515m2988j0590j34603k36598j64736r1289p3596K0323K4610J9879P1299
4437A5827226R0561P0675J43377J52177K06962K52271L18810K87763M00531M96866
$$ y = [22738850, 22222469, 21759927, 21253522, 20802841, 20423737, 19965587, 19487685, 19152691, 18809420, 18439968, 18098187, 17728762, 17402007, 17176226, 16862184, 16668210, 16463021, 16187522, 15972070, 15709368, 15490363, 15345777, 15119887, 14946257, 14838745, 14657864, 14555353, 14411447, 14295932, 14164197, 14056931, 13993222, 13951552, 13877181, 13863344, 13807712, 13800351, 13819249, 13705048, 13608156, 13564476, 13559776, 13623952, 13610190, 13599165, 13574746, 13663632, 13758508, 13849968, 14030819, 14170712, 14318241, 14638229, 14966932, 15352664, 15849049, 16240162, 16445515, 16402527, 16391937, 16257334, 16020736, 15856000, 15764711, 15691115, 15711438, 15736048, 15755927, 15827226, 15917787, 15988462, 16131839, 16284016, 16490978, 16743249, 17062059, 17349822, 17750353, 18247219]
4427A8247219M23039N12279P36526Q44871R57644Q79334N84879L11279J15661
4418B3612731r8409n7189j23470N9205J97145K48824M06880O05064P65340O70822
4408B6286943M62106L98800L66281K51031L92576M35018O03751P35782Q80925
4399C0813213J053033J093243J297529J398860J572631J720512J541280J516387
4391D2006688J553217J800881J987391K266599K861093L591543M211137N221226
4383F5499775N938640O638993P435299Q222771R496948J1396763J4541224J9453310
4375A48623723K4842322K3373622Q915609n726178j2537039j9612088k2752079
4368A45127892j8554960j2923521r108898o886093m920928l322192k110075j105859
$$ y = [18247219, 18670258, 19182537, 19919063, 20763934, 21721578, 22600912, 23185791, 23497070, 23612731, 23514322, 23457133, 23333663, 23392868, 23590013, 23838837, 24245717, 24850781, 25616121, 26286943, 26749049, 27147849, 27514130, 27765161, 28157737, 28592755, 29196506, 29932288, 30813213, 31866246, 32959489, 34257018, 35655878, 37228509, 38949021, 40490301, 42006688, 43559905, 45360786, 47348177, 49614776, 52475869, 56067412, 60278549, 65499775, 71438415, 78077408, 85512707, 93735478, 103232426, 114629189, 129170413, 148623723, 173466045, 196839667, 205755276, 200029098, 187492059, 167879971, 145127892, 126572932, 113649411, 104540513, 97654420, 92733492, 89411300, 87301225, 86195366]
4360H6195366l24206O78426J550775K527161L579382N038761O684360Q259183
4352A14189208R553220J0722033J1998899J4085161J7233712K1659343K8273413
4345B27714989L7947637M8059118M5363097K0832684q414671k6482295m0163561
4338C04856998m7679456m2738597l1981575k3347080j7829969j3698036j0415349
4331A17166936p968773o394974n205671m203243l292784k255072j263338n8212
4323H6524869J112650K148690L144495M080235N052313O076557P577253R961049
4315A25678111J3345246J8129082K4260198K4736465J2016585m650551j4558706
4308A98956430k1738949k6680562k4299328j8131908j3374453j0215259p865467
$$ y = [86195366, 85871160, 86549586, 88100361, 90627522, 94206904, 99245665, 105930025, 114189208, 123742428, 134464461, 146463360, 160548521, 177782233, 199441576, 227714989, 265662626, 313721744, 359084841, 379917525, 371502854, 345020559, 304856998, 257177542, 214438945, 182457370, 159110290, 141280321, 127582285, 117166936, 109198163, 102803189, 97597518, 93394275, 90101491, 87846419, 86583081, 86524869, 87637519, 89786209, 92930704, 97010939, 102063252, 108139809, 115717062, 125678111, 139023357, 157152439, 181412637, 206149102, 218165687, 213515136, 198956430, 177217481, 150536919, 126237591, 108105683, 94731230, 84515971, 76650504]
4301G6650504o169754m984801m564713m465415m213302l865738l442476k880493
4293D2063812k324005k180417j955989j761461j522959j445120j309973j081285
4285B8482603j013138r63861r37945p86477p26090o77153o44690n23004m77860
4276B1732385l99552l72130l74708j76458j86992m3231j3296j74419l81485n88611
4266A9021503p78634q22388o74987o71659m60832m67861m26604l83964k66242
4257A4068332l64633k64761k07439l28183k58301k91503l21313l29902l12564
4248A1389733l72807k36070k11833k64675j77272j85797k23036j66996j29602
4239I421645k16182j68401j22126j41698k002j36092k7887l4925n3140j8637N8620
$$ y = [76650504, 70480750, 65495949, 60931236, 56465821, 52252519, 48386781, 44944305, 42063812, 39739807, 37559390, 35603401, 33841940, 32318981, 30873861, 29563888, 28482603, 27469465, 26505604, 25567659, 24781182, 24055092, 23377939, 22733249, 22210245, 21732385, 21332833, 20960703, 20585995, 20409537, 20222545, 20179314, 20166018, 19991599, 19610114, 19021503, 18242869, 17420481, 16745494, 16073835, 15613003, 15145142, 14718538, 14334574, 14068332, 13703699, 13438938, 13231499, 12903316, 12645015, 12353512, 12032199, 11702297, 11389733, 11016926, 10780856, 10569023, 10304348, 10127076, 9941279, 9718243, 9551247, 9421645, 9205463, 9037062, 8914936, 8773238, 8771236, 8635144, 8607257, 8572332, 8519192, 8500555, 8559175]
4228H559175K0381J74454J26821K6108j56667l37572k17627l88582l83254k64533
4218G158704k61998k59823j94516j55548j75659j11864r9843j24004j28731j06305
4208E540413j10584j80758k6075k9373n3254n0392j01479p1485p003l871J06539
4197E012678J0547K1127j38797j25510j09884k18839k07822j93395q4119j29042
4187C836944r9219r7321r0407j09243k926p4098m2811p5246q7170j37111j8159
4176C003233K7706r4174j161m4556n6735j61701P384n1153j09387O606m3729O7102
4164B549435n0846n9191n3939k5253k2857M0840J0182p8937m754r3833j709J413
4152B210551p4840l5148k6969k2438j03524J6727n3339l1814j0345k4052n1057
$$ y = [8559175, 8579556, 8754010, 8880831, 8906939, 8750272, 8412700, 8195073, 7806491, 7423237, 7158704, 6896706, 6636883, 6442367, 6286819, 6111160, 5999296, 5899453, 5775449, 5646718, 5540413, 5429829, 5249071, 5222996, 5193623, 5140369, 5089977, 4988498, 4917013, 4910010, 4906139, 5012678, 5023225, 5044352, 4905555, 4780045, 4670161, 4451322, 4243500, 4050105, 3965986, 3836944, 3737725, 3640404, 3549997, 3440754, 3437828, 3363730, 3320919, 3245673, 3158503, 3021392, 3003233, 3030939, 2936765, 2935604, 2891048, 2834313, 2672612, 2679996, 2628843, 2519456, 2526062, 2482333, 2549435, 2498589, 2439398, 2385459, 2360206, 2337349, 2378189, 2388371, 2309434, 2304680, 2210847, 2209138, 2210551, 2135711, 2100563, 2073594, 2051156, 1947632, 1964359, 1911020, 1879206, 1868861, 1844809, 1793752]
4141A793752J1593q6507j1171O889o7301k1417o0434N2301L7399j537o8594k5423
4129A559550O5967N3438q016j1990P68p3475m9710m287o8152K1673n3012n626
4117A427128m4136J3597j759k7216r6627n7176O4718n4791n8935l4958k1813J3156
4105A121188q7130J0459O911J9635p6211L7328L2525N0837k0995p4744j9400K9181
4093A029584J0209j2273R3200n2485j2221q695k7457r796o3015j0353l5625K754
4081I03827K4904p567o3306k0204J9989K9612K6526j24322M8307n6872K389J7687
4069H00970l8544j7997j2397L3078q859Q7615o665J4426M0693p7918k1514j7060
4057G75828l8970J4246P9544q6483n2231K9787m7298O699K5857n5784M99P2502
$$ y = [1793752, 1805345, 1718838, 1707667, 1714556, 1647255, 1625838, 1565404, 1617705, 1655104, 1653567, 1584973, 1559550, 1625517, 1678955, 1670939, 1658949, 1659717, 1586242, 1536532, 1532245, 1464093, 1485766, 1432754, 1427128, 1382992, 1396589, 1394830, 1367614, 1270987, 1213811, 1278529, 1223738, 1164803, 1129845, 1108032, 1121188, 1034058, 1044517, 1051428, 1071063, 994852, 1032180, 1064705, 1115542, 1094547, 1019803, 1000403, 1029584, 1039793, 1027520, 1120720, 1068235, 1056014, 1047319, 1019862, 1010066, 947051, 936698, 901073, 903827, 928731, 921164, 857858, 837654, 857643, 887255, 913781, 789459, 837766, 780894, 783283, 800970, 762426, 744429, 732032, 765110, 756251, 843866, 837201, 851627, 892320, 814402, 792888, 775828, 736858, 751104, 830648, 744165, 691934, 721721, 674423, 681122, 706979, 651195, 651694, 724196]
4045G24196k6717L8848o4593l4290J6114o829O202r735J4215M822J8508k0952
4033F59789j5348O8249n5198p6292J26372l7064k5324N3024m5615O660L9458j2397
4021F86314j9463m2405J2411k4547O4955J0244J726K4852K7231J6254R0002K9833
4009H77407M3154J15991R8652J26544J82083M189m2756o4763q2436p7126o4771
3998A116168j38635o5099M4325q1625j3370q0916k012l081j0513q2576J6903M4427
3986G43996n826P5330Q2893m3373M9740R4329R359J48952J20867M9625K22735
3975A548627L24774K59656K01562j624j72208j76435k25879k53769j50195j31954
3965A222555j27304j10684p7883p7657k4213o0408n5367l5025l0963N0789J18757
$$ y = [724196, 697479, 736327, 671734, 637444, 653558, 646729, 652931, 643196, 657411, 662233, 680741, 659789, 644441, 712690, 657492, 581200, 707572, 670508, 645184, 698208, 652593, 659253, 698711, 686314, 666851, 624446, 636857, 612310, 677265, 687509, 689235, 714087, 741318, 757572, 847574, 877407, 920561, 1036552, 1135204, 1261748, 1443831, 1448020, 1405264, 1340501, 1258065, 1180939, 1116168, 977533, 912434, 956759, 875134, 861764, 780848, 778836, 775755, 765242, 682666, 699569, 743996, 738170, 813500, 896393, 853020, 902760, 997089, 1006448, 1155400, 1276267, 1325892, 1548627, 1873401, 2133057, 2334619, 2332995, 2160787, 1984352, 1758473, 1504704, 1354509, 1222555, 1095251, 984567, 906684, 829027, 804814, 744406, 689039, 654014, 623051, 673840, 792597]
3954G92597m6923r1716Q0673N192M7445L9192k64J37893P0883L7657J55288J44749
3942A372666R4925j04212j7076m0261k01499p9044k05737o8109K8727j29497J3279
3931F64162m0276q3053q29o266l4253K165n6338R964m5293K3574l1565j5871J00160
3918D86281k2729K6410L5049j39205N0341j5797k2626L1092m484K3098K7274o4492
3906D10212K5538n4246j5103k758N0568j0864o0770N108J9680J0401p9070L7386
3894C36082m4241R9586p1240N7310Q885j29828N1705N7759j53M3644k3865L8114
3882D23758R168m5150J2874J2149j6101j0652q162k4776k7014P3951q6490m3772
3870B69783M8886L635J0323j877J5960l7683J4679n015M5039N8884m9269l8853
$$ y = [792597, 745674, 653958, 734631, 739823, 787268, 826460, 826196, 964089, 1034972, 1072629, 1227917, 1372666, 1467591, 1363379, 1346303, 1306042, 1104543, 1025499, 819762, 751653, 780380, 650883, 664162, 623886, 540833, 540004, 533738, 499485, 501650, 445312, 455276, 409983, 433557, 401992, 386121, 486281, 463552, 489962, 525011, 385806, 436147, 420350, 397724, 428816, 424332, 447430, 474704, 410212, 435750, 381504, 366401, 363643, 414211, 403347, 342577, 347685, 367365, 377766, 298696, 336082, 291841, 391427, 320187, 377497, 386382, 256554, 308259, 366018, 365865, 409509, 385644, 423758, 432926, 387776, 400650, 412799, 396698, 386046, 377884, 353108, 326094, 400045, 313555, 269783, 318669, 322304, 332627, 330750, 346710, 309027, 323706, 318691, 363730, 422614, 373345, 334492]
3858C34492n4934L7028N9090N1359m8146K9297j0438o3630L6536k7843L1267Q308
3846C82386J9857Q70k0034k2125O4576l0982m5804m0440N1838K1878j7910P1236
3834D35346m8160J5434n212K4858J1597k9270J1611N4037K3523M7747m711n1324
3822D85476J1854N7224J5258k5057m0375o599O0174j1846m7927K3499P023J5844
3810E44548o198j3942J9526K0057n9054K4706k3876K3082l59q283O7223k9672
3798E57758J0418R421L9256j924j398K2552M9173K4698N1885k0722J044j127j6453
3785G24581J5689l292p544j783q4841Q6474K3147j895j5875j0357J0835J8885
3773G54024M6391J2191K2631L9389J8638l6658M2338N1459P8212K8578o8666N6879
$$ y = [334492, 279558, 316586, 375676, 427035, 378889, 408186, 397748, 334118, 370654, 342811, 374078, 382386, 402243, 403113, 383079, 360954, 425530, 394548, 348744, 308304, 360142, 382020, 364110, 435346, 387186, 402620, 397408, 422266, 433863, 404593, 416204, 470241, 493764, 541511, 536800, 485476, 497330, 554554, 569812, 544755, 504380, 497781, 557955, 546109, 498182, 521681, 528704, 544548, 538350, 524408, 543934, 563991, 504937, 529643, 505767, 528849, 528490, 520207, 587430, 557758, 568176, 577597, 616853, 614929, 613531, 636083, 685256, 709954, 761839, 741117, 742161, 741034, 724581, 740270, 736978, 729434, 727651, 642810, 729284, 752431, 750536, 734661, 724304, 735139, 754024, 800415, 812606, 835237, 874626, 893264, 856606, 898944, 950403, 1028615, 1057193, 988527, 1045406]
3761A045406l8932N7246O4224R280l1643o5226L9229J6818P667M2157J1706K149
3749A160081Q9227n9605K0773N7611J2604l5679L2938K1063M7135K3008M2688
3738A411844m4305M0117N9691p970R6949k4893K0160O8400l1721N8735O8515J1898
3726A727420R7248k6319J12072k1952q7645N7682N6591J23464n9757M7544R1861
3715B118209N0667J41108l1402Q3733O9366M3326O1681R2336N0627J15789K1474
3704B816914J14000R7797J6754J32030O2906J61494Q5107J26807J00317O7017
3694C781143J54883J38337J06410J44679J64318K80010J60847J76626K82751K43125
3684E633129K89783K77467L53820M75822L39713N06954M53197M53547O30781N30783
$$ y = [1045406, 1006474, 1063720, 1127944, 1137224, 1105581, 1040355, 1079584, 1096402, 1104069, 1146226, 1157932, 1160081, 1249308, 1189703, 1210476, 1268087, 1280691, 1245012, 1277950, 1299013, 1346148, 1369156, 1411844, 1367539, 1407656, 1467347, 1459377, 1556326, 1531433, 1551593, 1619993, 1588272, 1647007, 1715522, 1727420, 1824668, 1798349, 1910421, 1888469, 1800824, 1858506, 1915097, 2038561, 1978804, 2026348, 2118209, 2168876, 2309984, 2278582, 2362315, 2431681, 2475007, 2536688, 2629024, 2679651, 2795440, 2816914, 2930914, 3028711, 3045465, 3177495, 3240401, 3401895, 3487002, 3613809, 3714126, 3781143, 3936026, 4074363, 4180773, 4325452, 4489770, 4769780, 4930627, 5107253, 5390004, 5633129, 5922912, 6200379, 6554199, 7030021, 7369734, 7876688, 8329885, 8783432, 9414213, 9944996]
3674I944996N31762N25448L84828M69558M52544M36692M84976N83587O65173O15323
3664A5094887O55855O11347N34826O24936N54719O94818P32628P05812Q77554
3655B1087382Q52783R86300J050869J155323J296062J291536J355102J585583
3647C0660940J844857K080893K356671K946135L431723M155231K786117j31546
3639E0131021j081808r45459q23337p79031p02002m78829k63774k49030l59619
3630D4448132k84005j36752J59108L83924O24399Q05547J019024J361773J686429
3621E0067579K116519J795225N72663n33393o60734r32516p08557k22624K07319
3612E1701481O43773J093125J543520J961421J585934J239063O99012p04540p54900
$$ y = [9944996, 10476758, 11002206, 11387034, 11856592, 12309136, 12745828, 13230804, 13814391, 14479564, 15094887, 15750742, 16362089, 16896915, 17521851, 18076570, 18771388, 19504016, 20209828, 21087382, 21940165, 22926465, 23977334, 25132657, 26428719, 27720255, 29075357, 30660940, 32505797, 34586690, 36943361, 39889496, 43321219, 47476450, 50262567, 50131021, 49049213, 48103754, 47280417, 46501386, 45799384, 45320555, 45056781, 44807751, 44448132, 44164127, 44027375, 44186483, 44570407, 45194806, 46000353, 47019377, 48381150, 50067579, 52184098, 53979323, 54551986, 54018593, 53357859, 52425343, 51716786, 51494162, 51701481, 52345254, 53438379, 54981899, 56943320, 58529254, 59768317, 60467329, 59762789, 59007889]
3603E9007889m0904P21270J259075J160542o96124k223969j986880j270265p51584
3594E5179050n53038n43416k81969O8151K21243O92705M72377P5698O34406J454808
3584E7420015R86735j091973j553733j591395j782238j520549r73643n61288n37289
3575D8794642m24278l45283j23964q6187j4866p5713r3868J55080N15974Q71101
3565D9172638J157825R30242L27145l53678q38974o59003k82184M9751J06157
3556D9609919j66992j24449k49103q06370j827357j780050j068340o85835l19115
3547D2582308l4558K64887M49711R19945J245029J817715J176824n75536j285470
3538D6560855j260721q79356o98174n42374n95732n27427m52051n55951l62831
$$ y = [59007889, 58966985, 59688255, 60947330, 62107872, 61411748, 59187779, 57200899, 55930634, 55179050, 54626012, 54082596, 53800627, 53868778, 54090021, 54782726, 55255103, 55330801, 55965207, 57420015, 58406750, 57314777, 55761044, 54169649, 52387411, 50866862, 49893219, 49331931, 48794642, 48370364, 48025081, 47901117, 47814930, 47800064, 47724351, 47630483, 47785563, 48301537, 49172638, 50330463, 51260705, 51587850, 51234172, 50395198, 49736195, 49454011, 49503762, 49609919, 49442927, 49318478, 49069375, 48263005, 46435648, 44655598, 43587258, 42901423, 42582308, 42547750, 42812637, 43262348, 44182293, 45427322, 47245037, 48421861, 47846325, 46560855, 45300134, 44420778, 43722604, 43180230, 42584498, 42057071, 41605020, 41049069, 40686238]
3529D0686238j26192k872K2416K31157N58335P57397O03266K86813l89641j255738
3519D1371179k602376k967975k279574j970532j637195j797520j578378j357594
3511B5180035j274871j105288j091096r22679q97304q64083p57134p58383r54425
3502A6554772j049206q76475q52359p01557o27116n91078m65456m08526m45187
3493A0537812l64292m18134l98495l03898l45985k06980k51567l16917k38321
3484G693223k63605k44885j30794k23745k28191k73938j72062q1243j53867j72235
3474E748658k34745j71600j26813j85626j00325j32020j67531j34013j79973j05589
3464D210423j17460j82299j10397j29671l2157n8060j19278l7841j20403o5590
$$ y = [40686238, 40560046, 40557174, 40579590, 40810747, 41369082, 42126479, 42729745, 43016558, 42626917, 41371179, 38768803, 35800828, 33521254, 31550722, 29913527, 28116007, 26537629, 25180035, 23905164, 22799876, 21708780, 20786101, 19888797, 19024714, 18267580, 17509197, 16554772, 15505566, 14629091, 13776732, 13075175, 12448059, 11856981, 11391525, 10982999, 10537812, 10173520, 9755386, 9356891, 9052993, 8707008, 8500028, 8248461, 7931544, 7693223, 7429618, 7184733, 7053939, 6830194, 6602003, 6328065, 6156003, 6074760, 5920893, 5748658, 5513913, 5342313, 5215500, 5029874, 4929549, 4797529, 4629998, 4495985, 4316012, 4210423, 4092963, 3910664, 3800267, 3670596, 3638439, 3580379, 3461101, 3423260, 3302857, 3237267]
3454C237267p2323j26722j01827n2254q1837Q573n5588j06862j08379o2271m1727
3443B436050o8992k3466o7732q6899m3630j793q2346p2473q7430M2380k9339n7001
3431A857329M2604n3901l2431o5567j2720l0158m8684l2658l1105J4751m4028
3420A563432k4866m3363M6596j8919o2090j00479l4906L160p2871k9270k5634
3409A200790O73L2517K353j42529P74J9378k9676k1425J9598k9031J0379n5116
3397A008685q8126Q0605k2363j7556M4482K3849m2994j02577k3337K3799Q583
3386H93050n1249J7200j612p1286J8296R193r2977q0325j453M7927O4346k4005
3374G27105J0066m5186K4015O7794K0726n4689m5260KM251Q7169O875q8578q2420
$$ y = [3237267, 3164944, 3038222, 2936395, 2884141, 2802304, 2810877, 2755289, 2648427, 2540048, 2477777, 2436050, 2367058, 2343592, 2275860, 2188961, 2145331, 2143538, 2061192, 1988719, 1901289, 1943669, 1914330, 1857329, 1899933, 1846032, 1813601, 1748034, 1735314, 1705156, 1656472, 1623814, 1592709, 1607460, 1563432, 1538566, 1495203, 1541799, 1522880, 1460790, 1360311, 1325405, 1328565, 1255694, 1226424, 1200790, 1201463, 1233980, 1236333, 1093804, 1094578, 1113956, 1084280, 1062855, 1082453, 1053422, 1063801, 1008685, 920559, 1001164, 978801, 961245, 1005727, 1029576, 986582, 884005, 860668, 884467, 893050, 841801, 859001, 857389, 786103, 804399, 813592, 720615, 640290, 638837, 686764, 751110, 727105, 737171, 691985, 716000, 783794, 804520, 749831, 704571, 704573, 708824, 795993, 802868, 714290, 631870]
3361F31870q90n4114K900N3501n7734M3572n5720n5291k3917J8813P346k3885
3349D86451K4187M2281O2025j2597k8442m396k7880M0940N4757k7101K7379N9205
3337F96809r5767K249n582j1005L6174n7054N575K0980J695O771j19808Q772L5162
3324E24971j20467L1877k2737j2672M3130M2997J7158l2432P214K8877O0002k0558
3312E47360q359K1143M337J09457K85q1Q1313L5061l1182O2820o3310k5793L8791
3299G71842L000n8379l9635l6367m9989J05218j2804m8825N021o1056J8834R8932
3287F95792j8412m825O4956J7181J2334N5337Q2481R0026K1142M1112J20482K11954
3275A389560O1000N9096M5926n9163k1837j15861o7328q4113r9403p7969k1449
$$ y = [631870, 630980, 576866, 579766, 633267, 575533, 619105, 563385, 508094, 484177, 502990, 510336, 486451, 510638, 552919, 614944, 602347, 573905, 569509, 541629, 582569, 637326, 610225, 637604, 696809, 601042, 603291, 597709, 586704, 622878, 565824, 571399, 592379, 594074, 600845, 481037, 489809, 524971, 404504, 436381, 413644, 400972, 444102, 487099, 504257, 471825, 479039, 507916, 567918, 547360, 539001, 560144, 564481, 673938, 674223, 674142, 755455, 790516, 759334, 822154, 758844, 733051, 771842, 774842, 716463, 676828, 640461, 590472, 695690, 682886, 634061, 639082, 578026, 596860, 695792, 677380, 672555, 737511, 754692, 767026, 822363, 904844, 994870, 1016012, 1057124, 1177606, 1389560, 1450560, 1509656, 1555582, 1496419, 1474582, 1358721, 1291393, 1207280, 1107877, 1029908, 1008459]
3264A008459j53898o7403N4718M302k82R265k5877K4614O6501k4301O929K2880
3252I25907J16067P1170Q0511J18452P7043J60764J11627Q5725Q0073M2144J2555
3241A882038m5887p8776j43623j48040q7328j86892j28229o8396j7516J1787j2842
3230I76296o0196O5281P2754M607P4029L653J9551N3540O7974O2906Q9535M8824
3218A478754J85450J79385J67042J37132L1459r2502j03440j22928j52150j36297
3208A571905j34076r9968j37087q9548q0160k7222o012M3255L1727J3299P5753
3197A161866L704m1772j2191L0477j3911L956l724N436L7147M973l704m57J8217
3184A190017L9334L1342m3257m6260Q484n7339o231k3436j5340k3799l7532K3061
$$ y = [1008459, 854561, 787158, 841876, 846178, 845896, 855161, 829284, 853898, 920399, 896098, 903027, 925907, 1041974, 1113144, 1193655, 1312107, 1389150, 1549914, 1661541, 1747266, 1827339, 1869483, 1882038, 1836151, 1757375, 1613752, 1465712, 1378384, 1191492, 1063263, 994867, 977351, 989138, 976296, 916100, 981381, 1054135, 1058742, 1132771, 1136424, 1155975, 1209515, 1277489, 1340395, 1429930, 1478754, 1664204, 1843589, 2010631, 2147763, 2179222, 2086720, 1983280, 1860352, 1708202, 1571905, 1437829, 1337861, 1200774, 1111226, 1031066, 1003844, 997832, 1041087, 1072814, 1086113, 1161866, 1165570, 1123798, 1111607, 1142084, 1128173, 1132129, 1128405, 1133841, 1170988, 1175961, 1172257, 1171800, 1190017, 1229351, 1260693, 1217436, 1171176, 1179660, 1122321, 1116090, 1092654, 1077314, 1053515, 1015983, 1039044]
3172A039044k3309M2485R6812O5751M3267O1186P5392m8815j0498N7656N3403
3161A452374n167K933J5609M6352J2934n3195J8215k0477K5124J4815r2431L6270
3149A453356J9395K9151L9269j6286M1507K5826K1959k7212N0713O3755j179R2897
3137A793151Q7237K9830J7793L3418L1358P4493O1812l4068J4953P974L7646L406
3125B159003L4467j1877k970R380l1740M7471M9955l9914n953N2624j4921M5788
3113B291313J34706n5338R8261J31268J03347L9861M2958M5690R0464K2889m0324
3102B905095N6419j349K7240K3481K6603j8366L3179M755n933R6870Q223o556
3090C149661R5609l2775M3622J07258J4764O3828M2686q686J43127N9101J07688
$$ y = [1039044, 1015735, 1058220, 1155032, 1220783, 1264050, 1325236, 1400628, 1351813, 1341315, 1398971, 1452374, 1447207, 1450140, 1465749, 1512101, 1525035, 1471840, 1490055, 1469578, 1494702, 1509517, 1417086, 1453356, 1472751, 1501902, 1541171, 1524885, 1566392, 1592218, 1614177, 1586965, 1637678, 1701433, 1700254, 1793151, 1880388, 1910218, 1928011, 1961429, 1992787, 2067280, 2129092, 2095024, 2109977, 2117951, 2155597, 2159003, 2193470, 2181593, 2178623, 2188003, 2156263, 2203734, 2253689, 2213775, 2207822, 2260446, 2245525, 2291313, 2426019, 2370681, 2468942, 2600210, 2703557, 2743418, 2786376, 2832066, 2922530, 2945419, 2905095, 2961514, 2960165, 2987405, 3010886, 3037489, 3019123, 3052302, 3057057, 3051124, 3147994, 3156217, 3149661, 3245270, 3212495, 3256117, 3363375, 3378139, 3441967, 3484653, 3475967, 3619094, 3678195, 3785883]
3079C785883K8517R6991J25860J29087N6091M5326J78407P2711J26095J56858
3069D801826L6681L7797J89226L2279P1999J74222K1976J47679J05949J09569
3059E729203P3987K8411R9798J43879J66347N0413M5329J50987K12180R2326K52731
3048G045591J90801J94159J48965J60366K74485K00151K13457K39788K92656K26008
3038I186427K01135K10171K48365K43953K24742K87110L03205K95882K78211L06590
3028A1785791K74091K93014L31644L26118M05300M42660M39414M67269N53167
3019A5318468N67488P16931O85900P13742P29221O90053P54896P33608Q33663
3010B1743970J023264J258913J415266J620949J892577K091325K155422K487545
$$ y = [3785883, 3814400, 3911391, 4037251, 4166338, 4222429, 4267755, 4446162, 4518873, 4644968, 4801826, 4838507, 4876304, 5065530, 5097809, 5169808, 5344030, 5366006, 5513685, 5619634, 5729203, 5803190, 5831601, 5931399, 6075278, 6241625, 6292038, 6337367, 6488354, 6700534, 6792860, 7045591, 7236392, 7430551, 7579516, 7739882, 8014367, 8214518, 8427975, 8667763, 8960419, 9186427, 9387562, 9597733, 9846098, 10090051, 10314793, 10601903, 10905108, 11200990, 11479201, 11785791, 12059882, 12352896, 12684540, 13010658, 13415958, 13858618, 14298032, 14765301, 15318468, 15885956, 16602887, 17288787, 18002529, 18731750, 19421803, 20176699, 20910307, 21743970, 22767234, 24026147, 25441413, 27062362, 28954939, 31046264, 33201686, 35689231]
3002C5689231L028574L693812M698267O126166P488547O935528L153025o01726
2994G0211424k326836m180722n226887m111081k586689j380827o47681j89927
2986D9560774P0198L62811M70028Q53312J139125J660194K332284L150861L992074
2977F3591661M694188N564274O288088P254826Q503991J0577216J3597727J7748729
2969A37820700K1877070J9950183J3108157Q668804j610916j3837752j6536881
2962A69439365j7315179j7660249j4252497j0225454p208044n209689l815766
2955I3752487k848767j793863j106287k36762Q22729J993560L164858M351070
2947I8099025N732999O802220Q190729R906545J2223180J5424906K0051899K4622771
$$ y = [35689231, 38717805, 42411617, 47109884, 53236050, 60724597, 67660125, 70813150, 70211424, 67884588, 63703866, 58476979, 54365898, 51779209, 50398382, 49750701, 49560774, 49630972, 49993783, 50463811, 51317123, 52456248, 54116442, 56448726, 59599587, 63591661, 68285849, 73850123, 80138211, 87393037, 95897028, 106474244, 120071971, 137820700, 159697770, 179647953, 192756110, 201424914, 199813998, 185976246, 169439365, 152124186, 134463937, 120211440, 109985986, 102777942, 97568253, 93752487, 90903720, 89109857, 88003570, 87766808, 88589537, 90583097, 93747955, 98099025, 103832024, 110634244, 118824973, 128731518, 140954698, 156379604, 176431503, 201054274]
2939B01054274K5329838K2084653J8271709O621247q287823j6077384k3351289
2932B25645225k6515463k4313531k0696081j5976769j1824386q927220o784430
2925A10607345n178058m025705k951196j853369p55203L57066J616586K938207
2917A00755673M055792N462825O873725Q322336J0088043J2636782J6550488K1174843
2909A85920507K4338081K4790613K2947222J9995293Q683362j2555618k7263675
2902B46855785l3956043l4893567k8418730k0766325j5608508j2099330r538812
2895I1574470p712127o275494n087313m189593l544127k822807k150002j545541
2887E8247466j079885q49693p29572m84945J11717O50923J567224K663124L980482
$$ y = [201054274, 226384112, 248468765, 266740474, 273361721, 265073898, 248996514, 225645225, 199129762, 174816231, 154120150, 138143381, 126318995, 117391775, 110607345, 105429287, 101403582, 98452386, 96599017, 95843814, 96200880, 97817466, 100755673, 104811465, 110274290, 117148015, 125470351, 135558394, 148195176, 164745664, 185920507, 210258588, 235049201, 257996423, 277991716, 286675078, 274119460, 246855785, 212899742, 178006175, 149587445, 128821120, 113212612, 101113282, 91574470, 83862343, 77586849, 72499536, 68309943, 64765816, 61943009, 59793007, 58247466, 57167581, 56317888, 55588316, 55103371, 55215088, 55866011, 57433235, 60096359, 64076841]
2878F4076841M431220J999000j681743l564479m876918o258025o010683m731224
2870D3383989l656184k912175k395194j956032j674724j530728j298134j236214
2862B6724604j235407j013447r93424q77811q01114p60706o93342o02694o73496
2853A9073163n84753m85914n29695n09065m82966m38776m60031m19478l40740
2844A4821745l38888k93830l37667k33911k13303l33614j96646k58909k22804
2835A2392173j98625j94830k56027j93274k22216k61141j76531j57425k44827
2826A0487277k20948k08160r5566j57291k15637k03309j44957r9649k01583k36365
2816H703812j19628j88649j48321j25392j34211n0525l3636j52043j82417j30093
$$ y = [64076841, 68508061, 70507061, 68825318, 65260839, 60383921, 54125896, 48115213, 43383989, 39727805, 36815630, 34420436, 32464404, 30789680, 29258952, 27960818, 26724604, 25489197, 24475750, 23482326, 22604515, 21803401, 21042695, 20349353, 19746659, 19073163, 18488410, 18002496, 17472801, 16963736, 16480770, 16041994, 15581963, 15162485, 14821745, 14482857, 14189027, 13851360, 13617449, 13404146, 13070532, 12873886, 12614977, 12392173, 12193548, 11998718, 11742691, 11549417, 11327201, 11066060, 10889529, 10732104, 10487277, 10266329, 10058169, 9962603, 9805312, 9589675, 9386366, 9241409, 9141760, 8940177, 8703812, 8584184, 8395535, 8247214, 8121822, 7987611, 7937086, 7903450, 7751407, 7568990, 7438897]
2806G438897j07176k9278j76987j24619j05493j89653m8769j06467p3058k38968
2796F238429q7000j03692j75952l9839j66444l867n380j13407j23905j5477j05182
2785E298284j8570l9461j37255n2317l7460p224j8549m897j40838q2397j2588
2774D746728q0917k6968r5487r2811k3887j28756k8959q379r9663R153l2069j34750
2762D003235N9116o6688o1950L5682N2622N5057P6011R9706K0726M8165N3239
2751D374921r0739q7530j08110j00292l380j31719j5710l7367p6879p5155L8553
2740C686593J4036q3396r341L9188m0314L6348K9651J21425J25596Q1343J92916
2729D194045K16816L02044M04079K51412K44284N8634j39487k58178l39369k31433
$$ y = [7438897, 7331721, 7302443, 7125456, 7000837, 6895344, 6705691, 6656922, 6550455, 6477397, 6238429, 6151429, 6047737, 5871785, 5831946, 5665502, 5661635, 5656255, 5542848, 5418943, 5403466, 5298284, 5279714, 5240253, 5102998, 5050681, 5013221, 5005997, 4987448, 4982551, 4841713, 4759316, 4746728, 4665811, 4638843, 4543356, 4450545, 4426658, 4297902, 4268943, 4260564, 4160901, 4170054, 4137985, 4003235, 4062351, 3995663, 3933713, 3969395, 4022017, 4077074, 4153085, 4252791, 4273517, 4321682, 4374921, 4284182, 4196652, 4088542, 3988250, 3984870, 3853151, 3837441, 3800074, 3723195, 3648040, 3686593, 3700629, 3617233, 3607892, 3647080, 3606766, 3643114, 3672765, 3794190, 3919786, 4001129, 4194045, 4410861, 4712905, 5116984, 5368396, 5612680, 5671314, 5531827, 5273649, 4934280, 4702847]
2719D702847k38141k35581p8344j87909r3965n5976m9419j3538j8096M3900o522
2708C769256j5349R6074N1699M6639J39517J69267K44745K45211L27632L41355
2698E416046L05335K81944J12347j15646k00518m24779l86845k92628k72097k14022
2688D209137j28714p3670j17547r1840p0592j54588j08646r1905p6307O741M3548
2677C345617M2188M9565P0811Q8462J57050J67485K29282K51831J27514J15050
2667D644855p430k23647k03550l21229k51945q6634q1841K025L06N3188J6454
2656C540552k980j00249r7766j79115j14980j15420j68042j32114j01006k1382
2646B507498j1601l2743N757m2447R6686Q4958N2540K0781j18017o6006k7359
$$ y = [4702847, 4464706, 4229125, 4150781, 3962872, 3868907, 3812931, 3763512, 3749974, 3731878, 3775778, 3769256, 3753907, 3849981, 3901680, 3948319, 4087836, 4257103, 4501848, 4747059, 5074691, 5416046, 5721381, 6003325, 6115672, 6000026, 5799508, 5374729, 4987884, 4695256, 4423159, 4209137, 4080423, 4006753, 3889206, 3797366, 3726774, 3572186, 3463540, 3371635, 3295328, 3302069, 3345617, 3387805, 3437370, 3508181, 3596643, 3753693, 3921178, 4150460, 4402291, 4529805, 4644855, 4637425, 4413778, 4210228, 3888999, 3637054, 3550420, 3468579, 3470604, 3470910, 3524098, 3540552, 3537572, 3437323, 3339557, 3160442, 3045462, 2930042, 2762000, 2629886, 2528880, 2507498, 2495897, 2463154, 2468911, 2426464, 2523150, 2608108, 2660648, 2681429, 2563412, 2497406, 2470047]
2635B470047j06637K659M0639K7117R3687O9416J31318J16465J37979K9033n6936
2624B954787n0326j42295k12981k07231j86562j28198j34885o1993j3337j05851
2614A711128l8636p0788q2899M4085o2305l6995L4588K1176K7178O2849J6712
2603A626093P0415R0303J33872Q4214Q7621J21813M8799O0061j3583K8716k669
2592B335655q8685K7035j19645j72408j86977k02058j67302p2697k9036p4374
2582A249508r4698j00466n1815L9243p85n4315M3889l2763M773N3660O839M8052
2570A111122L8539L1284R4940j2102r285l7024m8258k1028p3019o0458q6350k8865
2558H99496N1054q4255K870p4763p2934n5538k1945M3939k3596O706j4227k3176
$$ y = [2470047, 2363410, 2366069, 2406708, 2433825, 2527512, 2596928, 2728246, 2844711, 2982690, 3011723, 2954787, 2904461, 2762166, 2549185, 2341954, 2155392, 2027194, 1892309, 1830316, 1816979, 1711128, 1672492, 1601704, 1518805, 1562890, 1500585, 1463590, 1498178, 1519354, 1546532, 1609381, 1626093, 1696508, 1786811, 1920683, 2004897, 2092518, 2214331, 2263130, 2323191, 2309608, 2338324, 2335655, 2246970, 2274005, 2154360, 1981952, 1794975, 1592917, 1425615, 1352918, 1323882, 1249508, 1154810, 1054344, 1002529, 1041772, 1040987, 986672, 1030561, 997798, 1002571, 1056231, 1063070, 1111122, 1149661, 1180945, 1275885, 1263783, 1254498, 1217474, 1169216, 1148188, 1075169, 1014711, 928361, 899496, 950550, 866295, 869165, 794402, 721468, 665930, 643985, 687924, 664328, 671034, 656807, 633631]
2546F33631k0303O4709j2713M2125J0092K0937N6617n3081Q3988O435k6187o303
2534G99947k4159j8350o4601K0789j8049j7846k3429k475m9414l3224k6333M2149
2522E85005k4601L603L7557n6587N9037p993k6518J2858P3337k3644m7195J9536
2510F04395R952Q8861N9803l204k8277J782q5555R9656k8891k0180m7693o0349
2498E90300j983J3701K1469o6264k5905n449k5751P855Q3757o4929J2753L9681
2486E79235L9282J2181j9646R0076J1367o4924Q0549K2599n340j4688L4055k6523
2474G38223o016o996k1449l9242m7015m8733k6469M1152p3684N6975Q059n1366
2462E23439K0548Q808L961p3667l6081K7594j7109R5343K8213N5108J44347k7327
$$ y = [633631, 613328, 678037, 665324, 707449, 717541, 738478, 795095, 742014, 826002, 832437, 806250, 799947, 775788, 757438, 692837, 713626, 695577, 677731, 654302, 651827, 602413, 569189, 542856, 585005, 560404, 564007, 601564, 544977, 604014, 596021, 569503, 582361, 655698, 632054, 584859, 604395, 614347, 703208, 763011, 759807, 731530, 733312, 647757, 747413, 718522, 698342, 650649, 590300, 588317, 602018, 623487, 557223, 531318, 525869, 500118, 507973, 591730, 526801, 539554, 579235, 618517, 630698, 611052, 701128, 712495, 647571, 728120, 750719, 745379, 730691, 764746, 738223, 732207, 725211, 703762, 664520, 617505, 568772, 542303, 583455, 509771, 566746, 574805, 523439, 543987, 552795, 556756, 483089, 447008, 474602, 457493, 552836, 581049, 636157, 780504, 753177]
2450G53177L6794k7080J0487M2951R9137R829J0587o4514j09819m1496j25441
2439E94612l8862l4660K5729o5248J2963L2824p6415R236p3406M4310O1134J1378
2427E03595J971M8636m816n11j2747m4197O1892P1277L1998p8614M1937J7071
2415F37492N4949m1041l1229L1175N494q395k9867k520j0201m5799q0391k5690
2403D53977K7394m3253k8117Q0543k3318K8858N7798M3431l5707L8699n0841N6139
2391F05603J0256n0920L0252n1176J5439K3396J3m3590N835K1447l2223q370J1539
2378E37501j22085p5505o14N0885L9296n3994l5413L2696J7506O4444O7634r008
2366E13343J0766j3794j2751M1842m6318N2130j8515p878J6931l3889k9940J2221
$$ y = [753177, 789971, 762891, 773378, 816329, 915466, 925295, 935882, 871368, 761549, 720053, 594612, 555750, 521090, 546819, 481571, 494534, 527358, 450943, 460179, 386773, 431083, 492217, 503595, 505566, 554202, 549386, 548875, 536128, 491931, 553823, 625100, 657098, 578484, 620421, 637492, 692441, 651400, 620171, 651346, 656840, 648445, 618578, 616058, 605857, 560058, 479667, 453977, 481371, 438118, 410001, 490544, 467226, 496084, 553882, 597313, 561606, 600305, 549464, 605603, 615859, 564939, 595191, 544015, 559454, 582850, 582863, 539273, 545108, 566555, 534332, 525962, 537501, 415416, 339911, 339297, 390182, 429478, 375484, 340071, 372767, 390273, 454717, 522351, 513343, 524109, 510315, 497564, 539406, 493088, 545218, 526703, 518825, 535756, 501867, 471927, 484148]
2354D84148O2936q6301L2132l265K2322O1110l9308J0757l0771j2316P0803o3133
2342E09114l0086O011k9585P0780O0227n281l9983K9422L5099k187M3946L7096
2330F84573J0844J6329j0216K2071j0526m1115k2718r579n3852M3724m4146L0766
2318F16155l6994n8036J44218K9569J2954j8242L7489Q133k3899J02202L9175
2307H52724k0145J5889P1712M4981J26115N3683L0050O1658R7456J24010J34505
2296A592638J32876j17279q4763j06099q6071r3749p2065r4035q8581O16l9054
2285I44434N4765Q098J6131o1436K4123p326K8855P2413K26M2730K2652K4053
2273A169718K253k2092l0192P1562k449q2524J08673k7935l8866M9616k036K4981
$$ y = [484148, 547084, 460783, 492915, 489650, 511972, 573082, 533774, 544531, 513760, 501444, 572247, 509114, 479028, 485039, 455454, 526234, 586461, 581180, 541197, 570619, 605718, 603531, 647477, 684573, 695417, 711746, 701530, 723601, 713075, 671960, 649242, 639663, 585811, 629535, 585389, 616155, 579161, 521125, 665343, 694912, 707866, 689624, 727113, 735246, 711347, 813549, 852724, 832579, 848468, 920180, 965161, 1091276, 1144959, 1175009, 1236667, 1334123, 1458133, 1592638, 1725514, 1608235, 1523472, 1417373, 1331302, 1237553, 1165488, 1071453, 982872, 983488, 944434, 999199, 1007297, 1023428, 961992, 986115, 978789, 1007644, 1080057, 1080283, 1123013, 1145665, 1169718, 1171971, 1149879, 1119687, 1191249, 1188800, 1106276, 1214949, 1187014, 1148148, 1197764, 1195728, 1220709]
2261A220709K921J6321k2801L9934p822M6729K2001r205M7799R1639R3443P1242
2249A612910J3520P063J18459N2237N4767O0507m2666M4228J04909J7633N5314
2238B098881N0178L7640K9640M4657j59N4663P9345k8837J5159P4488J05405N0961
2226B612021N6780P2324O8933O4063J15866J47658Q6223j7958R9546J08677J75980
2215C590113Q2309J4084N7526J50445J18720J17200J33452J06264P8662J05254
2205D554029P2736J19078J05045J93913K45705K34928K37322K37928K75493J89407
2195F465584K68533K21738K39189L63551L37754M59433M49408N45706O10287Q71912
2185A0833095Q91972R08708R64291J166259J346093J744266K282322L123181M199820
$$ y = [1220709, 1223630, 1239951, 1217150, 1257084, 1249262, 1295991, 1317992, 1308787, 1356586, 1448225, 1541668, 1612910, 1626430, 1633493, 1751952, 1804189, 1858956, 1919463, 1876797, 1921025, 2025934, 2043567, 2098881, 2149059, 2186699, 2216339, 2260996, 2260837, 2315500, 2394845, 2366008, 2381167, 2455655, 2561060, 2612021, 2668801, 2741125, 2810058, 2874121, 2989987, 3137645, 3223868, 3205910, 3305456, 3414133, 3590113, 3672422, 3686506, 3744032, 3894477, 4013197, 4130397, 4263849, 4370113, 4448775, 4554029, 4626765, 4745843, 4850888, 5044801, 5290506, 5525434, 5762756, 6000684, 6276177, 6465584, 6734117, 6955855, 7195044, 7558595, 7896349, 8355782, 8805190, 9350896, 9961183, 10833095, 11725067, 12633775, 13598066, 14764325, 16110418, 17854684, 20137006, 23260187, 27460007]
2176B7460007N134242K984126q47633k643253m111205l919747k723073j870670
2168A9462794j299448q73457n99000l09408j05501j08149j0057J51959K27300
2159A6537033K76039L66889N34835P04934Q70149R79964J369819J602224J839397
2150B5081283K110119K221321K398801K593919L162742L937151N115271O863004
2142E3483611R257405Q392257M27952m668910p950449r664298p398399n395898
2134C6483271m017034l169682k519463j940270j549417j352626j173032r87911
2126A9773836r60974q26243o43985o27787m74855m11183l46064j93411k7629J49893
2116A5411598L19046M21817N54792N78200P28667J215264J805704K635270L588717
$$ y = [27460007, 32594249, 35578375, 34730742, 32087489, 27976284, 24056537, 21333464, 19462794, 18163346, 17289889, 16690889, 16381481, 16275980, 16167831, 16157774, 16309733, 16537033, 16813072, 17179961, 17714796, 18419730, 19289879, 20269843, 21639662, 23241886, 25081283, 27191402, 29412723, 31811524, 34405443, 37568185, 41505336, 46620607, 53483611, 62741016, 71133273, 71561225, 66892315, 58941866, 49277568, 41879169, 36483271, 32466237, 29296555, 26777092, 24836822, 23287405, 21934779, 20761747, 19773836, 18812862, 17986619, 17342634, 16714847, 16239992, 15828809, 15482745, 15289334, 15261705, 15411598, 15730644, 16152461, 16707253, 17285453, 18014120, 19229384, 21035088, 23670358, 27259075]
2107B7259075M343957K178221j345351l006097m438383m178315k996242k235075
2099A5581790j791484j367634j174432q73017p07959n62296n28445m59116m38167
2090G679240l45826l59226l02751k59913k93999k89198k07803k00469j95548j62268
2080E062239j25121j96143j48277p6532j04886j88181n2216l9338j23871o3462
2070C944212j29992l8395o5824p0723j01385j27997q8070j1231j19808p0917m2774
2059C077096o5660p5495j40644l3959l2647j07639m6229q1272k9306o0069j10457
2048B293719l1646J6235j6190j9880p5150r210j7891n5191K2778p9396r075o5791
2036A953312K2394k4301Q967k3262l9089p2776k7631l4247q0287K231o8903m1319
$$ y = [27259075, 31603032, 33781253, 32435902, 29429805, 24991422, 20813107, 17816865, 15581790, 13790306, 12422672, 11248240, 10375223, 9667264, 9104968, 8576523, 8117407, 7679240, 7333414, 6974188, 6671437, 6411524, 6117525, 5828327, 5620524, 5420055, 5224507, 5062239, 4937118, 4740975, 4592698, 4516166, 4411280, 4223099, 4170883, 4131545, 4007674, 3944212, 3814220, 3775825, 3710001, 3639278, 3537893, 3409896, 3321826, 3310595, 3190787, 3119870, 3077096, 3011436, 2935941, 2795297, 2761338, 2728691, 2621052, 2574823, 2493551, 2464245, 2404176, 2293719, 2262073, 2278308, 2262118, 2242238, 2167088, 2157878, 2139987, 2084796, 2107574, 2028178, 2019103, 1953312, 1975706, 1951405, 1960372, 1937110, 1898021, 1825245, 1797614, 1763367, 1683080, 1685311, 1616408, 1575089]
2024A575089j1121L6634Q130l8891j02309k1098J4608j06018O379O724J6473K6562
2012A411162j1741R069r3189k0302Q421m7574J5004N8375j01917j829l7415J5105
2000A203169k4758j11706O0744o6723J0993j9417l5885K96o181k0442l1311q7133
1988H71646L6136L2082j3928O8529m7329K5219k4095j6156P1707m9037J4657J7861
1976I87292o1543P0805o1381j567l0518r6559N9660k9186N774O2356l9043L4005
1964I00095k7170p3409j195k0157m774K9309l8005P1763j8183l8216N766P339
1952G93163l0837k1818K459N8217n2688P7478k8170n0808Q3480o4782k4168O769
1940G48295j9448j417l8190L4601o398j9485n4897r465l2664K7200o855R8282
$$ y = [1575089, 1563968, 1600602, 1608732, 1569841, 1467532, 1446434, 1461042, 1355024, 1361403, 1368127, 1384600, 1411162, 1399421, 1408490, 1315301, 1294999, 1303420, 1255846, 1270850, 1329225, 1227308, 1225479, 1188064, 1203169, 1178411, 1066705, 1127449, 1060726, 1071719, 1052302, 1016417, 1016713, 1010532, 990090, 958779, 871646, 907782, 939864, 925936, 994465, 947136, 972355, 948260, 932104, 1003811, 954774, 969431, 987292, 925749, 996554, 935173, 933606, 903088, 806529, 866189, 837003, 842777, 905133, 866090, 900095, 872925, 799516, 798321, 778164, 773390, 802699, 764694, 836457, 818274, 780058, 785824, 793163, 762326, 740508, 742967, 801184, 748496, 825974, 797804, 746996, 830476, 765694, 741526, 748295, 728847, 727430, 689240, 723841, 717443, 697958, 643061, 633596, 600932, 628132, 621277, 719559]
1928G19559m6338l81J20k2356M1959o2208M7983L6493l5853m5611M4211k3167
1916F54411O2113K520r244J0044L0787m9480O597J1618n2460o9761J488l6591
1904E62042J2954j5061J04077K483k2159l3164J4047J538j7286O7049Q9440n8941
1892G07019o617P5140k4360L3631J8870o167K6373m222j7702l6085N7007K6207
1880H49094K432L669K4731R1521J9585q4268N5430M2969J9352K0122j8139N6687
1868A083185J16839K019k7060J8748k2329k6883N025J2847k2533J3182k7342K0613
1856A146311r317j1419K8762l1135K7886N2666j6442j8664O5403K0368j8087N1553
1844A287885N2364O0493O2054J18509m3769J24139Q9769L2126J15991J5097J21956
$$ y = [719559, 673221, 672840, 672960, 650604, 692563, 630355, 678338, 714831, 678978, 633367, 677578, 654411, 716524, 719044, 709800, 719844, 750631, 701151, 707748, 719366, 666906, 597145, 598633, 562042, 574996, 559935, 664012, 666495, 644336, 611172, 625219, 626757, 609471, 676520, 765960, 707019, 700402, 775542, 751182, 784813, 803683, 797516, 823889, 819667, 801965, 765880, 822887, 849094, 851526, 855195, 879926, 971447, 991032, 906764, 962194, 1005163, 1024515, 1044637, 1026498, 1083185, 1200024, 1202043, 1174983, 1193731, 1171402, 1144519, 1149544, 1162391, 1139858, 1153040, 1125698, 1146311, 1136994, 1125575, 1154337, 1123202, 1151088, 1203754, 1187312, 1168648, 1234051, 1254419, 1236332, 1287885, 1340249, 1400742, 1462796, 1581305, 1537536, 1661675, 1751444, 1783570, 1899561, 1914658, 2036614]
1833B036614P3053L5870N7198J346m0897J256N310P318K506J3855Q9278R686Q6594
1820B378987M544J6293P3612R5053J69348L5416M8078J79197J25419J95198K77598
1809C598743K02793K20454K50093K68590K74245K10932J79124Q3379J28452J17339
1799E534144M6434L6281j7774k9100n273j182m4966L7256M0293o4528J654J6360
1787E549599n9022K4317J21973J65596J55701J82194J15558K40679K85396L35590
1777G117581M13939M92982O98791Q26948Q60956L35875m4811n25590q73928q64057
1767H438686p32367o36439n89434m83759l58941k50883k01379j20208k44187j74814
1757D646275j32711j08271q7813q1093k9757m4091P95M0670k4047M3752M5715
$$ y = [2036614, 2109667, 2145537, 2202735, 2204081, 2163184, 2164440, 2169750, 2177068, 2179574, 2193429, 2282707, 2292393, 2378987, 2383531, 2399824, 2473436, 2568489, 2737837, 2773253, 2821331, 3000528, 3125947, 3321145, 3598743, 3801536, 4021990, 4272083, 4540673, 4814918, 5025850, 5204974, 5288353, 5416805, 5534144, 5580578, 5616859, 5599085, 5569985, 5564712, 5563530, 5518564, 5555820, 5596113, 5531585, 5533239, 5549599, 5490577, 5514894, 5636867, 5802463, 5958164, 6140358, 6255916, 6496595, 6781991, 7117581, 7531520, 8024502, 8723293, 9550241, 10411197, 10747072, 10702261, 10176671, 9302743, 8438686, 7706319, 7069880, 6480446, 5996687, 5637746, 5386863, 5185484, 5065276, 4821089, 4646275, 4513564, 4405293, 4317480, 4236387, 4206630, 4162539, 4163334, 4204004, 4179957, 4223709, 4269424]
1746D269424P8965J02271J74747M5193Q9939M4549N2783k8238j37898j80974l06429
1735D204332k21676k42564j93122l07711j53970j96099k08374j70826j18070j21793
1725B270127m8382j06024j01365j36897p9626l1784j20665K6454k2115p5683k7313
1714A546727p6644m2879o0534j4900k9143k7977k1009k0968p1596p9842j1361
1703A089874J380p4675q1710J4236n8350L419l282j9782k9276m6908K1597K5472
1691H41995n4010m6020J1822L6944k2161p004l035J7499m6391m0265n2969R6408
1679G32813N002J0527j2529j16917k4916L4557M5714p2156o8410M842M3935j802
1667E80660m0775L3979l9359l6940k5063k9101j6615L7693K5347L1908m8001L9057
$$ y = [4269424, 4348389, 4450660, 4625407, 4670600, 4760539, 4805088, 4857871, 4829633, 4691735, 4510761, 4204332, 3982656, 3740092, 3546970, 3239259, 3085289, 2889190, 2680816, 2509990, 2391920, 2270127, 2221745, 2115721, 2014356, 1877459, 1797833, 1766049, 1645384, 1671838, 1649723, 1574040, 1546727, 1470083, 1427204, 1366670, 1351770, 1322627, 1294650, 1273641, 1252673, 1181077, 1101235, 1089874, 1091254, 1016579, 934869, 949105, 890755, 894174, 890892, 871110, 841834, 794926, 816523, 841995, 787985, 741965, 753787, 790731, 768570, 761566, 758531, 776030, 729639, 689374, 636405, 732813, 737815, 748342, 735813, 618896, 593980, 628537, 674251, 602095, 533685, 538527, 582462, 580660, 539885, 573864, 534505, 497565, 472502, 443401, 426786, 464479, 489826, 521734, 473733, 512790]
1655E12790P429r1871K1993K6939k6702k4762J0800j4581M9533k9053M8148j9822
1643D70841k0426l1018n6245l6312P937L0986m8243j8832M5714l6384O77J0112
1631C18807M0405J5863p402r905K6931N8476n9791m509l7034O4905K984l8207
1619C71523N6478n1210p0879J30261k5539p8365j4050m8800M6390j6171n154n3830
1607B40654k6083O3537r1973M9943O3924k9579N070m633M0138k902J1238j6809
1595C02525J3505l8094P770K5042L054l9040j9923n886k6261O2058k9890n5340
1583A99520L2743L9122n0552k0523L2518o5227J118M5203o2321j1041K2885j5864
1571A47581M1039K8305n768n966j3226J11897j7686N5500M038k1918L0009m2186
$$ y = [512790, 520219, 428348, 450341, 477280, 450578, 425816, 436616, 422035, 471568, 442515, 490663, 470841, 450415, 419397, 363152, 326840, 334777, 365763, 317520, 298688, 344402, 308018, 308695, 318807, 359212, 375075, 367673, 357768, 384699, 443175, 383384, 378875, 341841, 406746, 409730, 371523, 428001, 376791, 305912, 436173, 410634, 332269, 318219, 269419, 315809, 299638, 294484, 240654, 214571, 278108, 186135, 236078, 300002, 270423, 275493, 270860, 310998, 308096, 319334, 302525, 316030, 277936, 285706, 310748, 313802, 274762, 254839, 248953, 222692, 284750, 254860, 199520, 232263, 271385, 220833, 200310, 232828, 167601, 168719, 213922, 151601, 140560, 163445, 147581, 188620, 216925, 211157, 205191, 191965, 303862, 286176, 341676, 345714, 323796, 353805, 311619]
1559C11619r849q4673j9468P0475q9099J187j1636p2365M9655p575M7741k3766
$$ y = [311619, 301770, 217097, 197629, 268104, 179005, 180192, 168556, 96191, 145846, 138271, 186012, 162246]
$$ [...]
##END NTUPLES=NMR SPECTRUM
##END=
