##TITLE=1H_EC-3239(21)
 CDCl3, 8 sc, 
 22.12.2020
##JCAMPDX= 6.0         $$ Bruker NMR JCAMP-DX V2.0
##DATA TYPE= NMR SPECTRUM
##DATA CLASS= NTUPLES
##ORIGIN= UXNMR, Bruker Analytische Messtechnik GmbH
##OWNER= root
$$ XWIN-NMR		Version 3.5
$$ Tue Dec 22 12:12:27 2020 Russian Standard Time (UT+4h)  she@DPX200
##.OBSERVE FREQUENCY= 200.1315066352
##.OBSERVE NUCLEUS= ^1H
##.ACQUISITION MODE= SIMULTANEOUS
##.ACQUISITION SCHEME= undefined
##.AVERAGES= 8
##.DIGITISER RES= 18
##SPECTROMETER/DATA SYSTEM= spect
##.PULSE SEQUENCE= zg30
##.SOLVENT NAME= CDCl3
##.SHIFT REFERENCE= (INTERNAL, CDCl3, 0, 15.9979)
##AUDIT TRAIL= $$ (NUMBER, WHEN, WHO, WHERE, WHAT)
$$ ##TITLE= Audit trail, XWIN-NMR		Version 3.5
$$ ##JCAMPDX= 5.01
$$ ##ORIGIN= Bruker BioSpin GmbH
$$ ##OWNER= she
$$ F:/spectra/data/she/nmr/H-F/1/pdata/1/auditp.txt
$$ ##AUDIT TRAIL=  $$ (NUMBER, WHEN, WHO, WHERE, WHAT)
(   1,<2020-12-22 12:11:13.75 +0400>,<she>,<DPX200>,
      <created by zg, POWCHK disabled, PULCHK disabled
       configuration hash MD5:
       00 E9 B6 7A A2 85 ED C7 34 08 36 98 17 FE 4E 26
       data hash MD5: 16K
       D7 6A A7 06 55 54 66 1C 57 4C 23 79 83 01 72 BC>)
(   2,<2020-12-22 12:11:16.54 +0400>,<she>,<DPX200>,
      <Start of raw data processing
       efp BC_mod = 2 LB = 0.24 FT_mod = 6 PKNL = 1 PHC0 = -10762.77 PHC1 = 11.40095 SI = 16K 
       data hash MD5: 16K
       B1 F6 03 F1 C0 B0 6E 2A 0F A7 7A FB DE B5 61 BA>)
(   3,<2020-12-22 12:11:33.51 +0400>,<she>,<DPX200>,
      <pk PHC0 = -155.7794 PHC1 = -2.2 
       data hash MD5: 16K
       87 E5 06 A2 32 21 13 0D 3B BC 37 FD ED E8 1A 6D>)
(   4,<2020-12-22 12:11:36.82 +0400>,<she>,<DPX200>,
      <abs ABSG = 5 
       data hash MD5: 16K
       F4 6F 2E DF FD D9 F3 3C 9E E8 AE 42 6A 88 16 05>)
$$ ##END=
$$ 
$$ hash MD5
$$ DE F4 70 19 96 D5 0F 57 38 4B B4 6B C2 0E C5 FA
##$RELAX= 
##$RELAX= 
##$RELAX= 
##$RELAX= 
##$RELAX= 
##$RELAX= 
$$ Bruker specific parameters
$$ --------------------------
##$DU= <F:/spectra>
##$EXPNO= 1
##$NAME= <H-F>
##$PROCNO= 1
##$TYPE= <nmr>
##$USER= <she>
##$AMP= (0..31)
100 100 100 100 100 100 100 100 100 100 100 100 100 100 100 100 100 100 
100 100 100 100 100 100 100 100 100 100 100 100 100 100 
##$AQSEQ= 0
##$AQ_mod= 1
##$AUNM= <au_zg>
##$AUTOPOS= <>
##$BF1= 200.13
##$BF2= 200.13
##$BF3= 200.13
##$BF4= 200.13
##$BF5= 200.13
##$BF6= 200.13
##$BF7= 200.13
##$BF8= 200.13
##$BYTORDA= 1
##$CFDGTYP= 0
##$CFRGTYP= 5
##$CHEMSTR= <none>
##$CNST= (0..31)
1 1 145 1 1 1 1 1 1 1 1 1 1 1 1 1 1 1 1 1 1 1 1 1 1 1 1 1 1 1 1 1 
##$CPDPRG= <>
##$CPDPRG1= <>
##$CPDPRG2= <>
##$CPDPRG3= <>
##$CPDPRG4= <mlev>
##$CPDPRG5= <mlev>
##$CPDPRG6= <mlev>
##$CPDPRG7= <mlev>
##$CPDPRG8= <mlev>
##$CPDPRGB= <>
##$CPDPRGT= <>
##$D= (0..31)
0 1.2 0 0 0 0 0 0 0 0.06 0 0.03 0 0 0 0 0.0002 0 0 0 0 0 0 0 0 0 0 0 0 
0 0 0 
##$DATE= 1608624673
##$DBL= (0..7)
120 120 120 120 120 120 120 120 
##$DBP= (0..7)
150 150 150 150 150 150 150 150 
##$DBP07= 0
##$DBPNAM0= <>
##$DBPNAM1= <>
##$DBPNAM2= <>
##$DBPNAM3= <>
##$DBPNAM4= <>
$$ [...]
##$SUBNAM3= <"">
##$SUBNAM4= <"">
##$SUBNAM5= <"">
##$SUBNAM6= <"">
##$SUBNAM7= <"">
##$SUBNAM8= <"">
##$SUBNAM9= <"">
##$SW= 16.9725356469052
##$SWIBOX= (0..15)
0 0 2 0 0 0 0 0 0 0 0 0 0 0 0 0 
##$SW_h= 3396.73913043478
##$TD= 16384
##$TD0= 1
##$TE= 0
##$TE2= 300
##$TE3= 300
##$TEG= 300
##$TL= (0..7)
0 120 120 120 120 120 120 120 
##$TP= (0..7)
150 150 150 150 150 150 150 150 
##$TP07= 0
##$TPNAME0= <>
##$TPNAME1= <>
##$TPNAME2= <>
##$TPNAME3= <>
##$TPNAME4= <>
##$TPNAME5= <>
##$TPNAME6= <>
##$TPNAME7= <>
##$TPOAL= (0..7)
0.5 0.5 0.5 0.5 0.5 0.5 0.5 0.5 
##$TPOFFS= (0..7)
0 0 0 0 0 0 0 0 
##$TUNHIN= 0
##$TUNHOUT= 0
##$TUNXOUT= 0
##$USERA1= <user>
##$USERA2= <user>
##$USERA3= <user>
##$USERA4= <user>
##$USERA5= <user>
##$V9= 5
##$VALIST= <valist>
##$VCLIST= <CCCCCCCCCCCCCCC>
##$VD= 0
##$VDLIST= <DDDDDDDDDDDDDDD>
##$VPLIST= <PPPPPPPPPPPPPPP>
##$VTLIST= <TTTTTTTTTTTTTTT>
##$WBST= 1024
##$WBSW= 4
##$XGAIN= (0..3)
0 0 0 0 
##$XL= 0
##$YL= 0
##$YMAX_a= 215261
##$YMIN_a= -267471
##$ZGOPTNS= <>
##$ZL1= 120
##$ZL2= 120
##$ZL3= 120
##$ZL4= 120
##$ABSF1= 15.97196
##$ABSF2= -1.000702
##$ABSG= 5
##$ABSL= 3
##$ALPHA= 0
##$AQORDER= 0
##$ASSFAC= 0
##$ASSFACI= 0
##$ASSFACX= 0
##$ASSWID= 0
##$AUNMP= <proc_1d>
##$AZFE= 0.1
##$AZFW= 0.1
##$BCFW= 0
##$BC_mod= 2
##$BYTORDP= 0
##$COROFFS= 0
##$CY= -3
##$DATMOD= 1
##$DC= 0
##$DFILT= <>
##$DTYPP= 0
##$F1P= 0
##$F2P= 0
##$FCOR= 1
##$FTSIZE= 16384
##$FT_mod= 6
##$GAMMA= 0
##$GB= 0
##$INTBC= 1
##$INTSCL= 2.992141e-10
##$ISEN= 128
##$LB= 0.24
##$LEV0= 0
##$LPBIN= 0
##$MAXI= 10000
##$MC2= 0
##$MEAN= 0
##$ME_mod= 0
##$MI= 1.114404
##$NCOEF= 0
##$NC_proc= -6
##$NLEV= 6
##$NOISF1= 3.799351
##$NOISF2= 2.8
##$NSP= 0
##$NTH_PI= 0
##$NZP= 0
##$OFFSET= 15.99785
##$PC= 1
##$PHC0= -10918.55
##$PHC1= 9.200951
##$PH_mod= 1
##$PKNL= yes
##$PPARMOD= 0
##$PSCAL= 0
##$PSIGN= 0
##$REVERSE= no
##$SF= 200.13000335486
##$SI= 16384
##$SIGF1= 3
##$SIGF2= 2
##$SINO= 5.538805
##$SIOLD= 16384
##$SREGLST= <1H.CDCl3>
##$SSB= 0
##$STSI= 16384
##$STSR= 0
##$SW_p= 3396.73913043478
##$SYMM= 0
##$S_DEV= 0
##$TDeff= 16384
##$TDoff= 0
##$TI= <>
##$TILT= no
##$TM1= 0
##$TM2= 0
##$TOPLEV= 0
##$USERP1= <user>
##$USERP2= <user>
##$USERP3= <user>
##$USERP4= <user>
##$USERP5= <user>
##$WDW= 1
##$XDIM= 16384
##$YMAX_p= 525035975
##$YMIN_p= -217185
$$ End of Bruker specific parameters
$$ ---------------------------------
##NTUPLES= NMR SPECTRUM
##VAR_NAME=  FREQUENCY,     SPECTRUM/REAL,   SPECTRUM/IMAG
##SYMBOL=    X,             R,               I
##VAR_TYPE=  INDEPENDENT,   DEPENDENT,       DEPENDENT
##VAR_FORM=  AFFN,          ASDF,            ASDF
##VAR_DIM=   16384,         16384,           16384
##UNITS=     HZ,            ARBITRARY UNITS, ARBITRARY UNITS
##FACTOR=    0.207333158178281, 1,           1
##FIRST=     3201.64985784306, 0,            0
##LAST=      -195.089272591715, 0,           0
##MIN=       -195.089272591715, -217185,     0
##MAX=       3201.64985784306, 525035975,    0
$$ Real data points
##PAGE= N=1
##DATA TABLE= (X++(R..R)), XYDATA
$$ [...]
7796A019807o4316L9673j06669q5909r7043q5244o9314k2933j37611j0428J89620
7785E69633j26139l7001o9041Q334M4808n7702l3856l0285o5928N8048m321l0173
7773B26377j8676k3210J2864j7655k4699m5959j8497L7127O8410M5256M57Q111
7761B49906r9587p1680l9260o034Q7282O5355R342J48k6478j6960m3609k4357
7749H4068P331j7190m2973M2116K4057l0573j6080k1360r375N456L3421L92l1332
7736B7958J2875j3713k8670k037O33k7057K0135L6265K374N7904K7569m8424l3237
7723C2575j9528j2058K7328M4907K3443j5531m8123j9529k1744K138L6461m2756
7711a2417P214L1561m3827m4992L2211Q581j9210N4469K0656L8091k8385l8052
$$ plain form
7796 1019807 955491 995164 888495 802586 705543 620299 550985 528052 390441 380013 569633
7785 569633 443494 406493 337452 345786 390594 332892 299036 268751 202823 260871 256550 226377
7773 226377 207701 184491 197355 179700 155001 109042 90545 127672 196082 241338 241795 249906
7761 249906 150319 78639 39379 33345 120627 185982 195324 195472 168994 152034 108425 84068
7749 84068 91399 74209 31236 73352 97409 66836 50756 29396 20021 25477 58898 59290 27958
7736 27958 40833 27120 -1550 -3587 -2954 -30011 -9876 26389 28763 86667 114236 65812 32575
7723 32575 13047 989 28317 73224 96667 81136 33013 13484 -8260 -6122 30339 -12417
7711 -12417 -5203 26358 -17469 -62461 -30250 -21669 -40879 13590 34246 72337 43952 5900
7699E900o6027m0798J2702J8222J4951L8005k6929m8122R858K9495J67J4389j1397
7686d9584m8641L5142O2981R0402l60j9888n262n5857L3489k3190k1442J9108
7674A6898p3286n4576K8979P4314K1113P1818J1490o5036m6971j1279q863j6802
7662e2201k7367M3125L3509N8364K9844k9879l5322n6095j548J8954J423K4653
7650G460j8642l171l3380P493M3593M5281j7031K0920J2688l7223k0655k0921
7638a3588l3645r896k1872N540O752M9412N4658m4740o2094l8821k3081P1816
7626e9559L1961M7154M3634K3627m1460o9899j0006p2545K7086K8463K6848K4690
7614fn6625N069J005j0641L8077K5057M4268l0324k5463j9011J1055J8665j0874
$$ plain form
7699 5900 -60127 -100925 -88223 -70001 -55050 -17045 -43974 -92096 -82238 -52743 -52576 -38187 -49584
7686 -49584 -98225 -63083 -102 90300 89940 70052 64790 8933 42422 19232 -2210 16898
7674 16898 -56388 -110964 -81985 -7671 13442 85260 96750 31714 -15257 -26536 -35399 -52201
7662 -52201 -79568 -36443 -2934 55430 85274 55395 20073 -36022 -37570 -18616 -17193 7460
7650 7460 -11182 -14353 -47733 -40240 3353 48634 31603 52523 65211 27988 7333 -13588
7638 -13588 -47233 -57129 -79001 -73461 -66709 -17297 37361 -7379 -69473 -108294 -131375 -59559
7626 -59559 -27598 19556 63190 86817 45357 -24542 -34548 -107093 -80007 -51544 -24696 -6
7614 -6 -56631 -51562 -50557 -61198 -23121 1936 46204 15880 -9583 -28594 -17539 1126 -9748
7601i748J5275l6237J0130L5107j3187J4084l9420l1743k9251n176K0147L9573
7589c0446j6631R29J6337K928M3867M6597J9964l4832j01104r128M0252L51K6888
7576E972k1467j8924j5580K0408J3547L253j2000l6681o255Q0241M8036L3657
7564I4207R280k4936r8392o8138N6257r831J7675J2887l5269l4520P709N8983
7552a4088P5633k0357j4952k1577l2860q255j5154J5975L8369L7505l698P5072
7540A11613K9225o7534k6803j18096n2962m2227P7978O9478J8045M9856L8415
7529H6988l9161M9663M797p8016n4656j7061l9390N9264P2095j2479K376o5303
7517c0883K5295q69L3968k3516m1692J6284j042k3913J5356N6789L8127k9169
$$ plain form
7601 -9748 5527 -30710 -20580 14527 1340 15424 -23996 -55739 -84990 -90166 -70019 -30446
7589 -30446 -47077 -46148 -29811 -26883 16984 63581 83545 48713 -52391 -61519 -21267 -20916 5972
7576 5972 -15495 -34419 -49999 -29591 -16044 -12791 -24791 -61472 -67727 12514 60550 94207
7564 94207 103487 78551 -19841 -87979 -31722 -41553 -23878 -10991 -46260 -80780 -73071 -14088
7552 -14088 61545 41188 26236 4659 -28201 -36456 -51610 -35635 2734 40239 36541 111613
7540 111613 140838 73304 46501 -71595 -124557 -166784 -88806 -19328 -1283 48573 86988
7529 86988 47827 97490 102287 24271 -30385 -47446 -86836 -27572 44523 32044 34420 -30883
7517 -30883 -5588 -6457 27511 3995 -37697 -21413 -22455 -46368 -31012 25777 63904 34735
7505C4735M3316m2805j2157n945n4560J0121j9537L5053M7494L1120o137p9045
7493a8347k3162M6k8702n1318L8917M5085O694R6349O649J6171r47j03342m4794
7480f0701k7582K0379L6360p631Q07L459L9489L7684N2798n2110K4751j4687l1758
7467B1258L8819m2013l5934P750J8968M2360K5573L0160j818n7405L6254k0773
7455F3199q703O470l4886o2776l1204K106J5564O5417M9833k2527P055l4869J2168
7442B6847P338l9115j163j8929l6219J2644K2261L7703q570O097Q447p497J1555
7429B1399m730K1146k4304K9572m3743j5695K0765N2418L8575m3935n8135m2255
7417d8922K9605j1616l1J9141L5937K0570K7582j9276m5607o1447q331N965K6109
$$ plain form
7505 34735 78051 35246 23089 17144 -37416 -27295 -46832 -11779 35715 66835 60698 -18347
7493 -18347 -41509 -41463 -70165 -121483 -82566 -37481 -30787 65562 72211 88382 87435 -15907 -60701
7480 -60701 -88283 -67904 -31544 -39175 -38368 -34909 4580 42264 95062 42952 67703 53016 21258
7467 21258 60077 18064 -17870 -10120 8848 51208 76781 106941 105123 47718 83972 63199
7455 63199 54496 60966 26080 -36696 -67900 -65794 -50230 15187 65020 42493 49548 14679 26847
7442 26847 34185 -4930 -6093 -25022 -61241 -48597 -26336 11367 2797 8894 17341 9844 21399
7429 21399 16669 37815 13511 43083 -660 -16355 4410 56828 95403 51468 -6667 -48922
7417 -48922 -19317 -30933 -30964 -11823 24114 44684 72266 52990 7383 -54064 -62395 -56430 -30321
7404c0321N1565M768J1833M459k0695k191L794J8268j4852J0199k9263k1372m8467
7391f2275L6492N1048j2538O6740N6945k2935l6885p3580j2333j7504L742J9387
7379c696o194M9206J9691J3565n4562n7023p1313j2980N1105L0307M9352O0844
7367F8302l0230j3836k0138j6738j6969p266J0389K5894p564o520p832J8755J6939
7354A3186J8092j7569M0884k1175l8817l4069l4310J2356M0420j8908K7952O1204
7342D9246K2842l2636o1258j1670j4708j2812k1801M6518n507L5803M692m1936
7330d3227P6100K6268r697k3236J6028J5218k6418J3049l7071n0061J3361j4226
7318d3912J8908M4099P2468l7562K7995R9o3876n933J4689k4939J4797j8376j1682
$$ plain form
7404 -30321 21244 26012 37845 42304 21609 19418 23212 41480 26628 36827 7564 -13808 -62275
7391 -62275 -25783 25265 12727 79467 136412 113477 76592 3012 -9321 -26825 -23083 -3696
7379 -3696 -9890 39316 59007 72572 18010 -39013 -110326 -123306 -72201 -41894 7458 68302
7367 68302 38072 24236 4098 -12640 -29609 -36875 -26486 -592 -8156 -14676 -22508 -3753 13186
7354 13186 31278 13709 54593 33418 -5399 -39468 -73778 -61422 -21002 -39910 -11958 49246
7342 49246 72088 39452 -21806 -33476 -48184 -60996 -82797 -36279 -41786 -5983 -1291 -43227
7330 -43227 32873 59141 49444 26208 42236 57454 31036 44085 7014 -43047 -29686 -43912
7318 -43912 -25004 19095 91563 54001 81996 82095 18219 12286 26975 2036 16833 -1543 -13225
7305a3225J0942o727k423j0743J6753J3436j0499k0773L8590j4598k1500k1471
7293d2238k9959L8469L1192j2338K423n327m3123k8551J5742k0116P5938m680
7281b2568J1072J1673q453M122m2866m0441P0430K0214K1398N5630K9523k8411
7269H1323l5253q8945j4971k5382n269N5560K7656j1963R188r79L2167j2308l0745
7256a9921J3691k4562j5602r619J9635J6955N3986l273K7293j0621l5463O032
7244A8531l1304k7023n233j8100j5838N1177K7913M4375R084L686J1622l5871
7232C3019o0936k6585n2699Q617Q4909O700p638L2011m0771j0059m1380p6289
7220a51101J5085L1232N7559L9059o119L8689K2490j7799l1284p3054m2996M8206
$$ plain form
7305 -13225 -2283 -9010 -11433 -22176 -5423 8013 -2486 -23259 15331 733 -20767 -42238
7293 -42238 -72197 -33728 -2536 -14874 -12451 -17778 -60901 -89452 -73710 -93826 -17888 -22568
7281 -22568 -11496 177 -8276 -4154 -47020 -87461 -17031 3183 24581 80211 109734 81323
7269 81323 46070 -42875 -57846 -83228 -88497 -32937 -5281 -17244 -8056 -9035 23132 10824 -19921
7256 -19921 -6230 -30792 -46394 -56013 -36378 -19423 34563 31290 58583 47962 12499 18531
7244 18531 -12773 -39796 -45029 -63129 -78967 -27790 123 44498 53582 57268 68890 33019
7232 33019 -27917 -54502 -107201 -98584 -13675 -6975 -14613 17398 -23373 -33432 -74812 -151101
7220 -151101 -136016 -104784 -47225 -8166 -14285 24404 46894 29095 -2189 -75243 -118239 -70033
7208g0033J0833J3111O6647J8944m1953n9831j651J6109M6521L4388N4967l0580
7196E7472q086l7647m6049o35M2403j7604N3943J0780q9271j5602k9730m2520
7184a22546N5185J6489M5071M4795J8242n9237n1120k8763N511j1000P409Q2236
7172B272J8161L116K3227p8048l1996j0643k9533J9687K4537O6503l4120j4147
7160d0984O834L1933k853l741k9106J9068P8670l3503n8058J0403j4757K074Q25
7147c3195m3237M496J797M4389j1243k3933k800L5392m0072j6281M581O276L2104
7134d1726N163L4804o80P399k872m1623j6177m158M5977R029j7115j8182o2216
7121a02377J6878J7511N8627K1043l4603K5169j9956p744j0826O666l5169k1156
$$ plain form
7208 -70033 -59200 -46089 20558 39502 -2451 -62282 -63933 -47824 -1303 33085 88052 57472
7196 57472 49386 11739 -34310 -34945 7458 -10146 43797 54577 -34694 -50296 -80026 -122546
7184 -122546 -67361 -50872 -5801 38994 57236 -2001 -53121 -81884 -76373 -87373 -79964 2272
7172 2272 20433 23549 46776 -31272 -63268 -73911 -103444 -83757 -59220 7283 -26837 -40984
7160 -40984 -34150 -2217 -5070 -8811 -37917 -18849 59821 26318 -31740 -21337 -36094 -34020 -33195
7147 -33195 -76432 -71936 -70139 -25750 -36993 -60926 -63726 -28334 -68406 -84687 -80106 -73830 -41726
7134 -41726 -36563 -1759 -2439 4960 2088 -39535 -55712 -59870 -13893 -4864 -21979 -40161 -102377
7121 -102377 -85499 -67988 -9361 11682 -22921 2248 -17708 -25452 -36278 -29612 -64781 -85937
7109h5937l461m6017P0196j4597P784Q301j2000J5533l579j5516L5089O93J5673
7096b7838j7721M0296j4680m905m3301k558N0968j369K1500j6944l3477K6010
7084b4019n3876m0646k1491j2684q532L120O5429N0379O9140K5115J6869o4725
7072D079j3795l5070p4798L0382P2081k6150K7869l2674n6137j1098r058J5224
7060a09145M5860K5586L440J027J4968K6859k3711N6537J0112k3134o4632m6795
7048h3028o3798K8817M4098K6963L7790N4244J1362q7234l2240m749j4361N0460
7036c1676j8869r975M0766k734q318k8078P0162n4299l0037J2162n1516j9390
7024a31802l197K125L0272K271N8928q125L1301J7050m0288m1533l6878q106J9293
$$ plain form
7109 -85937 -89398 -135415 -65219 -79816 -72032 -63731 -75731 -60198 -63777 -79293 -44204 -43511 -27838
7096 -27838 -45559 -5263 -19943 -24848 -68149 -70707 -19739 -21108 392 -16552 -50029 -24019
7084 -24019 -77895 -118541 -140032 -152716 -161248 -158128 -92699 -42320 26820 51935 68804 4079
7072 4079 -9716 -44786 -119584 -89202 -17121 -43271 -15402 -48076 -104213 -115311 -124369 -109145
7060 -109145 -63285 -37699 -34259 -33232 -18264 8595 -15116 41421 51533 28399 -36233 -83028
7048 -83028 -146826 -118009 -73911 -46948 -9158 45086 56448 -30786 -63026 -67775 -82136 -31676
7036 -31676 -50545 -60520 -19754 -22488 -30806 -58884 11278 -43021 -73058 -60896 -112412 -131802
7024 -131802 -134999 -132874 -102602 -100331 -41403 -49528 -18227 -1177 -41465 -82998 -119876 -127982 -108689
7011a08689O3069M316M5452N3567o7131r3053r1564M5573J2012M4469O6492K2427
6999c060j1309r3688J6203J250N5718M6203m7155L6408J8685n8216j5581k6785
6987h1327R655K314K0923j1917j4702P916j3886m261K5903K9183m617m736N6417
6974A6865J9857J8294J8694j8200j5698o4526p4445n8174N2252P3641P082j0074
6962c4432K2470l9119n552K1774K5194J2935L374l2325j0886J9751n1867j616
6950g0299J032j9680J1200M2819K4953J6292N944l4902r0568q7874j6102N2240
6938a64945Q5077J08063N9211l6214l4034n0077j7271N110L91K1125L3942M0090
6926E0468k1086k7056q0467j5692K6154j1375K875N4065J1154k2939n9601L3049
$$ plain form
7011 -108689 -45620 -41304 4148 57715 -9416 -102469 -194033 -148460 -136448 -91979 -25487 -3060
6999 -3060 -14369 -108057 -91854 -90604 -34886 11317 -35838 570 19255 -38961 -54542 -81327
6987 -81327 -71672 -69358 -48435 -60352 -75054 -67138 -81024 -85285 -59382 -30199 -34816 -39552 16865
6974 16865 36722 55016 73710 55510 39812 -24714 -99159 -157333 -105081 -31440 -24358 -34432
6962 -34432 -11962 -51081 -56633 -34859 -9665 3270 6644 -25681 -36567 -16816 -68683 -70299
6950 -70299 -69267 -88947 -77747 -34928 -9975 6317 12261 -22641 -113209 -201083 -217185 -164945
6938 -164945 -79868 28195 87406 51192 17158 -32919 -50190 -45080 -44689 -23564 10378 50468
6926 50468 29382 2326 -78141 -93833 -67679 -79054 -76179 -22114 -10960 -33899 -93500 -60451
6914f0451P9324L1213L2288n2613k8939n8080l0792l8804L6171K000m3672Q5282
6902d7073M1578M3316Q096n6204m4309m2404L268j302M9660R7911L4316j634j1671
6889G3548M6224o2543o7131n9456p9813M3101J8799J5358J4284O9998L0472K3034
6877F5875K0786j6977l5691n0934n6128m1005K9871L5275k2748Q470P2223j1089
6865b072J3404L5039k9622m8221n3480o2791R226J26278O0547j1285J3272k5364
6853B4931p4145n9672M4849L3440M0525M4008J5011k6422k1063n6558m3772P107
6841g1761M6136J6325r684J3334k9141j7454l5431J9748P4938J01950N010n6412
6829E7558L244l7953q4926k4797j161R868O3086N0670L4849K1183N716q0933n7435
$$ plain form
6914 -60451 18873 50086 82374 29761 822 -57258 -88050 -126854 -90683 -88683 -132355 -47073
6902 -47073 -5495 37821 45917 -10287 -54596 -97000 -93732 -95034 -45374 52537 86853 85219 73548
6889 73548 119772 57229 -9902 -69358 -149171 -106070 -87271 -71913 -57629 12369 42841 65875
6877 65875 86661 69684 33993 -16941 -73069 -114074 -84203 -48928 -71676 -63206 9017 -2072
6865 -2072 11332 46371 16749 -31472 -84952 -147743 -138517 -12239 48308 37023 50295 24931
6853 24931 -49214 -108886 -64037 -30597 9928 53936 68947 42525 21462 -35096 -78868 -71761
6841 -71761 -25625 -9300 -18984 -5650 -34791 -52245 -87676 -67928 7010 108960 113970 57558
6829 57558 60802 22849 -62077 -86874 -88035 -78167 -15081 35589 70438 91621 97337 16404 -41031
6816d1031k8960L7678K8966R970M4395k5579N433j4905k131k718L5410k7540m2561
6803b3573J9888j7563j5120k739J8414N3807L9848Q580j2674J2506k2796r5744
6791c7166m716L7894q129j3989p12N066P7584M8058k1642k9755k0635q1778j10590
6778a60510k387J09648P9069M5494J7581P706n7956o2210k5034P678N5656L9085
6766E3820o045l9802L6993j6035j6372n3779J971O2588K2343p0858k2715K2462
6754b5429l9143j1186O6851N8911N5947k5951k2365o399l8511o6855o4262P108
6742a11284J3367O7451O0925M7603m170n707l4211k2952O443k1111k155M7396
6730D1595K3819O635j5568m4204K1971J867k7468n0416k5142L7764j2517o471
$$ plain form
6816 -41031 -69991 -32313 -3347 6623 51018 25439 30872 15967 13836 11118 46528 18988 -23573
6803 -23573 -3685 -21248 -36368 -39107 -20693 33114 72962 81542 68868 81374 58578 -37166
6791 -37166 -41882 -3988 -12117 -26106 -26818 -21752 55832 103890 82248 52493 31858 -49920 -160510
6778 -160510 -162897 -53249 25820 71314 88895 96601 38645 -23565 -48599 -40921 14735 53820
6766 53820 47775 7973 44966 28931 12559 -41220 -39249 23339 45682 -25176 -47891 -25429
6754 -25429 -64572 -75758 -8907 50004 105951 80000 57635 51236 12725 -54130 -118392 -111284
6742 -111284 -97917 -30466 30459 78062 73892 68185 33974 11022 17465 -3646 -5801 41595
6730 41595 65414 72049 56481 12277 34248 36115 8647 -41769 -66911 -29147 -41664 -48135
6718d8135K3083R7372M6174l6261o6567l8764q256j8519K569m052O2421K4287
6706C5352p5711j9140M7249M0384J9110R326K497l4738l7658m5246N916M9870
6694b789N3486K9746N332J4825n064l4438p3895m2102J8208q911J1838K3385M839
6681e540J2659K2694R524k0671L169o021R350n929j3737j1822j5382K4008L9874
6668D2176k9279l1985K5912j126l6343J254k4681r891p597o281L3571P6610O7961
6655A00301l5096l3133o035K5012l5368n9573p3168n246Q618K8918L6841M0797
6643g132Q2717k2302o9599j9728M1624j1587j902M4858J3115N69m2296n7491K4290
6630b4864J5384n0254J7890K3535l872k2073l288K1104L2613L2349O1934J6896
$$ plain form
6718 -48135 -25052 72320 118494 82233 15666 -23098 -31354 -49873 -47304 -51356 11065 35352
6706 35352 -40359 -59499 -12250 28134 47244 56570 59067 24329 -13329 -58575 -52659 -2789
6694 -2789 50697 80443 85775 100600 95536 61098 -12797 -54899 -36691 -45602 -33764 -10379 -5540
6681 -5540 7119 29813 39337 18666 21835 15814 25164 19235 5498 -6324 -21706 2302 42176
6668 42176 12897 -19088 6824 5698 -30645 -29391 -54072 -63963 -71560 -77841 -44270 32340 100301
6655 100301 65205 32072 26037 51049 15681 -43892 -117060 -122306 -113688 -84770 -47929 -7132
6643 -7132 75585 53283 -16316 -36044 5580 -6007 -7909 36949 50064 50633 8337 -49154 -24864
6630 -24864 -9480 -59734 -41844 -18309 -22181 -44254 -47542 -26438 6175 38524 100458 117354
6618A17354n592m0918n2622l9716j7293L150M1523L9754N276J9914p0087j3118
6606a2375K7319K4358l6049j9173J6743K4051Q391k2987j9075K3336J1618J4125
6594D0282m4443M082J1799n1449k3138J9375K4040L6230J1498j4184J1158k2870
6582B380m1073k0900n116K7823K9673K5342j5223L951o657l2044J3614J9016K3862
6569B4648m8922j8374m4045O113K6742R491O4838Q508o437m4765k8931j2553l761
6556f7448K8486J5522N1332Q20o1384l4861m7992K8791J0691K2618Q9266J3534
6544D9375o572l4670m0798J973l0708P667L9543R723j4692K1598n9579j0667P8622
6531A0815J2745J3408n63K5926k8751o1134m3065k941Q958o321n285O3140L6460
$$ plain form
6618 117354 111762 70844 18222 -21494 -38787 -35637 5886 45640 50916 70830 743 -12375
6606 -12375 14944 39302 3253 -15920 823 24874 33265 10278 -8797 14539 26157 40282
6594 40282 -4161 -79 11720 -39729 -62867 -43492 -19452 16778 28276 14092 25250 2380
6582 2380 -38693 -59593 -64709 -36886 -7213 18129 2906 6857 200 -31844 -18230 786 24648
6569 24648 -24274 -42648 -86693 -80580 -53838 -44347 20491 28999 22562 -22203 -51134 -63687 -67448
6556 -67448 -38962 -23440 27892 28712 -32672 -67533 -115525 -86734 -76043 -53425 35841 49375
6544 49375 42803 8133 -32665 -30692 -61400 -53733 -14190 -4467 -19159 2439 -57140 -67807 10815
6531 10815 23560 36968 36405 62331 33580 -27554 -70619 -73560 -64602 -70923 -76208 -13068 23392
6518B3392J293o0848l4675k8894K0722J1090O658O1777O9788j5050k048l1175
6506B2030k9160l4196n3599n707j3935J4607L1382J2750J945L4757m2379k8593
6494i0098J5794L0190L1717P032J1519j1128j5940n4403r645P64K8533L9453l3825
6481e0037N6645j4476o3408k1729K2440O5281R4903M1287k1184L692n4960p7106
6469a8652r5159l6302M1432M740N3753P1559l3380k1986r40m4033l4807K4291
6457h9484K6593M1949K9070o4800k4743k8454M746M1902M6983K9894k5189l5029
6445d6562l5422p0294l1994M3772L4713N0464N4540L4234L4712j0258n5334k7063
6433b4492m0046k1720L572j5623K3752k1524k6395K6372L8490L7559R066l5029
$$ plain form
6518 23392 24685 -36163 -70838 -99732 -79010 -67920 -61262 515 70303 55253 53205 22030
6506 22030 -7130 -41326 -94925 -100632 -114567 -99960 -68578 -55828 -53883 -19126 -61505 -90098
6494 -90098 -74304 -44114 -12397 -5365 6154 -4974 -20914 -75317 -84962 -84198 -55665 -16212 -50037
6481 -50037 6608 -7868 -71276 -93005 -70565 -5284 89619 130906 109722 113414 58454 -18652
6469 -18652 -113811 -150113 -108681 -103941 -50188 21371 -12009 -33995 -34935 -78968 -113775 -89484
6457 -89484 -62891 -20942 8128 -56672 -81415 -109869 -105123 -63221 -16238 13656 -11533 -46562
6445 -46562 -81984 -152278 -184272 -140500 -105787 -55323 -783 33451 68163 57905 2571 -24492
6433 -24492 -64538 -86258 -82686 -98309 -74557 -96081 -122476 -96104 -57614 -20055 -10989 -46018
6421d6018m2183Q749M779N4361L4182P998J2536o4103l6601J1770k5515j4139
6409i4184J9397l2656O87Q465k2210P166J4660L2281N7478k686M3509P08n9080
6396b6465k9192k9037L028M0877L4305l8216k2481m8710n7115J7670j426M3765
6384a12997k236L5479R1059J4077K9560l5225o0287J7868m4200k4579M8288J4222
6372b8971n4300J5669l7013K7555N6778j388L5806j6560R342p191j4680R437L1858
6359B6342l256k2860p696n4737m029J42k9308Q26K1933K1719L0596J1709j5607
6346b4226j1514j2086L1595K6212l8388j875r335n751L2674m6843R953p241L995
6333e2830P05j7675l1323L9804j2162q107R0982N7511K1011l5799n4593j603j9849
$$ plain form
6421 -46018 -88201 -79452 -74673 -20312 13870 21868 34404 -29699 -66300 -54530 -80045 -94184
6409 -94184 -74787 -107443 -106756 -98291 -120501 -113335 -98675 -66394 -8916 -11602 31907 32615 -26465
6396 -26465 -55657 -84694 -81666 -40789 -6484 -44700 -67181 -115891 -173006 -155336 -156762 -112997
6384 -112997 -115233 -79754 11305 25382 54942 19717 -40570 -22702 -66902 -91481 -43193 -28971
6372 -28971 -83271 -67602 -104615 -77060 -20282 -21670 14136 -2424 6918 -273 -14953 -5516 26342
6359 26342 23086 226 -7470 -62207 -66236 -66094 -95402 -94576 -72643 -50924 -20328 -8619 -24226
6346 -24226 -35740 -47826 -16231 9981 -28407 -30282 -39617 -45368 -12694 -59537 -49584 -56825 -52830
6333 -52830 -52125 -69800 -101123 -61319 -73481 -81588 9394 66905 87916 52117 -2476 -4079 -23928
6320b3928L84L9114j0652l8815l7977l8462K7088P1696L3766K1l4985o5002J3042
6307f4710q896K1569N6003k9272L8189J4563j0794P66n4369q3547j4718K1461
6295a13755L3335Q7376N543j9103k1541p1502K6579M7313Q674M0939q879l104
6283A1875p470j3851l7904j430j7167M1205J6882k8155P8396j7490o5011j2268
6271e2388k6945N2548O9684Q944M6178j2648n8705j7322k8017L188J3240m0930
6259d3173j9559M6049m4952M3751R146k7409J03864K781j5421P706o234m6606
6247I943J1115o5601l6035Q023k8163L9878J0618J1170O8454k9957L3068L8303
6235G0816q5615m6032J379R171L1666K8753L7873K5260M25j5820l1677p8472L8673
$$ plain form
6320 -23928 -23544 15570 4918 -33897 -71874 -110336 -83248 -11552 22214 22235 -12750 -77752 -64710
6307 -64710 -73606 -52037 3966 -25306 12883 27446 16652 17418 -36951 -120498 -135216 -113755
6295 -113755 -80420 6956 12499 -6604 -28145 -99647 -73068 -25755 -17081 23858 14979 11875
6283 11875 4405 -9446 -47350 -48780 -65947 -24742 -7860 -36015 42381 24891 -40120 -52388
6271 -52388 -79333 -26785 42899 51843 98021 85373 26668 9346 -18671 -15483 -2243 -43173
6259 -43173 -62732 -16683 -61635 -17884 -8738 -36147 67717 70498 55077 62783 56549 9943
6247 9943 21058 -44543 -80578 -72555 -100718 -60840 -50222 -39052 29402 -555 32513 70816
6235 70816 -14799 -60831 -59452 -50281 -18615 10138 48011 73271 73696 57876 26199 -52273 -13600
6222a3600j9707j9249N1057J3939m6874J5304K5O4295O8056k2675M6339m8465
6210H8445o6399k8804o1926l7772N6203o642M6014L4571L5679R263o2198q4578
6198g8144P0946L1777j1845R6480o416m7901l3268n7738k5432J7246K0237j656
6186b5714j1261K1717N9173l9038k401M6071p0136J9657L6681p6079K2724N518
6174a3088l9665K0509Q560J8784L2840L0167l2942n479m8922K311L590j4357O5357
6161B7665o87K9244M8018l1312J2857j8606J7392J2716l2139m4718k1243o387
6149g200J7847l330k8190M0467K0540k9991N8116k858k9129j986j5818N095l18
6136B3245l1300k3119N2070m38O5l390j8647J5077r993j3875K0296J0723M2015
$$ plain form
6222 -13600 -33307 -52556 -1499 12440 -34434 -19130 -19105 45190 113246 90571 136910 88445
6210 88445 22046 -6758 -68684 -106456 -50253 -56895 -10881 23690 59369 68632 6434 -78144
6198 -78144 -7198 24579 12734 109214 102798 54897 21629 -36109 -61541 -44295 -24058 -25714
6186 -25714 -36975 -15258 43915 4877 2476 48547 -21589 -1932 34749 -41330 -18606 -13088
6174 -13088 -52753 -32244 -23684 -4900 27940 58107 25165 19686 -29236 -26925 -23335 -37692 27665
6161 27665 26978 56222 104240 72928 85785 67179 84571 97287 65148 20430 -813 -7200
6149 -7200 10647 7317 -20873 19594 40134 10143 68259 65401 36272 34286 18468 23563 23245
6136 23245 -8055 -31174 20896 20458 20523 17133 -1514 13563 3570 -10305 9991 20714 62729
6123F2729K8674k799J1455n2224k8754K5088l0435j467K0261l3098j1452Q330
6111c692k9488M9271j25K3518L7036m0528l1681L8379J8621K13l8850R645K7483
6098E9802R458j6292m161n1942n4038K2526K3529K0121K5687L103K5926Q252M498
6085G6469L2248j7106j3885p909l9874J1060l7495p780L0981m7931j446J6303
6073f365J8893k7685m0812j1762M6222N3796M0297K8985N414j1776o5395p7521
6061d7709L1031p687k9046N3371J9643Q318J095j7507n172R713J0803M4500K3347
6048I4700j8010L735l8117l1722j8790K5448N4227L8252p2039K3781o5568n2706
6036e6809k0045j4101M1324M542L8940M8229L9040k9494j6726k2509l2533m699
$$ plain form
6123 62729 91403 88604 100059 47835 19081 44169 13734 12267 32528 -570 -12022 -3692
6111 -3692 -33180 16091 15966 39484 76520 35992 4311 42690 61311 61524 22674 32319 59802
6098 59802 69260 52968 48807 -3135 -57173 -34647 -11118 9003 34690 37793 63719 71971 76469
6085 76469 108717 91611 77726 69817 29943 41003 3508 -4272 26709 -21222 -22668 -6365
6073 -6365 12528 -15157 -55969 -67731 -21509 32287 72584 101569 106983 95207 29812 -47709
6061 -47709 -16678 -24365 -53411 -40 19603 27921 29016 11509 6337 16050 26853 71353 94700
6048 94700 76690 80425 42308 10586 -8204 17244 71471 109723 37684 61465 -4103 -56809
6036 -56809 -76854 -90955 -49631 -45089 -6149 42080 81120 51626 34900 12391 -20142 -24841
6024b4841K435J5450J9488p2440k8023R660K2767J4549K4308N1932K4835K6927
6012H7047l001l0648J645J418K6101k1340L4130K261l2889l0983l5341J1396N1599
5999F1395k4907n1707k565m3949K5409J323L125L0097N542Q824J5030K085K9811
5986E9513n707j3882r240l3043n0496M776K8392L063q386L4996J6758Q051J5016
5973D9811L5438K4907j1402P337m1129n3338r112l4982l921J3298k0880M5807
5961A834j5857m1927m1885K2700N2833J1662j0618m325n8858m047L6735k150L4393
5948a9510P3321k4844n087Q6193m3460j7n3152p5483q87l4853o076N8046M1551
5935d258M6547J390k8491k6583r836j012L5722k1162j4498M7161p0767o603J052
$$ plain form
6024 -24841 -22406 -6956 12532 -59908 -87931 -78271 -55504 -40955 -16647 35285 60120 87047
6012 87047 84046 53398 55043 56461 82562 61222 95352 97613 64724 33741 -1600 9796 61395
5999 61395 36488 -15219 -17784 -61733 -36324 -35001 -31876 -1779 3763 12587 27617 29702 59513
5986 59513 53806 39924 30684 -2359 -52855 -48079 -19687 -16624 -25010 9986 26744 34795 49811
5973 49811 85249 110156 98754 106091 64962 11624 2512 -32470 -36391 -23093 -43973 1834
5961 1834 -14023 -55950 -97835 -75135 -22302 -10640 -21258 -25583 -84441 -88488 -51753 -53903 -19510
5948 -19510 53811 28967 23880 110073 66613 66596 13444 -62039 -62926 -97779 -103855 -45809 -4258
5935 -4258 42289 43679 15188 -11395 -21231 -22243 13479 -7683 -22181 24980 -45787 -52390 -51338
5922e1338p4940K4519M3181L6576k3885j6842l7529l1281k1984M4682Q8092J6706
5910d043K0361P221m9801O678l0245K674M6980q232j357k2668k6127m1116M7926
5897e1749R687Q752m6473K8446J8997m012K8771L1981k9794N7771j4428k9825
5885H124J1228m6249q1603J0250k5756j6782K3324j4656K9750P524M1878K2885
5873c0083q1679J0405J21492l6677j9660M1304l3660j6844J051m2607P2889j0273
5861b4342L053l269J3593l463m5296q561K0753j2545M0787L3035j7911j1614L4978
5848A9198m2303j329M2377n1900m4848j3318k4993k1789K9479M7097K8727j9774
5836e3376j5704m6964l5899P6570L8740j4468P9184m1775k1608r659r694J7617
$$ plain form
5922 -51338 -126278 -101759 -58578 -22002 -45887 -62729 -100258 -131539 -153523 -108841 -20749 -4043
5910 -4043 16318 23539 -26262 -19584 -49829 -47155 -175 -8407 -9764 -32432 -58559 -99675 -51749
5897 -51749 -42062 -33310 -79783 -51337 -32340 -36352 -7581 24400 -5394 52377 37949 8124
5885 8124 19352 -26897 -108500 -98250 -124006 -140788 -117464 -132120 -102370 -94846 -52968 -30083
5873 -30083 -111762 -101357 20135 -16542 -36202 5102 -28558 -45402 -44351 -86958 -14069 -24342
5861 -24342 -21289 -24558 -10965 -14428 -59724 -68285 -47532 -60077 -19290 13745 -4166 -15780 19198
5848 19198 -23105 -24434 17943 -33957 -78805 -92123 -117116 -138905 -109426 -62329 -33602 -53376
5836 -53376 -69080 -116044 -151943 -75373 -36633 -51101 28083 -13692 -35300 -44959 -54653 -37036
5824c7036q728o426m4012M865N1717m688J3990l4477K9294n0771J0969K8579o4780
5811a11504M0005o8646k3618K6335M0550L2004M5371K8392k4798j3559k1775k8313
5799g9556l3460k3557L3350j6862N5741P1900n765L7801k0862j0737J3205K186
5787B3384m4764K744K676n4129k335l5927J0092L0993o166J5475m9924r558N8285
5774e9154o237K701J356l8217K9370j339K402K7669R344m8652j1634o23r957J4135
5760h8836J5564O3203j3380j1931j0724k197n1572N3774N6982N524K3180k1933
5748A7654r839K0123k5892j1186l113m4542k9113j121k9209J6737K8184M020K2243
5735d5054K5950M9794j6469k6113K89m7041m5017M225M6305k493J1014M7988p872
$$ plain form
5824 -37036 -45764 -52190 -96202 -91337 -39620 -44308 -30318 -64795 -35501 -86272 -75303 -46724 -111504
5811 -111504 -71499 -140145 -163763 -137428 -96878 -64874 -19503 8889 -15909 -29468 -51243 -79556
5799 -79556 -113016 -136573 -103223 -120085 -64344 7556 1791 39592 18730 7993 21198 23384
5787 23384 -21380 -18636 -15960 -70089 -72424 -108351 -98259 -67266 -73432 -57957 -107881 -117439 -59154
5774 -59154 -65391 -62690 -61334 -99551 -70181 -71520 -69118 -41449 -32105 -80757 -92391 -93014 -102971 -88836
5760 -88836 -73272 -10069 -23449 -35380 -46104 -48301 -99873 -46099 10883 16407 39587 17654
5748 17654 7815 27938 2046 -9140 -12253 -56795 -85908 -87029 -116238 -99501 -71317 -67297 -45054
5735 -45054 -19104 30690 14221 -11892 -11603 -58644 -103661 -99436 -53131 -55624 -44610 3378 -4494
5722d494j2426m1606j1149k1329l3423K2379N8427N5038K0228j6899k8816l3537
5710d7607n695J0473Q5463j4988k4515l1425p7287p777j8071O9546N5680j5516
5698b1719L087o1449K7371k125R749k228L9647N0450L0547M7636o7669p4993m0463
5685f2159r4762L134O7650R5164K3572j7777M478K5839M2001n4134m6778j8779
5673c2551L4892J6592j2991N5172l7066m0194J5760m1265J9090k0234J9124j1462
5661c5133j1117k9993q054K714N5427M3856j0492p23J5422m382Q389m9974k7860
5648e1920L943L7199L5533K510K9882M445M277j1774j2474j3429J904m0484l161
5635a3549N9748j4352M019K524K1603l1481j8391K5558J86K736j9497m5571J7383
$$ plain form
5722 -4494 -16920 -58526 -69675 -91004 -124427 -102048 -43621 11417 31645 14746 -14070 -47607
5710 -47607 -53302 -42829 42634 27646 3131 -28294 -105581 -113358 -131429 -61883 -6203 -21719
5698 -21719 -18632 -80081 -52710 -54835 -45086 -47314 -7667 42783 73330 120966 53297 -21696 -62159
5685 -62159 -156921 -153787 -86137 9027 32599 14822 19300 45139 87140 33006 -13772 -32551
5673 -32551 2341 18933 5942 61114 24048 -16146 -386 -41651 -22561 -42795 -23671 -35133
5661 -35133 -46250 -76243 -84297 -81583 -26156 17700 7208 6485 21907 17525 25914 -24060 -51920
5648 -51920 -47977 -10778 24755 27265 57147 61592 65869 54095 41621 28192 30096 -10388 -13549
5635 -13549 46199 31847 35866 38390 59993 28512 10121 35679 35865 38601 19104 -26467 -9084
5622i084J0656K1862M049M741N572n055J3853k531J0587l6548k853m66K407K1340
5608C8530l2747L8J5972j505P312J9282l2272k5229K8553r619p38M4658M9366
5595A01601J2861k8096r076j641k2990j7381m3020j8718j7304K2827J4142M4198
5583C7403L1630L1417J7939K3973m19P354j5223k3793M162n5184l1260N7380m566
5570H0813k488j1686J2360n522m0244k1348j7219K3710O2986R0298Q184l6984
5558A42860j4635p8224n3086k1733K2525J12598L0782k0788j0118q625K8467j5481
5546A14542P2219j2884m9485o7491l9409m03N304O6300L166N0277L6007n0434
5534A27709J8191j1193n0791k044p987J1225j8704L4327j6164K7312M5575J7518
$$ plain form
5622 -9084 1572 23434 27483 32224 37796 32741 46594 44063 54650 18102 15249 14783 17190 38530
5608 38530 5783 5821 21793 20288 27600 46882 14610 -10619 17934 8315 7577 52235 101601
5595 101601 114462 86366 77290 75649 52659 35278 -7742 -26460 -43764 -20937 -6795 37403
5583 37403 69033 100450 118389 142362 141943 149297 134074 110281 114443 59259 27999 85379 80813
5570 80813 78325 66639 78999 73477 33233 11885 -5334 18376 81362 171660 179844 142860
5558 142860 128225 50001 -3085 -24818 -2293 110305 141087 120299 110181 101556 130023 114542
5546 114542 186761 173877 124392 56901 17492 17089 22393 88693 91859 142136 178143 127709
5534 127709 145900 134707 83916 81872 73885 85110 66406 100733 84569 111881 157456 174974
5522A74974J3485k2365L9904n7906J2638L9358m0821l678o8018n5217j7037M5579
5510F0896O1772j7406M150r712k8534k1339J671K2628j0036Q6822Q391j9611K054
5497A41746j1305K1288M648m3231j7911P928J7214k6499N504J1962Q537j3442
5485A06439O170J5379l6025k125M4635n164o794l8428o2168k7151L0423M2919
5473F8110L8809J482k631j0166k8612q610j9008J7462K556N910J8281O9921J8689
5460A72193j0993l3825m5484n485k4779l688J1774O0405p789m4886M7200k6140
5448H8503k3683J9906p843M7144k3467J7229O285n0139j0513l5173M0120L6469
5436A04838L2978M046k319q491m8966N7323L301J699j6760p1614R285J4244L8319
$$ plain form
5522 174974 188459 166094 205998 148092 160730 200088 159267 155589 87571 32354 15317 60896
5510 60896 122668 105262 109412 99700 71166 49827 51498 74126 64090 150912 159303 139692 141746
5497 141746 130441 151729 156377 113146 95235 103163 120377 93878 99382 111344 119881 106439
5485 106439 112609 127988 91963 89838 134473 129309 122515 84087 21919 -5232 25191 68110
5473 68110 106919 108401 105770 95604 66992 58382 39374 56836 59392 65302 83583 153504 172193
5460 172193 161200 127375 81891 76406 51627 47939 59713 120118 112329 67443 114643 88503
5448 88503 64820 84726 76883 124027 100560 117789 124074 73935 63422 28249 68369 104838
5436 104838 137816 141862 139543 131052 82086 139409 142710 144409 127649 56035 65320 79564 117883
5423A17883M9215P195N142k5333L81r279N1288r223j3919k7706o1454L062k1090
5410F6162j6601n773M0249L7305R010l7119k1527j3066j1982j6981L9224L2949
5398A01850K0635k1599j9248l2428m3007k9981L7747K4121N0044J7527M2766q768
5386A39659O60k8614m8428r740J0569Q215K2259Q1260K778q50j5546j7965k8678
5373A15579q951k6289J7914o26o653L0949K3775K2320K5377p512o6352l0543j3376
5360G5612o0722j8773L1620M440J4966N6466L5815l1806L5395K6685o9609j4151
5348H5938n8919n7811j0972J9615N3513P8075L5494K382M407l9029l6856o049
5336F9788j0678o800j1987R280J0473j0101L7552o2549J9451j6167K6061K2005
$$ plain form
5423 117883 167098 174293 179435 154102 154483 145204 196492 187269 173350 145644 84190 87252 66162
5410 66162 49561 43788 84037 121342 130352 93233 71706 58640 46658 29677 68901 101850
5398 101850 122485 100886 81638 49210 6203 -23778 13969 38090 88134 105661 148427 139659
5386 139659 140319 111705 63277 53537 64106 72321 94580 175840 178618 177768 162222 144257 115579
5373 115579 106628 80339 98253 97627 90974 121923 145698 168018 193395 185883 119531 88988 75612
5360 75612 14890 -3883 27737 32177 47143 103609 139424 107618 143013 169698 100089 85938
5348 85938 27019 -30792 -41764 -22149 31364 109439 144933 147315 151722 112693 75837 69788
5336 69788 59110 52310 40323 49603 60076 49975 87527 24978 44429 28262 54323 76328
5324G6328l4104k3111o55K2611L3375N2471L3532l6509j9956L765n0864j0482
5312D6401Q353J4888k0155J1082K6035M4109K4758k1519n3962q148r018Q609O5835
5299A37268L3574l8833l7382j0659P965Q0314L7370l0794O508o7965p0904j8022
5287B8440M9461M0128k3118M721j0531r446m3090q535p716j5686L7639K8194O8865
5274A39326M7172j5520l3432o9834q318l621j5200L973o6097J3947J4675M4126
5262E1197K7532n577L1876L440L9545k4216k9855n9357n1575k1956m0770N7595
5250b2121J567P3283M3215J0296k2442m0765k4437k3780n576l058J5613Q4017
5238H5812J3183K0181O657l3449l7558k2508r276l5695n212m4413J0385O1368
$$ plain form
5324 76328 42224 19113 18458 41069 74444 126915 160447 123938 103982 107747 56883 46401
5312 46401 54754 69642 49487 60569 86604 130713 155471 133952 79990 71842 62824 71433 137268
5299 137268 170842 132009 94627 83968 91933 172247 209617 178823 185331 117366 46462 28440
5287 28440 77901 118029 94911 99632 89101 79655 36565 28030 20314 4628 42267 70461 139326
5274 139326 186498 170978 137546 67712 59394 55773 40573 44546 -21551 -7604 7071 51197
5262 51197 78729 73152 105028 108468 148013 123797 93942 34585 -16990 -38946 -79716 -22121
5250 -22121 -20554 52729 95944 106240 83798 43033 18596 -5184 -10760 -13818 1795 85812
5238 85812 98995 119176 125833 92384 54826 32318 23042 -12653 -17865 -62278 -51893 9475
5226I475M6183K7846K4132K9523j6963k4044k3097k7730J6594Q472n8906j8635
5214g150L2328N911J1598J2184j8234l7441J7984J4415k9055J3572N205j8430
5202B887L5629J3264l5629k8144R718j3552q916J8714J1004J8432J7990N605N912
5189E2914L4627p120o9863o869j9260n03N5673K7855K2828L1121o433J019J2078
5176A28067m1774o5001l3375m4824N888m254M6139M3143J6417Q346j0411J3472
5164F1833o943l4561J0148n069k8583Q503K2709L336M4848K3833j842J370k4685
5151G4897m7658m0882m1444J8206l802R3155L3041o728O061l6169k232n532J5248
5138E6161k3780j0052j5295n5527j8986O307L3307K7333M6070L8631k493J8821
$$ plain form
5226 9475 55658 83504 107636 137159 120196 96152 73055 45325 61919 70391 11485 -7150
5214 -7150 25178 31089 42687 54871 36637 -804 17180 31595 2540 16112 21317 2887
5202 2887 38516 51780 16151 -11993 -2275 -15827 -24743 -6029 4975 23407 41397 47002 52914
5189 52914 87541 80421 10558 3689 -15571 -16074 39599 67454 90282 121403 114970 115989 128067
5176 128067 86293 21292 -12083 -56907 -51019 -55273 -9134 34009 50426 58772 48361 61833
5164 61833 54890 20329 30477 25408 -3175 5328 28037 31373 76221 100054 98212 99582 74897
5151 74897 27239 -13643 -55087 -36881 -40683 52472 85513 78785 84846 48677 46445 40913 56161
5138 56161 32381 22329 7034 -48493 -67479 -61172 -27865 -532 45538 84169 81676 100497
5126A00497l1485n4316m718k8518k8517l0122M2650L1466q754K2908L9963O284
5114E7338j5667J7855J4876N447J073M0464J3237j7979k9769J0011K9749J952
5102A28587k4171k3600l2259l4926k7067M8909K4827L7042k685l866l1410K8299
5090H7680n578m964k275q0459J6090O9421l3490K6338N3883J2287k7395J1740
5078A23278J0990l2533k6092R835J6434K4707R1858L0744p9705l1243m3309j5054
5066G9910R472j712K127n2230o322J8855O4144O5495L1099O632m1359n837j9515
5053A50759J4520L7423p4854L2694J9234O948N5302J6297K7114k5377o5491o5895
5041A28674j3620M2974M7575M0205J1082Q6550M1412N766N8285n0900l5359k0374
$$ plain form
5126 100497 69012 14696 9978 -18540 -47057 -77179 -34529 -3063 -11817 11091 51054 57338
5114 57338 41671 59526 74402 79849 80922 121386 134623 116644 86875 96886 126635 128587
5102 128587 104416 80816 48557 13631 -13436 35473 60300 97342 94657 90791 59381 87680
5090 87680 82102 77138 74863 -5596 10494 79915 46425 72763 126646 138933 111538 123278
5078 123278 134268 101735 75643 85478 101912 126619 218477 249221 169516 138273 94964 79910
5066 79910 89382 87670 89797 37567 31245 50100 114244 179739 210838 217470 176111 170274 150759
5053 150759 165279 202702 127848 160542 179776 186724 242026 258323 285437 260060 194569 128674
5041 128674 115054 158028 205603 245808 256890 343440 384852 390618 448903 398003 362644 342270
5029C42270k140J1575N7421L2866L7154N8836k4699n721q093l8591p9616k2555
5017C58707K4503K1859l812L5326k1131j4909L9470J2065k6393j3934j9664J1989
5005D04076J4306L957O9376O3137R8805R0918R5489O7365J3847j4689K507M061
4993I13155q8232j0826j2099p7515l9628k7501R544N3322K8255M5283K0486j0601
4981H03643K9914J7482K5063N0779J0933J6427L1837L9101J15500O6677M3555
4970A250911J01768P4595J96015K90620L02457K80162K23990R7045j13524k54045
4960B449994k91299k19050k07693j53227n5769p4337n0789m3306n7709j0343K7385
4949A313857M6996N3610M0047m459L8367R5010J41592J63923P9864J13482Q8423
$$ plain form
5029 342270 340130 351705 409126 441992 479146 537982 513283 507562 499469 460878 381262 358707
5017 358707 383210 405069 401257 436583 415452 400543 440013 452078 425685 411751 392087 404076
5005 404076 418382 422339 491715 554852 653657 744575 840064 907429 921276 906587 909094 913155
4993 913155 824923 814097 801998 724483 684855 657354 666898 720220 748475 793758 814244 803643
4981 803643 833557 851039 876102 926881 937814 954241 986078 1025179 1140679 1207356 1250911
4970 1250911 1352679 1427274 1623289 1913909 2216366 2496528 2720518 2817563 2704039 2449994
4960 2449994 2158695 1939645 1731952 1578725 1522956 1448619 1397830 1354524 1296815 1286472 1313857
4949 1313857 1360853 1414463 1454510 1450051 1488418 1583428 1725020 1888943 1968807 2082289 2170712
4938B170712J23912J78163K01947K75571L82709M51224O04872Q30828R18475O42176
4928F780589K8951o44954r16092p88773o55505m54969m11736k68076k10195j49891
4918B309349o9728p2294o4374q3401q1971r4683J6153M9604K3252J18102N8021
4907B108030P6510J41047J62863J47942J34877J96930K49222K55638M49043N65190
4897D487292O86331Q06831P82849K93791m05261q55206r31515o76720n54659m45332
4887C188401l68916k57665k40238j94464j46316j33220j27712o5877r5958r3932
4877A464103m3393L8483j2281N3143L2189j9003M533N4441R7639P0398N3557j1873
4865A781936K0144J23225K33560L28228L41928K43435m3742l11699l66475l28478
$$ plain form
4938 2170712 2294624 2472787 2674734 2950305 3333014 3784238 4389110 5219938 6138413 6780589
4928 6780589 6809540 6164586 5248494 4459721 3804216 3349247 2937511 2669435 2459240 2309349
4918 2309349 2239621 2167327 2102953 2019552 1937581 1842898 1859051 1908655 1931907 2050009 2108030
4907 2108030 2184540 2325587 2488450 2636392 2771269 2968199 3217421 3473059 3922102 4487292
4897 4487292 5173623 5980454 6763303 7057094 6651833 5796627 4865112 4188392 3633733 3188401
4887 3188401 2819485 2561820 2321582 2127118 1980802 1847582 1719870 1653993 1558035 1464103
4877 1464103 1420710 1459193 1446912 1500055 1532244 1513241 1517774 1572215 1669854 1740252 1793809 1781936
4865 1781936 1802080 1925305 2158865 2487093 2829021 3072456 3028714 2717015 2350540 2022062
4855B022062k44694j74926j20144j40357m3140q6386o4461k7129q2692o4586m3757
4844I29790m7019j2068m4682j6067k0004K7791o439j9738n994J9669M547p2435
4832G37351M0266L2159l6964O490m0616j6557J6556K3121K2548o1916p2928n6150
4820E93360m5291k1807P1567O002N509J524j3412N1423L1475m0010K4239L0847
4808F95426K802q2800M1292J5793J1100K9025l0698L0303j3714J9569n540K3830
4796G36388M5720J7221L8275L9562m1359m0401k0550N4647O4350N1267J3566K0070
4784I78756m835N6580J15198J20515J68981K11473J86338J16023M407j23685j55392
4773A674359j72646j33270p0106q0902n0511j1498m4267R22j2599K496J2888M7444
$$ plain form
4855 2022062 1777368 1602442 1482298 1341941 1298801 1212415 1147954 1120825 1038133 973547 929790
4844 929790 882771 870703 826021 809954 789950 817741 811302 791564 785570 805239 809786 737351
4832 737351 777617 809776 772812 779302 738686 722129 738685 761806 784354 722438 649510 593360
4820 593360 548069 526262 597829 603831 609340 610864 597452 648875 680350 640340 664579 695426
4808 695426 698228 615428 656720 672513 683613 712638 681940 712243 698529 718098 712558 736388
4796 736388 782108 799329 837604 877166 835807 795406 774856 829503 893853 945120 958686 978756
4784 978756 973921 1030501 1145699 1266214 1435195 1646668 1833006 1949029 1953436 1829751 1674359
4773 1674359 1501713 1368443 1298337 1217435 1166924 1155426 1111159 1112081 1099482 1101978 1114866 1162310
4761A162310J0131J3030O3209Q6639P3570Q0137R2750N9584N4617J53239J98116
4750B047332K65326K90178L24272K10712P559j88595l46628k98168l36085k13921
4740A761982j68675r5414q1070j5390L394k2919n8990m2693L559M3505K2958N1680
4728A401927J9014J0609J7611j3893O2249P3183J06904J06625J14414J76032R5219
4717B169894R6152q1708j74925j81637j35421j46854j70240m2376j15515P36l1529
4706A186577j0810o699L1924K3132L3052o233L2048l1871o081K6934R569j3905
4694A267637j9975J338p0499m3204m941l2341L122r087J7829M863m5993j00453
4682I68296o0544j535K4211P9778P6169Q1406J5497j7107N551L4011N4054Q0181
$$ plain form
4761 1162310 1172441 1185471 1248680 1335319 1408889 1489026 1581776 1641360 1695977 1849216 2047332
4750 2047332 2312658 2602836 2927108 3137820 3145379 2956784 2610156 2311988 1975903 1761982
4740 1761982 1593307 1497893 1416823 1401433 1404827 1381908 1322918 1280225 1283784 1327289 1350247 1401927
4728 1401927 1420941 1431550 1449161 1435268 1497517 1570700 1677604 1784229 1898643 2074675 2169894
4717 2169894 2266046 2184338 2009413 1827776 1692355 1545501 1375261 1332885 1217370 1218106 1186577
4706 1186577 1175767 1169068 1200992 1224124 1257176 1250943 1282991 1251120 1245039 1271973 1281542 1267637
4694 1267637 1247662 1249000 1178501 1135297 1130356 1098015 1101137 1092050 1109879 1114742 1068749 968296
4682 968296 907752 906217 930428 1010206 1086375 1167781 1183278 1166171 1171722 1205733 1259787 1339968
4670A339968J3538L6901j9851k42P056M8621L117o383j8206k8186l0092n0675
4658A295566l2590j487j2433Q077n182n7467J9917l3652N0906N1793L6316M9893
4646A369657J02872Q1296L4045Q4129N4438k3005l262m4369n8661k1593l3884
4635A541663m96J571O7468J242R57N9423j1991r674k222k7447o9031l375n963
4622A542125j6065N8494N1034M1018L0932R490L5792K9888j2980P7489K9640N053
4610A881910l796O929K4982K7962l6652k0659M3887J6495N2401o099M0589Q5878
4598B113827O4247J02944N422P430q740M082J3222K3239k2871o6098n0369n0092
4586B136243M4709P9552L0336M5028r267l6220l1546k9284Q4234O1344J12180
$$ plain form
4670 1339968 1353506 1390407 1370556 1370314 1377370 1425991 1429108 1422725 1404519 1376333 1346241 1295566
4658 1295566 1262976 1261489 1249056 1257133 1251951 1194484 1214401 1180749 1231655 1283448 1319764 1369657
4646 1369657 1472529 1553825 1587870 1671999 1726437 1703432 1700170 1655801 1597140 1575547 1541663
4635 1541663 1541167 1542738 1610206 1611448 1612405 1671828 1659837 1650163 1647941 1620494 1551463 1548088 1542125
4622 1542125 1526060 1584554 1635588 1676606 1707538 1717028 1752820 1782708 1769728 1847217 1876857 1881910
4610 1881910 1878114 1885043 1910025 1937987 1901335 1880676 1924563 1941058 1993459 1987360 2027949 2113827
4598 2113827 2178074 2281018 2286440 2293870 2285130 2289212 2302434 2325673 2302802 2236704 2186335 2136243
4586 2136243 2180952 2260504 2290840 2335868 2326601 2290381 2258835 2229551 2313785 2375129 2487309
4575B487309J54899J43069J02787J06620q157j1784j2124r965J7300M6515L0124
4564C046593M9340l816l4002o658l8985o5514p4834p1154k0735O076j2028R7287
4552B871570O2609R1466J08908J01080J82259J95499N8664J1224K4173Q4777R2643
4541C884872J00458P3929Q5615K7550M9028j8528M9N4693j8716l903M0700O946
4529D282693p0809p121j6753m93M0319O1345R9419J15999J02598J60615J67285
4518D935097K14709J86849J03493J23924J19476O7993M5552K1503M5983J22243
4508E986822Q9099J13520J36654J33200J27239P7071L6015M3675j8682N4522J21024
4497F900159P6252K02524K13522J10450J29534J77660J94093K50543K78490L24493
$$ plain form
4575 2487309 2642208 2785277 2888064 2994684 2986527 2974743 2962619 2952654 2969954 3016469 3046593
4564 3046593 3095933 3092117 3058115 3051457 3012472 2946958 2872124 2800970 2780235 2786311 2774283 2871570
4552 2871570 2934179 3025645 3134553 3235633 3417892 3613391 3672055 3683279 3707452 3792229 3884872
4541 3884872 3985330 4059259 4144874 4172424 4221452 4202924 4202973 4257666 4238950 4235047 4275747 4282693
4529 4282693 4211884 4204763 4188010 4187517 4227836 4289181 4388600 4504599 4607197 4767812 4935097
4518 4935097 5149806 5336655 5440148 5564072 5683548 5751541 5797093 5818596 5864579 5986822
4508 5986822 6075921 6189441 6326095 6459295 6586534 6663605 6699620 6743295 6724613 6779135 6900159
4497 6900159 6976411 7178935 7392457 7502907 7632441 7810101 8004194 8254737 8533227 8857720
4487H857720L39536K34087J91880J24556J66057Q3048M7723L4880J41112J25849
4477A0346448K45129L69366L27655L52965L59734L00987K78482K62226J97789
4468A3040781K74752L22713M52036M80095N35877N00675M57640M34931N19696
4459A7019196N02665N18013O55572N62363M91813N27017M83159M96670M83795
4450B1740263N76647O52829P24012Q46187R84135J071549J166597J134638J034314
4441B9931171J059449J120911J143079J313703J356895J509271J745424J847326
4433D1027229J917497K005195K142222K414836K714472L082324L426870L791207
4425F2521852M052604M494987N081252O030695O987163P874257Q712407R990156
$$ plain form
4487 8857720 9197256 9431343 9623223 9747779 9913836 9996884 10044607 10079487 10220599 10346448
4477 10346448 10591577 10960943 11288598 11641563 12001297 12302284 12580766 12842992 13040781
4468 13040781 13315533 13638246 14090282 14570377 15106254 15606929 16064569 16499500 17019196
4459 17019196 17521861 18039874 18695446 19257809 19749622 20276639 20759798 21256468 21740263
4450 21740263 22316910 22969739 23693751 24539938 25524073 26595622 27762219 28896857 29931171
4441 29931171 30990620 32111531 33254610 34568313 35925208 37434479 39179903 41027229
4433 41027229 42944726 44949921 47092143 49506979 52221451 55303775 58730645 62521852
4425 62521852 66574456 71069443 76150695 82181390 89168553 97042810 105755217 115745373
4417A15745373J2249351J5800136K1276544K8629882L5213817L6166346K0297449
4410B85378898j2034747l3029087l2593744k4551089j7667423j3312906j0448819
4403A41741083q371806o465373m525378k451566p07469R66299K428713L774762
4395A26389265M872083O209863P768791R815811J1790114J3608559J5260814J8291083
4387B14006383K3149082L0803167M2324165N6715948O7691548O4136142K6209540
4380E25035975l3187709o4998695o4729734n2372405m1301995l3873512k7853430
4373B06718495k2522765j7620536j3487681j0131257p552214n313219l460503
4366A26630320j917036p59814N04624J851907L510910N128363O491179P638740
$$ plain form
4417 115745373 127994724 143794860 165071404 193701286 228915103 265081449 285378898
4410 285378898 273344151 240315064 207721320 183170231 165502808 152189902 141741083
4403 141741083 133369277 126903904 122378526 119926960 119219491 120185790 122614503 126389265
4395 126389265 131261348 137471211 145240002 155055813 166845927 180454486 195715300 214006383
4387 214006383 237155465 267958632 310282797 366998745 434690293 498826435 525035975
4380 525035975 491848266 426849571 362119837 309747432 268445437 234571925 206718495
4373 206718495 184195730 166575194 153087513 142956256 135404042 130090823 126630320
4366 126630320 124713284 123953470 124458094 126310001 129820911 134949274 141440453 149079193
4358A49079193R032969J1004517J4534790K0866534K9247276L5909597L4526009
4351C04200885J0343425k5662785m1406870l7796788l0042777k4644634k0487470
4344A34502986j6424408j3087378j0332950q313639o708101n481784m507791l634955
4336F6011980k900822k406773j955364j503406j147336p27434j07520N38032J015603
4327E6816960M65066j172429l154066l973882l667526l145768k607904k134736
4319C7425715j872983j651212j544516j357246j249000j058131r89095q79955
4311B6823577q32104p80285p69916o68603m67154l28968j92167m2216K732j4540
4301B2730356R316R6370L10427O62526R21325Q31803J15126r16278j622070j739020
$$ plain form
4358 149079193 158112162 169116679 183651469 204518003 233765279 269674876 304200885
4351 304200885 314544310 288881525 247474655 209677867 179635090 154990456 134502986
4344 134502986 118078578 104991200 94658250 86344611 79636510 74154726 69646935 66011980
4336 66011980 63111158 60704385 58749021 57245615 56098279 55370845 55263325 55801357 56816960
4327 56816960 57282026 56109597 52955531 48981649 45314123 42168355 39560451 37425715
4319 37425715 35552732 33901520 32357004 30999758 29750758 28692627 27703532 26823577
4311 26823577 25991473 25211188 24441272 23772669 23305515 22976547 22784380 22742164 22744896 22730356
4301 22730356 22739672 22836042 23146469 23808995 24730320 25562123 25677249 24760971 23138901 21399881
4291B1399881j455091j217109j107107r31015p97650o61303n75526n70714n93302
4282A3491064n62381n55356n32530l98469l38225k65538k38622j49564j33971
4273A0316408k43381k09507k50705k73861k15824j74126j64579j55511j58472
4264H470442k06835j95870j31661j77859p8314j08165j26584j78959j49003j52122
4254F965070k45588k00262j69847j66916j93396r1710n6648m5092m6675j08888
4244E640048j22116r3676j46312p2634q7795n1576p1237r3824q1129j36500j33205
4233D550044j09206j48357j86904j40750j50213j31237o0710j13835m7110n3580
4223C408142l3990o2987l2788K3561k4882K8051O8370M9527l794K9639j2699J368
$$ plain form
4291 21399881 19944790 18727681 17620574 16689559 15891909 15230606 14655080 14084366 13491064
4282 13491064 12928683 12373327 11840797 11442328 11104103 10838565 10599943 10450379 10316408
4273 10316408 10073027 9863520 9612815 9338954 9123130 8949004 8784425 8628914 8470442
4264 8470442 8263607 8067737 7936076 7758217 7679903 7571738 7445154 7266195 7117192 6965070
4254 6965070 6719482 6519220 6349373 6182457 5989061 5897351 5840703 5795611 5748936 5640048
4244 5640048 5517932 5424256 5277944 5205310 5117515 5065939 4994702 4900878 4819749 4683249 4550044
4233 4550044 4440838 4292481 4105577 3964827 3814614 3683377 3622667 3508832 3461722 3408142
4223 3408142 3374152 3311165 3278377 3301938 3277056 3305107 3373477 3423004 3419210 3448849 3436150 3437518
4211C437518m120j1380k3469K046r9529j13905j10537j60071j47215j81510j62800
4200B425028r4547j25495j95927q3908l7786M5768P0637m208K3515J719j6822
4189B007974P4300N3050K5453J9339m4204l6812P075J7003k225M6641Q236L2972
4177B208802n1312j45344n9029j62291q4796j33799p9152m9749k2100p372J455
4166A415313K5080m101j9831l6608m0838J8792j4823P956Q105j9369m9666p9741
4154A210269J4479J8258M0013O2848L8878l7289m3062r462n3170m4091J6664J3209
4142A227544l200n0028l8995o4408l1347n28J5532N1097N7953m7080n9493k9827
4130A027220k9113j6438m5173n6174o4094m5817n5506J5617p666J8470L1494J9655
$$ plain form
4211 3437518 3433398 3422018 3398549 3400595 3301066 3187161 3076624 2916553 2769338 2587828 2425028
4200 2425028 2330481 2204986 2009059 1925151 1887365 1933133 2003770 1999562 2023077 2024796 2007974
4189 2007974 2082274 2135324 2160777 2180116 2135912 2099100 2106175 2123178 2120953 2167594 2175830 2208802
4177 2208802 2157490 2012146 1953117 1790826 1706030 1572231 1493079 1443330 1421230 1413858 1415313
4166 1415313 1440393 1436292 1416461 1379853 1339015 1357807 1342984 1350940 1359045 1339676 1290010 1210269
4154 1210269 1224748 1243006 1283019 1345867 1384745 1347456 1304394 1294932 1241762 1197671 1214335 1227544
4142 1227544 1224344 1174316 1135321 1070913 1039566 1039038 1054570 1105667 1163620 1116540 1057047 1027220
4130 1027220 998107 981669 936496 880322 816228 770411 714905 730522 722856 741326 772820 792475
4118G92475M5039j905j4603R2707J9470K047k8465k8219j9293M587K5473K9371
4106I18684M2386m1044l4438n1786q6784o1298o8380l6833p380p186P8767J6655
4094F61363m2648L3627j4572l8347j3390l6937j0197l432L0305n530P9326K5621
4082F65189P7824J9079M0659P034k7433J2326K3070l8956l7225m3180Q714j2313
4070F94788L5301j9393r2334o5480n3236J5814O6520R2592K0498J9231K4968n233
4058G34036N264J5867M93J9370l697L6992J6358J10335J02887N0131N7217N1840
4046A197093O1019L1246N2156J75909J26059J32871K9724j25235j29103j01622
4036A450117p0001p8602k4601o9473q3028o8511p3408l7871J9509R65N3914N4208
$$ plain form
4118 792475 837514 835609 821006 913713 933183 935230 906765 878546 859253 863840 889313 918684
4106 918684 961070 920026 885588 833802 747018 685720 617340 580507 573127 565941 644708 661363
4094 661363 618715 652342 637770 599423 586033 549096 538899 535467 565772 560242 639568 665189
4082 665189 743013 762092 802751 809785 782352 794678 817748 778792 741567 698387 707101 694788
4070 694788 730089 710696 618362 552882 499646 515460 581980 674572 695070 714301 739269 734036
4058 734036 739300 755167 755660 775030 771333 808325 824683 935018 1037905 1088036 1145253 1197093
4046 1197093 1258112 1289358 1341514 1517423 1643482 1776353 1806077 1680842 1551739 1450117
4036 1450117 1380116 1301514 1276913 1207440 1124412 1055901 982493 944622 964131 965096 1019010 1073218
4024A073218N3507L0406Q1467R8726O6729Q2389L2463M7836J42516K36173K47599
4013B193029K81229L33500J73371j03298k70622l32786k79216k45493j44299j25913
4003A479502j15195q7706j40845j19538l7824M4943J7841J986K2693n3136K9597
3992A042318r281L3087N4530L3153m15K6850O3619J08829J32724K00589J09149
3981A795152P7849o5411j75098j98247j89776j19535j75675q1250p1108n2598
3971G44303p0701J4987j5075l8117k1408k3049l4620J0615j3314L989J0957M7669
3959F16236j5235m2693J0724k7583o4034J0664J0291j5304m4273k6742J0543m4015
3947C78579J440n83j7208j3476n361K1039K095j4220q547J155K6361n6902J7400
$$ plain form
4024 1073218 1126725 1157131 1238598 1337324 1404053 1486442 1518905 1566741 1709257 1945430 2193029
4013 2193029 2474258 2807758 2981129 2877831 2607209 2274423 1995207 1749714 1605415 1479502
4003 1479502 1364307 1276601 1135756 1016218 978394 1023337 1041178 1043164 1065857 1012721 1042318
3992 1042318 1033037 1066124 1120654 1153807 1153392 1180242 1243861 1352690 1485414 1686003 1795152
3981 1795152 1873001 1807590 1632492 1434245 1244469 1124934 949259 868009 796901 744303
3971 744303 673602 688589 673514 635397 613989 590940 556320 566935 553621 557610 568567 616236
3959 616236 601001 558308 569032 541449 477415 488079 498370 483066 438793 412051 422594 378579
3947 378579 380019 379436 362228 348752 343391 364430 366525 352305 343758 344913 371274 314372 331772
3934C31772J7727k1883o206j3228M476k7910l4675J3409P229N3148J0518j0448
3922C23929l0923Q522k8182j5037K9016K309k8924l4738o5802L015k2387K565
3910A43363J0690L730P3153j4077k2196n5134o082l2742K013M24J6348q949n476
3897A05065j9675J3273k1157L7802L0517j8215L58k8880l484o911P720k9181M9344
3884A16576L313J7267m560m6367j8743j3890k2571k125K7595K3853O802n5303
3872C1847k6416L9022r076j3036J4852L4433N6238p13k3055j1943l2113l3928
3860B6112N007P310K8978J2270m6318l6106l3310J4580L9329K0834K6645L2235
3848I7566Q691m1301l7897l4705j733l8163M485M8288J9791M2589M4845n8196
$$ plain form
3934 331772 349499 327616 321410 308182 312658 284748 250073 263482 270711 323859 334377 323929
3922 323929 293006 301528 273346 258309 287325 289634 260710 225972 160170 163185 140798 143363
3910 143363 154053 157783 230936 216859 194663 139529 133447 100705 102718 103142 119490 110541 105065
3897 105065 85390 98663 77506 115308 145825 127610 127968 99088 95604 88693 96413 67232 116576
3884 116576 119889 137156 132596 86229 67486 53596 31025 28900 56495 80348 87150 31847
3872 31847 5431 44453 35377 22341 37193 71626 127864 127151 104096 92153 60040 26112
3860 26112 31119 38429 67407 79677 33359 -2747 -36057 -21477 17852 38686 65331 97566
3848 97566 106257 64956 27059 -7646 -9379 -47542 -43057 5231 25022 67611 112456 54260
3836E4260j6234K1528k2814j3353K0858j3454l9439K3859J7535M816K4217K6645
3824H8424K2131r100O113l2363k9653m3055p8183K4116M2974j2219N3626N0303
3812H3114k299j4578o356k4487q230K4707L634k5366n6267j5117J8378o712M727
3799b4852K1320q810n6879N068l170M1370L5367k3869r713J7732k4747l9405j882
3786g2470O917R819J5417k088o2950J7608K6928K7876K0729Q44R886m0665j5615
3773e7764j8933j8992L1978J2676K1236K151L5142j5309o5838K9747m5985l2896
3761a22787o29K2058J9911k7172k4812M6083Q6549l451j4220j2072L480k9954
3749e7016l244K6779J700j4151M3836N451K5522o807k8060o0889j9961M576m594
$$ plain form
3836 54260 38026 59554 36740 23387 44245 30791 -8648 15211 32746 37562 61779 88424
3824 88424 110555 101455 107568 75205 45552 2497 -75686 -51570 -8596 -20815 32811 83114
3812 83114 80815 66237 59881 35394 27164 51871 55505 30139 -26128 -41245 -22867 -29579 -24852
3799 -24852 -3532 -12342 -69221 -64153 -67323 -25953 9414 -14455 -24168 -6436 -31183 -70588 -72470
3786 -72470 -65553 -55734 -40317 -42405 -105355 -87747 -60819 -32943 -12214 -11370 -1484 -42149 -57764
3773 -57764 -76697 -95689 -63711 -51035 -29799 -27648 7494 -7815 -73653 -43906 -89891 -122787
3761 -122787 -123416 -101358 -81447 -108619 -133431 -87348 -799 -4250 -18470 -30542 -27062 -57016
3749 -57016 -60260 -33481 -31781 -45932 -2096 3355 28877 22070 -5990 -66879 -86840 -82264 -86858
3736h6858k1096J5528J5761J1022J2808N2251j1165K4456J1893n0395k9680m4107
3724i9582k0614J1538K7856L2279L307J6001r412N941l6129m1961k5517M3356
3712i2937M4787l704M3225Q630n0611j2996N203j7901O9693j5139R62k2970k5895
3699f9653j6621q064N3470M6734j2493J0956q117n6410o6065q163j2376J0702
3687a36100Q7854N8571N944o493j8617J459o0238m1574R882J4621N1514M592L4296
3674E711M8620K6266l8494m2674j7881J4290J4579m3544j3142J2147J1158M0013
3662A7049L4063M2716k2405m9576l9993n4750k0257o996N0315k3285K8647N083
3650c9389p193J6208N9336K3000j8242o2437K1596n7743j0801J4993Q6661K5679
$$ plain form
3736 -86858 -107954 -92426 -76665 -65643 -52835 -584 -11749 12707 24600 -25795 -55475 -99582
3724 -99582 -120196 -108658 -80802 -48523 -45216 -29215 -38627 -32686 -68815 -110776 -136293 -92937
3712 -92937 -48150 -51854 -8629 1 -50610 -63606 -58403 -76304 -6611 -21750 -20788 -43758 -69653
3699 -69653 -86274 -94338 -40868 5866 -6627 4329 -3788 -60198 -126263 -134426 -146802 -136100
3687 -136100 -48246 10325 16269 9776 -8841 -7382 -67620 -109194 -99312 -84691 -33177 -28585 5711
3674 5711 54331 80597 42103 -571 -18452 -4162 10417 -33127 -46269 -34122 -22964 17049
3662 17049 51112 93828 71423 21847 -18146 -72896 -93153 -100149 -49834 -73119 -44472 -39389
3650 -39389 -46582 -30374 28962 51962 33720 -28717 -7121 -64864 -75665 -60672 25989 51668
3638E1668K896L7458k6903q490r7766n0783N964N6771J25035o104K3835K5475
3626A39056l7743l2851o1072j1168O98L7470M238M7174p578K2353r381k6001L7395
3613A02590M4086l8169K2828l2887l5561j8132j2182J0495P8823Q236L2202L4277
3601A96606L4425k9726o7341m7313K5070J8410M9536R9267M707M962k8241j5130
3589B45232R422J1478M571K7261J9933M6655L0807J9869n3719N387r1123l7457
3577B38316n6867K4968J04755j8708o9236L4150L3988O7583K5511r575N0166K886
3565D27937K7348j6203J5791J16417Q9078N740R4534J29674J14397O8287p2842
3554A000158j41854n4410j19917q0863m8761j7787k7827M500J2907K9058L5052
$$ plain form
3638 51668 54564 92022 65119 56629 -41137 -91920 -85956 -29185 95850 89746 113581 139056
3626 139056 101313 68462 7390 -3778 -3080 34390 38628 85802 78224 100577 91196 65195 102590
3613 102590 146676 108507 131335 98448 62887 44755 32573 43068 121891 130127 162329 196606
3601 196606 231031 201305 133964 86651 111721 130131 179667 278934 283641 288603 260362 245232
3589 245232 254654 266132 270703 297964 317897 364552 395359 415228 361509 366896 275773 238316
3577 238316 181449 206417 311172 292464 223228 257378 291366 358949 384460 374885 425051 427937
3565 427937 455285 439082 454873 571290 660368 666108 760642 890316 1004713 1073000 1000158
3554 1000158 858304 803894 683977 603114 554353 536566 508739 513239 526146 555204 590256
3543E90256N579n6348k6518j3014N1773m1922Q7997N6145q743J14577N811O8140
3531H33733M5036O5889J28975R9021R1755P7745l3049j641r1999j65712j51672
3520H98081m1062j01733j7862p481l3325L1745l7594o0355l1993J4943P2514L2322
3508G18200L538L0799j0777P513j42M4328O6271J27452O2447O1788Q3846J3074
3496A208337o0399p8533j24941p5694p1249l7459M4458L2642K0331k3050p7161
3485G57282n8856k3770m4080N9277L3578k0541O5101j1702j1287M7149k2388N5731
3473H25494j0294j535L4245o3974n7931K865O897M1032P6293N1971M5994l4174
3461I16883j15561r518j3892k9185J5302k9248L0154K669L2427L2621n1945K8776
$$ plain form
3543 590256 595835 539487 512969 499955 551728 509806 597803 653948 645205 759782 765593 833733
3531 833733 878769 944658 1073633 1172654 1264409 1342154 1309105 1307464 1215465 1049753 898081
3520 898081 857019 755286 737424 729943 696618 728363 690769 630414 598421 613364 685878 718200
3508 718200 721738 752537 741760 749273 749131 793459 859730 987182 1049629 1111417 1195263 1208337
3496 1208337 1147938 1069405 944464 868770 797521 760062 804520 837162 857493 834443 757282
3485 757282 698426 674656 630576 689853 723431 702890 767991 756289 745002 792151 769763 825494
3473 825494 815200 813665 847910 783936 726005 728870 735767 776799 853092 905063 951057 916883
3461 916883 801322 791804 777912 748727 764029 734781 764935 767604 800031 832652 780707 809483
3449H09483j9246j0589P3546O9466N1131R167j2683l5646J3464l7316m3472J8664
3437H85969J7139J8523K4324J1313O9887N685J1029O404L7882J9263l1463k0692
3425A055263k4672K5359j1663K0879K7674j0075r094j6229k8669k1469o225n208
3413I95871l3935P6168P8069M9383N6648P6526N0800P1363M5686K4966J6390J3837
3401A521772p1884K4579K5713K895k3325j3147K2405l0195p855J7396k6985l8493
3389A402876k5142K319O1502Q0688J6129j3508J2136K1370N7831R696Q7244J20316
3377A833457P3353M3145L7946N589N7816Q872L5938N7566K0229J815L5949J6147
3365B227822K8277J7864p6730J5091L7394K3422R22j9294M5640O7671P670K8005
$$ plain form
3449 809483 790237 779648 853194 922660 973791 982958 970275 934629 948093 910777 867305 885969
3437 885969 903108 921631 945955 957268 1027155 1032840 1043869 1050273 1088155 1107418 1075955 1055263
3425 1055263 1030591 1055950 1044287 1065166 1092840 1082765 1073671 1057442 1028773 1007304 1001079 995871
3413 995871 961936 1038104 1116173 1165556 1222204 1298730 1349530 1420893 1466579 1491545 1507935 1521772
3401 1521772 1449888 1474467 1500180 1503075 1479750 1466603 1489008 1458813 1450958 1468354 1441369 1402876
3389 1402876 1377734 1380053 1441555 1522243 1538372 1524864 1537000 1558370 1616201 1625897 1713141 1833457
3377 1833457 1906810 1949955 1987901 1993490 2051306 2060178 2096116 2153682 2173911 2175726 2211675 2227822
3365 2227822 2256099 2273963 2197233 2212324 2249718 2273140 2274062 2254768 2300408 2368079 2375749 2403754
3353B403754P9126R9751J00146O3972O9122J38597J9922L3115P7585N0763J8890
3342C154743N2053K3382J09505J04265J01866Q5384L6141R4744K5498k8127K2579
3331C782033O0955M7763R3652J08167J20726J86418J09700L7411J16468J12106
3321D775399K02051J49903J65350J93793J24722P5193J32772K5583J39681J25834
3311F110281J11048J62427K38696J80240K41441K57832K51810K69085K19675K82151
3301H324686L15135K55285L17385K93544L28599L44900L47907M03637N13823N68514
3291A2013415N21973O31914O36954O97679P41963P48773R28802J144068J259777
3282A9325318J395186J493034J769030K191655K758328L770977M760959N458353
$$ plain form
3353 2403754 2482880 2582631 2682777 2746749 2815871 2954468 2974390 3007505 3085090 3135853 3154743
3342 3154743 3206796 3230178 3339683 3443948 3545814 3631198 3667339 3762083 3787581 3759454 3782033
3331 3782033 3842988 3890751 3984403 4092570 4213296 4399714 4509414 4546825 4663293 4775399
3321 4775399 4977450 5127353 5292703 5486496 5611218 5686411 5819183 5844766 5984447 6110281
3311 6110281 6221329 6383756 6622452 6802692 7044133 7301965 7553775 7822860 8042535 8324686
3301 8324686 8639821 8895106 9212491 9506035 9834634 10179534 10527441 10931078 11444901 12013415
3291 12013415 12535388 13167302 13804256 14501935 15243898 15992671 16921473 18065541 19325318
3282 19325318 20720504 22213538 23982568 26174223 28932551 32703528 37464487 42922840
3274D2922840M634630J436783k459711m305524l898356k913193k049968j507773
3266C1859728r87104n54922j61832J73871M30353O45320R22980J269189J578847
3257C5176430K003059K340868K859064L350480L798068M131304M551408N418616
3249F3629297P084893R621801J3250008J6890028J9017091J4452286j94826j3094437
3241A30656141j7167893j5450709j2294326r745478p469289n492361l949926k878367
3233E6207792k010604j309986o73591N4266O92503J379991K081717K669193L460181
3224F2551462M199789M789356N532430O408085P958000J0503813J3955742J8276795
3216A34175472K1178640J9265757J2200008j736448j5120360k1597736k1574082
$$ plain form
3274 42922840 47557470 48994253 46534542 42229018 38330662 35417469 33367501 31859728
3266 31859728 30872624 30317702 30155870 30329741 30760094 31405414 32328394 33597583 35176430
3257 35176430 37179489 39520357 42379421 45729901 49527969 53659273 58210681 63629297
3249 63629297 70714190 80335991 93585999 110476027 129493118 143945404 143750578 130656141
3241 130656141 113488248 98037539 85743213 75997735 68528446 63036085 59086159 56207792
3233 56207792 54197188 52887202 52213611 52267877 52960380 54340371 56422088 59091281 62551462
3224 62551462 66751251 71540607 77073037 83481122 91439122 101942935 115898677 134175472
3216 134175472 155354112 174619869 186819877 185083429 169963069 148365333 126791251
3209A26791251j8089568j4408500j1230312q655392o582335n167220m097924l198097
3201E5361903k462573j688748r41632l02882L60675Q59040J450604J943972K353071
3192E6933430K922794L600621M636841O354447Q728897J1538042J3960970J2245583
3184A20921625N683037k509907j1778149j5783601j4598509j1821315r283554
3177F0829627p376401n748989m456671l649980l000932k480560k044505j593330
3169C0478259j175904q84066n84309m39756k38413q095M0970K36348M11713P27058
3159B8563805J141347J663963K352144L142836L181328J297343j743145m193966
3151C5405655m539281l738181l082007k422132j930647j535363j225428j065909
$$ plain form
3209 126791251 108701683 94293183 83062871 74407479 67825144 62657924 58560000 55361903
3201 55361903 52899330 51210582 50268950 49966068 50326743 51185783 52636387 54580359 56933430
3192 56933430 59856224 63456845 68093686 74448133 83177030 94715072 108676042 120921625
3184 120921625 126604662 124094755 112316606 96533005 81934496 70113181 60829627
3177 60829627 53453226 47704237 43247566 39597586 36596654 34116094 32071589 30478259
3169 30478259 29302355 28418289 27833980 27394224 27155811 27147716 27188686 27425034 27836747 28563805
3159 28563805 29705152 31369115 33721259 36864095 40045423 41342766 39599621 35405655
3151 35405655 30866374 27128193 24046186 21624054 19693407 18158044 16932616 15866707
3143A5866707r72265q55395p47763o22039m69186l85407k91739k39370k67615
3134A1015928j58987j88441j75078j33181n9033K9941J72317K26915L46571K39215
3124A1316167k01214o13274q37760o99839n90717m67574m16939k94750l05670
3115F888430k91020l03633k94151j95466j90181j31493p0964q8076q2923j01475
3105E139048j67543m4056o6281j06134q4949q5435j09543m7481j62565j27992
3095D137069q9090n6008q4716j12854q3103m6570r1603j09393p4845n9861m2333
3084C286693m6737o7365J9987m0964o5819n8308O762p317M3286J3289N649l638
3072C085518o4754k5104n6143m9284k7160r6774k2906o0303j02545j23397j03423
$$ plain form
3143 15866707 14894442 14039047 13291284 12669245 12200059 11814652 11522913 11283543 11015928
3134 11015928 10856941 10668500 10493422 10360241 10301208 10331149 10503466 10730381 11076952 11316167
3124 11316167 11114953 10501679 9663919 8964080 8373363 7905789 7488850 7194100 6888430
3115 6888430 6597410 6293777 5999626 5804160 5613979 5482486 5411522 5323446 5240523 5139048
3105 5139048 4971505 4927449 4861168 4755034 4670085 4584650 4475107 4427626 4265061 4137069
3095 4137069 4047979 3991971 3907255 3794401 3711298 3664728 3573125 3463732 3388887 3329026 3286693
3084 3286693 3239956 3172591 3192578 3151614 3085795 3027487 3034249 3026932 3070218 3083507 3089156 3085518
3072 3085518 3020764 2995660 2939517 2890233 2863073 2766299 2743393 2683090 2580545 2457148 2353725
3061B353725n9191j9107L1557l947J0137n8099j7774o859J2763J02547K1582N7835
3049B425169P7096p276P3355K8365N3264N8306N2896K9859L1867M1384M7928j9631
3037B892582m9829K9218J0747n5113J855n195J0095N7195M7377J59393J93092
3026C291417K97449L11709L69619M05969K24818j3102k36602k88834k30541j84518
3016C947384j02655o6405M666O0l1840M4000L1967R8358N4370K3877R9296R9937
3004D203015J39887K02547K15466K97024L91695M70139N74046P76349R18487J009315
2994I197970R05866M97533J68979j00093m24929q56808j003410p50266o59889
2985F974953m85506l27318k37285k00460j49273m4909j4006N4995L6103P7403
$$ plain form
3061 2353725 2294534 2275427 2306984 2303037 2313174 2255075 2237301 2230442 2243205 2345752 2367334 2425169
3049 2425169 2502265 2494989 2568344 2596709 2649973 2708279 2761175 2791034 2822901 2864285 2912213 2892582
3037 2892582 2842753 2871971 2882718 2827605 2829460 2824265 2834360 2891555 2938932 3098325 3291417
3026 3291417 3588866 3900575 4270194 4676163 4900981 4887879 4651277 4362443 4131902 3947384
3016 3947384 3844729 3778324 3782990 3783050 3751210 3795210 3827177 3925535 3979905 4003782 4103078 4203015
3004 4203015 4342902 4545449 4760915 5057939 5449634 5919773 6493819 7270168 8188655 9197970
2994 9197970 10103836 10601369 10770348 10670255 10245326 9388518 8385108 7634842 6974953
2985 6974953 6489447 6162129 5924844 5724384 5575111 5530202 5516196 5571191 5607294 5684697
2975E684697K22607K55641L78317L95406M56478N57343O15102Q09655R87039J145788
2965A1508073J179002J043546Q06985K71028m81908j041973j111411j208523j172271
2956I792548r67799q55285n71997m36075l87635k37582k05215j18986m7490R913
2946E974397J08039J54348J99483K44805K77948L01877L58591M32276N40571P96649
2936I388984Q80006R47630P82437L41063Q3159r8707l15111m85928n81132n26638
2926A0415763m25621k93917o7652J08441K98084M71478N76937P06316R90851J260920
2916A4041600J873618K826721L713569M460869L607961j00258l760900m641506
2908B2021674l684590k688797k013221j452019j038590q21859p43716p97667p68487
$$ plain form
2975 5684697 5907304 6162945 6541262 6936668 7393146 7950489 8565591 9375246 10362285 11508073
2965 11508073 12687075 13730621 14537606 14808634 14326726 13284753 12173342 10964819 9792548
2956 9792548 8824749 7969464 7397467 6961392 6573757 6336175 6130960 6011974 5964484 5974397
2946 5974397 6082436 6236784 6436267 6681072 6959020 7260897 7619488 8051764 8592335 9388984
2936 9388984 10268990 11216620 11999057 12340120 12423279 12324572 12009461 11523533 10942401 10415763
2926 10415763 9990142 9696225 9628573 9737014 10035098 10506576 11083513 11789829 12780680 14041600
2916 14041600 15915218 18741939 22455508 26916377 30524338 30424080 26663180 22021674
2908 22021674 18337084 15648287 13635066 12183047 11144457 10322598 9578882 8781215 8012728
2899H012728o42904m89227m78772m03489m55944m14393l40765l73858k43217k66472
2889C903687k11193j08942r2677r1060r5050j30754j92256j30639j51848n8849
2879B640419k6334j28867N91n6286r2847o2021o6562N1479K9107J6343P0599m4071
2867B331550q6604j24435j58423j18601p0667o6568j01105n1575r6142o9272p7446
2856A310712j4688L3387k0797j0120n0567m7211k3390l6858n8631k9878k900n307
2844A043752J3275Q469J0808j518p2534J1155L5213k6774m2198l7240j1894j6236
2832I14278n0374L487o811j5638M1597m7981j7854J7064K8581n0042j1790l2248
2820G72269o0006k5371o2725R337J6753l4302o474k9089K0475J0113m4820O633
$$ plain form
2899 8012728 7369824 6880597 6401825 5998336 5542392 5127999 4787234 4413376 4170159 3903687
2889 3903687 3692494 3583552 3490875 3399815 3304765 3174011 2981755 2851116 2699268 2640419
2879 2640419 2614085 2485218 2485809 2429523 2336676 2274655 2208093 2259572 2288679 2305022 2375621 2331550
2867 2331550 2244946 2120511 1962088 1843487 1772820 1706252 1605147 1553572 1457430 1388158 1310712
2856 1310712 1296024 1329411 1308614 1298494 1247927 1200716 1177326 1140468 1081837 1051959 1049059 1043752
2844 1043752 1057027 1065496 1076304 1074786 1002252 1013407 1048620 1021846 979648 942408 930514 914278
2832 914278 863904 867391 860580 844942 886539 838558 820704 837768 866349 816307 804517 772269
2820 772269 712263 686892 624167 633504 650257 615955 609481 580392 600867 610980 566160 572793
2808E72793m7854j1201m9481p853o063K5513M430l6209m561M4272M2659m3227
2796D83218q9736l611k570l2869M2769K7245O6559R550l3622K5630l3048n3400
2784D06115n3752l0780K0156N7260j9965p014r971l0793K0885M1168j5017L3379
2772D11671m368m7571k7926l5196K9617Q17L4205M6976L3215L604m0815n8216
2760C46013l3225J618j2040P832P2772l9971n1885n9549k0732M7496l108K6565
2748B81786J9267l4661K0505k2110k059J4615j2504l8407L2343K4773m6948j1376
2736B25224o0586j1098J9096K2114N2779K1103q45p226o4364K747j4373K0147
2724B04718K4726k2640o199J867J4932k8912L0442J2420q576R881O665M8486k2906
$$ plain form
2808 572793 524939 513738 464257 456404 450341 475854 480284 444075 439514 483786 526445 483218
2796 483218 393482 389871 387301 354432 397201 424446 491005 500555 466933 492563 459515 406115
2784 406115 352363 321583 341739 398999 379034 372020 362049 331256 352141 393309 378292 411671
2772 411671 407303 359732 331806 296610 326227 327044 361249 408225 441440 445044 404229 346013
2760 346013 312788 314406 302366 310198 382970 342999 291114 231565 210833 258329 255221 281786
2748 281786 301053 266392 286897 264787 262728 277343 264839 226432 258775 283548 236600 225224
2736 225224 164638 153540 172636 194750 247529 268632 267787 260561 196197 198944 184571 204718
2724 204718 229444 206804 200605 202472 217404 188492 218934 231354 222778 232659 239324 287810 264904
2711B64904n1209n8269n1958j8056M4984L4965K4234N1884j1960q837K4623m5392
2699A99913l801M1444l5123N5452l3634k3588J0889k5634O4764m117k2127K0681
2687B45119J0529L34m7414n1918M544Q3399J1472J0740L1628k5566N675j3060
2675B65482k6646k240m5778J9709l832O189M4717M242K9553J0384R051l7465j3836
2662B59530K810J3068K3505k4762j2509L4266l5253k2184l4854O4604M9106k0047
2650B97280K112m0346Q259l2118j7327L9359K9639L2435n1840M284o513l4126
2638B31098k1860m6783K8355M777K0276Q941J3974O3858l8141j802J9648l2147
2626B50194J0486N907J0600j2646N2312N736j2486L8925j6182K0566M092l3195
$$ plain form
2711 264904 213695 155426 103468 85412 130396 165361 189595 241479 229519 220682 245305 199913
2699 199913 196112 237556 202433 257885 224251 200663 211552 185918 250682 246565 224438 245119
2687 245119 255648 255982 208568 156650 161194 244593 256065 266805 298433 272867 278542 265482
2675 265482 238836 236596 190818 210527 206695 212884 257601 261843 291396 301780 310831 273366 259530
2662 259530 262340 275408 298913 274151 261642 295908 260655 238471 203617 268221 317327 297280
2650 297280 299392 259046 267305 235187 217860 257219 286858 319293 267453 271737 265224 231098
2638 231098 209238 162455 190810 195587 215863 224804 238778 302636 264495 262693 282341 250194
2626 250194 260680 266587 277187 264541 316853 322589 310103 349028 332846 353412 357504 324309
2614C24309K3949m4538m150J1882k2029M3406k4838M1501K3151J6252m4877P608
2602C51626J9341o946O324o6064k4865l260N344M3829L6773M5043J4484r5186
2590C26443l0994p4701J8788O0998L8194J6408P5129k2437o5386l1346k9616k4747
2578B56733L1107K174O4552O1941K3655P711o3840J2129K8914j508K6074L4588
2566D84230k5357k8313j2659k0876K8725L9982L54O3786M625L2980l9645o5792
2554D62040M1653j7088K6778J09274K7431P3333L2986m2379m9790k3306o9437
2543E71495M6512Q4158Q205O2269M3731P2892J03744m3353N1677J1687k3243J05108
2531A094882N3669j9125L3744l2553k6235J7069k8607Q5431R5702N2382P6885
$$ plain form
2614 324309 348258 303720 299570 311452 289423 332829 307991 349492 372643 388895 344018 351626
2602 351626 370967 364021 370345 304281 279416 276156 281500 325329 362102 407145 421629 326443
2590 326443 295449 220748 239536 300534 338728 355136 430265 407828 342442 311096 281480 256733
2578 256733 287840 290014 354566 416507 440162 447873 384033 396162 425076 423568 449642 484230
2566 484230 458873 430560 417901 397025 425750 465732 466086 529872 534497 567477 527832 462040
2554 462040 503693 486605 513383 622657 650088 723421 756407 714028 664238 640932 571495
2543 571495 618007 702165 710370 772639 816370 889262 993006 949653 1001330 1013017 989774 1094882
2531 1094882 1148551 1129426 1163170 1130617 1104382 1121451 1092844 1178275 1273977 1326359 1403244
2520A403244O3080L6871O6412n6559N5037Q7844N2580J16034K8366n7177K6498
2509A822230p2045k1246R4092j2848K1411J7005n3278j4940o1612r0958j9117
2498A608694k9313n008L4621q6507q165j5540r5885k6129p2849m7082R374n1870
2486A214341n5811k292p8727p2345j3536j3717L3804L9495j639P6858k0036m5326
2474A061069k2171p4484j9186l276k2882M5207J1211l9937J4815J0633J5092J03533
2462A079624k144k5602K3657n3697L1039n4271k509P7762m3078j1845p0028q4823
2450H64085n8971m7502k4009K0347N3026n3237R352m8617J243M7175k5554M3824
2438G81162J7831k4724N0214j4305k9608L2816l7116L315M113j7139j0177J2658
$$ plain form
2520 1403244 1466324 1503195 1569607 1513048 1568085 1655929 1708509 1824543 1852909 1795732 1822230
2509 1822230 1750185 1728939 1823031 1810183 1831594 1848599 1795321 1780381 1718769 1627811 1608694
2498 1608694 1579381 1574373 1608994 1522487 1514322 1498782 1402897 1376768 1303919 1256837 1266211 1214341
2486 1214341 1158530 1156238 1077511 1005166 991630 977913 1011717 1051212 1049573 1126431 1106395 1061069
2474 1061069 1038898 964414 945228 941952 919070 964277 975488 935551 950366 960999 976091 1079624
2462 1079624 1077480 1051878 1075535 1021838 1052877 998606 996097 1073859 1030781 1018936 948908 864085
2450 864085 805114 757612 733603 753950 806976 753739 763091 714474 715717 762892 737338 781162
2438 781162 798993 774269 824483 810178 780570 813386 776270 779585 783698 766559 756382 769040
2426G69040m1120J1833L7538J0708L0528J8906K654M4603o9555m0252m7607j19457
2414F07819M2640j7767k5858M9655J3173j1749M0162O89P700j552r14K0498n2142
2401F72354j0591k598l433J8338L8389l8370M8264J4663k2838K5294R727q607
2389G40592J888j9622m2394K9788n8615l2159N6913N1629O2311K726r190K6977
2377H10844l5706J6200O11k9264L064m453k3421j1670N2932N0100N3181K5633
2365I08051k9427J3567p33O550P179L4116O5786P654N1048K6108J6556m1269J0481
2352A075667M462j9242Q6476Q4541N6779N270K8144p425L7884N2294K3761Q429
2340A437040O6509K1474K1534K8845M7656N1832Q6248Q1212J31148J12722Q6148
$$ plain form
2426 769040 727920 739753 777291 787999 818527 837433 840087 884690 815135 774883 727276 607819
2414 607819 650459 632692 606834 656489 669662 657913 698075 698764 706464 704912 703998 724496 672354
2401 672354 661763 659165 655732 674070 712459 674089 722353 737016 714178 739472 749199 740592
2389 740592 742480 722858 680464 710252 651637 619478 676391 728020 790331 793057 783867 810844
2377 810844 775138 791338 791949 762685 765749 761296 737875 726205 779137 829237 882418 908051
2365 908051 878624 892191 891458 898008 905187 939303 1005089 1012743 1063791 1089899 1106455 1065186 1075667
2352 1075667 1080129 1060887 1147363 1231904 1288683 1293953 1322097 1314672 1352556 1404850 1428611 1437040
2340 1437040 1503549 1525023 1546557 1575402 1623058 1674890 1761138 1842350 1973498 2086220 2172368
2329B172368Q3740R7090J23587K36115K50258K65852K90735K88274L62361M65322
2319D635702O68530Q97594R70293P45976j75450r47693r98366p70712n35371m70842
2309D019661l90570l19607k01968k07172j62160n8046r6053m4918m418m8938p289
2298B478522j6548M3174K3337K7222Q778n099O2113J6468j8930K4574J4839O3827
2286B722277j6557P7756L2579O3565P5923J4536R262L9867Q1750P3876J16073
2275C290907J22458L2908L6902M1211N8862M6034Q6554R0910N4836J30548J18336
2264D110466J11210R4683Q2578O9050J40563Q6328N8317J33881J70727J37981
2254E195784J52102K16611K94053K36701J55248K04337J29028J60977J86929J90185
$$ plain form
2329 2172368 2256108 2353198 2476785 2712900 2963158 3229010 3519745 3808019 4170380 4635702
2319 4635702 5304232 6201826 7172119 7918095 7742645 6794952 5796586 5025874 4490503 4019661
2309 4019661 3629091 3309484 3107516 2900344 2738184 2680138 2584085 2539167 2534749 2485811 2478522
2298 2478522 2461974 2505148 2528485 2555707 2564485 2559386 2621499 2637967 2619037 2643611 2658450 2722277
2286 2722277 2705720 2783476 2816055 2879620 2955543 2970079 2979341 3019208 3100958 3174834 3290907
2275 3290907 3413365 3446273 3483175 3524386 3583248 3629282 3715836 3806746 3861582 3992130 4110466
2264 4110466 4221676 4316359 4398937 4467987 4608550 4694878 4753195 4887076 5057803 5195784
2254 5195784 5347886 5564497 5858550 6095251 6250499 6454836 6583864 6744841 6931770 7121955
2244G121955K38073K19435J92574J93859J89188J81996J22394J55582J06664J20354
2234H842074J31255Q9477J13972J61591K20391K18418K58641L02089K51169L34294
2224A0923371L38044L06277L45482L94104M83138M98712N49803N12815M96746
2215A4848492M92003M16092M01694M12740M58073N59928M35013N24172M94367
2206A9042574M94098N11392M77808N17328N08681N42527N07079O24585P16023
2197B3942095P18751P89029Q19543R55200J149533J391920J617064J911241K182334
2188C5476710J927945Q19447q6165r8403J39988L98145O39531P92386R52585J118401
2178D2080570J243418J440804J782689K093018K442814K808080L007215L218020
$$ plain form
2244 7121955 7360028 7579463 7772037 7965896 8155084 8337080 8459474 8615056 8721720 8842074
2234 8842074 8973329 9062806 9176778 9338369 9558760 9777178 10035819 10337908 10589077 10923371
2224 10923371 11261415 11567692 11913174 12307278 12790416 13289128 13838931 14351746 14848492
2215 14848492 15340495 15756587 16158281 16571021 17029094 17589022 18024035 18548207 19042574
2206 19042574 19536672 20048064 20525872 21043200 21551881 22094408 22601487 23226072 23942095
2197 23942095 24660846 25449875 26269418 27224618 28374151 29766071 31383135 33294376 35476710
2188 35476710 37404655 38224102 38137937 38039534 38179522 38577667 39217198 40009584 40962169 42080570
2178 42080570 43323988 44764792 46547481 48640499 51083313 53891393 56898608 60116628
2170F0116628L324178L205888L063501K892152K725882K222368J533328O99113
2162G9783038k64785r69938j454288j897366j948446j534183q19052j60344K46494
2153G0981130j169510l511257m213896l932026l561402l378738l168398k921441
2145D5124462k601608k426851k329120k184963j982706j757693j653712j516498
2137B8671311j401175j343092j269570j207598j128373r93914q21231p18300n67892
2128A9220166m62961m39462m11166l60654k36493m3916J71222M97245N72748K78734
2118A8785463p80034j510973j451764j173593r69991q13458o85724o27535n20102
2109A0252289m11672l36669l32819l54196l08979l26889k47014j91558k78424
$$ plain form
2170 60116628 63440806 66646694 69710195 72602347 75328229 77550597 79083925 79783038
2162 79783038 79518253 78548315 77094027 75196661 73248215 71714032 70894980 70734636 70981130
2153 70981130 69811620 66300363 62086467 58154441 54593039 51214301 48045903 45124462
2145 45124462 42522854 40096003 37766883 35581920 33599214 31841521 30187809 28671311
2137 28671311 27270136 25927044 24657474 23449876 22321503 21327589 20506358 19788058 19220166
2128 19220166 18757205 18317743 17906577 17545923 17309430 17265514 17436736 17933981 18506729 18785463
2118 18785463 18005429 16494456 15042692 13869099 12899108 12085650 11399926 10772391 10252289
2109 10252289 9840617 9503948 9171129 8816933 8507954 8181065 7934051 7742493 7464069
2100G464069k39044k19244j99150k58924j99573k34887j37914r3821j25641j21717
2090E634154j45729j39946j64238j95531j29983j35022j40781j11894q3827j30070
2080D257133o6565n5770j25101j02352j74428j30011j06718p4976k5800n0281
2070C345131k9880n3538q5410m0327r3912j03744j03418j02692j50644m6404m3096
2059B492066q4544J9902K0578l0483k7236n3346l0380r7372n9059l9621n0902
2048B059603P21l1582m9621n5995q391o8543K4881J1917n6336l9580o7013n6208
2036A663853k1002l4218K4829l0912J3185j0471j3298l3733J4433l1208o5201
2025A476257K8955K1739K7943r102o2747o3973j3906n1560k427P776L9209k8702
$$ plain form
2100 7464069 7225025 7005781 6806631 6547707 6348134 6113247 5975333 5881512 5755871 5634154
2090 5634154 5488425 5348479 5184241 4988710 4858727 4723705 4582924 4471030 4387203 4257133
2080 4257133 4190568 4134798 4009697 3907345 3732917 3602906 3496188 3421212 3395412 3345131
2070 3345131 3315251 3261713 3176303 3135976 3042064 2938320 2834902 2732210 2581566 2535162 2492066
2059 2492066 2407522 2427424 2448002 2417519 2390283 2336937 2306557 2209185 2150126 2110505 2059603
2048 2059603 2060324 2028742 1979121 1923126 1914735 1846192 1871073 1882990 1826654 1787074 1720061 1663853
2036 1663853 1642851 1608633 1633462 1602550 1615735 1605264 1591966 1558233 1572666 1541458 1476257
2025 1476257 1505212 1526951 1554894 1545792 1483045 1419072 1405166 1353606 1351179 1358955 1398164 1369462
2013A369462l7347j6428J6743j4596L535l3216m6306j5122m132j3431K6932l6145
2001A199949m3549L4732J0366L7550J4220l3520j5783l0882N4629O3786o0293
1990A231205n7210o4996q953r006P3962M8804N0912k369m9975j9915o6026l5990
1978A090443j4756k7115M6926n921J9467N1415j939j1260m0902J263K7883P658
1966A143162l1344m5621l3695o5576M4733R0942Q1935O0136j3894k171l2523L0805
1954A226889J4737l5186j0487O8611Q040j6297J7237R321O62M018k3586P6297
1942A340256R0578K2616J1578m6854L9134L7256J0137L3852j2550k0958L8441
1931A543486K8697M581J16050Q7032L7102N4692J4885L2662l2618j495K3838M4310
$$ plain form
2013 1369462 1332115 1315687 1332430 1317834 1321369 1288153 1241847 1226725 1222593 1209162 1236094 1199949
2001 1199949 1156400 1191132 1201498 1239048 1253268 1219748 1203965 1173083 1227712 1291498 1231205
1990 1231205 1173995 1108999 1100046 1091040 1165002 1213806 1264718 1262349 1212374 1192459 1126433 1090443
1978 1090443 1075687 1048572 1095498 1089577 1109044 1160459 1158520 1147260 1106358 1107621 1135504 1143162
1966 1143162 1111818 1066197 1032502 966926 1011659 1102601 1184536 1244672 1230778 1228607 1196084 1226889
1954 1226889 1241626 1206440 1195953 1264564 1272604 1256307 1273544 1282865 1283527 1287545 1263959 1340256
1942 1340256 1430834 1453450 1465028 1418174 1457308 1494564 1504701 1538553 1526003 1505045 1543486
1931 1543486 1572183 1576764 1692814 1779846 1816948 1871640 1886525 1919187 1886569 1885074 1908912 1953222
1919A953222R4691M8525O6684L3419L1128N4393M2199J02942M4073Q3064Q9547
1908B643887N3477Q0841M3517P1061J22292J02273R0765J18082J28049J37198
1898C591442P9086J13120J32773J42717J95577J72205J21594J68986J82911J35390
1888E035801J10639N7461j8574m7259k9973m5544j5623M7636L1589o90O5092J04630
1876E295185P5846Q5597J57969J23038Q8527J36985J60973J82605K20186J06617
1866F633528J44147J42136K07614K46545K61979L27027L10331K99213K78175L36736
1856I187431L37454L01161L00499K97550K96007K50406J44590J05592O3140J43948
1846A1427778J22015J75830K63450K66995K97306K46072K86891L48533M42785
$$ plain form
1919 1953222 2047913 2096438 2163122 2196541 2227669 2282062 2324261 2427203 2471276 2554340 2643887
1908 2643887 2697364 2778205 2821722 2892783 3015075 3117348 3208113 3326195 3454244 3591442
1898 3591442 3670528 3783648 3916421 4059138 4254715 4426920 4548514 4717500 4900411 5035801
1888 5035801 5146440 5203901 5185327 5138068 5108095 5062551 5046928 5094564 5126153 5125463 5190555 5295185
1876 5295185 5371031 5456628 5614597 5737635 5826162 5963147 6124120 6306725 6526911 6633528
1866 6633528 6777675 6919811 7127425 7373970 7635949 7962976 8273307 8572520 8850695 9187431
1856 9187431 9524885 9826046 10126545 10424095 10720102 10970508 11115098 11220690 11283830 11427778
1846 11427778 11549793 11725623 11989073 12256068 12553374 12799446 13086337 13434870 13877655
1837A3877655M72276N23315P25961P37910Q82500R82000J069853J185928J169298
1828B1626696J159990J172467J271864J269575J055928R30005N60170K18770L2679
1819B9298144j3180Q7401J18076J63825J17194J44578J12720P6204O3324L7235
1809C0205521L1989J12769K40144L90423M69901O06752O71129P15762Q58587J042456
1799C5345433J408885J829836K401215L145736L926105M419606M051127J423463
1791E7951406k345869m287594m549636m129214l679947l301111k831314k282904
1783C0543817j841676j460308j130687r38139q43437p95977o61229o31479m39058
1774B1801827k86951k33368q3959J2379P2845O7788J38507K19765K90586M20370
$$ plain form
1837 13877655 14349931 14873246 15599207 16337117 17219617 18201617 19271470 20457398 21626696
1828 21626696 22786686 23959153 25231017 26500592 27556520 28486525 29046695 29265465 29298144
1819 29298144 29284964 29372365 29490441 29654266 29771460 29916038 30028758 30104962 30168286 30205521
1809 30205521 30237510 30350279 30590423 30980846 31450747 32057499 32728628 33444390 34302977 35345433
1799 35345433 36754318 38584154 40985369 44131105 48057210 52476816 56527943 57951406
1791 57951406 55605537 51317943 46768307 42639093 38959146 35658035 32826721 30543817
1783 30543817 28702141 27241833 26111146 25173007 24329570 23533593 22872364 22240885 21801827
1774 21801827 21514876 21281508 21197549 21209928 21282773 21350561 21489068 21708833 21999419 22419789
1764B2419789M46105M87953M83817L41441r951m65593q91441j178782j355809
1755B0277529j387799j362801j251114j156724j075017r84413q22138o51396o69722
1746A0916405n21606n10170m66834m57633m72849m20161l98513l13632l11801
1737G043206l37647l00518k46890k31889k61320j67530j89579j72950k02070k51410
1727D681403j48719j81326j37074j29343j27037q0126j63102j35172r0902j16536
1717C372066j00521p8325p6977p9238m8071j27105o2359n1586j49327j10846r8978
1706B388733n2843k5547o2800k6876j8576l6173m0140o7030j06189p0062r0094
1695A792403j34382k2041n8633L188J0908l8127k4825l7713n7833p6246j2723
$$ plain form
1764 22419789 22865894 23353847 23837664 24179105 24169154 23703561 22812120 21633338 20277529
1755 20277529 18889730 17526929 16275815 15119091 14044074 13059661 12237523 11586127 10916405
1746 10916405 10394799 9884629 9417795 8960162 8487313 8067152 7668639 7355007 7043206
1737 7043206 6705559 6405041 6158151 5926262 5664942 5497412 5307833 5134883 4932813 4681403
1727 4681403 4532684 4351358 4214284 4084941 3957904 3877778 3714676 3579504 3488602 3372066
1717 3372066 3271545 3193220 3116243 3037005 2988934 2861829 2799470 2747884 2598557 2487711 2388733
1706 2388733 2335890 2310343 2247543 2220667 2202091 2165918 2125778 2058748 1952559 1882497 1792403
1695 1792403 1658021 1635980 1577347 1580535 1591443 1553316 1528491 1490778 1432945 1356699 1343976
1684A343976K338j1240l5873n8417J5954p4545k3445K6609o4401N9715k1911p7554
1672A081206l2909k2053r8281j5394K0967N3016P9019j9129J1857m1887j34030
1661H82382n9894n5767M5432L2098k3195k2447K3400l7324n3691n1636l8877J8389
1649F58870k9420k0646K7223J1487L4932J2321q4893J3254k7947n1074o8757q167
1637D67183l823L9931n1774j4687M9390l3819J158J3589L4856M4609O92l2587
1625E14718j528j1548j359m2464n2897P861K4992L1011O5394L671p3270l9257
1613D25324r4337L108K6407K730L8472P8259J6983m5016o7351q2495N2312q981
1601C45415P8058O3151m0476O808q5523q9638K338L4476L2927M1368L6313Q702
$$ plain form
1684 1343976 1346314 1335074 1299201 1240784 1256738 1182193 1158748 1185357 1120956 1180671 1158760 1081206
1672 1081206 1048297 1026244 927963 912569 933536 986552 1065571 1046442 1058299 1016412 882382
1661 882382 822488 766721 812153 844251 821056 798609 822009 784685 730994 679358 640481 658870
1649 658870 629450 608804 636027 647514 682446 694767 609874 623128 595181 544107 475350 467183
1637 467183 463360 503291 451517 436830 486220 452401 453559 467148 502004 546613 547305 514718
1625 514718 513190 501642 500283 457819 404922 412783 437775 468786 534180 537851 464581 425324
1613 425324 330987 334095 360502 363232 401704 479963 496946 451930 384579 302084 354396 345415
1601 345415 423473 486624 446148 452956 367433 277795 280133 314609 347536 388904 425217 433919
1589D33919P420o3079k9913L4036L943M9163m1597J1755J9397o8131r424J0040
1577C57529l3288J7162J0095k1091P3387M2505K7527J1211m6581L3731l0971m2738
1565C98478L7216j6675j2277M8085L59J2630P121l3807q855K4045j0599p248J2696
1552D51169k0374P0159J4469L7136J8855j794l1990K493n768Q58M873p6994k101
1539D60991N635j0562J26805M9663N796O9655j6775l4055m1177j9518K7041O1016
1527F84515O8018N2287K8626l9463k2313j0051P3878N1304K9195K4296J8570k8533
1515I30329j251L0345K4370R1204L73J4340M928j1423k1428k6339K2746N8894
1503A117088k7579K7145O9159J796j6165q318L9951L5464Q8073K4114O6383O2055
$$ plain form
1589 433919 441339 378260 348347 382383 386326 435489 393892 405647 425044 356913 347489 357529
1577 357529 324241 341403 351498 330407 403794 446299 473826 485037 438456 472187 441216 398478
1565 398478 435694 419019 406742 454827 455186 467816 474937 441130 432275 456320 445721 438473 451169
1552 451169 430795 500954 515423 552559 571414 569620 537630 540123 534355 535213 540086 463092 460991
1539 460991 466626 456064 582869 632532 638328 707983 691208 657153 615976 596458 623499 684515
1527 684515 752533 804820 833446 793983 771670 761619 835497 886801 915996 940292 958862 930329
1515 930329 929078 959423 983793 1074997 1075370 1089710 1094638 1083215 1061787 1035448 1058194 1117088
1503 1117088 1089509 1116654 1185813 1187609 1171444 1163126 1203077 1238541 1326614 1350728 1417111 1479166
1491A479166P0691L3137m7665R309j5201O019M134J127n799m377o4918r1808R588
1478A383403N0389K4192N4436J2895J670m3067l8094J4875K158k3889K6747O9285
1466A535000J9070j6327k6997m684J8134l3663M0438N9214Q7939O4824K07M3085
1454A786240P9247M4520k5285j6821q1756q045j6009m4811k9244l9061l9958j09560
1442A499457n5421k5549J8454N0892o8687o0720p6314m3412j536j2129P5564K153
1430A302752p735o7325m9507L2730m1270p2277q6393M2078P0867L7061M5460N758
1418A212199J345j2534K6131k3299L9860N7979n5790j9013l8107o8224m7635n7624
1406A015288l9566q5574k8864j1818k6435q0084p2387l353k6832M0524N8252m891
$$ plain form
1491 1479166 1549857 1582994 1535329 1544638 1529437 1535456 1539590 1540717 1534918 1530541 1465623 1373815 1383403
1478 1383403 1433792 1457984 1512420 1525315 1526985 1483918 1445824 1460699 1462857 1438968 1465715 1535000
1466 1535000 1554070 1537743 1510746 1506062 1524196 1490533 1530971 1590185 1678124 1742948 1743155 1786240
1454 1786240 1865487 1910007 1884722 1867901 1786145 1778100 1762091 1717280 1688036 1648975 1609017 1499457
1442 1499457 1444036 1418487 1436941 1487833 1419146 1358426 1282112 1238700 1237164 1225035 1300599 1302752
1430 1302752 1295017 1227692 1178185 1210915 1169645 1097368 1010975 1053053 1123920 1160981 1206441 1212199
1418 1212199 1213544 1201010 1227141 1203842 1243702 1301681 1245891 1226878 1188771 1120547 1072912 1015288
1406 1015288 975722 890148 861284 849466 823031 742947 670560 667207 640375 680899 739151 734260
1394G34260n924p4998m9650m9710j3263L9504Q186r980o3652k7403m3619k299
1382D41452K923K968L6565J3696k862l9057k3176J582j3077J0595m3021O089m6826
1369C47851m7136m2117j1350l9469m4090L7951L2779O7261n024p5842l6626j9306
1357A64882k0240k5297N063M9194L0468j867k4914l0718o3024k8771K5608K2153
1345A02537O3162n618k1838m6916k6576m6861l52K1439L0632O7261K2550m172
1333A55248p8079l6035k5760j5730L7174L3751l4677P080m886K9717j5765k6611
1321B5427Q45j4082r347K558L4764M0843O4844p5355o5519J8337l7961k4231j482
1308d0359M3518K9109K0765l3724n5214K4724p873L4275L7707J2855K8746k2853
$$ plain form
1394 734260 728336 653338 603688 553978 540715 580219 588405 578425 514773 487370 443751 441452
1382 441452 444375 447343 483908 497604 494742 455685 432509 434091 421014 431609 388588 394677 347851
1369 347851 300715 258598 247248 207779 163689 201640 234419 301680 296656 220814 184188 164882
1357 164882 144642 119345 124408 173602 204070 202203 177289 146571 83547 54776 80384 102537
1345 102537 165699 160081 138243 91327 64751 17890 17538 38977 69609 136870 159420 155248
1333 155248 77169 41134 15374 -356 36818 70569 35892 42972 38086 67803 52038 25427
1321 25427 26272 12190 2843 5401 40165 81008 145852 70497 4978 23315 -14646 -38877 -40359
1308 -40359 3159 32268 53033 19309 -35905 -11181 -19054 15221 52928 65783 94529 71676
1296G1676j4494j1626n7180n2904j2294j1475L4904M9510J045p725j6401k9527
1284e6491j1618k7386L9930O728J6325K8718R238Q479m0701m4104k2363O2940
1272c0305k777K7359j3118l0955O038j9582K7028N3420N445k9417k2851M1210
1260A1495K034J2511L5420K2922R552r6035n8449j5920N4228L6893Q627P204j1383
$$ plain form
1296 71676 57182 45556 -11624 -64528 -76822 -88297 -53393 -3883 -2838 -10563 -26964 -56491
1284 -56491 -68109 -95495 -55565 -48837 -32512 -3794 5444 13923 -26778 -70882 -93245 -30305
1272 -30305 -33082 -5723 -18841 -49796 -43758 -63340 -36312 17108 22553 -6864 -29715 11495
1260 11495 13529 26040 61460 84382 93934 -2101 -60550 -76470 -22242 14651 23278 30482 19099
$$ [...]
##END NTUPLES=NMR SPECTRUM
##END=
