##TITLE=1H_EC-3239(2)
 CDCl3, 8 sc, 
 21.12.2020
##JCAMPDX= 6.0         $$ Bruker NMR JCAMP-DX V2.0
##DATA TYPE= NMR SPECTRUM
##DATA CLASS= NTUPLES
##ORIGIN= UXNMR, Bruker Analytische Messtechnik GmbH
##OWNER= root
$$ XWIN-NMR		Version 3.5
$$ Mon Dec 21 10:18:17 2020 Russian Standard Time (UT+4h)  she@DPX200
##.OBSERVE FREQUENCY= 200.1315066352
##.OBSERVE NUCLEUS= ^1H
##.ACQUISITION MODE= SIMULTANEOUS
##.ACQUISITION SCHEME= undefined
##.AVERAGES= 8
##.DIGITISER RES= 18
##SPECTROMETER/DATA SYSTEM= spect
##.PULSE SEQUENCE= zg30
##.SOLVENT NAME= CDCl3
##.SHIFT REFERENCE= (INTERNAL, CDCl3, 0, 16.0238)
##AUDIT TRAIL= $$ (NUMBER, WHEN, WHO, WHERE, WHAT)
$$ ##TITLE= Audit trail, XWIN-NMR		Version 3.5
$$ ##JCAMPDX= 5.01
$$ ##ORIGIN= Bruker BioSpin GmbH
$$ ##OWNER= she
$$ F:/spectra/data/she/nmr/H-F/1/pdata/1/auditp.txt
$$ ##AUDIT TRAIL=  $$ (NUMBER, WHEN, WHO, WHERE, WHAT)
(   1,<2020-12-21 10:15:54.71 +0400>,<she>,<DPX200>,
      <created by zg, POWCHK disabled, PULCHK disabled
       configuration hash MD5:
       00 E9 B6 7A A2 85 ED C7 34 08 36 98 17 FE 4E 26
       data hash MD5: 16K
       22 BA 86 D0 9D 9D AC E2 6A B6 A4 70 6A 02 9A 40>)
(   2,<2020-12-21 10:15:59.28 +0400>,<she>,<DPX200>,
      <Start of raw data processing
       efp BC_mod = 2 LB = 0.24 FT_mod = 6 PKNL = 1 PHC0 = -10760.51 PHC1 = 10.40095 SI = 16K 
       data hash MD5: 16K
       49 7C 97 23 7C 01 59 8B 06 28 F7 46 8A 91 F2 74>)
(   3,<2020-12-21 10:16:24.79 +0400>,<she>,<DPX200>,
      <pk PHC0 = -159.1284 PHC1 = 3.600001 
       data hash MD5: 16K
       CE 33 37 AA 06 20 FB C2 2C 29 83 6F BA 1D C1 DB>)
(   4,<2020-12-21 10:16:28.39 +0400>,<she>,<DPX200>,
      <abs ABSG = 5 
       data hash MD5: 16K
       DC 6D 33 30 47 EB BD D9 54 A1 1D 9E CC 1C 1C D7>)
$$ ##END=
$$ 
$$ hash MD5
$$ C4 75 27 6E 90 3D FF 74 45 6A B3 14 4F 12 FE 45
##$RELAX= 
##$RELAX= 
##$RELAX= 
##$RELAX= 
##$RELAX= 
##$RELAX= 
$$ Bruker specific parameters
$$ --------------------------
##$DU= <F:/spectra>
##$EXPNO= 1
##$NAME= <H-F>
##$PROCNO= 1
##$TYPE= <nmr>
##$USER= <she>
##$AMP= (0..31)
100 100 100 100 100 100 100 100 100 100 100 100 100 100 100 100 100 100 
100 100 100 100 100 100 100 100 100 100 100 100 100 100 
##$AQSEQ= 0
##$AQ_mod= 1
##$AUNM= <au_zg>
##$AUTOPOS= <>
##$BF1= 200.13
##$BF2= 200.13
##$BF3= 200.13
##$BF4= 200.13
##$BF5= 200.13
##$BF6= 200.13
##$BF7= 200.13
##$BF8= 200.13
##$BYTORDA= 1
##$CFDGTYP= 0
##$CFRGTYP= 5
##$CHEMSTR= <none>
##$CNST= (0..31)
1 1 145 1 1 1 1 1 1 1 1 1 1 1 1 1 1 1 1 1 1 1 1 1 1 1 1 1 1 1 1 1 
##$CPDPRG= <>
##$CPDPRG1= <>
##$CPDPRG2= <>
##$CPDPRG3= <>
##$CPDPRG4= <mlev>
##$CPDPRG5= <mlev>
##$CPDPRG6= <mlev>
##$CPDPRG7= <mlev>
##$CPDPRG8= <mlev>
##$CPDPRGB= <>
##$CPDPRGT= <>
##$D= (0..31)
0 1.2 0 0 0 0 0 0 0 0.06 0 0.03 0 0 0 0 0.0002 0 0 0 0 0 0 0 0 0 0 0 0 
0 0 0 
##$DATE= 1608531354
##$DBL= (0..7)
120 120 120 120 120 120 120 120 
##$DBP= (0..7)
150 150 150 150 150 150 150 150 
##$DBP07= 0
##$DBPNAM0= <>
##$DBPNAM1= <>
##$DBPNAM2= <>
##$DBPNAM3= <>
##$DBPNAM4= <>
$$ [...]
##$SUBNAM3= <"">
##$SUBNAM4= <"">
##$SUBNAM5= <"">
##$SUBNAM6= <"">
##$SUBNAM7= <"">
##$SUBNAM8= <"">
##$SUBNAM9= <"">
##$SW= 16.9725356469052
##$SWIBOX= (0..15)
0 0 2 0 0 0 0 0 0 0 0 0 0 0 0 0 
##$SW_h= 3396.73913043478
##$TD= 16384
##$TD0= 1
##$TE= 0
##$TE2= 300
##$TE3= 300
##$TEG= 300
##$TL= (0..7)
0 120 120 120 120 120 120 120 
##$TP= (0..7)
150 150 150 150 150 150 150 150 
##$TP07= 0
##$TPNAME0= <>
##$TPNAME1= <>
##$TPNAME2= <>
##$TPNAME3= <>
##$TPNAME4= <>
##$TPNAME5= <>
##$TPNAME6= <>
##$TPNAME7= <>
##$TPOAL= (0..7)
0.5 0.5 0.5 0.5 0.5 0.5 0.5 0.5 
##$TPOFFS= (0..7)
0 0 0 0 0 0 0 0 
##$TUNHIN= 0
##$TUNHOUT= 0
##$TUNXOUT= 0
##$USERA1= <user>
##$USERA2= <user>
##$USERA3= <user>
##$USERA4= <user>
##$USERA5= <user>
##$V9= 5
##$VALIST= <valist>
##$VCLIST= <CCCCCCCCCCCCCCC>
##$VD= 0
##$VDLIST= <DDDDDDDDDDDDDDD>
##$VPLIST= <PPPPPPPPPPPPPPP>
##$VTLIST= <TTTTTTTTTTTTTTT>
##$WBST= 1024
##$WBSW= 4
##$XGAIN= (0..3)
0 0 0 0 
##$XL= 0
##$YL= 0
##$YMAX_a= 277544
##$YMIN_a= -305559
##$ZGOPTNS= <>
##$ZL1= 120
##$ZL2= 120
##$ZL3= 120
##$ZL4= 120
##$ABSF1= 16.02375
##$ABSF2= -0.9489136
##$ABSG= 5
##$ABSL= 3
##$ALPHA= 0
##$AQORDER= 0
##$ASSFAC= 0
##$ASSFACI= 0
##$ASSFACX= 0
##$ASSWID= 0
##$AUNMP= <proc_1d>
##$AZFE= 0.1
##$AZFW= 0.1
##$BCFW= 0
##$BC_mod= 2
##$BYTORDP= 0
##$COROFFS= 0
##$CY= -3
##$DATMOD= 1
##$DC= 0
##$DFILT= <>
##$DTYPP= 0
##$F1P= 0
##$F2P= 0
##$FCOR= 1
##$FTSIZE= 16384
##$FT_mod= 6
##$GAMMA= 0
##$GB= 0
##$INTBC= 1
##$INTSCL= 2.992141e-10
##$ISEN= 128
##$LB= 0.24
##$LEV0= 0
##$LPBIN= 0
##$MAXI= 10000
##$MC2= 0
##$MEAN= 0
##$ME_mod= 0
##$MI= 1.114404
##$NCOEF= 0
##$NC_proc= -7
##$NLEV= 6
##$NOISF1= 3.799351
##$NOISF2= 2.8
##$NSP= 0
##$NTH_PI= 0
##$NZP= 0
##$OFFSET= 16.02375
##$PC= 1
##$PHC0= -10919.64
##$PHC1= 14.00095
##$PH_mod= 1
##$PKNL= yes
##$PPARMOD= 0
##$PSCAL= 0
##$PSIGN= 0
##$REVERSE= no
##$SF= 200.129998172154
##$SI= 16384
##$SIGF1= 3
##$SIGF2= 2
##$SINO= 5.538805
##$SIOLD= 16384
##$SREGLST= <1H.CDCl3>
##$SSB= 0
##$STSI= 16384
##$STSR= 0
##$SW_p= 3396.73913043478
##$SYMM= 0
##$S_DEV= 0
##$TDeff= 16384
##$TDoff= 0
##$TI= <>
##$TILT= no
##$TM1= 0
##$TM2= 0
##$TOPLEV= 0
##$USERP1= <user>
##$USERP2= <user>
##$USERP3= <user>
##$USERP4= <user>
##$USERP5= <user>
##$WDW= 1
##$XDIM= 16384
##$YMAX_p= 512095011
##$YMIN_p= -499573
$$ End of Bruker specific parameters
$$ ---------------------------------
##NTUPLES= NMR SPECTRUM
##VAR_NAME=  FREQUENCY,     SPECTRUM/REAL,   SPECTRUM/IMAG
##SYMBOL=    X,             R,               I
##VAR_TYPE=  INDEPENDENT,   DEPENDENT,       DEPENDENT
##VAR_FORM=  AFFN,          ASDF,            ASDF
##VAR_DIM=   16384,         16384,           16384
##UNITS=     HZ,            ARBITRARY UNITS, ARBITRARY UNITS
##FACTOR=    0.207333158178281, 1,           1
##FIRST=     3206.83311928588, 0,            0
##LAST=      -189.906011148899, 0,           0
##MIN=       -189.906011148899, -499573,     0
##MAX=       3206.83311928588, 512095011,    0
$$ Real data points
##PAGE= N=1
##DATA TABLE= (X++(R..R)), XYDATA
$$ [...]
7531g9535j5446K988j0198k2179p6306J4712l3726o8773N9259M8237Q0321q7952
7519a88598j24047l2284M6150J40996q438n3869k2001O6165R2371p3887j33881
7508b91323l822J25119K01874N4164j50278q2323k1948J56780J26965K3905l2561
7497A06552o4002M0894R8755L5480j09732k1390J6222J5994J9314r8327j11405
7486g1645P7637Q6056J9405n5510k39424j4879J39414L7985m0462k13625m9388
7475c24436J99692J02108j03711j17426p2419J39656J09868R851r5635r9487P7837
7464a74102O2789M7037r315q6033l8178j4396M2898P3724M3528n182k6371R6977
7452A3376K0537p2917j12077O2513J65285K2916m5925n4960J0824J03905K5743
$$ plain form
7531 -79535 -94981 -91993 -102191 -124370 -200676 -185964 -219690 -288463 -229204 -180967 -100646 -188598
7519 -188598 -312645 -344929 -298779 -157783 -166221 -220090 -242091 -175926 -83555 -157442 -291323
7508 -291323 -295145 -170026 31848 86012 -64266 -146589 -168537 -11757 115208 139113 106552
7497 106552 42550 83444 182199 217679 107947 86557 102779 118773 138087 39760 -71645
7486 -71645 5992 92048 111453 55943 -183481 -198360 -58946 -20961 -61423 -275048 -324436
7475 -324436 -124744 -22636 -126347 -243773 -316192 -176536 -66668 -56817 -152452 -251939 -174102
7464 -174102 -111313 -64276 -73591 -159624 -197802 -212198 -169300 -95576 -52048 -57230 -83601 13376
7452 13376 33913 -39004 -151081 -88568 76717 99633 53708 -1252 9572 113477 139220
7441A39220o4074m1430o9554M6898J7655l9489p9327K3388J53362K2934q8142
7430B1441j10731m5353q899K2744M6193J1739k0083j24979l3537P8893N8479j6202
7418a20295l5807l322p89P809l1077m9934O5561K5991L4351n0029j15997L1097
7406b42441L2534N6110O8103l6340N4130M3720o8296k8732k8973N9750P8868q57
7394a2424n4393o7067K8511L3472n2972K4754O190o4162p0946j756J18530O6433
7382d5830r1505K8056P529j0815J2718N630j2185K886J11726J2099q3749j25111
7370a88551n8274R5079N2520K5347l0948o5194n37Q648J5992O0602R2413J4807
7358B1904m0150j03415l2306J619L4346J14564M1545k4257j03280J3053J35697
$$ plain form
7441 139220 75146 33716 -35838 11060 28715 -10774 -90101 -66713 86649 109583 21441
7430 21441 -89290 -134643 -143542 -120798 -74605 -62866 -82949 -207928 -241465 -162572 -104093 -120295
7418 -120295 -156102 -159424 -160213 -152404 -183481 -233415 -167854 -141863 -107512 -157541 -273538 -242441
7406 -242441 -209907 -153797 -85694 -122034 -67904 -24184 -92480 -121212 -150185 -90435 -11567 -12424
7394 -12424 -66817 -133884 -105373 -71901 -124873 -100119 -93929 -158091 -229037 -230793 -112263 -45830
7382 -45830 -137335 -109279 -101750 -112565 -99847 -94217 -106402 -103516 8210 20309 -63440 -188551
7370 -188551 -246825 -151746 -99226 -73879 -104827 -170021 -170558 -161910 -145918 -85316 7097 21904
7358 21904 -18246 -121661 -153967 -152348 -118002 -3438 38107 13850 -89430 -76377 59320
7347E9320R3850o0701j6312j6073j3134N6149J5166r2728k831R5562P0153n5803
7335A32618j07130n5935N7827j0251j9937j5848J5075k1781j8840o9285j200J04605
7323a0082l9299M4569m7211j5935j2702l0262j8278m0624J6561m5489l8926N2482
7311a85196K0929J15234m1037j08916K9211J18101j3548j4179l5870k2556N883
7300a31944O3902N8999m9008m4550L6677O4228m2590M2968J8800q359q916p4467
7288g4260M8920N7792J0298o6720o5479j0K0799l4020K8529M7132j35837J4620
7276a48236R766N4967J08184o6327p4927p6641k0695P6776Q302J2952p8399j6568
7264b10846J4548J12233M5304j37709n457K9374L3336L5076n8449J0220j3900
$$ plain form
7347 59320 153170 92469 76157 60084 46950 103099 118265 25537 22706 118268 188421 132618
7335 132618 25488 -30447 27380 17129 -2808 -18656 -3581 -25362 -44202 -113487 -114687 -10082
7323 -10082 -49381 -4812 -52023 -67958 -80660 -110922 -129200 -169824 -153263 -198752 -237678 -185196
7311 -185196 -164267 -49033 -90070 -198986 -169775 -51674 -65222 -79401 -115271 -137827 -131944
7300 -131944 -68042 -9043 -58051 -102601 -65924 -1696 -44286 -1318 17482 9123 207 -74260
7288 -74260 -25340 32452 42750 -23970 -89449 -89459 -68660 -102680 -74151 -27019 -162856 -148236
7276 -148236 -138470 -83503 24681 -41646 -116573 -193214 -213909 -137133 -128831 -115879 -194278 -210846
7264 -210846 -196298 -84065 -38761 -176470 -181927 -152553 -119217 -84141 -142590 -132370 -146270
7253a46270k3397J03749k5875l1650l8607O0860N6025o2245p1846M2871J16213
7242b0172O8488n8257j26340o1557P7501R3943K2407p0840m4428Q639N202N0372
7230e5042L0207r6938m5929Q9539J31697o0095j24531o2236J08988P2515p9287
7219i1112m2379q5469n87Q2573M9489j6238j14974q2994J10015P9774j4575p8404
7207b04881k7674J17851L8980p2844p6367R709K7640Q8865J12964r5398j09980
7196a91135n1327Q1944J43201K0561j16112p4424Q610J67039K5822o7460m5074
7185i8355k9110J05353J07058j34768o7866j161P7833Q9924n8160l0122m7924
7174h7298R548N3452K4768M1837j7934l3116P4478L7666Q494j01983j15200J21311
$$ plain form
7253 -146270 -169667 -65918 -91793 -123443 -162050 -101190 -45165 -107410 -179256 -136385 -20172
7242 -20172 48316 -9941 -136281 -197838 -120337 -26394 -3987 -74827 -119255 -110616 -105414 -55042
7230 -55042 -24835 -121773 -167702 -78163 53534 -6561 -131092 -193328 -84340 -11825 -91112
7219 -91112 -133491 -218960 -219547 -136974 -87485 -103723 -218697 -301691 -191676 -111902 -126477 -204881
7207 -204881 -232555 -114704 -75724 -148568 -224935 -215226 -187586 -98721 14243 -81155 -191135
7196 -191135 -242462 -160518 -17317 3244 -112868 -187292 -178682 -11643 14179 -53281 -98355
7185 -98355 -127465 -22112 84946 -49822 -117688 -118849 -41016 48908 -9252 -39374 -87298
7174 -87298 -77750 -24298 470 42307 24373 -8743 65735 103401 111895 9912 -105288 16023
7162A6023J26825n7028j52232q2827N0480J17645M4770n1738n6188M349L0013
7151i908N2459q5280j15398O590K9559J18604o680o7366J1464N1571l169L7881
7139B0327o6276n8995J4810L7128o616k2431k8866p5250L9276R5621J1057r3949
7127a34164j5554R033Q9054N7277p5281j03654M0228Q5188Q329p7880q5413M166
7115a98671J5974Q7132L1343n2799m2444N1177N2334j20577K0352J02165K1218
7104c2796p3234p4630R551o0739p641Q2601O0969q873o6367k7854O3424M4680
7092i0909K951j5217j01570M0714J48273k5339o7010j2675p8728j3906M2435k242
7080a73223m030K7985J9515R998k723m6072j7420L9784L3138o0925J6271j2687
$$ plain form
7162 16023 142848 85820 -66412 -149239 -98759 18886 63656 11918 -44270 -39921 -9908
7151 -9908 42551 -42729 -158127 -151537 -121978 -3374 -10054 -77420 -65956 -14385 -17554 20327
7139 20327 -45949 -104944 -90134 -53006 -59622 -82053 -110919 -186169 -146893 -51272 -40215 -134164
7127 -134164 -149718 -140685 -51631 5646 -69635 -173289 -133061 -47873 -39544 -117424 -202837 -198671
7115 -198671 -182697 -95565 -64222 -117021 -159465 -108288 -55954 -176531 -156179 -54014 -32796
7104 -32796 -106030 -180660 -171109 -231848 -239489 -156888 -95919 -104792 -171159 -199013 -135589 -90909
7092 -90909 -87958 -103175 -204745 -164031 -15758 -41097 -108107 -120782 -199510 -213416 -170981 -173223
7080 -173223 -177253 -149268 -129753 -119755 -122478 -168550 -185970 -146186 -113048 -173973 -157702 -170389
7068a70389J6001K8206J8395m7705l0617M1171N0854R6095o902n8621K0627k570
7056d5455R6554l2851q5329n6103Q328N5744o4664j5825L086k5107J36683O6550
7044D1611j15470M8541K3943J4266p3844k4063P4374p366O9551l328j29437O1704
7032a9518M7066L6290J4563r3083o3073j3653J32459R0490p0468j30680r4147
7021a63754P6672J06150K2662J7781j12547r6984N3689O7954L2213j50365l0754
7010a77283J22518O6606K006j03977o7886K0826L3628j1940r727j8294O653l2232
6998a69102P4767N6424M2947K1258n8054j1065n9736m4883M6851P6353j8025o8060
6986a10325J0215j2380K6637P3170n925j9237j2159j511N2029K7169m8169k962
$$ plain form
7068 -170389 -154388 -126182 -107787 -155492 -186109 -144938 -94084 2011 -4891 -63512 -42885 -45455
7056 -45455 51099 18248 -67081 -123184 -114856 -59112 -123776 -139601 -136515 -161622 -24939 41611
7044 41611 -73859 -25318 -1375 12891 -60953 -85016 -10642 -18008 51543 48215 -81222 -19518
7032 -19518 27548 63838 78401 -14682 -77755 -91408 41051 131541 61073 -69607 -163754
7021 -163754 -87082 19068 41730 59511 -53036 -150020 -96331 -28377 3836 -146529 -177283
7010 -177283 -54765 11841 13847 -90130 -158016 -137190 -103562 -115502 -125229 -143523 -136870 -169102
6998 -169102 -94335 -37911 5036 26294 -31760 -42825 -102561 -147444 -100593 -24240 -42265 -110325
6986 -110325 -100110 -112490 -85853 -12683 -18608 -37845 -50004 -51515 514 27683 -20486 -23448
6974b3448j599N5690P4617k9849j84901m6288J52238J25259k8798k2229n8449
6963A2243l6776J5725K105Q2322k9495L4065m1585j04353p495J8440R0289N9576
6951I5061o6410N0807j08312l0881O04J9061R9892p6999r2888l6989P3980R8989
6939B5915p5190j37356O9376L7592N6910o3082q1875m555L9262Q0626j5584k4155
6927i2116l7680q1014j0793N9585J6568k4406k3947r356M312k6710l551j7636
6915b46744L3826K4884k5657j36707J9689N3917J55275n375j44433o4167P4001
6904b61491J52471P214m6916o0782j8868M3803J1843J14617P9244o6705l3963
6893g9533m8340L1056K262j3580j1119m1488k1427P81O0231O2135r2769n484M7754
$$ plain form
6974 -23448 -25047 30643 105260 75411 -109490 -155778 -3540 121719 92921 70692 12243
6963 12243 -24533 -8808 -6703 75619 46124 80189 38604 -65749 -73244 -54804 35485 95061
6951 95061 28651 79458 -28854 -59735 -59131 -40070 59822 -17177 -110065 -147054 -73074 25915
6939 25915 -49275 -186631 -117255 -79663 -22753 -85835 -167710 -172265 -133003 -52377 -67961 -92116
6927 -92116 -129796 -210810 -221603 -162018 -145450 -169856 -193803 -203159 -198847 -225557 -229108 -246744
6915 -246744 -212918 -188034 -213691 -350398 -330709 -276792 -121517 -126892 -271325 -335492 -261491
6904 -261491 -109020 -101806 -148722 -209504 -228372 -184569 -172726 -58109 21135 -45570 -79533
6893 -79533 -127873 -96817 -94555 -108135 -119254 -160742 -182169 -181388 -121157 -59022 -151791 -157275 -109521
6880a09521j9822m4202l5469R9362Q6577j14516o8174J32932N1121J0929j48406
6869a59189o8166Q5586L962O0029L6198j6549k7109r078L1079N4326K8270m6239
6857b6880j10592M3199P6903j7763q6184m2020Q7886N7084J3213q0497o1794J10094
6845c7351M6271j6042k9117r5430J7796J43314j6134o0810j61802R5368J18708
6834D771j135L594j9891j03659L9400O828J28294K5768j11821m6356L7296J29600
6822I2689q596n4738l3204K616L5021R099o1572n553M7310j2277o4509m6165j7895
6809a17774j5615J44356j9585o3762j7692j8047Q7633j00539k2093R8202L1718
6798a3198Q6497M136q7459M3787l9069j6184J4542M9262L2875j49895r1274J58735
$$ plain form
6880 -109521 -129343 -173545 -209014 -109652 -23075 -137591 -205765 -72833 -21712 -10783 -159189
6869 -159189 -227355 -141769 -137807 -77778 -41580 -58129 -85238 -94316 -63237 -8911 19359 -26880
6857 -26880 -137472 -94273 -17370 -35133 -121317 -163337 -75451 -18367 -5154 -85651 -147445 -37351
6845 -37351 8920 -7122 -36239 -131669 -113873 29441 13307 -47503 -209305 -113937 4771
6834 4771 3636 7230 -12661 -116320 -76920 -70092 58202 83970 -27851 -74207 -36911 92689
6822 92689 84093 29355 -3849 -1233 33788 42887 -18685 -24238 23072 10795 -53714 -99879 -117774
6809 -117774 -133389 10967 -8618 -72380 -90072 -108119 -20486 -121025 -143118 -44916 -13198
6798 -13198 73299 77435 -10024 33763 -5306 -21490 -6948 42314 75189 -74706 -165980 -7245
6786g245P4931O4065p7431q5272M0761L7430l3664j26328R196J54967M44q0271
6774b8417o2903Q2444M1669M1373K8891k7653p9341R441k0164L3103n809l4715
6762b2081M7888n7606J9207N5253l3336P951o4510N6511J01987q5442p3241p7694
6750a25113J19674O9225m9866m9100k5136J09470K0662p5809m6902j6187J11764
6739D2682N9186o5387p8552J61J19718P8104p8454q380n6795J6411K7537k4851
6727C1380M7992m6968o4749M770k8177M5199j2758l8505L1174L0136J7175r5650
6715g8981m9437L6491K2905L6867p7195o4906p639K3848K6397j27201J0194Q0942
6703a67715P1263j5553j18632p1586P9991L9420P9822L279p8820N7424J1671j2344
$$ plain form
6786 -7245 67686 131751 54320 -30952 9809 47239 13575 -112753 -103557 51410 51854 -28417
6774 -28417 -91320 -8876 32793 74166 103057 75404 -3937 5504 -14660 18443 12634 -22081
6762 -22081 25807 -31799 -12592 42661 9325 17276 -47234 9277 111264 25822 -47419 -125113
6750 -125113 -5439 63786 13920 -35180 -60316 49154 69816 -5993 -52895 -69082 42682
6739 42682 101868 36481 -42071 -41910 77808 155912 77458 69078 12283 28694 56231 31380
6727 31380 79372 32404 -32345 -27575 -55752 -10553 -23311 -61816 -30642 -506 16669 -78981
6715 -78981 -128418 -91927 -69022 -32155 -109350 -174256 -181895 -158047 -131650 -258851 -248657 -167715
6703 -167715 -96452 -112005 -230637 -302223 -222232 -182812 -102990 -99711 -178531 -121107 -109436 -121780
6691a21780L4724M9581P540l2935K5759M3814k0020q2631j1492J04672J24614
6680A21846o2259q6348l9824L7644P994p398O3438j9969L3323K0766n0163K5344
6668D4394n4957l75J54367J9426r2310j80144K486M0559P2344P1522l0122n5145
6656g955j11154R9574R7524l4175r5072p2496O6677P6471P017n8660n927M1247
6644C071P3188j09027q7219j0689O4658M7360K5905k6835r0210p78J13160l3522
6632c0938q1640K6680P93J16950J4430r1938j06901j0571J30992J2061m6452q1081
6620a47615p8271K1377R1865J19058p8216r4228L7465K9984J5160j21696m8448
6609b53565R2223K0156L3051J016j01338J2235L3926J6818K9476J142Q44Q313
$$ plain form
6691 -121780 -87056 -37475 -29935 -62870 -37111 6703 -13317 -95948 -107440 -2768 121846
6680 121846 59587 -26761 -66585 -28941 -20947 -28345 35093 15124 48447 69213 19050 44394
6668 44394 -10563 -10938 143429 162855 70545 -109599 -107113 -66554 5790 77312 47190 -7955
6656 -7955 -119109 -19535 77989 43814 -51258 -123754 -57077 19394 26411 -32249 -38176 3071
6644 3071 76259 -32768 -119987 -130676 -66018 -18658 7247 -19588 -109798 -110576 2584 -30938
6632 -30938 -112578 -85898 -85105 31845 46275 -45663 -152564 -163135 -32143 -20082 -66534 -147615
6620 -147615 -225886 -204509 -112644 6414 -71802 -166030 -128565 -98581 -83421 -205117 -253565
6609 -253565 -161342 -141186 -108135 -107119 -208457 -196222 -162296 -145478 -116002 -114860 -114016 -105703
6597a05703r022Q0843k6117k4809l6325N1872M9930n7754K080L8287J1273J4051
6585a1394R1106j512o4765j34059K3649P0564O3857o9224m1786L6381p9853M3471
6573g3565l5928r737M8520o4287r845Q093l5904N3054k7084l1688L3141l8668
6561a83898J5619q2030N4630K5010n0938m1367J8648R1375p785m1243l1984Q692
6549b25271Q4411L7914m1736k972k3736J18281N1129j08769q097M7591N965l41
6537f5631r453Q9587m803J0537j2555j26463J3341K2515K3322j0482q9680n862
6525a65627J10070k160j8820q5303J01112M6882j17698j1650Q7459q927j10334
6514a74996l2738J04445M8384K9284j43406k8652J75724K678n2182o0676k120
$$ plain form
6597 -105703 -114725 -33882 -59999 -84808 -121133 -69261 -19331 -77085 -75005 -36718 -25445 -11394
6585 -11394 79712 78200 13435 -120624 -96975 -26411 37446 -31778 -73564 -37183 -117036 -73565
6573 -73565 -109493 -119230 -70710 -134997 -144842 -136749 -172653 -119599 -146683 -178371 -145230 -183898
6561 -183898 -168279 -250309 -195679 -170669 -221607 -262974 -244326 -152951 -160736 -201979 -233963 -225271
6549 -225271 -140860 -102946 -144682 -147654 -171390 -53109 -1980 -110749 -118846 -71255 -65290 -65631
6537 -65631 -75084 14503 9700 20237 7682 -118781 -105440 -82925 -59603 -70085 -159765 -165627
6525 -165627 -55557 -57717 -76537 -161840 -60728 -13846 -131544 -143194 -55735 -64662 -174996
6514 -174996 -207734 -103289 -54905 -25621 -169027 -197679 -21955 -19277 -71459 -132135 -134255
6503a34255P7671n357J9602L6502J86q896o257k1691r135L3040n9040p082j1783
6490i6495N5387O2575J6043r8472n5483J12570R0613l4748j91409L5932J33393
6479B9906J0899j09417q4512J12358M7918j18605j9931Q301O2817P3946n8784
6468d5104N1661o0674q4405l2064R2485J16257o4586j42763k5390J06221Q2349
6457f013k7983l9324m7277l4747P9634O3164o871j17655k8548R6615N6141j145
6445a4009j43797j1935J41746m7054p0020m3855P0098J04575j28722p3353N0957
6434a65369L2363O0296l59q468m0227o8361K7045N6196Q9163o9595j11653K9926
6422a69043P8864L5606J2573J8136J9615j16848Q3491J25819p9845j03405r164
$$ plain form
6503 -134255 -56584 -61941 -42339 -5837 -5651 -14547 -20804 -42495 -51630 -18590 -77630 -84712 -96495
6490 -96495 -41108 21467 37510 -60962 -116445 -3875 86738 51990 -139419 -103487 29906
6479 29906 40805 -68612 -153124 -40766 7152 -111453 -131384 -123083 -60266 13680 -45104
6468 -45104 6557 -54117 -138522 -170586 -78101 38156 -26430 -169193 -194583 -88362 -6013
6457 -6013 -33996 -73320 -120597 -155344 -75710 -12546 -19417 -137072 -165620 -69005 -12864 -14009
6445 -14009 -157806 -169741 -27995 -75049 -145069 -188924 -118826 -14251 -142973 -216326 -165369
6434 -165369 -133006 -72710 -73069 -81537 -121764 -190125 -163080 -106884 -17721 -87316 -198969 -169043
6422 -169043 -90179 -54573 -42000 -23864 -4249 -121097 -37606 88213 8368 -95037 -104201
6411a04201J14102M7524m6142j9205l978k1027j8270j3483Q2246M5779p9131j49180
6399a64966m5289J67588M4491p9109L4499K123m0080n6437J876O1537l01n4788
6387a28856k4290O3150O1586K0007l436m6844P366L2889M6417j4220o0091m1441
6375h7763K5080J8650K68j7083l6847R3865r3625J0070J57949K3601o1947j19737
6363h7519K4689J8491n7429O6289o961N3481k9825r5188N5088P664L3940j8878
6351c6158p1617q001l3771Q3630L6018l9147l4715N0350N2428J373j11806L809
6339a07607O5695n228j8352J0417L1786r6065j4635O8563N4323N049q3250m1728
6327a31032P3689J0740K4027o6987J04416Q4893q9553j1751k6817J14822N2886
$$ plain form
6411 -104201 9901 57425 11283 -7922 -11900 -32927 -51197 -64680 17566 63345 -15786 -164966
6399 -164966 -210255 -42667 1824 -77285 -42786 -40663 -80743 -137180 -135304 -73767 -74068 -128856
6387 -128856 -153146 -89996 -28410 -8403 -11839 -58683 -51317 -18428 27989 13769 -46322 -87763
6375 -87763 -62683 -44033 -43765 -60848 -97695 -3830 -97455 -87385 70564 94165 32218 -87519
6363 -87519 -62830 -44339 -101768 -35479 -42440 11041 -18784 -113972 -58884 -51220 -17280 -36158
6351 -36158 -107775 -115776 -149547 -65917 -29899 -69046 -103761 -53411 -983 390 -111416 -107607
6339 -107607 -41912 -47140 -65492 -55075 -23289 -119354 -133989 -65426 -11103 -6054 -89304 -131032
6327 -131032 -57343 -46603 -22576 -89563 14853 99746 10193 -1558 -28375 86447 139333
6316A39333p1977J9628L5887N3318k3347o5575r348r8875k0572J75307j0690m9166
6304G3923j6630O6863N3236o8532j26664r222M0588q301j11071L8981J61384P765
6292A02320p4585r1666O179L2344o7674R9220N6521O582n7183k860Q7298k3036
6280G3460r5481l9692q743J67159K7064j06985p0346j5752J26761R7848l5179
6269A20114l8296p0598j6059M1836K6766l3907L3679n5358R765j6389K3560J46009
6257A71122O046o9251j33678N5593Q4189L2868j93377k7075Q9651n121j11819
6246a00852O9906M9098M1689q7349j46921P9765M372J4171N077k790m286M7541
6234c0579J6234R2o4366p4982k640N7380N8186m8346P3480j3326k1278l642P4908
$$ plain form
6316 139333 67356 86984 122871 176189 152842 87267 77919 -20956 -41528 133779 123089 73923
6304 73923 57293 124156 177392 108860 -17804 -27026 13562 5261 -105810 -66829 94555 102320
6292 102320 27735 -63931 -57752 -25408 -93082 6138 62659 69241 12058 9198 96496 73460
6280 73460 -22021 -61713 -70456 96703 123767 16782 -53564 -69316 57445 155293 120114
6269 120114 81818 11220 -4839 36997 63763 29856 63535 8177 17942 1553 25113 171122
6257 171122 177168 107917 -25761 29832 114021 146889 -46488 -73563 16088 10967 -100852
6246 -100852 -30946 18152 59841 -27508 -174429 -94664 -90292 -76121 -71044 -73834 -78120 -30579
6234 -30579 -14345 -14253 -78619 -153601 -156241 -98861 -40675 -89021 -15541 -28867 -50145 -53787 21121
6221B1121M0412L8467j27834m3730J22773O1832p5144n3923P3041Q8296J1399
6210A56710q1797K140Q7582M9402K0885o0372J1837J5718p587l2309M5750R132
6198B17091k8982m9176r2783J00229O6350l7490j05409q105O8243r8337o9241
6187c7610N462n7O6938O4924j35485p4153L5547O0807N8645K5712k7625j1399
6175C1706k4430l4750L0540m1310m4335R5208M0246p224L622K51k3002q8431R7485
6162C5576R1284N8472p3701j35019J06885J81022j07084k22829M2271J51067O0705
6151A88649p9324n3576K944k1117M4038n5793l6353o5996q5341J2514J13115l5476
6139g1716n5183P206O7359m0427M7768r9956k0372P2148L9104K8589p054j58563
$$ plain form
6221 21121 61533 100000 -27834 -71564 51209 113041 37897 -16026 57015 145311 156710
6210 156710 74913 77053 164635 214037 234922 174550 186387 202105 194518 162209 207959 217091
6198 217091 188109 138933 46150 146379 212729 175239 69830 61725 129968 31631 -37610
6187 -37610 -32148 -32205 34733 99657 -35828 -109981 -74434 -13627 45018 70730 43105 31706
6175 31706 7276 -27474 3066 -38244 -82579 12629 52875 45651 49273 49524 26522 -61909 35576
6162 35576 126860 185332 111631 -23388 83497 264519 157435 -65394 -23123 127944 188649
6151 188649 109325 55749 58693 37576 81614 25821 -10532 -76528 -161869 -149355 -36240 -71716
6139 -71716 -126899 -119693 -52334 -92761 -44993 -144949 -165321 -93173 -54069 -25480 -32534 -191097
6127a91097q5427J50644J35307j0434q5712m8314O6523R2174r465n7611j10890
6116a54302J04374Q257j2118J31276n4495l3900m0020J5274P5551n8700r5192
6105a13995j3451N6712N1635M0423k0112j8946k2506K714k399K1658q6633n375
6093a10275K9600K2152q851j01599P0378R1875j06297n1633j5262O5826Q8522
6082b5564k6845q1941m9182Q6545J6839q6841L9045O365M2258O9812l9574J3123
6070c5960k0193O227K7509j5280O5178q1287j2381L5561q7920N9190P6068l1491
6058a4779m8580p0453J33358K324p9937m9552K054J21382N594o6801j0222q0607
6046a56219O6231J5016n5439R8331n4021M6562o2409j6885M6475k4872M6132l296
$$ plain form
6127 -191097 -276524 -125880 9427 -1007 -86719 -135033 -68510 23664 14199 -43412 -154302
6116 -154302 -49928 -41671 -53789 77487 22992 -10908 -50928 -35654 39897 -18803 -113995
6105 -113995 -127446 -70734 -19099 21324 1212 -17734 -40240 -37526 -39925 -18267 -104900 -110275
6093 -110275 -80675 -58523 -67374 -168973 -98595 -6720 -113017 -164650 -179912 -114086 -25564
6082 -25564 -52409 -134350 -183532 -96987 -80148 -166989 -127944 -121579 -79321 -9509 -49083 -35960
6070 -35960 -56153 -49926 -22417 -37697 27481 -53806 -66187 -30626 -118546 -59356 16712 -14779
6058 -14779 -63359 -133812 -454 1870 -78067 -127619 -125565 -4183 1411 -65390 -75612 -156219
6046 -156219 -89988 -74972 -130411 -32080 -86101 -39539 -101948 -118833 -72358 -97230 -51098 -54394
6034e4394l4313Q4542q5967j3959P6217L1068J8791o8490K302M7442O1720K5754
6022I0713j61032m2932J16338K0510M4168q0820n4415k983R0425Q2008j02583
6011f03q6810L4490O5361O1189q8792k6537N0538j19131K7004j899O5891l8695
5999e7994K6390K1224l7383L1340j14268p7547J53901J42037m9032r6059o3030
5988a20421J75410R3789o3872q8231j20217R3375J44088j6068j3437j11546O224
5977b0906Q1654j7685M6395p6311M58J06626j3864M4302r5031m4221o7587k1599
5965g7769J11756N3599n1798j09731M7889J68198j6626r5474o6139M7326J83211
5954A94442j72838j68962m8R0769O6852q0791k1849L7844j25652M771O7932N3049
$$ plain form
6034 -54394 -88707 -4165 -90132 -104091 -27874 3194 21985 -46505 -44203 3239 64959 90713
6022 90713 -70319 -113251 3087 23597 67765 -13055 -67470 -70453 19972 101980 -603
6011 -603 -87413 -52923 12438 73627 -15165 -41702 8836 -110295 -83291 -85190 -19299 -57994
5999 -57994 -31604 -10380 -47763 -16423 -130691 -208238 -54337 87700 38668 -57391 -120421
5988 -120421 54989 148778 84906 -3325 -123542 -30167 113921 97853 84416 -27130 -20906
5977 -20906 60748 43063 89458 13147 13605 120231 106367 150669 55638 11417 -56170 -77769
5965 -77769 33987 87586 35788 -73943 -26054 142144 125518 30044 -36095 11231 194442
5954 194442 21604 -147358 -147406 -56637 10215 -70576 -92425 -54581 -180233 -175462 -107530 -54481
5942e4481j9165j55216P7493Q2544N6929l3755j02690l772J12779J8592L6695
5931A5953q9174p4860N0425J84418M9890j06295M689k6396J26858Q1551q4245
5920A32814k8619m0165N051m964l1461J9147m4093m1473O816L6093J02214q9263
5908B2097j43003k1504Q1953L2383l4062p3843J3677M4652N9489J1713r7530O9669
5896c4309J0282K282r8086M7648Q5769l0537j00652J4093Q6548N1593n3034o621
5884b5024K4977o974L0674M752K2752R929k0519k3418l645M7945J30936q917p1895
5871A11573j12258J7083J15452K0472N565q6162j10014P3568j60K281K0679N873
5859F3952k4792l5616N5261K4730L1422j51256k8255O0438M3313k1771o0822l1862
$$ plain form
5942 -54481 -73646 -228862 -151369 -68825 -11896 -45651 -148341 -152113 -39334 -20742 15953
5931 15953 -73221 -148081 -97656 86762 136652 30357 35046 8650 135508 217059 132814
5920 132814 104195 64030 69081 64117 32656 51803 7710 -33763 -26947 9146 111360 22097
5908 22097 -120906 -142410 -60457 -28074 -62136 -135979 -122302 -77650 -18161 -6448 -103978 -34309
5896 -34309 -24027 -21745 -119831 -72183 13586 -16951 -117603 -103510 -16962 34631 -18403 -25024
5884 -25024 -47 -7021 23653 28405 51157 61086 40567 17149 13504 61449 192385 183468 111573
5871 111573 -685 16398 131850 152322 157887 71725 -38289 35279 35119 37400 58079 63952
5859 63952 39160 3544 58805 83535 114957 -36299 -64554 -4116 39197 17426 -43396 -75258
5847g5258M3399j0763R688J1155m4112j4093R008j1019O9509J01363m0457l5345
5835A3075L5908k5368k3488O6134n954l4571L7076m1489K4402m4501Q651Q3358
5823I3233L8342j54169q8425J06352J20926J503p6950n0620N0706J05495r5547
5812E0846p312O8216l0604r7802J3482J35755L1901j19919j05211M8977J82162
5801A70491j9660r1261j13696K7091o357M3202M7347k2516n3755K5795L6064p868
5789C4877q0122M4367J00604n7039j17809K1976M8942P3756p0881r7822Q2855
5778a6296P1421j13221q5379Q0486J5652K0287j24519L1194J34050J908j49322
5767a33739j17775R7341J78371L9985j20811o3392k5604M0436J34712R545o2669
$$ plain form
5847 -75258 -31859 -42622 -32934 -21779 -65891 -79984 -70976 -81995 -12486 88877 48420 13075
5835 13075 48983 23615 127 66261 60307 25736 62812 21323 45725 1224 9875 93233
5823 93233 131575 -22594 -111019 -4667 116259 117762 40812 -9808 40898 146393 50846
5812 50846 43534 111750 81146 -16656 -3174 132581 164482 44563 -60648 -11671 170491
5801 170491 150831 59570 -54126 -27035 -33392 9810 57157 34641 -19114 6681 42745 34877
5789 34877 -45245 -878 99726 42687 -75122 -53146 -4204 69552 -1329 -99151 -16296
5778 -16296 55125 -58096 -143475 -62989 -47337 -27050 -151569 -120375 13675 15583 -133739
5767 -133739 -251514 -154173 24198 64183 -56628 -120020 -145624 -105188 29524 39069 -23600
5756b3600M3572K2420K2329J2176R538M9393l5617j42637p9764J36152L4506p1745
5744b3277n3217P7748J10976p1816j74557k5265J17696N4958n7435k3462M9004
5733a8647j5412l8320m4227o614J26424K8389o9804r3577m3760R2132O9379l8207
5721e2244n6020N5706K5736j3224p6935j9940R0518K6588o9364n5861j5707O4065
5709i6682N2825k5841M4252K234n9126m6129L2073P3254m3117p4123N2901Q3511
5697c968J08199l6506q3864r0351m6703J05731L242R169l7326l2878J3172N6002
5685c6081m0547j11452J7686J23084J4478o5764m7745R1453P6060p5780j3514
5674f8122M5526p0873p41J22679J4424l9276r9484j5427R1257J84829K6884k04869
$$ plain form
5756 -23600 19972 42392 64721 76897 86435 135828 100211 -42426 -122190 13962 48468 -23277
5744 -23277 -76494 1254 112230 40414 -134143 -159408 -41712 13246 -44189 -67651 -18647
5733 -18647 -34059 -72379 -116606 -123220 3204 31593 -38211 -131788 -175548 -83416 -14037 -52244
5721 -52244 -108264 -52558 -26822 -40046 -116981 -136921 -46403 -19815 -89179 -145040 -160747 -96682
5709 -96682 -43857 -69698 -25446 -23212 -82338 -128467 -96394 -23140 -66257 -140380 -87479 -3968
5697 -3968 104231 67725 -16139 -106490 -153193 -47462 -44220 -35051 -72377 -105255 -92083 -36081
5685 -36081 -76628 -188080 -170394 -47310 -32832 -98596 -146341 -54888 21172 -54608 -68122
5674 -68122 -22596 -93469 -94210 28469 42893 3617 -95867 -111294 -20037 164792 191676 -13193
5662a3193L9881J04809j3412k21o5517l7842j0024L4423N8247k8548p5373K0493
5650A3723L1011Q0155k045k6585J959M0048j1915r1738J1274J4689O8952k8716
5638A00812n7488P1751l0135k2746Q9124J10338n8616n4654j6580N63L2832q527
5626A56674l4276L3119m680m4596O3103k7928r0952l4790J15423R6063j00592
5615A26568n4932k8659M6703j3116m1257l818L3493m2296l3367L0053j6840O0262
5603F2794L664o4252k7197j8989k0737J25665P0731m0756j39109j2247R8797J2573
5591E0937j2848q191P5097L2624Q823q4086Q6728k4344j6178M4398L7120n6790
5579A33290q4527J0663O4959l5868j3536O1035p822L9225r3400k1930J0983J12531
$$ plain form
5662 -13193 26688 131497 118085 117864 52347 14505 4481 38904 97151 68603 -6770 13723
5650 13723 44734 124889 122844 96259 98218 138266 126351 34613 45887 60576 129528 100812
5638 100812 43324 115075 84940 62194 151318 261656 203040 148386 131806 132369 165201 156674
5626 156674 122398 155517 150837 106241 169344 141416 50464 15674 131097 227160 126568
5615 126568 71636 42977 89680 76564 35307 31489 64982 22686 -10681 19372 2532 62794
5603 62794 66458 2206 -24991 -43980 -64717 60948 131679 90923 -48186 -60433 38364 50937
5591 50937 38089 29898 104995 137619 146442 62356 149084 124740 108562 152960 190080 133290
5579 133290 48763 59426 124385 88517 74981 136016 128194 167419 74019 52089 63072 175603
5567A75603J0254L088r4834j56941n298J46259J0286l4610o8372j3355l6948M3509
5555b1359N9320J2749P211l1054j02319O6658P0337k5984n1237j4391l7917O7654
5543c32J7865N3684j148J2085l7001j2587J00597q725j5507o8447J3778M8156
5531A02418P4128k7271l9239k7025n0345K4891J24807o5408r0819R7203k5286
5520I8054J4720m4196k4461J40311n2233o1197j01903R4244N6115N7588p7434
5509I9608k1860J2435P1551N8583o0717j009p507K264N0729O7040r2963o2594
5497A15560N103N050O3263J9410p214l5486o980k4505Q8391k8927M196L2120J4762
5484B44743l0551j28492j9804O8000L8907J1939k2221o0958o42O3690O6372O3445
$$ plain form
5567 175603 185857 188945 94111 -62830 -68128 78131 88417 53807 -14565 -27920 -64868 -21359
5555 -21359 37961 50710 57921 26867 -75452 -8794 61543 35559 -15678 -30069 -67986 -332
5543 -332 17533 71217 70069 82154 45153 32566 133163 124438 108931 40484 54262 102418
5531 102418 176546 149275 110036 83011 32666 57557 182364 116956 26137 123340 98054
5520 98054 112774 68578 44117 184428 132195 70998 -30905 63339 119454 177042 99608
5509 99608 77748 90183 161734 220317 159600 158591 151084 153348 204077 271117 178154 115560
5497 115560 120663 125713 188976 208386 201172 165686 158706 134201 222592 193665 197861 229981 244743
5484 244743 214192 85700 65896 133896 172803 184742 162521 101563 100921 164611 230983 294428
5472B94428m0478j17871o853N5913N7646p1512j14270j2963J34713L7049p1795
5461A44007m5410r9860k6353J24638Q1756l4432j43726n8400P3694R5683k3566
5450H8031m2864n3523J36595L2885o4395k1257J4635N0115j3547k1609o5782j6610
5438B2674J5416K8942J17047k7105j48837L1386P8833L4519j3712q7109K4442
5427G6496J72770j489j17701q3050O1299R0661L1207J2421o8720R646O1284O7821
5415C12645n256j270m3976M9246q416J0376k4025j4812M8906m4969J6640Q067
5403C03156M1089m1207j14347J6087P5224n0812n5830j8797L6242J8565L6896
5392B46266Q7876J4519r9998p1204p9267o548P5319m7013m707Q7791r958r425
$$ plain form
5472 294428 253950 136079 129226 185139 242785 171273 57003 44040 178753 215802 144007
5461 144007 98597 -1263 -27616 97022 178778 144346 620 -57780 15914 111597 88031
5450 88031 45167 -8356 128239 161124 96729 75472 90107 140222 126675 105066 39284 22674
5438 22674 38090 67032 184079 156974 8137 39523 118356 152875 139163 52054 76496
5427 76496 249266 247777 130076 47026 108325 198986 230193 242614 173894 183540 244824 312645
5415 312645 307389 306119 262143 311389 302973 313349 289324 274512 323418 278449 295089 303156
5403 303156 344245 303038 188691 204778 280002 229190 173360 154563 190805 209370 246266
5392 246266 334142 348661 248663 177459 98192 91644 166963 119950 115243 203034 193076 183651
5380A83651N6154j2292L7530M240l3140l7791J0441m4432O1112Q0906m9238n9995
5368A97146q737O5462K6426j2901k5056L8041J3401j7638p7455m9069K7905M0244
5356B17769k5049K0737L6239l3207q8898n2737L250P2463P1155j7158r7799q753
5344I8012K2594j7056n6974P4813J3899o8326n2763L1883P6330n3299K5966N5957
5332A51036L7026k8724r1152M5592Q1573J064j0960L3642P2409N60j43243k8779
5320A20044k2787Q0405P6866M0475L4822j14706j73116J05024J90207O81j49554
5309A88361p6245J1191J3363L1431j2996M3453L801m7847l6510J9818J4400K6161
5297A78381J960k997k3962J0209R0622m3034L9505n1712l9953P2710L913M019
$$ plain form
5380 183651 239805 227513 265043 269283 236143 198352 208793 164361 225473 306379 257141 197146
5368 197146 188409 253871 280297 267396 242340 280381 293782 276144 198689 149620 177525 217769
5356 217769 192720 213457 249696 216489 127591 74854 78104 150567 221722 204564 106765 98012
5344 98012 120606 103550 46576 121389 135288 66962 14199 46082 122412 69113 95079 151036
5332 151036 188062 159338 68186 113778 195351 196415 185455 219097 291506 292066 148823 120044
5320 120044 97257 177662 254528 295003 329825 215119 42003 147027 337234 337915 188361
5309 188361 112116 123307 136670 168101 155105 198558 202359 154512 118002 137820 152220 178381
5297 178381 180341 177344 153382 163591 254213 211179 250684 198972 159019 231729 235642 239661
5285B39661n6458K2689j02831R3820J05859N5535q8786p6639L8784J79616J4656
5274D25906n5715j23062j7150R4770J8815N1336K3189L4273m8027j34832R8503
5263C68006J60214M8350n8742q2276m8288L7803J2973M8142k8191k6319m6133
5252C85539m6276M2458L5301J9633m3590J3049L5625R805O8084K5942k427p1134
5240D72009j06051J47636O7772Q459j05508l7155L8832m7135Q8283K6224m4639
5229E08727m5015m3893M1713J10296J09924j03906j08741K0009R7745l5883k6171
5218E24805q1521O5086N3058R533L3033l4992K4618k086n4675L0647K0027M2812
5206F30345O149l0463M0044Q205j0475J5866j4914L2441m6911n8065O6925P1230
$$ plain form
5285 239661 183203 205892 103061 196881 302740 358275 269489 192850 231634 411250 425906
5274 425906 370191 247129 229979 324749 343564 394900 418089 452362 404335 269503 368006
5263 368006 528220 576570 517828 435552 387264 425067 438040 486182 457991 431672 385539
5252 385539 339263 381721 417022 436655 393065 406114 441739 451544 519628 545570 543143 472009
5240 472009 365958 513594 581366 589825 484317 447162 485994 438859 527142 553366 508727
5229 508727 463712 419819 461532 571828 681752 577846 469105 489114 586859 550976 524805
5218 524805 443284 508370 561428 570961 603994 569002 593620 591534 536859 567506 587533 630345
5206 630345 636494 606031 646075 654280 643805 659671 644757 677198 630287 572222 639147 710377
5194G10377P038r2560J67P151j5564J1237o2146n8044o344R153M1768K8398j8699
5181E61932p796m4933m929J3144K6514L1351l6388r246l2415k0737J28097n0831
5169E53763j09158J8915O1045R8770L8546j3960L9417k7969r3545k6194Q6410
5158F26040K4729K8081n0239o4971N912l7730L7046Q9335p9006j2380N6484j7687
5146F05614K1861K5904K8435k2459o7831o1739M685O8433L9990o2361m506k6368
5134E49658N3633o2711r877Q5262l2017o9909L4328O7677M2978j78772n9482J52577
5122E73345J59452J0216j41958n6081L3810J0222M8109L2728N156M4137m6318
5111F72818j2545J0608j40827N7493J01410L9379j34797k00773K2235J21054J52217
$$ plain form
5194 710377 717415 624855 625022 632173 616609 627846 565700 507656 501312 510465 552233 580631 561932
5181 561932 554136 509203 504274 517418 543932 575283 538895 529649 497234 476497 604594 553763
5169 553763 444605 463520 524565 623335 661881 647921 687338 659369 565824 539630 626040
5158 626040 650769 678850 628611 563640 569552 531822 568868 658203 579197 566817 623301 605614
5146 605614 627475 653379 681814 659355 591524 529785 534470 602903 642893 580532 576026 549658
5134 549658 603291 540580 530703 615965 583948 514039 548367 616044 659022 480250 420768 573345
5122 573345 732797 743013 601055 544974 578784 589006 637115 669843 674999 719136 672818
5111 672818 660273 670881 530054 587547 688957 728336 593539 392766 415001 536055 688272
5100F88272m7263n0641m8349Q2037K8905L4944K2914m2045m2856M8520Q0792O635
5088G61865p7815q3638O2991J10841M3853m5649k6086j6118L0898M501K867R7156
5076H65666O7856k3381j48399n5467J03587J09997J04357j05615j12844j9577
5066G86180P1549P1012L8824p1584K4957l918M3607N0726M4434J0380r4278k8464
5054I43425R5639J08002j9121j08910m2694K1864R6015J18845k1154r410p4414
5043A108087m4119M7690M1437Q0054M0709q7707l0527m9004N6397N3691O5019
5032A281727m9576j02540J8102J0099L1198N5958o840j8645m2314k3211J23950
5021A277908J03064j17697j64884J3506Q7171O6362m0854n3008p1822J03479K35419
$$ plain form
5100 688272 641009 590368 542019 624056 652961 687905 710819 668774 625918 674438 755230 761865
5088 761865 684050 600412 663403 774244 818097 772448 746362 730244 761142 765643 768510 865666
5076 865666 933522 910141 761742 706275 809862 919859 1024216 918601 805757 786180
5066 786180 857729 928741 967565 895981 920938 917020 960627 1011353 1055787 1066167 971889 943425
5054 943425 1039064 1147066 1127945 1019035 976341 998205 1094220 1213065 1191911 1182501 1108087
5043 1108087 1063968 1111658 1153095 1233149 1273858 1186151 1155624 1106620 1163017 1216708 1281727
5032 1281727 1232151 1129611 1147713 1157812 1189010 1244968 1238128 1219483 1177169 1153958 1277908
5021 1277908 1380972 1263275 1098391 1111897 1199068 1265430 1224576 1171568 1099746 1203225 1438644
5010A438644k4807q6833p3083n6071O6513P8977P21L4836K7237m7430r2103L2734
4998A299335j7836Q5847N9818j03426m7477q5538l043J02540J08900m5481j46269
4987A207370n0482R7110R6729k6679j24057p3956J16792P9911o7079n9500j6206
4976A179953p8624J9810J64107J3624o7511n5639r986M3798O7973L4899N1407
4965A363811k6902l5840k3517J5346J61910M0751o3924J3163L5688N5438K9004
4954A564928O8899J22729N2356k4092r2323O6014Q4466L0698k8064l1188j8803
4943A795620k8465p7423j5072Q4715R763q955O1936R3954k7022p1975N3166J01349
4931A971591J33895J9957n6656P5701M6391J40237J88277J31719O7994J13260
$$ plain form
5010 1438644 1413837 1327004 1253921 1197850 1264363 1343340 1344061 1378897 1406134 1358704 1266601 1299335
4998 1299335 1281499 1367346 1427164 1323738 1276261 1190723 1187680 1290220 1399120 1353639 1207370
4987 1207370 1156888 1253998 1350727 1324048 1199991 1126035 1242827 1322738 1255659 1196159 1179953
4976 1179953 1101329 1121139 1285246 1298870 1231359 1175720 1165734 1209532 1277505 1312404 1363811
4965 1363811 1336909 1301069 1277552 1292898 1454808 1495559 1431635 1444798 1480486 1535924 1564928
4954 1564928 1633827 1756556 1808912 1784820 1692497 1758511 1842977 1873675 1845611 1814423 1795620
4943 1795620 1767155 1689732 1674660 1759375 1769138 1760183 1822119 1916073 1889051 1817076 1870242 1971591
4931 1971591 2105486 2125443 2068787 2144488 2190879 2331116 2519393 2651112 2719106 2832366
4921B832366K22337J97103R7735M9332q5792j87563j45922j90286m0629j05720
4911B642961j08770n4072M617N9410k0832j2273l441R4738N3111K0024j0468J17328
4899B782333N3071J00571J16689J55283K03896K02199J56964J44873L52931J84077
4889D452887m4914j73577l28713m07260k64468k09641k26105q4268n2720n4436
4879B606785j01142l3393J7811K8444M7754m9167r8625P8467J99571Q1177n6669
4868B721013p6854K3664J25287J74637R8695J11514k171N534P3865n2803k10407
4857B991974j30744j70319j03510J4764k1908l0052q5387j0875L0825L5279l5836
4846B484211q9997k9992J06306l0830k9401J03539M312k295j02901j08481J6253
$$ plain form
4921 2832366 3054703 3251806 3349541 3398873 3313081 3125518 2979596 2789310 2748681 2642961
4911 2642961 2534191 2480119 2484736 2544146 2523314 2511041 2507600 2602338 2655449 2675473 2665005 2782333
4899 2782333 2835404 2935975 3052664 3207947 3411843 3614042 3771006 3915879 4268810 4452887
4889 4452887 4407973 4234396 3905683 3498423 3233955 3024314 2798209 2713941 2661221 2606785
4879 2606785 2505643 2472250 2490061 2518505 2566259 2517092 2418467 2496934 2696505 2777682 2721013
4868 2721013 2644159 2667823 2793110 2967747 3066442 3177956 3175785 3181319 3255184 3202381 2991974
4857 2991974 2861230 2690911 2587401 2602165 2580257 2550205 2464818 2453943 2484768 2520047 2484211
4846 2484211 2394214 2364222 2470528 2439698 2410297 2513836 2518148 2515853 2412952 2304471 2320724
4835B320724R5679K5877q5021n0879L0226m0442J10514J00815K6789L4943j39897
4824B429328Q093J41688J54243M5472K702J1418j24412k0412K64428M9432n1538
4813B910442m8447K2336J52212N636m5135L9005J02378M9882o9066m9547N0403
4802C120099L3240Q5345L3326K7335R9186j16732Q723Q1014m4983J1935K5389
4791C363877J17762Q5103n9534r0268r5197J02853K21540K18495l3001k05551
4781C626079j7165J83306J71927P7050r1279j8058M3292N3529Q8237M1031J27569
4770D285518O9255L3533J5897J2291J06898M1427M768M9456p5185J22556J5929
4759D682343J844J21422o8916N1925P7059M6763R6755N0013J9826J9936M6173
$$ plain form
4835 2320724 2416403 2442280 2357259 2306380 2336606 2296164 2406678 2507493 2534282 2569225 2429328
4824 2429328 2437421 2579109 2733352 2778824 2781526 2792944 2668532 2648120 2912548 2961980 2910442
4813 2910442 2861995 2884331 3036543 3042179 2997044 3036049 3138427 3188309 3119243 3069696 3120099
4802 3120099 3153339 3238684 3272010 3299345 3398531 3281799 3290522 3371536 3326553 3338488 3363877
4791 3363877 3481639 3566742 3507208 3416940 3321743 3424596 3646136 3864631 3831630 3626079
4781 3626079 3608914 3792220 3964147 4041197 3949918 3931860 3975152 4028681 4116918 4157949 4285518
4770 4285518 4354773 4388306 4404203 4416494 4523392 4564819 4569587 4619043 4543858 4666414 4682343
4759 4682343 4684187 4805609 4736693 4788618 4865677 4912440 5009195 5059208 5079034 5098970 5145143
4748E145143J58072J45383L3020r627K4246K09838J03198J26465Q9990O3858K4809
4737F114395r64O2012K69908K10325N3293o3569J17090K10192J00061J92665J94383
4726G459791J44528O9967k8020q7713o6727L5491K2980l0522N6692J89663J16822
4715G882952N2479O2577R4647J51908K30690K42495O3546N6029P7379K41229L07625
4704I463556J08141J54324J01256J12515K77632K33215L88905M44813M01712L22914
4694A2008983K15127p0860l06159j49490L8448j7469r7766O98J25735J88850J73059
4683A2109156M6706J44914K34118K65887J99783L11726K06122L9895K88748M38178
4673A4285233K40152K09943K51158L28767L75256M07630M00621N83438N12663
$$ plain form
4748 5145143 5303215 5448598 5481618 5471991 5496237 5706075 5809273 5935738 6025728 6089586 6114395
4737 6114395 6113431 6175443 6445351 6655676 6708969 6645400 6762490 6972682 7072743 7265408 7459791
4726 7459791 7604319 7674286 7646266 7558553 7491826 7527317 7550297 7519775 7576467 7766130 7882952
4715 7882952 7935431 7998008 8092655 8244563 8475253 8717748 8781294 8837323 8914702 9155931 9463556
4704 9463556 9571697 9726021 9827277 9939792 10217424 10450639 10839544 11284357 11686069 12008983
4694 12008983 12224110 12153250 11847091 11697601 11736049 11718580 11620814 11621512 11747247 11936097 12109156
4683 12109156 12155862 12300776 12534894 12800781 13000564 13312290 13518412 13558307 13847055 14285233
4673 14285233 14525385 14735328 14986486 15315253 15690509 16098139 16498760 17082198 17594861
4664A7594861L43188L15394L12038L10412K94490K52314K62155L56883L49381
4655B0391116M30356N31669N98227L34849L95126N10062O04015N48361M96839
4646B4840620O21515P41818O86191O81648P83408Q97054R27201Q28411R13338
4637C1921204J044000J075392J114444J229955J236256J266879J480387J562597
4629D1931114J768017J675404J669244K055629K344905K459699K558290K690570
4621E9152872K982460L217219L598360M130879M491402M855710N163759N605156
4613I3197817N959006N978434N573432M782073L297171J541000k11425j354325
4605A18763183j879562j822285j478242j139833n41386O6330Q00271J583619K234235
$$ plain form
4664 17594861 17938049 18253443 18565481 18875893 19170383 19422697 19684852 20041735 20391116
4655 20391116 20821472 21353141 21951368 22286217 22681343 23191405 23795420 24343781 24840620
4646 24840620 25462135 26203953 26890144 27571792 28355200 29252254 30179455 31007866 31921204
4637 31921204 32965204 34040596 35155040 36384995 37621251 38888130 40368517 41931114
4629 41931114 43699131 45374535 47043779 49099408 51444313 53904012 56462302 59152872
4621 59152872 62135332 65352551 68950911 73081790 77573192 82428902 87592661 93197817
4613 93197817 99156823 105135257 110708689 115490762 118787933 120328933 120117508 118763183
4605 118763183 116883621 115061336 113583094 112443261 111901875 111968205 112768476 114352095 116586330
4596A16586330K974776L690500M676755N600935O535608P538946Q662521R861792
4588A66128163J1379782J2809905J4301512J5477017J6175382J6871793J7692071
4581B70835625J8865275J9911878K1029930K0404926J1512194r514140l0691437
4574C22354251l6762813l0791171k3168979j7165486j2852032r316159o176579
4567A86121032l762071j764921P0241J949970M020348N544780P248885R079021
4559B08507285J0797815J2599987J4413499J6787766J9608767K3031072K7623682
4552C33369873L3134833L9945928M5637623M2561441J7445313k7909957o2652178
4545D21532876o6711609n3567435m0163671l0914952k4305898j9012223j4750506
$$ plain form
4596 116586330 119561106 123251606 127928361 133529296 140064904 147603850 156266371 166128163
4588 166128163 177507945 190317850 204619362 220096379 236271761 253143554 270835625
4581 270835625 289700900 309612778 330642708 351047634 362559828 353045688 322354251
4574 322354251 285591438 254800267 231631288 214465802 201613770 192297611 186121032
4567 186121032 182358961 180594040 180664281 182614251 186634599 192179379 199428264 208507285
4559 208507285 219305100 231905087 246318586 263106352 282715119 305746191 333369873
4552 333369873 366504706 406450634 452088257 494649698 512095011 484185054 421532876
4545 421532876 354821267 301253832 261090161 230175209 205869311 186857088 172106582
4538A72106582j1184206q346230n773963l648150j842182k63097P33709J493930
4530A43276393K164913K648055L405271M743252P154326J0582349J4412886J8357407
4522B06744852K2386198K4830583K0413172J247238k4971840l7435667l3658476
4515A79556060k5559353j9523094j5478153j2430861j0057636q111497o482156
4508H1913310n014565l922738l064062k242590j761782j551073j858014k290078
4500F0208408k121517j847440j481154j197180j007096p38961r64408j475518
4492D9375134j924222k183427j969374j704558j600179j479511j438540j195827
4484C5879496j087508j068487j114684r86975o86010n72959n22002n11343m63953
$$ plain form
4538 172106582 160922376 152576146 146802183 143154033 141311851 141048754 141782463 143276393
4530 143276393 145441306 148089361 151494632 156237884 163392210 173974559 188387445 206744852
4522 206744852 229131050 253961633 274374805 275622043 250650203 213214536 179556060
4515 179556060 153996707 134473613 118995460 106564599 96506963 88395466 81913310
4508 81913310 76898745 72976007 69911945 67669355 65907573 64356500 62498486 60208408
4500 60208408 58086891 56239451 54758297 53561117 52554021 51815060 50850652 49375134
4492 49375134 47450912 45267485 43298111 41593553 39993374 38513863 37075323 35879496
4484 35879496 34791988 33723501 32608817 31621842 30935832 30362873 29840871 29329528 28865575
4475B8865575m30362n00229n09482l72722k96277l06082k98979k05839k32710
4466B5712893l33608k04701j96936j33326j32005k02475j81680k13575j80044
4457B3934543j10497j07594m5310r6490q1572P7432Q4831J5260L7829J61435J58132
4446B4027999J8077J8187K73382K86386L11141L16202M28171O14650O66818P02955
4436B7663968P88086J064379J115979J131950R49136M90046L16991M16107N86818
4427C4523460N34487J25582n87081q27572r59514p19882m01992L4361J14354P5538
4417C1911741K21123L37245N63571P94234R18084J028143J163517J448270J770206
4408D0156134J920517K215114K635791L047067K896489K325323J725446J675421
$$ plain form
4475 28865575 28435213 27934984 27425502 27052780 26756503 26450421 26151442 25945603 25712893
4466 25712893 25379285 25174584 24977648 24844322 24712317 24509842 24328162 24114587 23934543
4457 23934543 23824046 23716452 23671142 23574652 23493080 23570512 23655343 23670603 23708432 23869867 24027999
4446 24027999 24046076 24064263 24337645 24624031 24935172 25251374 25679545 26294195 26961013 27663968
4436 27663968 28452054 29516433 30632412 31764362 32713498 33203544 33520535 33936642 34523460
4427 34523460 35057947 35183529 34596448 33768876 32809362 32089480 31687488 31721849 31836203 31911741
4417 31911741 32132864 32470109 33033680 33827914 34745998 35774141 36937658 38385928 40156134
4408 40156134 42076651 44291765 46927556 49974623 52871112 55196435 56921881 58597302
4400E8597302K146032J797014O64289q94839j964976j910517j228947m65064L37642
4391E7077936J108941J715356K554982K504722Q68865j134114j426308n06099
4383F2764281M41614J094569J491223K079680K703674L294850L947319M671661
4375H2488871N240395N563879O105917P049459P919245Q002528P354536P424542
4367A37149372R546057J3153746J7883181K3847849K8892944K7929697J2635033
4360B71037879j2755760k7033553k5985841k2002258j9278153j5724047j1867556
4353A36390711q829881o457353m376804k678399j372216k75064J076592K334463
4345A15812049L666840N112036O413811P772478Q818166R901572J1435998J3607960
$$ plain form
4400 58597302 60743334 62540348 63204637 62309798 60344822 58434305 57205358 56740294 57077936
4391 57077936 58186877 59902233 62457215 64961937 65830802 64696688 63270380 62764281
4383 62764281 63205895 64300464 65791687 67871367 70575041 73869891 77817210 82488871
4375 82488871 87729266 93293145 99399062 106448521 114367766 122370294 129724830 137149372
4367 137149372 146695429 159849175 177732356 201580205 230473149 258402846 271037879
4360 271037879 258282119 231248566 205262725 183260467 163982314 148258267 136390711
4353 136390711 127560830 121103477 116726673 114048274 112676058 112400994 113477586 115812049
4345 115812049 119478889 124590925 131004736 138777214 147595380 157496952 168932950 182540910
4337A82540910J6781901K1176165K7397024L5475552M5341807N4668176N4163347
4330D37544882K8402161k0238832n8429639o5125776n2797928l8932729k9219976
4323B01202163k2905651j8398462j4799433j1484418q564298o557984n165566
4316A13326351l957237k496089j150054k10013P21461J747616K894423M119033
4308A14995491N161470O316139P731854R481437J2467254J6677329K1945609K6958340
4300B21734923K8199370J7003957q732547l1200180l5445785k7921192k0026864
4293A43611682j5142044j2574506j1089138r615147p933169o394352n094180m160657
4285G1608489l445755k881859k467407k005121j591453j425730j309169r58085
$$ plain form
4337 182540910 199322811 220498976 247896000 283371552 328713359 383381535 437544882
4330 437544882 465947043 445708211 387278572 322152796 269354868 230422139 201202163
4323 201202163 178296512 159898050 145098617 133614199 125049901 118491917 113326351
4316 113326351 109369114 106873025 105722971 105512958 106234419 107982035 110876458 114995491
4308 114995491 120156961 126473100 134204954 143686391 156153645 172830974 194776583 221734923
4300 221734923 249934293 266938250 258205703 227005523 191559738 163638546 143611682
4293 143611682 128469638 115895132 104805994 95190847 87257678 80863326 75769146 71608489
4285 71608489 68162734 65280875 62813468 60808347 59216894 57791164 56481995 55523910
4277E5523910o80192n29750n60549m38018k87267k61325j68420k46385k21595
4268E2130409j44712j65424O1220K67176N12845O19294M89763K93516j84801n45349
4258E3333937n72672l53671q0191J12187L52187M28029M77722O44688P57709Q31760
4248E5931685R82922J021959J097986J225129J452015J466644J440105J612597
4240F6231042J743294J944244K035299J982405K109548K437242K612534K851855
4232H3947463K959697L032831L042874L233564L603064L772407M076197M375635
4224A12043732M657060N179343N529514N815208O134103O601942P079631P366011
4216A60406544P505793P866330Q087990Q173790Q104051P767724P387644O662585
$$ plain form
4277 55523910 54843718 54313968 53753419 53315401 53028134 52766809 52598389 52352004 52130409
4268 52130409 51985697 51820273 51881493 52148669 52661514 53280808 53770571 54064087 53879286 53333937
4258 53333937 52761265 52407594 52327403 52439590 52791777 53219806 53697528 54342216 55099925 55931685
4248 55931685 56914607 57936566 59034552 60259681 61711696 63178340 64618445 66231042
4240 66231042 67974336 69918580 71953879 73936284 76045832 78483074 81095608 83947463
4232 83947463 86907160 89939991 92982865 96216429 99819493 103591900 107668097 112043732
4224 112043732 116700792 121880135 127409649 133224857 139358960 145960902 153040533 160406544
4216 160406544 167912337 175778667 183866657 192040447 200144498 207912222 215299866 221962451
4208B21962451N753514M676244L432873K122227Q22125n19028k018986l621236
4200B32610184m888482o013307o906667p682929q379628q708789q934443r002618
4192A72093321q941697q741049q343529p957414p573587p087105o586848o181354
4184A10680738n805916n310557m904937m660022m309439l923915l497589l275716
4176G4992647l182838l038903k770088k538712k551583k580651k397669k024823
4168E3907380j996519j892546j786109j725321j533797j484964j351158j264873
4160D0872093j234409j203619j233072j037871j001523j034375r64222r06271
4152C2256731q36009q36822q65071p28286p16565p46588p07672n90377o56034
$$ plain form
4208 221962451 227715965 232392209 235825082 237947309 238769434 238250406 236231420 232610184
4200 232610184 227721702 221708395 214801728 207118799 198739171 190030382 181095939 172093321
4192 172093321 163151624 154410575 146067046 138109632 130536045 123448940 116862092 110680738
4184 110680738 104874822 99564265 94659328 89999306 85689867 81765952 78268363 74992647
4176 74992647 71809809 68770906 66000818 63462106 60910523 58329872 55932203 53907380
4168 53907380 51910861 50018315 48232206 46506885 44973088 43488124 42136966 40872093
4160 40872093 39637684 38434065 37200993 36163122 35161599 34127224 33163002 32256731
4152 32256731 31420722 30583900 29718829 28990543 28273978 27527390 26819718 26229341 25573307
4143B5573307p27189n91198m46296n00712n85616o09515m71288l93691m88668
4134B0759134l87191m28773l72210m17194l82124l36438l10945l40903m10692
4125A7372664l85942k46533k25873l63317m32321l10198j31515j73016l58235
4116A4745714l78723l39584j34296k13888k93891k96102k60712k45640k35131
4107A2347747k40447k55958k61651k03182k08948k22166k57418k81128j41965
4098A0274884j31719j28439k10381k72942k29299q8658p0499q2520k61089k24014
4088H575324l6282l5330q9775k69440k14223j38796n7443m0230k30230k16713
4078G246862j14091k7831q4258j73568j71547r8868j42864p6382r2671p5218l3937
$$ plain form
4143 25573307 24846118 24254920 23808624 23307912 22722296 22112781 21641493 21247802 20759134
4134 20759134 20371943 19943170 19570960 19153766 18771642 18435204 18124259 17783356 17372664
4125 17372664 16986722 16740189 16514316 16150999 15718678 15408480 15276965 15103949 14745714
4116 14745714 14366991 14027407 13893111 13679223 13385332 13089230 12828518 12582878 12347747
4107 12347747 12107300 11851342 11589691 11386509 11177561 10955395 10697977 10416849 10274884
4098 10274884 10143165 10014726 9804345 9531403 9302104 9213446 9142947 9060427 8799338 8575324
4088 8575324 8539042 8503712 8413937 8144497 7930274 7791478 7734035 7693805 7463575 7246862
4078 7246862 7132771 7104940 7020682 6847114 6675567 6576699 6433835 6357453 6264782 6189564 6155627
4067F155627j29790r8071o2516o8588r4504m0537j7647l7627p0673j08593q2607
4056E344474p8377M5003l2277q2460k04179j15901k453J2660q6028j55594q8340
4045D556528j4307L258q7802j16181k5917n7867j50151J2685N6282n6109j12390
4034D008029J0374K4982J0526p2527p0070m88O3747r212j53803j1263j0734j2291
4022C777270l0892p8860J3810j6338K0839M4612J5818j09670j30918L7011N1056
4011C593738n9193j31007n8258P3117P9752r5312j07781k0165Q1633O2840P452
4000C426816K7208J07301k3167L7977Q2122J20938J36920o2248J05963L1755j81318
3989C810267j78840j06024j01798l2660k19746m5749p8032m2124n2004q7846N7591
$$ plain form
4067 6155627 6025837 5927766 5865250 5796662 5702158 5661621 5643974 5606347 5535674 5427081 5344474
4056 5344474 5266097 5311100 5278823 5196363 4992184 4876283 4873830 4886490 4800462 4644868 4556528
4045 4556528 4542221 4545479 4457677 4341496 4315579 4257712 4107561 4120246 4176528 4120419 4008029
4034 4008029 4018403 4043385 4053911 3981384 3911314 3910826 3974573 3965361 3811558 3800295 3789561 3777270
4022 3777270 3746378 3667518 3681328 3664990 3685829 3730441 3746259 3636589 3505671 3542682 3593738
4011 3593738 3534545 3403538 3345280 3418397 3498149 3402837 3295056 3274891 3356524 3419364 3426816
4000 3426816 3454024 3561325 3538158 3576135 3658257 3779195 3916115 3853867 3959830 3991585 3810267
3989 3810267 3631427 3525403 3423605 3390945 3171199 3125450 3047418 3005294 2953290 2865444 2923035
3978B923035l1814j4909L2838L7516R0147n2277o1610J19247L2464Q7197n167
3967C156667O4071J58025J14791K52893K96093K72703J52962j21275k87713l38359
3957C720858l02946k94641k50123j21442j05559j41058k3534j43154n4993P269
3947B290677p0434q1786p3901P0822n2376o366l7177m7492Q3175N7538R2816m0030
3935B185466n2182J05180J73766J22510R0915j2592m4125j10395k22403q8797
3925B147343j89297j88690p6908p1327O3918P736j01392q0458N602J40228r7111
3914A559644j17139M000J18841N8512j76993j22593L0795O3673L4443o3786j06669
3903A282728k4573j6202J12457O2925j17738j19248p9417Q8957L0438j09194j8352
$$ plain form
3978 2923035 2891221 2876312 2909150 2946666 3036813 2984536 2922926 3042173 3074637 3161834 3156667
3967 3156667 3220738 3378763 3493554 3746447 4042540 4315243 4468205 4346930 4059217 3720858
3957 3720858 3417912 3123271 2873148 2751706 2646147 2505089 2481555 2338401 2283408 2290677
3947 2290677 2220243 2138457 2064556 2135378 2083002 2076636 2039459 1991967 2075142 2132680 2225496 2185466
3935 2185466 2133284 2238464 2412230 2534740 2625655 2613063 2568938 2458543 2236140 2147343
3925 2147343 1958046 1769356 1692448 1621121 1685039 1692775 1591383 1510925 1516527 1656755 1559644
3914 1559644 1442505 1446505 1565346 1623858 1446865 1324272 1355067 1418740 1453183 1389397 1282728
3903 1282728 1258155 1241953 1354410 1417335 1299597 1180349 1100932 1189889 1220327 1111133 1092781
3892A092781J5417N1446j2344m4868J01972o6211r3955n9065N4652J26226j32771
3881A033280m7160O5633N68q588q8746L2271R0180j21374n7400p7244J48994J52499
3869A122913n8045o1057j09859m589N5738k5735K1114q4237j4400J1679k6805
3858H26717Q4336M5528n4447N877j36354J7853J23471J6323o6846q8076l6314
3847G38068M3325M9959n5362k6646j2947k7870l7637J10326n0875K4433k4052
3836G30722j47577O4282K3447R8469l6677k31475j4856J17525J37686K4366o9294
3825F96618j1682r9965l2718J13955n9248J2477j17606Q383l24M6211R3070p9915
3813E69256o5096L6126P5386j7602q119l7996P0367n8208p3894m9251O8846J32033
$$ plain form
3892 1092781 1108198 1159644 1147300 1102432 1204404 1138193 1044238 985173 1039825 1166051 1033280
3881 1033280 986120 1051753 1052321 1043733 954987 987258 1077438 956064 898664 821420 970414 1122913
3869 1122913 1064868 1003811 893952 889363 945101 919366 940480 856243 841843 853522 826717
3858 826717 911053 956581 902134 908011 771657 789510 912981 929304 862458 774382 738068
3847 738068 781393 831352 775990 749344 736397 708527 670890 781216 730341 754774 730722
3836 730722 583145 647427 670874 769343 732666 501191 486335 603860 741546 765912 696618
3825 696618 684936 584971 552253 666208 606960 619437 501831 510214 509890 556101 649171 569256
3813 569256 504160 540286 615672 598070 589951 551955 622322 564114 490220 440969 509815 641848
3801F41848r419L672j25304l2208J83075N3142j05432j47580n8249P9773O6007
3790E49325L9490n0051l3607L3291P8437N6486n8993j30649l7799p862R3107O3749
3778E94924n6228l372K4156M8054q0955l0465N6321k3061K4905o0745m1642O5979
3766E17871m2109l0653p996o1984n6515j0046O3358P6395j09119p9322j09768
3755A50112Q3266J52583m2738j21807k8586m1251n8323L1239J13296m5836j19299
3744G2656k9418O5157J43841l0770o4816O357J9369o417M759J8557M3427o3359
3732A79343N570M8386k2141N7575j05319J1852L2894o8285Q0241l308J37717P972
3720C62497j42488k4146N3174Q6719n749j22997J4531K6818j8377L4337Q172J026
$$ plain form
3801 641848 632429 636101 510797 478589 661664 714806 609374 461794 403545 483318 549325
3790 549325 588815 538764 505157 538448 616885 673371 614378 483729 445930 438068 531175 594924
3778 594924 538696 535324 559480 607534 526579 496114 552435 529374 554279 493534 451892 517871
3766 517871 475762 445109 437113 375129 318614 308568 371926 448321 339202 259880 150112
3755 150112 233378 385961 343223 221416 192830 151579 93256 124495 237791 191955 72656
3744 72656 43238 108395 252236 221466 156650 163007 182376 175959 180718 199275 242702 179343
3732 179343 184913 233299 211158 268733 163414 175266 208160 139875 220116 216808 354525 362497
3720 362497 220009 195863 249037 335756 330007 207010 221541 248359 229982 264319 272491 273517
3708B73517r7059p5581N3987K259M0185j32216N133L2776p974M6119o0940K0467
3696A00673j8320o5125q639J7636k3582M4401j16966J8934q634K1113Q2120m4718
3684a107k0801q03N6928J72574L3090j19075n2747K6174P5038m6557N2224L1045
3672B05983q214L4339o4133j8659J4152r625m0176j4369N0193M1653R777n9201
3660A41720k9637M2314l4435o6721M5067P2592M542n8265j39111n101Q6861K1248
3648H1074l7668k8789L6959N0171J908l837p4832L992M090N8573N4112n2451N8003
3635A51305K0449K715J0786N5936j824n4859j2042J14600J6763Q819j23999m497
3623A84152P1877M1290j0445j18367J4094L5726M3346m2948j17202l4045J01345
$$ plain form
3708 273517 176458 100877 154864 157123 197308 65092 70225 103001 95027 141146 80206 100673
3696 100673 82353 17228 8589 26225 2643 47044 -69922 -50988 -59622 -38509 43611 -1107
3684 -1107 -21908 -22711 34217 206791 239881 120806 68059 94233 169271 122714 174938 205983
3672 205983 197769 232108 167975 149316 163468 153843 113667 99298 149491 191144 200921 141720
3660 141720 112083 154397 119962 53241 98308 170900 175442 117177 -21934 -27035 59826 81074
3648 81074 43406 14617 51576 101747 103655 99818 24986 28978 33068 91641 145753 93302 151305
3635 151305 171754 174469 185255 241191 239367 184508 172466 287066 303829 312648 188649 184152
3623 184152 256029 297319 286874 168507 182601 218327 261673 218725 101523 67478 168823
3612A68823O6981q4509l6936J927J3375r740j6066l7120P329m1139k7776J20028
3600A25177R501q1411r5789M6085R7481k1196r5607j01473J4376K01634K1293
3589A20071p3303q6337M1928P6658J29364j3533k24455j5992K07020P7494j08854
3578A30061q9206k1327K0195j2239L7087Q4096J0258m2245p0130L3327R0689n1186
3566A19380q5766j7681L0479J1300n9026p3796J10983O3935o4641j16180J4969
3555f6044N8132P7952m9182m4632m7779J7433J23910r5l6599p5192J012M0128
3543i56k5594k4107O4398o1994m0572l8324J32061J31742l5018j13794L8006J01539
3531A27387P0818r9542j19542L4408M291J8595q822M7738P5770j02894p3966n3574
$$ plain form
3612 168823 235804 151295 114359 116286 129661 119921 103855 66735 74064 32925 5149 125177
3600 125177 134678 53267 -42522 3563 101044 79848 -15759 -117232 -102856 98778 120071
3589 120071 46768 -39569 2359 79017 208381 194848 -29607 -45599 161421 238915 130061
3578 130061 40855 19528 39723 27484 64571 148667 158925 116680 46550 79877 170566 119380
3566 119380 33614 15933 46412 57712 -1314 -75110 35873 99808 35167 -81013 -66044
3555 -66044 -7912 70040 20858 -23774 -71553 -54120 69790 69695 33096 -42096 -41084 -956
3543 -956 -26550 -50657 13741 -48253 -88825 -127149 4912 136654 101636 -12158 25848 127387
3531 127387 198205 98663 -20879 13529 17820 36415 27593 75331 151101 48207 -25759 -79333
3519g9333M1575L7619J671k9580n9205P1428o7614O5791J09424q8541p6737K1597
3507e1905L35N1848q4521K8816M7479p5167O4087l0904J9910K2648p8930J01828
3495A5524K7598n1430l2275p8090N3921L895n527L221L0066J48907o8790j17113
3483g0093K4745Q8309J24069K8331p2128n3854p9000J26726O2630o3730K6049
3472A42054q0671M5379J427L7470O8470j31501r1873L7703K9255L9183p8015l4111
3460a5230M2543J3164K1415j18395J3732M79N7291L4374p4581J0446o14R0969
3448G5593O3645j64594R3845O0845q424J4927j53154L1093J12428q3625N1514
3437I4093n7196J2813q153j31651P6956L6504Q087m674p3554Q5652Q5356k5220
$$ plain form
3519 -79333 -37758 -139 1532 -28048 -87253 -15825 -83439 -17648 91776 3235 -73502 -51905
3507 -51905 -51570 278 -84243 -55427 -7948 -83115 -19028 -49932 -30022 -7374 -86304 15524
3495 15524 43122 -8308 -40583 -118673 -64752 -60857 -66384 -63163 -33097 115810 47020 -70093
3483 -70093 -45348 42961 167030 195361 123233 69379 -9621 117105 179735 116005 142054
3472 142054 61383 106762 108189 145659 214129 82628 -9245 28458 57713 96896 18881 -15230
3460 -15230 27313 40477 61892 -56503 -42771 -42292 14999 49373 -25208 -14762 -15376 75593
3448 75593 139238 -25356 68489 129334 120910 135837 -17317 13776 126204 42579 94093
3437 94093 36897 49710 41557 -90094 -13138 23366 31453 26779 -46775 38877 124233 99013
3425I9013m2352p3416M2078L3644k7667l8001N0738O0408j15943l9193J52777
3414A02086m1349p3587l2891P2465O5658p7268O1510o6992J5678k2549p3808J65161
3402I4114r7481l0671N0332j0105l543r2757K7608J89115o1985p6327m0502P3940
3390B1738J40434q5423r673k72J258N3790r7865N4417J07667j4694p4318l1571
3378F5488J31860P8282j33110m0526J9571N9222m7436j7069R1603L6980J5610
3367B60475K7336O491k1733j16939j628R6161R484L7989o1993o133O916j052k2387
3354B12987p2330N2301q428L1280K5359m5311O1353j05656L0486R2773m4092L2186
3342B62908l203L7455n2096p2422K4320K0075j9616M7302m267N3985P6200n7176
$$ plain form
3425 99013 56661 -16755 25323 58967 31300 -6701 44037 104445 -11498 -50691 102086
3414 102086 60737 -12850 -45741 26724 92382 15114 76624 9632 25310 2761 -71047 94114
3402 94114 -3367 -34038 16294 6189 2646 -90111 -62503 126612 64627 -11700 -52202 21738
3390 21738 162172 76749 67076 66804 68062 121852 23987 78404 186071 171377 97059 65488
3378 65488 197348 275630 142520 101994 121565 180787 133351 116282 207885 244865 260475
3367 260475 287811 294302 272569 155630 154002 250163 259647 297636 235643 229510 236426 235374 212987
3354 212987 140657 192958 184530 215810 241169 195858 257211 151555 182041 274814 230722 262908
3342 262908 259705 297160 245064 172642 196962 217037 197421 244723 240456 294441 370641 313465
3330C13465l0869j7464J5125k0130Q3616M1162n4321M1055r043M7585J1694m7109
3318C74766l649l108n4075n9361O8919P9628N2321o9319M016n473K718M021K1334
3305D12738O0838J1053m6149K7620R7731M6984j8185k6372r794P0576J55852Q6096
3293H68988m8887j8999R7335R2072L5762J6439o1681q8586o2816J3192P4181K0764
3281I37764m9313J7665k4969L4647M1980n2056L4993R4300R0000j4818J6267J07987
3269A234447M6963J06292L1470J09814J66099J13089J86947J75504J67695J09238
3259B447558M0439J17975M5270j87133p7767p1063J94777K16208J14549J97303
3249C038116J65182K64104K60132J88166j59978m55922l44863N973L5285o0867
$$ plain form
3330 313465 282596 265132 280257 260127 343743 384905 330584 371639 362596 410181 421875 374766
3318 374766 371117 368009 313934 254573 323492 403120 455441 386122 390138 384665 387383 391404 412738
3305 412738 473576 484629 438480 466100 563831 610815 592630 566258 556464 627040 782892 868988
3293 868988 820101 801102 898437 990509 1026271 1042710 981029 892443 829627 842819 917000 937764
3281 937764 888451 906116 881147 915794 957774 905718 940711 1035011 1125011 1110193 1126460 1234447
3269 1234447 1281410 1387702 1419172 1528986 1695085 1808174 1995121 2170625 2338320 2447558
3259 2447558 2487997 2605972 2651242 2464109 2386342 2315279 2510056 2726264 2840813 3038116
3249 3038116 3203298 3467402 3727534 3915700 3755722 3299800 2954937 2960910 2996195 2935328
3239B935328j68295J7782J08328J41331J31919J27920K58617J44456J51793K61141
3229D110320J71699J45325l9673O504L00494J59396K09076L66379O86342R15039
3219G030901R58665J080890O48878l41484r52068j172168r37102p11426m98278
3210E106808l16253k21185q8291k00135j26197J24915J66554J85095L8663J58772
3200D828746K97058J01187J39207K08347K47613K89764K55522N65738P52958Q42064
3190H528204J220120J256192J084834M87277n21097j273166j574365j373644j027433
3181F806922q57544n18418m28688l15341k12701j87431q5065j82590m1556P0147
3171D047735n617l0761K5297J83667K04893K1401J52922K60143L68171N41350
$$ plain form
3239 2935328 2767033 2784815 2893143 3034474 3166393 3294313 3552930 3697386 3849179 4110320
3229 4110320 4282019 4427344 4387671 4394175 4694669 4854065 5063141 5429520 6115862 7030901
3219 7030901 7989566 9070456 9719334 9377850 8425782 7253614 6316512 5605086 5106808
3210 5106808 4790555 4569370 4481079 4280944 4154747 4279662 4446216 4631311 4669974 4828746
3200 4828746 5125804 5226991 5366198 5574545 5822158 6111922 6367444 6933182 7686140 8528204
3190 8528204 9748324 11004516 12089350 12576627 12055530 10782364 9207999 7834355 6806922
3181 6806922 5949378 5430960 5002272 4686931 4474230 4286799 4201734 4019144 3977588 4047735
3171 4047735 4042118 4011357 4036654 4220321 4425214 4446615 4599537 4859680 5227851 5769201
3161E769201O30735P26149Q54427O23803K27034m25469q63580j039911q36083
3152E666306n87749n47739m07149k54718j27500n3601j59592j82604p7929q0932
3142C186793P0176p8557m4822n8409o1310L7848O6567N7815j30816j0773J66614
3131C201126K36622J88622J52972J02006K5892j31249j06184j73854l35168j85919
3121B974866p6484R6533k9666j44197m358L9687J15527j0696n3950J3911Q2482
3110C003655O7274j6925p8601r2064p2442L7700O0867l0780l9455o9879J51816
3099B921166J30968J7199p0231m1877J71653O7139N6076M2465j04867N1285J95730
3088C436706J33195m848k9559N4715J39863J26866K9804j7584J29845P5792K5210
$$ plain form
3161 5769201 6399936 7126085 7980512 8604315 8831349 8405880 7542300 6502389 5666306
3152 5666306 5078557 4530818 4123669 3868951 3741451 3687850 3528258 3345654 3267725 3186793
3142 3186793 3256969 3178412 3133590 3075181 3013871 3051719 3118286 3176101 3045285 3034512 3201126
3131 3201126 3437748 3626370 3779342 3881348 3907240 3775991 3669807 3495953 3160785 2974866
3121 2974866 2898382 2994915 2965249 2821052 2816694 2856381 2971908 2961212 2907262 2921173 3003655
3110 3003655 3070929 3054004 2975403 2883339 2810897 2848597 2909464 2878684 2839229 2769350 2921166
3099 2921166 3052134 3069333 2999102 2957225 3128878 3196017 3252093 3294558 3189691 3240976 3436706
3088 3436706 3569901 3565053 3535494 3590209 3730072 3856938 3886742 3869158 3999003 4074795 4100005
3077D100005J6577Q6026L4058Q474L6558J49003J8646M5589n0131J31450K00836
3066D777091L5477l0184M4242J06947J80863N7655J5104M9642Q4661K13525J33132
3055E668155J46583m3999J5014K52937J94860R2808L3982J03523J65122R1011
3045F719996J47910M3492J12621J42304R1198K65645J81765P9919J42458K44021
3035H171329L85683J45207Q5489J81336L04296L56940K46933O1036K09128K58589
3025A0405966K93880L36908K46470K69056K97283L07250L66856L27355L82257
3016A3233281M23501M70316M09339M49843N67984N94471P17469P42831O61516
3007A8270551P64496N52205N60232O22276N22206O31047O02603Q88837J046157
$$ plain form
3077 4100005 4116582 4202608 4236666 4245140 4281698 4430701 4449347 4494936 4444805 4576255 4777091
3066 4777091 4812568 4782384 4826626 4933573 5114436 5172091 5187195 5236837 5321498 5535023 5668155
3055 5668155 5814738 5770739 5785753 6038690 6233550 6326358 6360340 6463863 6628985 6719996
3045 6719996 6867906 6911398 7024019 7166323 7257521 7523166 7704931 7784850 7927308 8171329
3035 8171329 8557012 8702219 8787708 8969044 9273340 9630280 9877213 9938249 10147377 10405966
3025 10405966 10699846 11036754 11283224 11552280 11849563 12156813 12523669 12851024 13233281
3016 13233281 13656782 14127098 14536437 14986280 15554264 16148735 16866204 17609035 18270551
3007 18270551 19035047 19587252 20147484 20769760 21291966 21923013 22525616 23414453 24460610
2998B4460610J179294J240872J223518J559340J841485K077547K333322K486225
2990C8402213K930846L437472M115505N258193O531447P887029Q206018N781409
2982H2550132M0139n323520o579738n034092l430588k231240j500895j005977
2974E7484221o74288m84287M8871L93054R02413J448703K072872K765554L327189
2965F7284302M171039N080078N930245O890675P791676R293666J1617236J4678163
2957A32737080J8664959K2711014K4916263J9587326O869857m012914j4211499
2950B07262086k2506890k3003284j8321300j3436693j0346093q167829o357835
2943A05122162m706271l387307k292495j282619K2402J097627K249380L432005
$$ plain form
2998 24460610 25639904 26880776 28104294 29663634 31505119 33582666 35915988 38402213
2990 38402213 41333059 44770531 48886036 54144229 60675676 68562705 76768723 82550132
2982 82550132 82590271 77266751 70687013 65652921 62222333 59991093 58490198 57484221
2974 57484221 56809933 56325646 56374517 56767571 57669984 59118687 61191559 63957113 67284302
2965 67284302 71455341 76535419 82465664 89356339 97148015 106441681 118058917 132737080
2957 132737080 151402039 174113053 199029316 218616642 225486499 221473585 207262086
2950 207262086 184755196 161751912 143430612 129993919 119647826 111479997 105122162
2943 105122162 100415891 97028584 94736089 93453470 93475872 94573499 96822879 100254884
2935A00254884M747604N862623P061005Q591388J0574651J3056725J6090763K0301365
2927A86541008K5373112K9555447K8543393K0262034Q558944p205096k3491431
2920B68137411l1153534l1654983k7718334k2072377j7185140j3312769j0544845
2913A14495429q273224o573256n086321l703836k606818j494416l75247O33407
2905H7015718J748672K622870L462326M465424N572300P173350R352704J2298334
2897A33711698J5552108J8576735J8839646J3420433K923202q323023j6845122
2890A77855677k2553721k3157018j9212518j4689371j1331180r008601p206988
2883G0696280n884502m679820l904521l219128k641914j981293j469933j088975
$$ plain form
2935 100254884 105002488 110865111 117926116 126517504 137092155 150148880 166239643 186541008
2927 186541008 211914120 241469567 270012960 290274994 298833938 291628842 268137411
2920 268137411 236983877 205328894 177610560 155538183 138353043 125040274 114495429
2913 114495429 106222205 99648949 94562628 90858792 88251974 86757558 86382311 87015718
2905 87015718 88764390 91387260 94849586 99315010 104887310 112060660 121413364 133711698
2897 133711698 149263806 167840541 186680187 200100620 203023822 194700799 177855677
2890 177855677 155301956 132144938 112932420 98243049 86911869 77903268 70696280
2883 70696280 64811778 60131958 56227437 53008309 50366395 48385102 46915169 45826194
2875D5826194o42351k10193N8096K85708M84708P96760J257125K016497L180461
2866E3053005M202824N001783M656391J489671l878184p651268p790074o294933
2858D2789215m753957l683130l129101k494079j874738j606538j414642j386480
2850B2446550j076433p89396q87193p52126o28172n05578n01234n33261n09137
2841A6264020m48114l26942l08732m45290l47644l88427l26771k29878k99640
2832A3142582l30162l23106k27285k70791l88282l07445j60297k76147j39772
2823A0719295k58933j75333q9529k19955j52071k32005l8784j38042j34532q6413
2813I193698k18827k08895j59590j48499L142j18431j64363p0100j75143q7393
$$ plain form
2875 45826194 45183843 44973650 45031746 45317454 45802162 46598922 47856047 49872544 53053005
2866 53053005 57255829 62257612 66914003 68403674 64525490 56874222 49084148 42789215
2858 42789215 38035258 34352128 31223027 28728948 26854210 25247672 23833030 22446550
2850 22446550 21370117 20580721 19693528 18941402 18313230 17807652 17306418 16773157 16264020
2841 16264020 15815906 15488964 15180232 14734942 14387298 13998871 13672100 13442222 13142582
2832 13142582 12812420 12489314 12262029 11991238 11602956 11295511 11135214 10859067 10719295
2823 10719295 10460362 10285029 10195500 9975545 9823474 9591469 9552685 9414643 9280111 9193698
2813 9193698 8974871 8765976 8606386 8457887 8461029 8342598 8178235 8108135 7932992 7845599
2803G845599j17219J138k2778j58712j34823j82291j14987m4026p1136j8294l4237
2792F948234j47568j29449m8936P5689o3467j80129o1079N1508J03001j19269
2782F428535j45279N2950n849j0882n3742R3394L4173j76631n9420O1812P0432
2771F289493P1773q4772k9338K3429m7456K1883J51455J01460n4172j08184M4924
2760F380495J41881J75287J13775m6829P9997R802J72711K52832M9384L0203L1881
2749G391419K79270K85113J61312K20374K23191K98586J97886L2504K20846J30636
2739I441137j3461K2988M7584K96967M38912L66496K62787L56766K45381J38009
2729A1603566K09355K13254n5065P1357K37218L66986M36859L84342M35031M71836
$$ plain form
2803 7845599 7728380 7729518 7706740 7548028 7413205 7230914 7115927 7071901 7000765 6982471 6948234
2792 6948234 6800666 6671217 6622281 6697970 6634503 6454374 6393295 6444803 6547804 6428535
2782 6428535 6283256 6336206 6330357 6319475 6265733 6359127 6393300 6216669 6157249 6219061 6289493
2771 6289493 6361266 6276494 6247156 6270585 6223129 6245012 6396467 6497927 6443755 6335571 6380495
2760 6380495 6522376 6697663 6811438 6764609 6844606 6854408 7027119 7279951 7329335 7359538 7391419
2749 7391419 7670689 7955802 8117114 8337488 8560679 8859265 9057151 9089655 9310501 9441137
2739 9441137 9427676 9450664 9498248 9795215 10234127 10600623 10863410 11220176 11465557 11603566
2729 11603566 11812921 12026175 11971110 12042467 12279685 12646671 13083530 13467872 13902903 14374739
2719A4374739O36641Q82920R77590J066239R93449Q36010O17635K40627J85437
2710B0811287M72981P95070R81299J128256J437981J695953J682608J442813Q83094
2701C1331342K97110n3035j92008l33670o09922o75333n29232k90258Q8447K88640
2691B9322081N26565P09138R03222J098432J304259J507766J307841R02838Q39478
2682C8421620J093484J567774K187720K632434L055256L404693L523862L338750
2674E9225593K676260J813249M38906j044581k147292k741311k983411k917756
2666E2319657k569917k223277j677091j226606q51611l25705J52389N36198P08343
2657D4842380Q61357J051389J124372J342644J706021K214747K756365L268767
$$ plain form
2719 14374739 15011380 15894300 16871890 17938129 18931578 19767588 20385223 20625850 20811287
2710 20811287 21284268 22079338 23060637 24188893 25626874 27322827 29005435 30448248 31331342
2701 31331342 31628452 31575417 31383409 31049739 30439817 29764484 29235252 28944994 29033441 29322081
2691 29322081 29848646 30557784 31461006 32559438 33863697 35371463 36679304 37582142 38421620
2682 38421620 39515104 41082878 43270598 45903032 48958288 52362981 55886843 59225593
2674 59225593 61901853 63715102 64154008 63109427 60962135 58220824 55237413 52319657
2666 52319657 49749740 47526463 45849372 44622766 43771155 43445450 43597839 44134037 44842380
2657 44842380 45703737 46755126 47879498 49222142 50928163 53142910 55899275 59168042
2649E9168042L796439L878379L311210K516990J446719J51465j432829k822456
2641G0013959l700421m232273m275629m230184l878224l178376k674999k187130
2633D1656723j784196j351083r29684n94942k99068m3556J82741M71213O32381
2624C7940529R62039J337431J520211J854419K002456J955909J508317P15830
2616D9797141j49604j190960k033976k825183l243389l287070l250553k877423
2608C0938983k426153k067917j806884j647379j134863r52158q22281p01707o54156
2599A8725485l21451j88054k90587j84626k0142P3268J08626J65437K48777J74281
2589A8491014J4221j16066m26277p90918j061262j179856q53822r22449r22993
$$ plain form
2649 59168042 62964481 66842860 70154070 72671060 74117779 74269244 72836415 70013959
2641 70013959 66313538 62081265 57805636 53575452 49697228 46518852 43843853 41656723
2633 41656723 39872527 38521444 37591760 36996818 36697750 36654194 36836935 37308148 37940529
2624 37940529 38902568 40239999 41760210 43614629 45617085 47572994 49081311 49797141
2616 49797141 49647537 48456577 46422601 43597418 40354029 37066959 33816406 30938983
2608 30938983 28512830 26444913 24638029 22990650 21855787 20903629 20081348 19379641 18725485
2599 18725485 18404034 18215980 17925393 17740767 17720625 17793893 17902519 18067956 18316733 18491014
2589 18491014 18505235 18389169 17962892 17171974 16110712 14930856 14077034 13154585 12231592
2580A2231592q75588o97547o90345o34037n19778m41837k96372l57710l83262
2571G335116k11059k27403j78276j80434j97080j64743j39218k42233j34835k02172
2561E457663p7334j41934j37342l5447j19354q5226q1853j56323n0151j03053
2551D469646j66493l0086j69950j82645j58847o9580k3712m6447o4288j38350
2541C419248j64187q8203n7020J29634j588j64406j20849p6447O8169j6682j38543
2530B789126r4931o8896P8525l5592j27953p3348k641J9869p870p4319j0437P590
2518B399123N2853j53678q8520K2625o8745N257m2583r7478m4029j32745L8044
2507A890124P6627j0015r7005j17851m0805L6605m5982M9123q6729j13293q5060
$$ plain form
2580 12231592 11356004 10658457 9968112 9334075 8814297 8372460 8076088 7718378 7335116
2571 7335116 7124057 6896654 6718378 6537944 6340864 6176121 6036903 5794670 5659835 5457663
2561 5457663 5380329 5238395 5101053 5065606 4946252 4861026 4779173 4622850 4572699 4469646
2551 4469646 4303153 4273067 4103117 3920472 3761625 3692045 3668333 3621886 3557598 3419248
2541 3419248 3255061 3166858 3109838 3239472 3237884 3073478 2952629 2876182 2944351 2927669 2789126
2530 2789126 2694195 2625299 2703824 2668232 2540279 2466931 2464290 2484159 2476289 2401970 2391533 2399123
2518 2399123 2451976 2298298 2209778 2232403 2163658 2168915 2126332 2028854 1984825 1852080 1890124
2507 1890124 1966751 1956736 1859731 1741880 1701075 1737680 1691698 1740821 1654092 1540799 1455739
2496A455739m1537J01901o8209j67409r2917O398N5895o2690n7161Q0512m3029
2485A167493m0940n4665P4337O8594r4454j04891R8587J35317k6075j19914J2691
2474A116080N7710N3708o9268j30300M2432J23753N9844j36036j31406q89L4974
2463A020602Q1486M887j95411p4437N6724L7918R9662j41844j33875M5835M8875
2452H50422l2663m6457M2673l4301o9021N6242O8510j8122j59983p5102J62186
2441G44384J32303j23223j23033P2651R6388n9446n0117l0048O3088Q0278p4274
2430G28951J068o168l850M5488K6158J04872m8313j32552l4895L5849J20547n4377
2418G82778l4106Q637J3135O0372m0565n5423n9056l1374O5071J0984J0997r4611
$$ plain form
2496 1455739 1414202 1516103 1447894 1280485 1187568 1193966 1249861 1187171 1130010 1210522 1167493
2485 1167493 1126553 1071888 1146225 1214819 1120365 1015474 1114061 1249378 1223303 1103389 1116080
2474 1116080 1173790 1227498 1158230 1027930 1070362 1194115 1253959 1117923 986517 985628 1020602
2463 1020602 1102088 1106975 911564 837127 893851 931769 1031431 889587 755712 801547 850422
2452 850422 817759 771302 813975 779674 710653 766895 835405 817283 657300 582198 744384
2441 744384 876687 753464 630431 703082 799470 740024 689907 659859 722947 803225 728951
2430 728951 730019 723851 720001 765489 791647 896519 848206 715654 680759 716608 837155 782778
2418 782778 748672 757309 770444 830816 790251 734828 675772 644398 709469 720453 731450 636839
2406F36839j25642J59090P173n2369p2208n1200R1989n350M0910m832j2799N0350
2394F61951m6199K6829k9570j05784l0857K4987O8584M3375j12570r2450m9J29116
2382E37363Q6398j23551n0582k989Q5327O0931n0363j238N7365L5407K4210k1698
2370F36580R7595j5731k2111J6471p4608j5195l105M0200J6173r0846p9261L7201
2358E43363O9952J9821j21329j8090K1173J7743J13714J7787q4056o9102r923
2347E01053J20191N7392N9562j12978p1461J35955j1203l0076J9158M7516R5770
2336H10879j35195j41990K9535P0400Q4788q4794r0179J1525K3486l907k9722
2325E44826n0859O3613n6202M0939O7718R878q1733m1456P8090L4443J06480l5121
$$ plain form
2406 636839 511197 670287 677460 625091 552883 501683 593672 588322 629232 624400 611601 661951
2394 661951 615752 642581 613011 507227 476370 501357 569941 613316 500746 408296 408247 537363
2382 537363 623761 500210 449628 446639 531966 592897 542534 541296 598661 634068 658278 636580
2370 636580 734175 718444 696333 712804 638196 623001 619896 660096 676269 585423 506162 543363
2358 543363 613315 633136 511807 493717 514890 532633 646347 664134 580078 510976 501053
2347 501053 621244 678636 738198 625220 553759 689714 678511 648435 667593 715109 810879
2336 810879 675684 533694 563229 633629 718417 633623 543444 554969 578455 574548 544826
2325 544826 493967 557580 501378 542317 610035 619913 538180 496724 574814 609257 715737 680616
2313F80616l6050k5085m1640O4592J7774m9740p9525q9839N8642L2987j06728
2302D26004L1980M7514l0105j00892q6937J44820L2721j16529L5024M1081m5258
2291C79423p0928m4602k0399J09838p515j52456k0228J55463Q2424j06557j48448
2280A56015K5021J64135N1679j06756j22076l6705J1862J633Q5734K1658n8554
2269A93646r0648J8365M4664l5370l8996N1427L8436k3924j4193J00382K3813
2258B67602o5808j9479M1477P6978o4403N757N2516k144L31r8866J6479J58291
2246C68731o5697j72748k5381J42335J04267j05244q1825p5882K6714R6616l05
2235B11581j7124N288M1466l9274n7717o873M4452m8747M8835r0283l1539N4297
$$ plain form
2313 680616 644566 619481 577841 642433 660207 610467 530942 441103 499745 532732 426004
2302 426004 457984 505498 475393 374501 287564 432384 465105 348576 383600 424681 379423
2291 379423 308495 263893 243494 353332 345817 193361 173133 328596 411020 304463 156015
2280 156015 181036 345171 396850 290094 168018 131313 143175 144808 230542 252200 193646
2269 193646 102998 121363 166027 130657 91661 143088 181524 157600 143407 243789 267602
2258 267602 201794 182315 223792 300770 236367 242124 294640 292496 292827 193961 210440 368731
2246 368731 303034 130286 104905 247240 351507 246263 164438 88556 115270 211886 211581
2235 211581 194457 199745 241211 201937 144220 137347 181799 133052 181887 91604 60065 114362
2223A14362M6903K8669n7357m8977J8787j5222O7524K2538K2671M135j04118L0727
2211A30642R2324J3472l6462m8441O8666N347Q2595J6698r4631M3787M1511k4615
2199B90893j3210m7440L6897L795q5967n1412L4072O9633q5317p3056O8153J7284
2187A64325m8702r7824Q7882J66143l3161r5121j30895J8840J74016j7288n1708
2176A36507l1109k6323R9903l6249L1926O715j47912N4860J51944k306n8054o4252
2164A15650J33689j0018k3807r398m7517K1833j7138O2021L9811j06105K2863
2153A81884n0329J28026J11935j19929o1426P4032J29831L1662j96895l101M3258
2142B68948J11844J32277j60119K9864r056o167J51887k2996r3846o818N2894
$$ plain form
2223 114362 161265 189934 132577 83600 102387 87165 154689 177227 199898 204033 99915 130642
2211 130642 222966 236438 199976 151535 220201 225548 308143 324841 230210 273997 315508 290893
2199 290893 277683 230243 267140 270935 184968 133556 167628 237261 151944 78888 147041 164325
2187 164325 115623 17799 105681 271824 238663 143542 12647 31487 205503 188215 136507
2176 136507 105398 79075 178978 142729 174655 181370 33458 88318 240262 237956 179902 115650
2164 115650 249339 239321 215514 206116 158599 180432 163294 225315 265126 159021 181884
2153 181884 131555 259581 371516 251587 190161 264193 394024 425686 228791 225690 268948
2142 268948 380792 513069 352950 382814 373758 367591 519478 496482 402636 395818 448712
2131D48712J91536M8996N677m6753J5967J20044k8449l0396j20241p4783J7075
2120E47385j38213k7374m6496k1419K6430n5606k7762m7287q5346R3377K766O4603
2108B85058m0670j45349N2047K6797L0210O6643p1951m9202m4833l4642J79914
2097B54022n5078p5781j52841P5470O7401n4508j9901p633R0900L181r9593J9573
2085D5212o7290q4812m878M5328J03014m8170r9048J5149m568M4203O884l7934
2073h6910Q209j21839K0134N4204j5832O8485M0765K7965j3325p1092M5816L3694
2061i726M8791n3643m0062L1481P3740J7967j00889L6886R5064M4529k8299k5801
2049I0038j3828Q8009m0926j33084R791N984L1033n7595j8636n3823Q2386M4981
$$ plain form
2131 448712 640248 689244 694921 648168 664135 784179 755730 725334 605093 530310 547385
2120 547385 409172 381798 335302 313883 340313 284707 256945 209658 124312 217689 220455 285058
2108 285058 244388 99039 151086 177883 208093 274736 202785 153583 108750 74108 254022
2097 254022 198944 123163 -29678 45792 113193 58685 38784 31151 122051 125232 25639 45212
2085 45212 -22078 -106890 -111768 -66440 36574 -11596 -110644 -95495 -100063 -55860 -48976 -86910
2073 -86910 -78701 -200540 -180406 -126202 -142034 -73549 -32784 -4819 -18144 -89236 -43420 -9726
2061 -9726 39065 -14578 -54640 -23159 50581 68548 -32341 4545 99609 144138 115839 90038
2049 90038 76210 164219 123293 -9791 0 5984 37017 -20578 -39214 -93037 -10651 34330
2037C4330r8758p2098N5136p1984n1373P5105j0591L032n2217J19N9461J32470
2025B632l356j91775n9245O3038K9786j9138m700P6937J6003l9921k601k4852
2013a57192j5934J17601R3022R455j22089n6474R6771j825n2001J316O5913O1064
2001C9627k4886j7502K6340k0468M1475q6015K3194K8070l5140m2279r17L6061
1989c2440L8572m2721N6293n4771l5286m3450n3561R9294p4731j7643K5524J4036
1977a20884J5351n2653r1715N9346P907J45283k061k954O850j00228J21088o4549
1965g9219q9612Q717Q5000J29727L3288j15619q0031P5270J35364L4630j13683
1954B3832q8342M6395J41192l7256n094o5075j2954N3679m501J3693r756n6256
$$ plain form
2037 34330 -64428 -136526 -81390 -153374 -204747 -129642 -140233 -137201 -189418 -189299 -129838 2632
2025 2632 -724 -192499 -251744 -188706 -158920 -178058 -182758 -105821 -89818 -129739 -132340 -157192
2013 -157192 -173126 -55525 37497 46952 -75137 -131611 -34840 -36665 -88666 -87350 -21437 39627
2001 39627 14741 -2761 23579 3111 44586 -41429 -18235 9835 -25305 -67584 -68501 -32440
1989 -32440 6132 -36589 19704 -35067 -70353 -113803 -167364 -68070 -142801 -160444 -134920 -120884
1977 -120884 -105533 -158186 -249901 -190555 -182648 -37365 -39426 -42380 -35530 -135758 -14670 -79219
1965 -79219 -168831 -160114 -75114 54613 87901 -27718 -107749 -32479 102885 137515 23832
1954 23832 -64510 -18115 123077 85821 80727 15652 2698 56377 51876 65569 55813 -443
1942d43J7790K3651k0445j9237k3302J07016K6640j23962k8526k0363L3114K9504
1930A437l895Q3541N4008j10653o4219L5829K1754k5634k7002K4325P6522k7692
1918C8321k2974m12j0469j4021o3037j5235J19468j9195q6701m0282M7430K6531
1906d0576j3160j9692j4045N6534l7959M7911M7852J296p0211q1230m9709Q0596
1894i2393l3586O7300L8292p3471K2947P3659P3023P3523r1429m6369N3245N7793
1882A22534M3107o5547n5N8672N9837M4686n8052j5222O4237Q9534j5435n1645
1870B76651M7174O3573M0412l3001k1837O0590k4389k8619P8153j17267j10145
1859B31295p6838R4498J27844J7473p2843j81399K8307J14187l348k591r7315
$$ plain form
1942 -443 17347 40998 20553 1316 -21986 85030 111670 -12292 -40818 -61181 -28067 1437
1930 1437 -2458 81083 135091 24438 -39781 -3952 17802 -7832 -34834 -10509 66013 38321
1918 38321 15347 14935 4466 -9555 -72592 -87827 31641 12446 -74255 -114537 -67107 -40576
1906 -40576 -53736 -73428 -87473 -30939 -68898 -20987 26865 28161 -42050 -123280 -172989 -92393
1894 -92393 -125979 -58679 -20387 -93858 -70911 2748 75771 149294 57865 11496 64741 122534
1882 122534 165641 100094 100039 158711 218548 263234 205182 189960 254197 343731 328296 276651
1870 276651 323825 387398 427810 394809 372972 433562 409173 380554 458707 341440 231295
1859 231295 154457 248955 376799 394272 321429 140030 168337 282524 279176 276585 179270
1848A79270o3163R7017O8693j7870j36157m67J44545N4347o278j30741N8014J69898
1836D17108J53108L6089j06635q26J90383M9125K4715p051l8652N5298J0122j2981
1824G69803j23028o6526N361K0459R5428j02341j15861j9185o1448M0387n0655
1813C92394o6225k9615o5471M9006m9478o5359l3867N645J09379j01841n9285
1802H5283N4208J07771O2522o3592m475J14362J709O7941n1430M3008P5837r9819
1790C93325J5875M3861J30137l8609j91125k8126K7310j4106J6947r1765M278
1779B68002l335p2291Q0230l3076K2532q5084j25353M4302o922O3170p5763q6234
1767i822J11197n8026N0322m5698l0954Q8245k4047J276o9286p5717M9929Q466
$$ plain form
1848 179270 116107 213124 281817 263947 127790 127323 271868 326215 319937 189196 247210 417108
1836 417108 570216 606305 499670 498844 689227 738352 763067 756016 717364 772662 782784 769803
1824 769803 646775 580249 585610 606069 701497 599156 483295 464110 402662 443049 392394
1813 392394 326169 296554 231083 280089 230611 165252 131385 137030 246409 144568 85283
1802 85283 139491 247262 309784 246192 241717 356079 357788 425729 374299 417307 493144 393325
1790 393325 409200 453061 583198 544589 353464 325338 352648 338542 355489 263724 268002
1779 268002 264667 192376 272606 239530 262062 176978 51625 95927 89005 152175 76412 -9822
1767 -9822 101375 43349 93671 47973 17019 105264 81217 82493 13207 -62510 -12581 -4115
1755d115N9691r3440j00285J14065P2436K6703j24917j18435J10795L2225N4591
1744B9314l7204J463J00575m2436m6297N8506R2377p6852j37719N387M2840M1050
1732C1004O5476p0885k008j5472K2972Q4958n347l2208m6218q8031Q8748M1190
1720G4179M387k6411k8922j855M3285J2302n8639p5482N7400Q3567K5958j61642
1708e1873j18035Q3268K4728J7719l3068l4241M3777n1442j5270o2847n0196J74674
1696g2806J47008l6612j49339j37792K1832J13943M0064k4437p4343K1706N8465
1685i2311j186O2148m7901n8724L645k5057l5020M169O9341M0042l1238k4691
1673a36783m3396J0865l3888J2259N4565j6240L7362J6431J0204K928m1565l0081
$$ plain form
1755 -4115 55576 -37864 -138149 -24084 48352 75055 -49862 -168297 -57502 -25277 29314
1744 29314 -7890 -6427 94148 51712 5415 63921 156298 79446 -58273 -52886 -10046 31004
1732 31004 96480 25595 23587 8115 31087 116045 110698 78490 32272 -55759 32989 74179
1720 74179 78566 52155 23233 21378 64663 76965 18326 -57156 244 83811 109769 -51873
1708 -51873 -169908 -86640 -61912 -44193 -77261 -111502 -67725 -119167 -134437 -197284 -247480 -72806
1696 -72806 74202 37590 -111749 -249541 -227709 -113766 -73702 -98139 -172482 -150776 -92311
1685 -92311 -93497 -31349 -79250 -137974 -134329 -159386 -194406 -190237 -120896 -80854 -112092 -136783
1673 -136783 -180179 -169314 -203202 -190943 -136378 -152618 -115256 -98825 -88621 -85693 -127258 -157339
1661a57339J12989L8290n2682j12324r9240Q8339R8378j2328r8330l6972N7969
1650a73250J0502k9956q303J7081N6613J2560N0844o2379l5135o380L4069O0497
1638g3237m9654l4672K0593N8153M497L014m5879O7892n4591n6181J8282R4146
1626d7637M8002j9847n0501K4941J8691J8294L942j6297K4376N4997J0696K7917
1614I7574l7457k7624n0187J7252L1229n9099l5155K6198j1333l0821l1319l1999
1602a42741L7463K7392m4683K719q3176p7064j245J02952O1342p9014l7700l3626
1590b67381L9524N6408o1205k7101Q2147O5570O42r3136O011K4421K7104N427
1578a41569O3653L9738J4717r4665L6220L6881O2027R8342k8544p9065p7999J6697
$$ plain form
1661 -157339 -44350 -6060 -58742 -171066 -270306 -181967 -83589 -95917 -194247 -231219 -173250
1650 -173250 -162748 -192704 -201007 -183926 -127313 -114753 -63909 -126288 -161423 -167803 -133734 -73237
1638 -73237 -122891 -157563 -136970 -78817 -74320 -71306 -117185 -49293 -103884 -160065 -141783 -47637
1626 -47637 365 -19482 -69983 -45042 -26351 -8057 -4115 -20412 3964 58961 69657 97574
1614 97574 60117 32493 -17694 -442 30787 -28312 -63467 -37269 -48602 -79423 -110742 -142741
1602 -142741 -105278 -77886 -122569 -119850 -203026 -280090 -281335 -178383 -117041 -196055 -233755 -267381
1590 -267381 -227857 -171449 -232654 -259755 -177608 -112038 -111396 -204532 -198521 -174100 -146996 -141569
1578 -141569 -77916 -38178 -23461 -118126 -81906 -45025 17002 115344 86800 7735 -70264 -53567
1566e3567J06236Q6290M4902n0100l4437K1582j21707l1859L1036O2667j1841
1555D9202q7974l4603m5944P2047N733j5229K6475o9511j41985O8237O8607J1735
1543i3210q5131k1926M5761O0991k4877j15516j7357J03754K6987M5650o6318
1532a41192n6849J16011j3015J08449J6293n815n540q8341J8930l5571O0699J25942
1520A00001m6237J1935r2338k9163N4676m727P9498m894o7465K1373j4042M3502
1508E2119m6139q7564P6615J4553j6741k1850N8636R619n5417R0329m5585j2654
1496A5921m0455j2204O8057j3027l4289O5525R4979M9005r3250l7358j8767K2948
1484F7085N5459n5273j5943P159m1615O9767j6307q299J16739p2262n49k8045
$$ plain form
1566 -53567 52669 138959 183861 133761 99324 120906 -801 -32660 -1624 61043 49202
1555 49202 -38772 -73375 -119319 -47272 -41539 -56768 -30293 -99804 -241789 -173552 -104945 -93210
1543 -93210 -178341 -200267 -154506 -93515 -118392 -233908 -251265 -147511 -120524 -74874 -141192
1532 -141192 -198041 -82030 -95045 13404 29697 23882 18342 -69999 -51069 -86640 -25941 100001
1520 100001 53764 65699 -26639 -55802 -1126 -5853 73645 68751 1286 22659 8617 52119
1508 52119 5980 -81584 -4969 9584 -7157 -29007 29629 39248 -16169 74160 28575 15921
1496 15921 -24534 -36738 31319 18292 -15997 49528 144507 193512 100262 62904 44137 67085
1484 67085 122544 67271 51328 58487 16872 86639 70332 62033 178772 106510 105961 77916
1472G7916k4210J5892l0110M2565m6245q4461O9968P40N3629m4696p1950P7432
1460C6470n9131J04622N591l3689J6379n1839J02032l4788j5257J9378j02351
1449a2583K9029O1198O0378R8897k7706M5569r2491r507J47210m3473k256l2792
1437B21473P32P8573k0127R1184n8301N976J24074m2136K1099j00882J0969Q5740
1425D18374k9930l448j09088j1010L4018o0787j1190r0315q00L8337o3287l8240
1413G2634k8311N4298N9705k2906O5349o3695j27807N2636j876J14399O845j07660
1401G3611M762M2737O9966q720p0993J01488R2806o4953j08963l5099J72536N2211
1389C21389L6238j6494j24275K8298J7131n14j3431J959K4259p4211m0507p7163
$$ plain form
1472 77916 53706 69598 39488 82053 35808 -48653 21315 22055 75684 30988 -40962 36470
1460 36470 -22661 81961 87552 53863 70242 18403 120435 85647 70390 89768 -12583
1449 -12583 16446 77644 138022 236919 209213 254782 162291 152784 299994 256521 254265 221473
1437 221473 222205 300778 280651 371835 313534 319510 443584 401448 422547 321665 332634 418374
1425 418374 388444 384996 275908 264898 298916 238129 226939 136624 135824 174161 110874 72634
1413 72634 44323 98621 158326 135420 200769 137074 9267 61903 60027 174426 181271 73611
1401 73611 78373 121110 191076 182356 111363 212851 305657 240704 131741 96642 269178 321389
1389 321389 357627 341133 216858 245156 262287 261773 248342 250301 274560 200349 159842 82679
1377H2679j5549J30105J5850l8266L0173m5397l2422j06782K8081L9635k0038
1366F8069l3141n8914J03495m9452m6012J12396Q5574j5279r0459m8265K7587
1355E5599m9762J05459k398q372o8586q5528J37421j0642j01800k9100L2328J22398
1343I7017l1814j08882m7869N2097Q3132p3978j10736K8817J13395j9904m6817
1332f5542P2447R1190m2423m4895o9138L6241l319m0575N1820j1805j00521L7913
1320h8607M4788K850M3885j7544m2032l5068m3553O0001O1339j09922p289N3411
1308g7741O2148K4276r4067k7128J6762O5261J6628L9182k0776l0934m0829O3518
1296c700P657J337q4970j5934O7609k2791K8858K016q0392k4037J2243K2612k8570
$$ plain form
1377 82679 67130 197235 213085 174819 204992 159595 127173 20391 48472 88107 68069
1366 68069 34928 -23986 79509 30057 -15955 96441 182015 166736 76277 28012 55599
1355 55599 5837 111296 108898 100526 31940 -53588 83833 73191 -28609 -57709 -25381 97017
1343 97017 65203 -43679 -91548 -39451 43681 -30297 -141033 -112216 1179 -18725 -65542
1332 -65542 6905 98095 55672 10777 -58361 -22120 -25439 -66014 -14194 -25999 -126520 -88607
1320 -88607 -43819 -40969 2916 -14628 -56660 -91728 -135281 -75280 -13941 -123863 -131152 -77741
1308 -77741 -15593 8683 -85384 -112512 -95750 -30489 -13861 25321 4545 -26389 -67218 -3700
1296 -3700 3957 5294 -79676 -95610 -28001 -50792 -21934 -19918 -100310 -124347 -112104 -89492 -118062
1283a18062j33863n9943L1279J48673o7630n9780N6904O5253M1160q6505j5796
1272a98310Q1160K5204K925j54635m4819M8885M0672K9786P708m4969p2642K0258
1260b58777N4877M3161l193j06804L048J19244L291j6553n2793p7831P0161J17871
$$ plain form
1283 -118062 -251925 -311868 -280589 -131916 -199546 -259326 -202422 -137169 -96009 -182514 -198310
1272 -198310 -117150 -91946 -89021 -243656 -288475 -239590 -198918 -169132 -161424 -206393 -279035 -258777
1260 -258777 -203900 -160739 -163932 -270736 -267688 -148444 -145153 -161706 -214499 -292330 -222169 -104298
$$ [...]
##END NTUPLES=NMR SPECTRUM
##END=
