##TITLE=1H_EC-3238(3)
 CDCl3, 8 sc, 
 18.11.2020
##JCAMPDX= 6.0         $$ Bruker NMR JCAMP-DX V2.0
##DATA TYPE= NMR SPECTRUM
##DATA CLASS= NTUPLES
##ORIGIN= UXNMR, Bruker Analytische Messtechnik GmbH
##OWNER= root
$$ XWIN-NMR		Version 3.5
$$ Wed Nov 18 13:31:37 2020 Russian Standard Time (UT+4h)  she@DPX200
##.OBSERVE FREQUENCY= 200.1315066352
##.OBSERVE NUCLEUS= ^1H
##.ACQUISITION MODE= SIMULTANEOUS
##.ACQUISITION SCHEME= undefined
##.AVERAGES= 8
##.DIGITISER RES= 18
##SPECTROMETER/DATA SYSTEM= spect
##.PULSE SEQUENCE= zg30
##.SOLVENT NAME= CDCl3
##.SHIFT REFERENCE= (INTERNAL, CDCl3, 0, 15.9347)
##AUDIT TRAIL= $$ (NUMBER, WHEN, WHO, WHERE, WHAT)
$$ ##TITLE= Audit trail, XWIN-NMR		Version 3.5
$$ ##JCAMPDX= 5.01
$$ ##ORIGIN= Bruker BioSpin GmbH
$$ ##OWNER= she
$$ F:/spectra/data/she/nmr/H-F/1/pdata/1/auditp.txt
$$ ##AUDIT TRAIL=  $$ (NUMBER, WHEN, WHO, WHERE, WHAT)
(   1,<2020-11-18 13:29:47.56 +0400>,<she>,<DPX200>,
      <created by zg, POWCHK disabled, PULCHK disabled
       configuration hash MD5:
       00 E9 B6 7A A2 85 ED C7 34 08 36 98 17 FE 4E 26
       data hash MD5: 16K
       B2 74 E7 CA 9F CA 99 34 DC B1 E1 48 2B 54 13 7A>)
(   2,<2020-11-18 13:29:50.43 +0400>,<she>,<DPX200>,
      <Start of raw data processing
       efp BC_mod = 2 LB = 0.24 FT_mod = 6 PKNL = 1 PHC0 = -11039.83 PHC1 = 2.800903 SI = 16K 
       data hash MD5: 16K
       3B F5 45 28 4B 88 60 C1 78 11 9F 79 77 00 47 86>)
(   3,<2020-11-18 13:30:12.20 +0400>,<she>,<DPX200>,
      <pk PHC0 = -82.54826 PHC1 = 4.200001 
       data hash MD5: 16K
       E7 B0 C9 D5 2A D9 38 E2 3B B5 BD 71 7E 23 68 C1>)
(   4,<2020-11-18 13:30:15.34 +0400>,<she>,<DPX200>,
      <abs ABSG = 5 
       data hash MD5: 16K
       62 7C 97 D3 B4 A0 C0 B6 A2 76 E3 24 6C 0E 6D C2>)
(   5,<2020-11-18 13:30:31.98 +0400>,<she>,<DPX200>,
      <pk PHC0 = -1.212054 PHC1 = 0.7999999 
       data hash MD5: 16K
       0A A1 A6 D8 86 64 D7 85 A2 CC 53 63 F3 0E DB C0>)
(   6,<2020-11-18 13:30:35.62 +0400>,<she>,<DPX200>,
      <abs ABSG = 5 
       data hash MD5: 16K
       2B 93 C2 66 C0 45 DB 33 6E E5 68 94 08 33 03 20>)
$$ ##END=
$$ 
$$ hash MD5
$$ B5 0C 74 29 A7 42 5B DD A5 AB 80 75 60 9C 16 0F
##$RELAX= 
##$RELAX= 
##$RELAX= 
##$RELAX= 
##$RELAX= 
##$RELAX= 
$$ Bruker specific parameters
$$ --------------------------
##$DU= <F:/spectra>
##$EXPNO= 1
##$NAME= <H-F>
##$PROCNO= 1
##$TYPE= <nmr>
##$USER= <she>
##$AMP= (0..31)
100 100 100 100 100 100 100 100 100 100 100 100 100 100 100 100 100 100 
100 100 100 100 100 100 100 100 100 100 100 100 100 100 
##$AQSEQ= 0
##$AQ_mod= 1
##$AUNM= <au_zg>
##$AUTOPOS= <>
##$BF1= 200.13
##$BF2= 200.13
##$BF3= 200.13
##$BF4= 200.13
##$BF5= 200.13
##$BF6= 200.13
##$BF7= 200.13
##$BF8= 200.13
##$BYTORDA= 1
##$CFDGTYP= 0
##$CFRGTYP= 5
##$CHEMSTR= <none>
##$CNST= (0..31)
1 1 145 1 1 1 1 1 1 1 1 1 1 1 1 1 1 1 1 1 1 1 1 1 1 1 1 1 1 1 1 1 
##$CPDPRG= <>
##$CPDPRG1= <>
##$CPDPRG2= <>
##$CPDPRG3= <>
##$CPDPRG4= <mlev>
##$CPDPRG5= <mlev>
##$CPDPRG6= <mlev>
##$CPDPRG7= <mlev>
$$ [...]
##$SUBNAM3= <"">
##$SUBNAM4= <"">
##$SUBNAM5= <"">
##$SUBNAM6= <"">
##$SUBNAM7= <"">
##$SUBNAM8= <"">
##$SUBNAM9= <"">
##$SW= 16.9725356469052
##$SWIBOX= (0..15)
0 0 2 0 0 0 0 0 0 0 0 0 0 0 0 0 
##$SW_h= 3396.73913043478
##$TD= 16384
##$TD0= 1
##$TE= 0
##$TE2= 300
##$TE3= 300
##$TEG= 300
##$TL= (0..7)
0 120 120 120 120 120 120 120 
##$TP= (0..7)
150 150 150 150 150 150 150 150 
##$TP07= 0
##$TPNAME0= <>
##$TPNAME1= <>
##$TPNAME2= <>
##$TPNAME3= <>
##$TPNAME4= <>
##$TPNAME5= <>
##$TPNAME6= <>
##$TPNAME7= <>
##$TPOAL= (0..7)
0.5 0.5 0.5 0.5 0.5 0.5 0.5 0.5 
##$TPOFFS= (0..7)
0 0 0 0 0 0 0 0 
##$TUNHIN= 0
##$TUNHOUT= 0
##$TUNXOUT= 0
##$USERA1= <user>
##$USERA2= <user>
##$USERA3= <user>
##$USERA4= <user>
##$USERA5= <user>
##$V9= 5
##$VALIST= <valist>
##$VCLIST= <CCCCCCCCCCCCCCC>
##$VD= 0
##$VDLIST= <DDDDDDDDDDDDDDD>
##$VPLIST= <PPPPPPPPPPPPPPP>
##$VTLIST= <TTTTTTTTTTTTTTT>
##$WBST= 1024
##$WBSW= 4
##$XGAIN= (0..3)
0 0 0 0 
##$XL= 0
##$YL= 0
##$YMAX_a= 38743
##$YMIN_a= -18472
##$ZGOPTNS= <>
##$ZL1= 120
##$ZL2= 120
##$ZL3= 120
##$ZL4= 120
##$ABSF1= 15.93466
##$ABSF2= -1.038002
##$ABSG= 5
##$ABSL= 3
##$ALPHA= 0
##$AQORDER= 0
##$ASSFAC= 0
##$ASSFACI= 0
##$ASSFACX= 0
##$ASSWID= 0
##$AUNMP= <proc_1d>
##$AZFE= 0.1
##$AZFW= 0.1
##$BCFW= 0
##$BC_mod= 2
##$BYTORDP= 0
##$COROFFS= 0
##$CY= -3
##$DATMOD= 1
##$DC= 0
##$DFILT= <>
##$DTYPP= 0
##$F1P= 0
##$F2P= 0
##$FCOR= 1
##$FTSIZE= 16384
##$FT_mod= 6
##$GAMMA= 0
##$GB= 0
##$INTBC= 1
##$INTSCL= 1.245715e-10
##$ISEN= 128
##$LB= 0.24
##$LEV0= 0
##$LPBIN= 0
##$MAXI= 10000
##$MC2= 0
##$MEAN= 0
##$ME_mod= 0
##$MI= 1.114404
##$NCOEF= 0
##$NC_proc= -10
##$NLEV= 6
##$NOISF1= 3.799351
##$NOISF2= 2.8
##$NSP= 0
##$NTH_PI= 0
##$NZP= 0
##$OFFSET= 15.93466
##$PC= 1
##$PHC0= -11123.59
##$PHC1= 7.800904
##$PH_mod= 1
##$PKNL= yes
##$PPARMOD= 0
##$PSCAL= 0
##$PSIGN= 0
##$REVERSE= no
##$SF= 200.130016001114
##$SI= 16384
##$SIGF1= 3
##$SIGF2= 2
##$SINO= 5.538805
##$SIOLD= 16384
##$SREGLST= <1H.CDCl3>
##$SSB= 0
##$STSI= 16384
##$STSR= 0
##$SW_p= 3396.73913043478
##$SYMM= 0
##$S_DEV= 0
##$TDeff= 16384
##$TDoff= 0
##$TI= <>
##$TILT= no
##$TM1= 0
##$TM2= 0
##$TOPLEV= 0
##$USERP1= <user>
##$USERP2= <user>
##$USERP3= <user>
##$USERP4= <user>
##$USERP5= <user>
##$WDW= 1
##$XDIM= 16384
##$YMAX_p= 314813094
##$YMIN_p= -1522253
$$ End of Bruker specific parameters
$$ ---------------------------------
##NTUPLES= NMR SPECTRUM
##VAR_NAME=  FREQUENCY,     SPECTRUM/REAL,   SPECTRUM/IMAG
##SYMBOL=    X,             R,               I
##VAR_TYPE=  INDEPENDENT,   DEPENDENT,       DEPENDENT
##VAR_FORM=  AFFN,          ASDF,            ASDF
##VAR_DIM=   16384,         16384,           16384
##UNITS=     HZ,            ARBITRARY UNITS, ARBITRARY UNITS
##FACTOR=    0.207333158178281, 1,           1
##FIRST=     3189.00375234398, 0,            0
##LAST=      -207.735378090796, 0,           0
##MIN=       -207.735378090796, -1522253,    0
##MAX=       3189.00375234398, 314813094,    0
$$ Real data points
##PAGE= N=1
##DATA TABLE= (X++(R..R)), XYDATA
$$ [...]
6202A199829p7115o6150m728q5225l7626n1018l2184M5867m9511n4641M8748K3127
6190H59373j7624Q4355O2557n9293l2909p389M7668j5678J769k02971r408J15122
6178H25572n1296m5767N8068N2575m3838l4295R9171O951j42239O6780K7350o7126
6166G51906J7047O1096Q3129j14646j5446J7930n5871N8729R6217M8075J18627
6155A066793R0851O1495n8953j23802p380Q3j28241l7626r8334j35059N3749K990
6143F86566m2214N0921J04506o8274M6450J43654n8330r0833n2818O4832N1659
6132H36119n2416L395N4812j01602M9442J20393q4116j11110Q9529j0964o7231
6121G26251J41473m6457K5040o0635Q2022J00887r067j2919m815J04125J50331
$$ plain form
6202 1199829 1122714 1056564 1051836 966611 928985 877967 845783 891650 842139 787498 836246 859373
6190 859373 841749 926104 988661 929368 896459 889070 936738 921060 922829 719858 710450 825572
6178 825572 774276 728509 786577 839152 795314 761019 860190 867141 724902 791682 819032 751906
6166 751906 768953 830049 913178 798532 783086 801016 745145 803874 900091 948166 1066793
6155 1066793 1157644 1219139 1160186 1036384 1029004 1029087 900846 863220 764886 629827 683576 686566
6143 686566 644352 695273 799779 731505 777955 921609 863279 772446 719628 784460 836119
6132 836119 783703 787098 841910 740308 789750 910143 826027 714917 804446 793482 726251
6121 726251 867724 821267 846307 785672 867694 968581 959514 946595 941780 1045905 1196236
6110A196236k846o5672l5309O9072J15769q6856J3430k1895Q81k3237L8109K6342
6098A224024m9939R3856J05085R519M3447J80590K1226N947M1858O0473O7351
6087A803437l0750P7000J32865R9947O4446m9187P7924m2035O1581K5937m787
6076B216378J43363N4450L2737O4646J85095J70089J7295J32283J93153J70550
6066C380039J90206J97724L62498L49180K92562L89516L55239N48548N00949K88470
6056F854931K53173J33547K60791K55285K44561M66303K43134J75805K10727J81977
6046I280234M8106J38491J70215P7844P7742K07949J14316j06910j86638k42103
6036I579246k52636k34401k23628k65588l30722k35822k55608k63166j82131k11872
$$ plain form
6110 1196236 1193390 1127718 1092409 1161481 1277250 1190394 1203824 1181929 1182810 1159573 1197682 1224024
6098 1224024 1174085 1267941 1373026 1382545 1425992 1606582 1627808 1633755 1675613 1736086 1803437
6087 1803437 1772687 1849687 1982552 2082499 2146945 2097758 2175682 2133647 2195228 2221165 2216378
6076 2216378 2359741 2414191 2446928 2511574 2696669 2866758 2884053 3016336 3209489 3380039
6066 3380039 3570245 3767969 4130467 4479647 4772209 5161725 5516964 6065512 6566461 6854931
6056 6854931 7108104 7241651 7502442 7757727 8002288 8468591 8711725 8887530 9098257 9280234
6046 9280234 9328340 9466831 9637046 9714890 9792632 10000581 10114897 10007987 9821349 9579246
6036 9579246 9326610 9092209 8868581 8602993 8272271 8036449 7780841 7517675 7335544 7123672
6026G123672q4040r3320M785p5805m2358n4323n9031L640O434j226M4961J15102
6014F888491l5900j21434j52131j09859l3855R3702K10l8768J15028l4387m0167
6003F530930M009N1304o0695q3917j38459j51337j69788L9990q9055k0380P8380
5992E990982K21086J5457L1199K44125J53723K21687K71322J75921J66425K88073
5982G780000M30136M80257M64451M65050M71422N26876O23021O99910M95120L30551
5972A2766794M76993M41812M01617M86613O53285N33180M11727M96146L40102
5963A7008269L04577K07539K53432K95760M17298L45664m5667k98538k84627r2241
5953A8111466p7252k82500k80150l41821k40451k82938l77311m90429l76549k03753
$$ plain form
6026 7123672 7039632 6946312 6951097 6875292 6832934 6778611 6719580 6723220 6729654 6728428 6773389 6888491
6014 6888491 6852591 6731157 6579026 6469167 6435312 6529014 6529224 6490456 6605484 6571097 6530930
6003 6530930 6534939 6586243 6525548 6441631 6303172 6151835 5982047 6022037 5932982 5912602 5990982
5992 5990982 6212068 6227525 6258724 6502849 6656572 6878259 7149581 7325502 7491927 7780000
5982 7780000 8210136 8690393 9154844 9619894 10091316 10618192 11241213 11941123 12436243 12766794
5972 12766794 13243787 13685599 14087216 14573829 15227114 15760294 16172021 16668167 17008269
5963 17008269 17312846 17520385 17773817 18069577 18486875 18832539 18786872 18488334 18203707 18111466
5953 18111466 18034214 17751714 17471564 17129743 16889292 16606354 16229043 15738614 15362065 15158312
5943A5158312k91761j50559r5951k31224j99814l8121k04295j29982l8914N8735
5933A3836426K27989J74633J11038m8247o4842M7779L06464K71761J50279J08493
5923A5121773J36864j7010K29357M40552K70471L86431O11032Q49641Q96147R89182
5913A9914440J058729R05548O13627O15924Q33734J034048J367289J315094J164050
5904B8822483O96913o12787j174606o06281L42969P48370K34751q46439j718804
5895B5886569j782928j824834j373696r13049o79918o35315q95317j249906j199664
5886A5331942r79040p29154o92277n89635l92564l65722l87045l37019j04866
5877A0754620k61884k32559k1581l8210l5331m789k27R3987J71679L64761K74289
$$ plain form
5943 15158312 14866551 14715992 14620041 14388817 14189003 14150882 13946587 13816605 13777691 13836426
5933 13836426 14064415 14239048 14350086 14301839 14236997 14284776 14591240 14863001 15013280 15121773
5923 15121773 15258637 15241627 15470984 15911536 16182007 16568438 17179470 18029111 18925258 19914440
5913 19914440 20973169 21878717 22492344 23108268 23942002 24976050 26343339 27658433 28822483
5904 28822483 29519396 28906609 27732003 27125722 27468691 28217061 28451812 27605373 25886569
5895 25886569 24103641 22278807 20905111 19992062 19312144 18676829 17781512 16531606 15331942
5886 15331942 14352902 13623748 12931471 12341836 11949272 11583550 11196505 10859486 10754620
5877 10754620 10492736 10260177 10238596 10200386 10165055 10160266 10160039 10254026 10425705 10790466 11064755
5866A1064755M88034P39191Q47525O87539L83031K99011L77102O58134J061716
5857A6606038J220313J011429Q46248K29054q31074j110229l30848L71508O91055
5848A8703494K41141q76667j499272j603623j431145j006144o91400m48878m25838
5839A0961668q07423r95885q74572o95612o02491n00441l38346l54004k28190
5830E564704k59207k70237j72256j04460j18515j27888k13610j88512n1864p1093
5820C987062p4252r1367j42854J9117K194n2204p6629j9656L801j47599r1449
5809C316164N179p7170j36514p0893p6506j78387j7983K3001j01072j38502o3195
5798B484122N8421J9717j34901j01175L6063L126N5355l1521n0579P0232L6972
$$ plain form
5866 11064755 11552789 12291980 13139505 13827044 14210075 14509086 14886188 15544322 16606038
5857 16606038 17826351 18837780 19684028 19913082 19082008 17971779 17640931 18012439 18703494
5848 18703494 18944635 18067968 16568696 14965073 13533928 12527784 11836384 11387506 10961668
5839 10961668 10154245 9158360 8283788 7588176 6985685 6485244 6146898 5792894 5564704
5830 5564704 5305497 5035260 4863004 4758544 4640029 4512141 4298531 4110019 4058155 3987062
5820 3987062 3912810 3821443 3678589 3697706 3699900 3647696 3571067 3551411 3555212 3407613 3316164
5809 3316164 3321343 3244173 3107659 3036766 2960260 2781873 2763890 2786891 2685819 2547317 2484122
5798 2484122 2542543 2562260 2427359 2326184 2362247 2365373 2420728 2389207 2338628 2408860 2445832
5787B445832o0185O3134k7810p0435q4752p2921k5853n6714r8749P9035j7480
5776B073102q189l1180k7679j9919q7058k5638J9452n6402J8411O9569M9492p1686
5764A902275m4854R7860K8499J38843M7513p6359k1131N5453N1892p5197n8935
5753B045859k5274o2279M0589r605o1267l0339Q9073N9850O6372J57814p1208
5742B199585j25750P4322J7766M2947J7273P4897N8794L8331m0386M0643M4124
5731B442546n2535O9459m3487J23473J06678k4011M1895P1508L154P0897L3683
5720B843260J07112K42791J62603J00935P5414J09492J58709K80169K02029J67750
5710D450264K32879L44076L67145K41032L62446L97911N59125O31838R71763J016333
$$ plain form
5787 2445832 2385647 2448781 2420971 2350536 2265784 2192863 2167010 2110296 2011547 2090582 2073102
5776 2073102 2064913 2033733 2006054 1986135 1899077 1873439 1892891 1836489 1854900 1924469 1973961 1902275
5764 1902275 1857421 1955281 1983780 2122623 2170136 2093777 2072646 2128099 2179991 2104794 2045859
5753 2045859 2020585 1958306 1998895 1989290 1928023 1897684 1986757 2046607 2112979 2270793 2199585
5742 2199585 2073835 2148157 2165923 2208870 2226143 2301040 2359834 2398165 2357779 2398422 2442546
5731 2442546 2390011 2459470 2415983 2539456 2646134 2622123 2664018 2735526 2738680 2809577 2843260
5720 2843260 2950372 3193163 3355766 3456701 3532115 3641607 3800316 4080485 4282514 4450264
5710 4450264 4683143 5027219 5394364 5635396 5997842 6395753 6954878 7586716 8558479 9574812
5700I574812Q71313P59771M31776K77018N98743R46530J196765J214889J283813
5691A7155430J149067L41517p43336j083432l43722L39296Q90604K90045q89092
5682A7106377j258612j251221j415152j280501q46907m21244l85082m70024r11869
5673H865765j074010r08350o72904n63018m20468l00217k01089k01905j88060
5664D335744j14742k5195j09883k17665r9514P6961q8510r0587o135j3694K9012
5653C675792K0877j05330q8188K8167j15675L0491Q5272n0199l7088Q528R6603
5642C549250Q6649j8092L5369j03922M1805J36924J42040l6928j119K8395O2710
5631C923081J96122J32834K62794J32098Q2669K68671K95171K51116L74397M91879
$$ plain form
5700 9574812 10446125 11205896 11637672 11914690 12513433 13459963 14656728 15871617 17155430
5691 17155430 18304497 18646014 17902678 16819246 16475524 16814820 17705424 17995469 17106377
5682 17106377 15847765 14596544 13181392 11900891 11053984 10632740 10247658 9777634 8865765
5673 8865765 7791755 6883405 6210501 5647483 5227015 4926798 4725709 4523804 4335744
5664 4335744 4221002 4195807 4085924 3868259 3768745 3845706 3757196 3666609 3660474 3646780 3675792
5653 3675792 3696669 3591339 3503151 3531318 3415643 3446134 3531406 3481207 3444119 3452647 3549250
5642 3549250 3635899 3617807 3653176 3549254 3591059 3727983 3870023 3833095 3831976 3860371 3923081
5631 3923081 4119203 4252037 4514831 4646929 4729598 4998269 5293440 5544556 5918953 6410832
5621F410832N26305P34766Q36760Q57057O48225M48429L04010M52744Q31154J024207
5611A3074489J030070R53892R81681N88396l20475q57235m28492Q5507O21414
5602A5729247L68803m97486r64184j078550j100710j055704r21091m67424j75668
5593I837233m07772p89516r93179r62435n75501n03798l93617l48932l41709j95392
5583D325382j42588r0605j37064j74995p8073J01285K344j16837n0722r9246r185
5572C529696R332n4337m0607K1047J04708o5297J26236m9691L0155q4385l9287
5561C487570l0168k2400Q536j51404Q0927m978o4398N723J6710k8779J287N2646
5549C351272J4528O203L9108N0277r1760J46305J10802Q8820R0260J70970k78325
$$ plain form
5621 6410832 6937137 7671903 8508663 9365720 10013945 10462374 10766384 11219128 12050282 13074489
5611 13074489 14104559 15058451 16040132 16628528 16308053 15450818 15022326 15107833 15729247
5602 15729247 16098050 15600564 14636380 13557830 12457120 11401416 10480325 10012901 9837233
5593 9837233 9429461 8639945 7646766 6684331 6108830 5605032 5211415 4862483 4520774 4325382
5583 4325382 4182794 4092189 3955125 3780130 3702057 3803342 3805686 3688849 3638127 3538881 3529696
5572 3529696 3539028 3484691 3444084 3465131 3569839 3504542 3630778 3581087 3611242 3526857 3487570
5561 3487570 3457402 3435002 3443538 3292134 3373061 3368083 3303685 3309408 3326118 3297339 3298626 3351272
5549 3351272 3365800 3372003 3411111 3461388 3369628 3515933 3626735 3715555 3805815 3976785 3698460
5538C698460k6040J3644J9934j7098o836K6977j40797j092O1271M5380o9122R2935
5526C697616r5461p2144L2189K52047J437o2693Q0632K9493j0258j06013P4188
5515C821033N0396K3055K0208k8473k532j10547K5476L6301O2255l1929J60574
5504D025817P5370R2564j147M7296N7349N8717Q1920R0951M2777J21409M7870
5493D740893O5966J65751K5683L2875J10174J74603J62994K36289K92686O8742
5483F076656J38828K21447J27718K61962J31367J78301K41198L14057N24072N14103
5473H729709L98063N69690N36552N85487L91106L83484J88998O0848O3439r4622
5463A1812754r1861l9662Q5899J41496J92968J6689k5065k8876k1627J84003K53991
$$ plain form
5538 3698460 3672420 3686064 3705998 3688900 3682064 3709041 3568244 3567152 3628423 3673803 3604681 3697616
5526 3697616 3602155 3530011 3562200 3814247 3815684 3752991 3833623 3863116 3852858 3746845 3821033
5515 3821033 3871429 3894484 3914692 3886219 3883687 3773140 3798616 3834917 3897172 3865243 4025817
5504 4025817 4101187 4193751 4192604 4239900 4297249 4355966 4437886 4528837 4571614 4693023 4740893
5493 4740893 4806859 4972610 4998293 5031168 5141342 5315945 5478939 5715228 6007914 6076656
5483 6076656 6215484 6436931 6564649 6826611 6957978 7136279 7377477 7691534 8215606 8729709
5473 8729709 9127772 9697462 10234014 10819501 11210607 11594091 11783089 11843937 11907376 11812754
5463 11812754 11720893 11681231 11767130 11908626 12101594 12118283 12093218 12064342 12042715 12226718 12480709
5452A2480709L65912M99497N75263P48606P74562Q82158Q76409J036376J003735
5443A9243227O83461L97804J02860p9101k54570j40000J09129L50192N12367Q24103
5433B1749472J290001J753073J892076K178504K265744J461400Q82288L86731
5425C3859289K95175P57793J567889K307647K645808K198556Q95811q19795k269518
5416D1438655k458907j877774j026210j7365P54344P44604M47862M2250j47713
5407C7899746L4378J17046j34169n08693q15424n47804l1035Q41499J619024J882529
5397D0357097J431524o520j730288l053624l340786k638606j754059j125439n97877
5388B7541422p62456j296514j917256k260041k269100k102582j692216j243594
$$ plain form
5452 12480709 12846621 13346118 13921381 14669987 15444549 16326707 17203116 18239492 19243227
5443 19243227 19926688 20324492 20427352 20348251 20093681 19953681 20062810 20413002 20925369 21749472
5433 21749472 23039473 24792546 26684622 28863126 31128870 32590270 33472558 33859289
5425 33859289 34154464 34912257 36480146 38787793 41433601 43632157 44527968 43708173 41438655
5416 41438655 38979748 37101974 36075764 36058399 36812743 37557347 38005209 38047459 37899746
5407 37899746 37934124 38051170 37917001 37408308 36592884 36045080 36014045 36855544 38474568 40357097
5397 40357097 41788621 41782101 40051813 36998189 33657403 31018797 29264738 28139299 27541422
5388 27541422 26778966 25482452 23565196 21305155 19036055 16933473 15241257 13997663
5380A3997663j073393r27065p65692n33154o06519o18341l72414l09294l76058
5371H415733m38730l00911k59930j95720k08141j82893j24459j12349j66530k49223
5361F176847k51256j57982o7598j28480k53489j73005j02750l5408p0736o7495
5351D868648o2774p4985j39365j05109k0246j5072j23694q410K0285j28577j58872
5340D051829k9422L5795r9015j22067m9584p9614m4372k1715j10892j02592J5019
5329C443370Q1552r5857k7895j9871K9249l6903P5314K5908m9135j11461J2016
5318C326287M1755j01305O4030L4336k38407l9139m4836k8489m614Q3259J00039
5307C192916j04338j916J356j13360O1832K9211k0545j5270r20J26758q189n1653
$$ plain form
5380 13997663 12924270 11997205 11231513 10698359 10091840 9473499 9101085 8791791 8415733
5371 8415733 7977003 7676092 7416162 7220442 7012301 6829408 6704949 6592600 6426070 6176847
5361 6176847 5925591 5767609 5700011 5571531 5318042 5145037 5042287 5006879 4936143 4868648
5351 4868648 4805874 4730889 4591524 4486415 4466169 4451097 4327403 4318993 4339278 4210701 4051829
5340 4051829 4022407 4058202 3959187 3837120 3787536 3707922 3663550 3641835 3530943 3428351 3443370
5329 3443370 3524922 3429065 3401170 3381299 3410548 3373645 3448959 3474867 3425732 3314271 3326287
5318 3326287 3368042 3266737 3330767 3365103 3126696 3087557 3042721 3014232 3009618 3092877 3192916
5307 3192916 3088578 3086662 3088018 2974658 3036490 3065701 3045156 3029886 3028966 3155724 3147535 3095882
5295C095882q0824l3004l4048J45679J24214j23094k6054j06657k3678O7000n7714
5284B947702j6183J8534m0761M1891J39017q6522n2549K1559N9895O6849Q6218
5273C185650J55185J1482p6112M461k672M596K4811o5529j01047J12763k1235
5262C232353J185P630M9305r723q2364r2306O1454k8230J0276P2360J17482m1381
5250C298041J18927N7453n2861R6496N0958L3284L6232m666J4374n0200o0878
5239C537160O3612q8175K1596j4071j696Q8821m602n3547m2223m2778l6894k210
5227C424993M9088j380Q8379P1820r3890J25358M6441j44078J87779M6518m7039
5216C753989K7360J68846R3838J3353P7899n0370j9034J26871J06792M1702j7582
$$ plain form
5295 3095882 3015058 2982054 2948006 3093685 3217899 3094805 3068751 2962094 2938416 3005416 2947702
5284 2947702 2931519 2950053 2909292 2951183 3090200 3003678 2951129 2972688 3032583 3099432 3185650
5273 3185650 3340835 3352317 3276205 3280666 3277994 3282590 3307401 3241872 3140825 3253588 3232353
5262 3232353 3233538 3241168 3290473 3280750 3198386 3106080 3167534 3139304 3149580 3221940 3339422 3298041
5250 3298041 3416968 3474421 3421560 3518056 3569014 3602298 3638530 3633864 3648238 3598038 3537160
5239 3537160 3600772 3512597 3534193 3520122 3518426 3607247 3602645 3549098 3506875 3464097 3427203 3424993
5227 3424993 3474081 3472701 3561080 3632900 3539010 3664368 3710809 3566731 3754510 3801028 3753989
5216 3753989 3781349 3950195 4044033 4057386 4135285 4084915 4065881 4192752 4299544 4341246 4323664
5205D323664n0940J12257J23894Q4622O1231L1643P0791k757Q1017K6719R8039
5194D960180O7841r364O8769J04650J12310J07100O2041J07742J06459J08543
5184E796271R8174J70891J62749J06058J65461M8701J69318K35557J66528J25425
5174G245133N9251K1432J34948J56615J03901J11156J43619L21606J89665J92747
5164H680073J91478K09698K01005J77735J77108K51655K30876L96881K94492L98046
5154A1209047N03780N72037N90617N69435O25752O86001Q72227J041764J224979
5145A7895639J172209J481069J974207K285997K543681K940860L240364L187136
5137C6721162K478538Q04283j037181k299208l389108l435080k709245j978000
$$ plain form
5205 4323664 4272724 4384981 4508875 4593497 4654728 4686371 4757162 4754405 4835422 4862141 4960180
5194 4960180 5028021 5018657 5087426 5192076 5304386 5411486 5473527 5581269 5687728 5796271
5184 5796271 5894445 6065336 6228085 6334143 6499604 6548305 6717623 6953180 7119708 7245133
5174 7245133 7304384 7325816 7460764 7617379 7721280 7832436 7976055 8297661 8487326 8680073
5164 8680073 8871551 9081249 9282254 9459989 9637097 9888752 10119628 10516509 10811001 11209047
5154 11209047 11712827 12284864 12875481 13444916 14070668 14756669 15628896 16670660 17895639
5145 17895639 19067848 20548917 22523124 24809121 27352802 30293662 33534026 36721162
5137 36721162 39199700 40003983 38966802 36667594 33278486 29843406 27134161 25156161
5129B5156161j264125q35866o90056j91276N9604J69705L74495N96759P49653
5120B4125054R25597J239482J450178J849428K412839K918853L601569M533050
5112D3056050N181519N728273N797854M859119K440447o79875l253670n375759
5104E7753958o235264n843816n012904m044314l246588k427067j900594j535269
5096B7508142j032570q08896m72260k55611j45178O4176K34389L27698P11319
5087B6131209R91184J310596J688319K229080K578670K964165K641529J504452
5079D2039204l37778j770936k858945l765509l226412k418817j887172j544128
5071B4229507j127449j001891r03991r97624p50663o18943n19095l69410l00828
$$ plain form
5129 25156161 23892036 23056170 22366114 22174838 22234442 22404147 22778642 23375401 24125054
5120 24125054 25050651 26290133 27740311 29589739 32002578 34921431 38523000 43056050
5112 43056050 48237569 53965842 59763696 64622815 67063262 66383387 63129717 57753958
5104 57753958 51518694 45674878 40661974 36617660 33371072 30944005 29043411 27508142
5096 27508142 26475572 25666676 25194416 24938805 24793627 24857803 25092192 25419890 26131209
5087 26131209 27122393 28432989 30121308 32350388 34929058 37893223 40534752 42039204
5079 42039204 41701426 39930490 37071545 33306036 30079624 27660807 25773635 24229507
5071 24229507 23102058 22100167 21196176 20198552 19447889 18828946 18309851 17940441 17639613
5062A7639613l51059l98386l63915l32645n38078j98420j85420l56114j60521
5053A4755055k36801j86004j52024j79137j71456j80247k60406M3286j73699j44609
5043A3113958K8130j82200j39609m9077n682N6136R4651K68035K27083J57757
5033A3569182J75844J71153J04798O3169J27155K02645J56730K19952J87364J02871
5023A5080863J01382K19092J50540J16979K43747K75403J89207L08390L81121
5014A7066724L49537M10088M37663O13466P83005Q24259J015032J102424J193007
5005B3795205J418203J492479J568958J551515J270797R36049L93381q3305n86950
4996C1756332r64038j122302j236156j130074q86933o83083m69921l10376j79636
$$ plain form
5062 17639613 17288554 16890168 16526253 16193608 15655530 15457110 15271690 14915576 14755055
5053 14755055 14518254 14332250 14180226 14001089 13829633 13649386 13388980 13432266 13258567 13113958
5043 13113958 13142088 12959888 12820279 12771202 12765520 12821656 12916307 13184342 13411425 13569182
5033 13569182 13745026 13916179 14020977 14084146 14211301 14413946 14570676 14790628 14977992 15080863
5023 15080863 15182245 15401337 15551877 15668856 15912603 16188006 16377213 16685603 17066724
5014 17066724 17416261 17826349 18264012 18877478 19660483 20484742 21499774 22602198 23795205
5005 23795205 25213408 26705887 28274845 29826360 31097157 32033206 32426587 32343282 31756332
4996 31756332 30792294 29669992 28433836 27303762 26416829 25733746 25263825 24953449 24773813
4987B4773813r9042O0564L72167M10293N75851N19177P57841R52767J180617J316853
4977C0820901J503462J769264K071096K240406K444399K637881K927751K876875
4969D9292035K659309K074484J124108k74949j883988k840161l307311l408858
4961D3434669l103345k683264k152700j754486j326902r78430q25880m70552j44027
4952B9995083n1462N9093K44059L59392N06348P95488J106943J222803J520382
4943C5758129J830000K067992K421216K663868K826207K850739K726859K463060
4935E5608070J984479J153797K73969r02887k016360k739609l087602l158768
4927D7115089k936303k410505j940626j374734j084853q54341n63722n13563l67145
$$ plain form
4987 24773813 24674771 24735335 25107502 25517795 26093646 26612823 27370664 28323431 29504048 30820901
4977 30820901 32324363 34093627 36164723 38405129 40849528 43487409 46415160 49292035
4969 49292035 51951344 54025828 55149936 54874987 52990999 50150838 46843527 43434669
4961 43434669 40331324 37648060 35495360 33740874 32413972 31435542 30609662 30139110 29995083
4952 29995083 29943621 30002714 30246773 30606165 31112513 31908001 33014944 34237747 35758129
4943 35758129 37588129 39656121 42077337 44741205 47567412 50418151 53145010 55608070
4935 55608070 57592549 58746346 59020315 58117428 56101068 53361459 50273857 47115089
4927 47115089 44178786 41768281 39827655 38452921 37368068 36513727 35950005 35436442 35069297
4918C5069297k80463l50000k18203N2371L96335P78786J377537J663374K121362
4909D0610396K668751L203696L344812L172130K454887J206336k65057j723771
4901E4672180k854241l379011l390545l014596k507513j869433j107015p98142
4893C5751684o30587n42709q34886j117186j055214j004413r17665p36678l31759
4884B8580587n998K97533O49686Q79790J253443J132626J207711R31047L11857
4875C5238282m68065j155494j959909k306790k044845j858684j470891j246207
4867B2727397q76821o43564n42187l89926n45490p36640p81758o87727p24997
4858A6798287o85051p38536p00399o99881n96870m49747m05894n21907m24630
$$ plain form
4918 35069297 34788834 34438834 34220631 34273002 34669337 35448123 36825660 38489034 40610396
4909 40610396 43279147 46482843 49827655 52999785 55454672 56661008 56395951 54672180
4901 54672180 51817939 48438928 45048383 42033787 39526274 37656841 36549826 35751684
4893 35751684 35121097 34578388 33743502 32626316 31571102 30566689 29649024 28912346 28580587
4884 28580587 28574589 28872122 29521808 30401598 31655041 32787667 33995378 34926425 35238282
4875 35238282 34770217 33614723 31654814 29348024 27303179 25444495 23973604 22727397
4867 22727397 21850576 21207012 20664825 20274899 19729409 18992769 18211011 17523284 16798287
4858 16798287 16113236 15374700 14674301 13974420 13377550 12927803 12521909 12000002 11575372
4849A1575372l12829l91117l65933k86521k36696m15967j69866k17408l32746
4840H846289j84513r4530m2817k36043j59620R721j35782K3121j32649p8373p1292
4829G743512j55989p4213l8101j9791j11728k21423p192j62145k6453n5551k44447
4818F626479j22530k76925j37815n395k08567j29045j16748m3026p6744n8424
4808E451260p4451j45725k3930P0005r5353r7385r5480L1323o9579q1008N4838
4797D924515r8854o0708P0617n1717j44745j35802N4284M6572j16232O890l79
4786D494441O9178N0409Q0548o02p1549k9092O1919J6351O5259R838l9066n9993
4774D647641M9619m6685p7329j25695J8779n0675l6119j7210j70143q9315j15014
$$ plain form
4849 11575372 11262543 10871426 10505493 10218972 9982276 9566309 9396443 9179035 8846289
4840 8846289 8661776 8567246 8524429 8288386 8128766 8138487 8002705 8025826 7893177 7814804 7743512
4829 7743512 7587523 7513310 7475209 7455418 7343690 7122267 7115075 6952930 6926477 6870926 6626479
4818 6626479 6503949 6227024 6089209 6083814 5875247 5746202 5629454 5586428 5509684 5451260
4808 5451260 5376809 5231084 5207154 5277159 5181806 5084421 4988941 5020264 4950685 4869677 4924515
4797 4924515 4825661 4764953 4835570 4783853 4639108 4503306 4557590 4604162 4487930 4494820 4494441
4786 4494441 4563619 4614028 4694576 4693974 4622425 4593333 4655252 4671603 4736862 4746700 4707634 4647641
4774 4647641 4697260 4650575 4573246 4447551 4466330 4415655 4379536 4362326 4192183 4102868 3987854
4763C987854K5840n262o7473J08155k7885j2002R4273J25809l5495p4524J09542
4752D228832J02889N0480P4496O5971R5428O7736K9042l8447L8990L8473M0280
4741D794170j34180N860J8539j31440r5741o0142L6179j46307j13512m7807j2109
4730D113510J7125o5067p688j14029j74371K1422n3178j5513o4416j8798O1229
4719C700226R8595Q8263j14516n2356O4085n6237Q0028J09736P9978K2411j00560
4708C919653J24772J05895k3352m3656m4810p4100j16839o602M3234m6688p7648
4697C759859j3403j21641L4836l6009j33142M2624L5653K3619q3013m3503K6411
4686C492291j19113L9751M0698j5585k0261O9295K9860j19557n502L9029l1898
$$ plain form
4763 3987854 4013694 4008432 3940959 4049114 4021229 4009227 4103500 4229309 4193814 4119290 4228832
4752 4228832 4331721 4382201 4456697 4522668 4618096 4685832 4714874 4676427 4715417 4753890 4794170
4741 4794170 4659990 4665850 4684389 4552949 4457208 4397066 4433245 4286938 4173426 4125619 4113510
4730 4113510 4130635 4065568 4057880 3943851 3769480 3790902 3737724 3722211 3657795 3638997 3700226
4719 3700226 3798821 3887084 3772568 3720212 3784297 3728060 3808088 3917824 3997802 4020213 3919653
4708 3919653 4044425 4150320 4126968 4083312 4038502 3964402 3847563 3840961 3884195 3837507 3759859
4697 3759859 3746456 3624815 3659651 3623642 3490500 3533124 3568777 3592396 3509383 3465880 3492291
4686 3492291 3373178 3412929 3453627 3438042 3417781 3487076 3516936 3397379 3391877 3430906 3399008
4675C399008L1683J9838l6864O5814J17342Q9673K5740l5342R6256M8715L8471
4664C860334J32518J8338l5800l9264J08599J10585j37195m6064L2839L5164J747
4653D041801P4470P6393k0066q4626M6222L174N2362Q6168J03635J57422J8648
4642D555603k1131K7254M4473R7793J20302N5698R0639J22777P7693J52371R9537
4631E423009r4683J0627j411P0831J6310l6391n3397P4976Q0178P5035P8791N4524
4619E698399m1596J02905J46986K0152J28670M0983Q0590J39687J45442R2555
4609F554773O6663K11660R8749N987K51525J25577K3611J11686J69629K21109
4599G840969J05954J87506J50855m620R6863J91095N5237K11733K04068K40532
$$ plain form
4675 3399008 3430691 3450529 3413665 3479479 3596821 3686494 3712234 3676892 3773148 3821863 3860334
4664 3860334 3992852 4011190 3975390 3936126 4044725 4155310 4018115 3972051 4004890 4040054 4041801
4653 4041801 4116271 4192664 4172598 4087972 4134194 4137368 4189730 4275898 4379533 4536955 4555603
4642 4555603 4534472 4561726 4606199 4703992 4824294 4879992 4970631 5093408 5171101 5323472 5423009
4631 5423009 5328326 5338953 5337542 5408373 5424683 5388292 5334895 5409871 5490049 5565084 5643875 5698399
4619 5698399 5656803 5759708 5906694 5926846 6055516 6096499 6177089 6316776 6462218 6554773
4609 6554773 6621436 6833096 6931845 6937832 7189357 7314934 7338545 7450231 7619860 7840969
4599 7840969 7946923 8134429 8285284 8280664 8377527 8568622 8623859 8835592 9039660 9280192
4589I280192J80871J05171K99475J59725Q9834J50182K29976K38333K01739K77124
4579A1212622K60359J23133K40146K45980L56526L42029J57303L03407K13079
4570A3454584M01346M55142L60422M46042M94021L23346M35649N82481M87802
4561A7440835N44332P24817O70005N64096P97623R03532Q62228R09804J095272
4552B4512544J248474J284670J465955J660311J744202J916005K293340K696403
4544C8821904L053854L442226L892408M278108M547483M825043M739643M621037
4536G2221706M482921M571746M646226M692046M552614L629226J983508R1154
4528A00871147j370646k172793k204826k251673j759457j384280j035007o01000
$$ plain form
4589 9280192 9461063 9566234 9865709 10025434 10115268 10265450 10495426 10733759 10935498 11212622
4579 11212622 11472981 11596114 11836260 12082240 12438766 12780795 12938098 13241505 13454584
4570 13454584 13855930 14311072 14671494 15117536 15611557 15934903 16370552 16953033 17440835
4561 17440835 17985167 18709984 19379989 19944085 20741708 21645240 22507468 23417272 24512544
4552 24512544 25761018 27045688 28511643 30171954 31916156 33832161 36125501 38821904
4544 38821904 41875758 45317984 49210392 53488500 58035983 62861026 67600669 72221706
4536 72221706 76704627 81276373 85922599 90614645 95167259 98796485 100779993 100871147
4528 100871147 99500501 97327708 95122882 92871209 91111752 89727472 88692465 88091465
4520H8091465l06893j9172N12919J053572J489899J929297J880886J328497K96409
4511I6256879j253785k637534l462000l592759l280693l052856k535017j965648
4503G4476587j650612j260941j088294j189099j669343k381998k790299k973812
4495E9472189k895476k689677k769121k878985k855760k747919k266737k051804
4487C8316710j682506j521207j407059j417365j509275j491733j437921j367372
4479B6482272j017523r28041p36791p85355p85625n98121m51189m35370l88333
4470B0355924m81481l95000k88200k87392j87880l33769l76543k82854j91666
4461A7531139p7226j87872p4189j9795M4156K71158K91716M13805O06087P60686
$$ plain form
4520 88091465 87784572 87765400 88278319 89331891 90821790 92751087 94631973 95960470 96256879
4511 96256879 95003094 92365560 88903560 85310801 82030108 78977252 76442235 74476587
4503 74476587 72825975 71565034 70476740 69287641 67618298 65236300 62446001 59472189
4495 59472189 56576713 53887036 51117915 48238930 45383170 42635251 40368514 38316710
4487 38316710 36634204 35112997 33705938 32288573 30779298 29287565 27849644 26482272
4479 26482272 25464749 24536708 23799917 23014562 22228937 21630816 21179627 20744257 20355924
4470 20355924 19874443 19479443 19191243 18903851 18715971 18382202 18005659 17722805 17531139
4461 17531139 17453913 17266041 17191852 17172057 17216213 17487371 17779087 18192892 18798979 19559665
4451A9559665M98814j35032o70902j077037j226892r69350p36897o15818m66454
4442A4160097l21395l55922l95378j70107j95306j80916q5165q5515j36645j92937
4432A2040811k0740o125q495j8762J2744P8462J23679K34567K09754K68690M85830
4421A3400415P29198O86482Q69366J053645O24500r9959q08605j219422j499177
4412A3736443j005977p58130n28470m89599m22008l41020k34601k03474j46426
4403I606738j64367j18597j68440j71551r5276j44049K004j7166j26528J9061
4393H621829O1139l8158P2708J04875J68004J02839K20128K87669J33803J12437
4383I847273L5338k94295k57682m02932m52117l13175l20244m0153j02809o9650
$$ plain form
4451 19559665 20058479 19923447 19252545 18175508 16948616 15979266 15242369 14626551 14160097
4442 14160097 13838702 13482780 13087402 12917295 12721989 12541073 12455908 12370393 12233748 12040811
4432 12040811 12020071 12013946 12005451 11986689 11999433 12077895 12201574 12436141 12645895 12914585 13400415
4421 13400415 14129613 14816095 15685461 16739106 17363606 17263647 16455042 15235620 13736443
4412 13736443 12730466 11972336 11443866 10954267 10532259 10191239 9956638 9753164 9606738
4403 9606738 9442371 9323774 9155334 8983783 8888507 8744458 8746462 8729296 8602768 8621829
4393 8621829 8682968 8644810 8717518 8822393 8990397 9093236 9313364 9601033 9734836 9847273
4383 9847273 9882611 9588316 9330634 8927702 8475585 8162410 7842166 7802013 7699204 7629554
4373G629554K3287o2941p1961l3327M623j09815j58285j73958j04103n0238j15371
4362F777465p5255j65652j66857k5732o6210p5046l0233K365m5122j11308j3007
4351F005408j00629j53062M1231K1975k4252M1591j14446j43706n6820j00435
4341E416855m9055L374J3575M4094m405O7540O0356j0398o8142M5369O2888m1697
4329E540354L8171K8027j00499o7262j04216K3109m589J01012J59476J07000m5353
4318E675230j40716k8922n0078m5208l9966j10000j24576P1393j8753n2276q4854
4307E051274n3257K8942L0690R3753M4968j5472L0490R5607J46807k5829n7322
4296E370651L031k4438J24429J05169J5442L1850P3573l2933j32236j16684j35873
$$ plain form
4373 7629554 7652841 7589900 7517939 7484612 7489235 7379420 7221135 7047177 6943074 6892836 6777465
4362 6777465 6702210 6536558 6369701 6343969 6277759 6202713 6172480 6174845 6129723 6018415 6005408
4351 6005408 5904779 5751717 5792948 5814923 5790671 5832262 5717816 5574110 5517290 5416855
4341 5416855 5367800 5371174 5384749 5428843 5424438 5491978 5552334 5541936 5473794 5519163 5582051 5540354
4329 5540354 5578525 5606552 5506053 5438791 5334575 5357684 5353095 5454107 5613583 5720583 5675230
4318 5675230 5534514 5505592 5455514 5410306 5370340 5260340 5135764 5207157 5188404 5136128 5051274
4307 5051274 4998017 5026959 5057649 5151402 5196370 5180898 5211388 5306995 5453802 5427973 5370651
4296 5370651 5373682 5349244 5473673 5578842 5594284 5626134 5699707 5666774 5534538 5417854 5281981
4285E281981j18774j06054j20016j15787j13599j1274L0754N637j57878k2145
4275D552845L5162l8989O7527m4141r820j49994k3557n4151m6953J10854R3026
4264D491809o3480J24455J4608R6745r2179p5697n0068j20888o6735K1263l9579
4253D240254j86355o0677J5672o3161o387l8374o7782l2036J5055j7883j31413
4242C666913q4516L1183J7059j15276n6594q1208J7861j8007J30888k1066k2763
4231C464474P4288K2821l072L2437j705J7204J9883J65465O8619k7279J0680o9163
4219C774652P0253N2726j09925j0186p96J57716Q5016l4234k5330L0812M6970
4208D037674L0427J16339j2103K4743K8879Q4835k5506P351R3598K6088k965J11448
$$ plain form
4285 5281981 5163207 5057153 4937137 4821350 4707751 4696477 4727231 4732868 4574990 4552845
4275 4552845 4588007 4549018 4616545 4572404 4562584 4412590 4389033 4334882 4287929 4398783 4491809
4264 4491809 4428329 4552784 4567392 4664137 4571958 4496261 4446193 4325305 4258570 4279833 4240254
4253 4240254 4053899 3993222 4008894 3945733 3939346 3900972 3833190 3801154 3816209 3798326 3666913
4242 3666913 3582397 3613580 3630639 3515363 3458769 3377561 3395422 3377415 3508303 3487237 3464474
4231 3464474 3538762 3561583 3558511 3590948 3589243 3606447 3626330 3791795 3860414 3833135 3843815 3774652
4219 3774652 3844905 3897631 3787706 3777520 3776724 3934440 4019456 3985222 3959892 3990704 4037674
4208 4037674 4068101 4184440 4172337 4197080 4225959 4310794 4285288 4292639 4386237 4412325 4409360 4520808
4196D520808Q4608j03577r5131O2974P6302Q1925P7186N5279J11302K47685K97061
4185E416422J41389K90704L43663L38163L67811M39756M48923O32794N66127R63543
4175I949295J300965J345526J492312R25808l87447r60334j650014k083641j438430
4166H494040j011141p60658o99575m37052k87119r9003j94511j63003j2804m7067
4156D782107j74080J03856J24878P1785J16234J84075n4458l15823k75288k80691
4146D282595k79280j34008q5633j27747j52938k5819K49q1159j06094k5276o0870
4135C204020L441o0851J42045p2589l7892J4699r9515J22625j3574j48381j42763
4124B911265J13222J8031p3703o293J39576p1540l8661O5341M0682m6449q249
$$ plain form
4196 4520808 4605416 4501839 4406708 4469682 4545984 4627909 4705095 4760374 4871676 5119361 5416422
4185 5416422 5557811 5848515 6192178 6530341 6898152 7337908 7786831 8419625 8985752 9949295
4175 9949295 11250260 12595786 14088098 15013906 14626459 13666125 12016111 9932470 8494040
4166 8494040 7482899 6722241 6022666 5585614 5298495 5199492 5004981 4841978 4829174 4782107
4156 4782107 4608027 4711883 4836761 4908546 5024780 5208855 5154397 4838574 4563286 4282595
4146 4282595 4003315 3869307 3783674 3655927 3502989 3477170 3477419 3396260 3290166 3264890 3204020
4135 3204020 3207461 3146610 3288655 3216066 3178174 3192873 3093358 3215983 3202409 3054028 2911265
4124 2911265 3024487 3042518 2968815 2962522 3102098 3030558 2991897 3057238 3097920 3051471 3043222
4113C043222P9365J18655l1611M8568p1924l6777O7282J4771n5258n6765p50k8198
4101C090580m0909M1992m5192j17328o5882J35118P4929r016o011J59574Q3682
4090C301537j04222R2861J5655q522M9731R8331J5087P250J82319N3580N7114
4079C760721n991J26074M9027N3169K36030O3920J14070M1967m7791j8180j35740
4068D237276n5307Q44j10420p2567Q4370j2752o7741p0857n149L2407J73819M3322
4056D177245L033J39240q9138j49923K1117M0376m266J02489K35492J35315J33570
4045D744550M4707J7212J29414j9155m128J62517o8637M2968J34602j2112j10965
4034E060973L38L286L069J55256J61147J13783J2200P3641J86506J12126q6823
$$ plain form
4113 3043222 3122587 3241242 3209631 3258199 3186275 3149498 3216780 3231551 3176293 3119528 3118778 3090580
4101 3090580 3049671 3091663 3046471 2929143 2863261 2998379 3073308 3064292 3058281 3217855 3301537
4090 3301537 3197315 3290176 3305831 3297309 3347040 3445371 3460458 3467708 3650027 3703607 3760721
4079 3760721 3754730 3880804 3929831 3983000 4219030 4282950 4397020 4438987 4391196 4373016 4237276
4068 4237276 4181969 4182813 4072393 3999826 4084196 4071444 4003703 3932846 3927697 3960104 4133923 4177245
4056 4177245 4180278 4319518 4230380 4080457 4101574 4141950 4137684 4240173 4475665 4610980 4744550
4045 4744550 4789257 4806469 4935883 4916728 4912600 5075117 5006480 5049448 5184050 5171938 5060973
4034 5060973 5061311 5064597 5067666 5222922 5384069 5497852 5510052 5583693 5770199 5882325 5795502
4023E795502J97446J10778J08434K38513K31616J9734k3614n0909m6446j14257
4013F466797Q7357L7806N9585J15472J21742J16473P8034n5293K11677J63436
4003G403086J97709J24261J62692K33975K57713K49305J07756J03764K57276J71315
3993I268852K73199L36938K62403K47242K82024L55135L28047L74437N59686O45939
3983A2933902O29462P52974P05409P42952P49995Q74247Q71328M97301N72851
3974A9330421N05319M38088M68302L54420M356j85976j89907j38838j43738k64373
3964B0178074m66473m85684n17317m22402j93297j35454n5883J13344R3483K96589
3954A8404980M72281M24976M61181O25082Q40524P35792O37702O78709N22740
$$ plain form
4023 5795502 5992948 6103726 6212160 6450673 6682289 6702023 6678409 6627500 6581054 6466797
4013 6466797 6554154 6591960 6651545 6767017 6888759 7005232 7083266 7027973 7239650 7403086
4003 7403086 7600795 7725056 7887748 8121723 8379436 8628741 8736497 8840261 9097537 9268852
3993 9268852 9542051 9878989 10141392 10388634 10670658 11025793 11353840 11728277 12287963 12933902
3983 12933902 13563364 14316338 15021747 15764699 16514694 17388941 18260269 18757570 19330421
3974 19330421 19835740 20273828 20742130 21096550 21100906 20914930 20725023 20586185 20442447 20178074
3964 20178074 19711601 19225917 18708600 18286198 18092901 17957447 17901564 18014908 18108391 18404980
3954 18404980 18877261 19302237 19763418 20388500 21229024 21964816 22602518 23281227 23803967
3945B3803967L60993M67111M38668K89838L09639K02120j55737l56997l17941
3936B5041661k72095l74972l80177l91376m81474o22457m74355k87882m55364
3927B1301509l31678k51267l17757j51396q8047m2420l17823j24608j59832j81127
3917A9335554n4627j62264j32513j07179j50039j64126j55394j20439j42526l7126
3907A8109321l8082j00292j07770L0411J6156J39228K35025K23190J55697M33824
3897A9096708L70116K82339K25277L99456K51023L19352L63539J73092O2351K06488
3887B1749741J18059J41042J86006L34651J88957K74134L06143N91640M31280
3878B4321653P34790O10895O56060P36800R02089P50318R07230J110545J380327
$$ plain form
3945 23803967 24164960 24632071 25070739 25360577 25670216 25872336 25716599 25359602 25041661
3936 25041661 24769566 24394594 24014417 23623041 23141567 22519110 22044755 21756873 21301509
3927 21301509 20969831 20718564 20400807 20249411 20161364 20118944 19801121 19676513 19516681 19335554
3917 19335554 19280927 19118663 18986150 18878971 18728932 18564806 18409412 18288973 18146447 18109321
3907 18109321 18071239 17970947 17863177 17893588 17909744 18048972 18283997 18507187 18662884 19096708
3897 19096708 19466824 19749163 19974440 20373896 20624919 20944271 21307810 21480902 21543253 21749741
3887 21749741 21867800 22008842 22194848 22529499 22718456 22992590 23298733 23890373 24321653
3878 24321653 25056443 25667338 26323398 27060198 27962287 28712605 29619835 30730380 32110707
3869C2110707J392091J764445J696773J674636J589469K016260K056880K115846
3861D6417107K014930K505582L005152L895508M585954N253628O269229Q399472
3853H2346562J0596836J3660055J6968653K0650500K3351109K0982431O292557
3846A94848703j0841860k0535953l1431286k5974047j7978406j3177375r368570
3839F5541206o826417n056067l916374l172885k771307k360501j955540j547550
3831C7934565j490392j133670j001855q44893p59272o79663n42541o02290n49714
3822C0330275l59882l54742l36512k16663l55597l56379j83067k46976k88546
3813B7631911k83340l8679l3803k4419O5442L6108j36601m4494L4989J0075j1629
$$ plain form
3869 32110707 33502798 35267243 36964016 38638652 40228121 42244381 44301261 46417107
3861 46417107 48432037 50937619 53942771 57838279 62424233 67677861 73947090 82346562
3853 82346562 92943398 106603453 123572106 144222606 167573715 188556146 194848703
3846 194848703 184006843 163470890 132039604 106065557 88087151 74909776 65541206
3839 65541206 58714789 53658722 49742348 46569463 43798156 41437655 39482115 37934565
3831 37934565 36444173 35310503 34308648 33463755 32704483 32024820 31482279 30879989 30330275
3822 30330275 29970393 29615651 29279139 29062476 28706879 28350500 28167433 27920457 27631911
3813 27631911 27348571 27309892 27276089 27251670 27317112 27353220 27216619 27172125 27207114 27217189 27205560
3802B7205560l6529l0142L1581l8442J21474J96628K17151J18890J48171J26099
3792B8060441J49525K13812K66726L37331M62178M58991N24406O33124O94919
3783C1801453O65327N64556M73261L45063L23037N66057O99652O79719P42196
3774C6860321R53004J046530J164243J201904J193620J358979J347599J603971
3766D6730171J506395J252383R15866O51232M60102N82971Q49614R45561J296063
3757E5190358J675350J930376K166720K510815K803069L157182L711554M384948
3749G7530372N144395N583125O193671P109774Q612835J0539017J3709734J7259878
3741A51682801K0959949K3278463K0312223N101569j0160775k1333335k5821036
$$ plain form
3802 27205560 27169031 27138889 27170470 27132028 27253502 27450130 27667281 27786171 27934342 28060441
3792 28060441 28209966 28423778 28690504 29027835 29490013 29949004 30473410 31106534 31801453
3783 31801453 32466780 33031336 33504597 33849660 34172697 34738754 35438406 36118125 36860321
3774 36860321 37813325 38859855 40024098 41226002 42419622 43778601 45126200 46730171
3766 46730171 48236566 49488949 50404815 51056047 51516149 52099120 52948734 53894295 55190358
3757 55190358 56865708 58796084 60962804 63473619 66276688 69433870 73145424 77530372
3749 77530372 82674767 88257892 94451563 101561337 110174172 120713189 134422923 151682801
3741 151682801 172642750 195921213 216233436 221335005 211174230 189840895 164019859
3734A64019859j8298904j2114159p060693l891547j045973P19568K320565L265681
3726A27914397M432822N383989O542918P482791Q649164R648302J0556157J1233340
3718A91843880J1381706J0973660J0223509Q590479O285209L333748r52037o725020
3710B34955134j0513552j2331700j0705656p194245l996791j161536O37951J446346
3702A91135951J538834J728781J610086J358121J010640K75142j673697n051841
3694A91932017q555230j0673549j1004916j0453024r848810r116072q854045q501444
3686A14924927q121493p247243o379123n418395m771094m082111l556702l459308
3678G1889458l111064k734613k715410k382125k106660j755091j626031j272076
$$ plain form
3734 164019859 145720955 133606796 126546103 122654556 121608583 122328151 124648716 127914397
3726 127914397 132347219 137731208 144274126 151756917 160406081 170054383 180610540 191843880
3718 191843880 203225586 214199246 224422755 233013234 239298443 242632191 241680154 234955134
3710 234955134 224441582 212109882 201404226 194209981 190213190 189051654 189689605 191135951
3702 191135951 192674785 194403566 196013652 197371773 198382413 198657555 196983858 191932017
3694 191932017 183376787 172703238 161698322 151245298 141396488 132280416 123426371 114924927
3686 114924927 106803434 99556191 93177068 87758673 82987579 78905468 75348766 71889458
3678 71889458 68778394 66043781 63328371 60946246 58839586 57084495 55458464 54186388
3670E4186388j071453q02087o22923m87830l29133p0533J52096L44675Q11574
3661E2110774J321976J797866J906908N84642k476169m294979l904367l172160
3653D3874491k532562k093385j662281j274067j050856j000010o62803p04138
3645C2894389o72941o37167n28591n28836n64672p03890n55475n84258n43937
3636B7574622n59685m73217m31289l33243l27314l59370l94650j33991k54524
3627B4307339k01208k27083j02727j66456j47360r2474j71108k27787j32254l26014
3617B2512868l32308j86622l28992k84722l26090l89815l28405l92921k83021
3608A9659972m51393m27746l62212m16970l91237m15408l16001j83151j90580
$$ plain form
3670 54186388 53114935 52312848 51689925 51202095 50872962 50802429 50954525 51299200 52110774
3661 52110774 53432750 55230616 57137524 57722166 55245997 50951018 47046651 43874491
3653 43874491 41341929 39248544 37586263 36312196 35261340 34261330 33598527 32894389
3645 32894389 32221448 31584281 31055690 30526854 29962182 29258292 28702817 28118559 27574622
3636 27574622 27014937 26541720 26110431 25777188 25449874 25090504 24695854 24561863 24307339
3627 24307339 24106131 23879048 23776321 23609865 23462505 23370031 23198923 22971136 22838882 22512868
3617 22512868 22180560 21993938 21664946 21380224 21054134 20664319 20335914 19942993 19659972
3608 19659972 19208579 18780833 18418621 18001651 17610414 17195006 16879005 16695854 16505274
3599A6505274k49282k21626k51075j28179k78936j65862l43222j70083j79445
3590A4517564p6236j48947q0795j16862j75293q5301j59313r3515k23069p130
3580A3351103j09540k13346p7721n6171p0692j08518j6021m9980J8538J1005L3972
3569A2712629J326N0070L7155m07j19454P6192J23827J33398J39500q682P2523
3558A3218077k01931j27498N8752k1275m9969j35211K2237l1088p3145N3672K6232
3547A2738853J08422R9250K8887J19539J9792M1513J7670j0398q190q9024J34583
3536A3200897J38766J38495Q5862P8631J81695K08774O0903K31042K54186J51074
3526A4730325L30891K44800K19329J37571M9513M2004m4310j884N7482O1679R2167
$$ plain form
3599 16505274 16255992 16034366 15783291 15655112 15376176 15210314 14867092 14697009 14517564
3590 14517564 14441328 14292381 14211586 14094724 13919431 13834130 13674817 13581302 13358233 13351103
3580 13351103 13241563 13028217 12950496 12894325 12823633 12715115 12699094 12649114 12667652 12678657 12712629
3569 12712629 12713955 12764025 12801180 12800773 12681319 12757511 12881338 13014736 13154236 13145554 13218077
3558 13218077 13016146 12888648 12947400 12926125 12876156 12740945 12763182 12732094 12658949 12712621 12738853
3547 12738853 12847275 12946525 12975412 13094951 13114743 13156256 13173926 13163528 13155338 13066314 13200897
3536 13200897 13339663 13478158 13564020 13642651 13824346 14033120 14094023 14325065 14579251 14730325
3526 14730325 15061216 15306016 15525345 15662916 15712429 15754433 15710123 15708239 15765721 15827400 15919567
3515A5919567L1087K91982J65100Q3587J05574J74857Q1875L6796J1415L6297
3505A6938137J22202K68112K32775L11577K82521M11161N42271N89518N14057
3496B0212331O86422N64372M91763M22258M12266K64961J81259K90583L91389
3487B3917604K91593K90049M23312L34422M43131O00964N45942O63392P53882
3478B8264291O89490P76924R24374J024785J166949J281028J305519J493203J550228
3469C8476791J647080J761218K144383K499953K890270L128130L437463L706547
3461E9691835L979039M145903M269698M623293N218388O041344P247870Q685252
3453A03902622J0451802J2797868J5649676J8980514K2933287K7336636L1877585
$$ plain form
3515 15919567 15950654 16242636 16407736 16491323 16596897 16771754 16853629 16890425 16901840 16938137
3505 16938137 17060339 17328451 17561226 17872803 18155324 18566485 19108756 19698274 20212331
3496 20212331 20898753 21463125 21954888 22377146 22789412 23054373 23235632 23526215 23917604
3487 23917604 24209197 24499246 24922558 25256980 25700111 26301075 26847017 27510409 28264291
3478 28264291 28953781 29730705 30655079 31679864 32846813 34127841 35433360 36926563 38476791
3469 38476791 40123871 41885089 44029472 46529425 49419695 52547825 55985288 59691835
3461 59691835 63670874 67816777 72086475 76709768 81928156 87969500 95217370 103902622
3453 103902622 114354424 127152292 142801968 161782482 184715769 212052405 243929990
3446B43929990L4185968K8304631Q392505k0587657l9630637m0858333l3778206
3439A79958261k6125181j9908995j5341965j1880634r478286p638045o297292
3432H3287863n507712m625325m396797l963483l381555k928857k307257j906770
3424E4270107j660983j368119j279631j063597q35988o80285n16746p41779j021283
3415D5101696j417945j571003j546423j516556j212828j138518q02015o21214
3407C5275194n26626k65384j95970N1773K72079L84327M36202L18386K11688M9485
3397C6011154j46949m07784k66484j30967K18069L77821Q65333Q81681R08310
3388C8310184J034799R61933O34771k10587j332453k038573k430625k177001j701391
$$ plain form
3446 243929990 278115958 306420589 314813094 294225437 254594800 213736467 179958261
3439 179958261 153833080 133924085 118582120 106701486 97223200 89585155 83287863
3432 83287863 77780151 73154826 68758029 64794546 61412991 58484134 56176877 54270107
3424 54270107 52609124 51241005 49961374 48897777 48061789 47381504 46864758 46122979 45101696
3415 45101696 43683751 42112748 40566325 39049769 37836941 36698423 35896408 35275194
3407 35275194 34748568 34483184 34287214 34338987 34611066 34995393 35431595 35749981 35961669 36011154
3397 36011154 35864205 35456421 35189937 35058970 35277039 35654860 36520193 37401874 38310184
3388 38310184 39344983 40306916 40941687 40731100 39398647 37360074 34929449 32752448 31051057
3379C1051057j496024j177664r64543r28177p86618q99129r04331r11107p68559
3370B2214905o86767o90766n53015n07295m16626l49734k80727j01006j56335
3361A8472634k59824k86891l30099j62010l10139l13422l11209l14914l41042
3352A5843084l90122k52662k99146l14822j15797k26016k23681k45308l12047
3343A3463483k83715k09863j26277q3737k96561k02026j00762j99211k50632j82016
3333A1528683k46962j82441M217m3573r5866o9521K2147L1659O0494l0061j04972
3322A0873804L2527k0996O3103n0439l3773j11021O896j10488j23133q172j59305
3311A0359003j84768r6340j63917m3487j77376r8575m7882m7070R8362J8604J0515
$$ plain form
3379 31051057 29555033 28377369 27412826 26484649 25698031 24798902 23894571 22983464 22214905
3370 22214905 21528138 20837372 20284357 19777062 19360436 19010702 18729975 18628969 18472634
3361 18472634 18212810 17925919 17595820 17433810 17123671 16810249 16499040 16184126 15843084
3352 15843084 15452962 15200300 14901154 14586332 14470535 14244519 14020838 13775530 13463483
3343 13463483 13179768 12969905 12843628 12759891 12463330 12261304 12160542 11961331 11710699 11528683
3333 11528683 11281721 11099280 11103497 11059924 10964058 10894537 10916684 10948343 11008837 10978776 10873804
3322 10873804 10906331 10885335 10948438 10897999 10864226 10753205 10760101 10649613 10526480 10518308 10359003
3311 10359003 10174235 10077895 9913978 9870491 9693115 9594540 9546658 9499588 9597950 9616554 9627069
3300I627069J61602K03061J80802K29954P1216J21001J78445R3351P4554r5902
3290A0845153n0009R6180J33860J46689R6652K16399K16683L33753M03821L01727
3280A2740908N41642M15477O17292P25537Q31780R43134J194427J482898J631073
3271B1124168J615774Q25061n23646j613127j908289j621733j271576j064167
3263A5562465o62333n94787m72528k80464l73383m17153l14983m44944k90056
3254A1711834j82233j42321n1771j25536j28903q2256k20664j99181j24621o5618
3244A0388730r8072k6401q8751l268M9664K5084J8508j11766O8599K27553J73820
3233A0623700J21893J94371J26407M6129R7081J04256K85894J82203J5708l2328
$$ plain form
3300 9627069 9788671 9991732 10172534 10402488 10473704 10594705 10773150 10866501 10941055 10845153
3290 10845153 10795144 10891324 11025184 11171873 11268525 11484924 11701607 12035360 12439181 12740908
3280 12740908 13282550 13698027 14315319 15040856 15872636 16815770 18010197 19493095 21124168
3271 21124168 22739942 23565003 23041357 21428230 19519941 17898208 16626632 15562465
3263 15562465 14900132 14305345 13832817 13552353 13178970 12761817 12446834 12001890 11711834
3254 11711834 11529601 11387280 11335509 11209973 11081070 10998814 10778150 10578969 10454348 10388730
3244 10388730 10290658 10264257 10175506 10172238 10221902 10246986 10265494 10153728 10222327 10449880 10623700
3233 10623700 10745593 10939964 11066371 11112500 11209581 11313837 11599731 11781934 11797642 11765314
3223A1765314j81506j21943j28397J04750k9445k561k0992l8303K0752l4078l7653
3212A1295938l2941k05948k13516j13444r2622p7211j4190n7527j33052O7702
3202A0423189N1145q2815p2558m4954q2005J3443P0900m5336k7228J59Q0498Q4273
3190A0368711R3302J41517m4347J90517R6745J11378M3792K65097K60608J60391
3180A1687711K61256L40792L66008L25486L48244N80539M86533O13063M73905
3171A5483537O07977Q16569Q38972J056835J315454J567398J685056J745803J431564
3162B6549165O55724n25853j377209j757801j705940j385923j226592q07179o24729
3153A7793663m58983l61524k15727k00317k54619r7441m6119n4568m6195K42751
$$ plain form
3223 11765314 11583808 11461865 11333468 11438218 11408773 11406212 11385220 11346917 11367669 11333591 11295938
3212 11295938 11262997 11057049 10843533 10730089 10637467 10560256 10546066 10488539 10355487 10423189
3202 10423189 10474334 10391519 10318961 10274007 10192002 10205445 10276345 10231009 10203781 10203940 10284438 10368711
3190 10368711 10462013 10603530 10559183 10749700 10846445 10957823 11001615 11266712 11527320 11687711
3180 11687711 11948967 12289759 12655767 12981253 13329497 13910036 14396569 15009632 15483537
3171 15483537 16091514 16908083 17747055 18803890 20119344 21686742 23371798 25117601 26549165
3162 26549165 27204889 26679036 25301827 23544026 21838086 20452163 19225571 18418392 17793663
3153 17793663 17334680 16973156 16757429 16557112 16302493 16205052 16158933 16104365 16058170 16300921
3143A6300921K72944J42533L49071J91719J38525L55030L61066L38042M03827
3134A8853678M11732M50285O00971M54240N38967L12864L51907M36660N35906
3125B2947210N53033O77498Q17750P32013P11830Q08361O43371P26401Q47825
3116B9465292Q72281J000492J067204J325345J557891J621255J874681J900280
3108D0684721J922172K239540K702059L144111L332067L153263K059064N12802
3100E9749799j040346j925167k198208k014703j948852k071513j971080j792832
3092D4787098j394435j353266r93187q49256p64205n18568m79992j82585o3918
3083C8187686J09706J60831j05655m45255p20562r54299r82828q02052m90554
$$ plain form
3143 16300921 16573865 16716398 17065469 17257188 17395713 17750743 18111809 18449851 18853678
3134 18853678 19265410 19715695 20316666 20770906 21309873 21622737 21974644 22411304 22947210
3125 22947210 23500243 24177741 24995491 25727504 26439334 27247695 27891066 28617467 29465292
3116 29465292 30337573 31338065 32405269 33730614 35288505 36909760 38784441 40684721
3108 40684721 42606893 44846433 47548492 50692603 54024670 57177933 59236997 59749799
3100 59749799 58709453 56784286 54586078 52571375 50622523 48551010 46579930 44787098
3092 44787098 43392663 42039397 41046210 40196954 39432749 38914181 38434189 38251604 38187686
3083 38187686 38297392 38458223 38352568 37907313 37186751 36232452 35249624 34447572 33957018
3074C3957018j24884J25599L60494N93384Q16637J088683J380418J358987J394479
3065D0950815J387633J310393J201652J024510P73288N05150J71106q5703n05634
3056D6733210q45626r37817j045601j324536j485607j389476j222997j127467
3048C7354083p82649n27240k83593q3917L57406M95071Q30217J241552J542897
3039D0143827J766348J885219K276522K519374K659434K552665K139785J540882
3031E7484056Q76279j83988j366758k391137k822119l132992l087548k657965
3023D2717828k386067j881446j572533j308347j104252j001640n87396m57096
3015C2419051k18577M5648L67164N73579P86985J256141J481713J696645K058187
$$ plain form
3074 33957018 33832134 33957733 34318227 34911611 35728248 36816931 38197349 39556336 40950815
3065 40950815 42338448 43648841 44850493 45875003 46648291 47153441 47324547 47238844 46733210
3056 46733210 45887584 44949767 43904166 42579630 41094023 39704547 38481550 37354083
3048 37354083 36571434 36044194 35760601 35676684 36034090 36529161 37359378 38600930 40143827
3039 40143827 41910175 43795394 46071916 48591290 51250724 53803389 55943174 57484056
3031 57484056 58360335 58176347 56809589 54418452 51596333 48463341 45375793 42717828
3023 42717828 40331761 38450315 36877782 35569435 34465183 33463543 32876147 32419051
3015 32419051 32200474 32246122 32613286 33186865 33973850 35229991 36711704 38408349 40466536
3006D0466536K285837K210818J821851J356695N23981o87008j670153k231636
2998D4076921k811213k809141k730110k605117k227244j771801j419981j352054
2990B6350260j295376j014669q18585n78975n38744l52172j61272L9607L13487
2981B1943561L59471O08704P66871Q66736J068384J080064R69258O80120P4250
2972B8417419n51910j094774j514123j828681j707992j598947j281055j073752
2964A7766185r66618q11550o77215n03284m79878n27718l62673l25172l15200
2955A2796877k52235p2922j55370k33164j07023J54326K07988J53855J36553k8611
2945A2600274L7090j57662m07331n96321n21203m69652l03761k63795k12984j09314
$$ plain form
3006 40466536 42752373 44963191 46785042 48141737 48665718 47978710 46308557 44076921
2998 44076921 41265708 38456567 35726457 33121340 30894096 29122295 27702314 26350260
2990 26350260 25054884 24040215 23221630 22642655 22103911 21751739 21590467 21630074 21943561
2981 21943561 22303032 22911736 23678607 24545343 25613727 26693791 27663049 28343169 28417419
2972 28417419 27865509 26770735 25256612 23427931 21719939 20120992 18839937 17766185
2964 17766185 16799567 15988017 15310802 14807518 14327640 13799922 13437249 13112077 12796877
2955 12796877 12544642 12471720 12316350 12083186 11976163 12130489 12338477 12492332 12628885 12600274
2945 12600274 12637364 12479702 12072371 11476050 10954847 10485195 10181434 9917639 9704655 9595341
2935I595341k62830j90409j88841j31990j81354k07734n7277r4043l0824j13328
2925H136711j76013n6448M0091l119k3247J4430J7172M0292J07112P131p8530
2914H025582o0610m7604j09514m3105k40344o1298q5868M0660L2942j20599j24828
2903G205414j50790q4450Q545k8196m5586j36427p7743Q6533M110o5107k8695
2892F687608L9794M1853J79003J44751K0299P6217L0315J5162l0545r6597n951
2881G101909j16859j01922j33152j87929k34645r3403l5205K2612j47293j03900
2871E970213q0890n9463M5394K297q5227L9093J29448J7922L7833j2616N3491
2860F057495q2551j04434l2953J9489j0889l287J20094p119L2873J06938o8675
$$ plain form
2935 9595341 9332511 9142102 8953261 8821271 8639917 8432183 8374906 8280863 8250039 8136711
2925 8136711 7960698 7904250 7944341 7941222 7917975 7932405 7949577 7989869 8096981 8104112 8025582
2914 8025582 7964972 7917368 7807854 7764749 7524405 7463107 7377239 7417899 7450841 7330242 7205414
2903 7205414 7054624 6970174 6978719 6950523 6904937 6768510 6690767 6777300 6781410 6716303 6687608
2892 6687608 6727402 6769255 6948258 7093009 7113308 7189525 7219840 7235002 7204457 7107860 7101909
2881 7101909 6985050 6883128 6749976 6562047 6327402 6233999 6198794 6221406 6074113 5970213
2871 5970213 5889323 5829860 5875254 5877551 5792324 5831417 5960865 5978787 6016620 6004004 6057495
2860 6057495 5974944 5870510 5837557 5857046 5846157 5842870 5962964 5955845 5988718 6095656 6026981
2849F026981n1737J45693K8982r4976k15701p2330L6462r5624o2626q2994n7582
2838E504548q2827P5628N7075j60629L7255j7868l7529l4829R3844l9940p4464
2827E320264L3696Q8762r5R0373q2001L817j12122q1141L0273j37608j7075O8918
2815E206061j8705j09776k3764j65849j46361j4036o5479j10262j02035L8043
2805D487837J8775o7114J6636K3181r3585l2831P5027M1264l2649m9408P718O6601
2793D461452J07653M4764O2443j6521N2540J47765N8882O0608L3626r5449o8742
2782D849021N268Mj38586m8201j09499n6740l8705m0975l0955j42621l1309m4945
2770D171757j1494k4001J6990N2539K1813J9822o2373L1061P3880J30839P7410
$$ plain form
2849 6026981 5975244 6120937 6149919 6054943 5839242 5766912 5803374 5707750 5645124 5562130 5504548
2838 5504548 5421721 5497349 5554424 5393795 5431050 5413182 5375653 5340824 5434668 5394728 5320264
2827 5320264 5353960 5442722 5442627 5533000 5450999 5454816 5342694 5261553 5291826 5154218 5137143 5206061
2815 5206061 5187356 5077580 5053816 4887967 4741606 4727570 4662091 4551829 4449794 4487837
2805 4487837 4506612 4439498 4456134 4479315 4385730 4352899 4427926 4469190 4436541 4387133 4394851 4461452
2793 4461452 4569105 4613869 4676312 4659791 4712331 4860096 4918978 4979586 5013212 4917763 4849021
2782 4849021 4854289 4854293 4715707 4667506 4558007 4501267 4462562 4421587 4390632 4248011 4216702 4171757
2770 4171757 4160263 4136262 4153252 4205791 4227604 4247426 4185053 4216114 4289994 4420833 4498243
2759D498243p3467J74403K7562l4614J9270j06320j14920o4002K537j1212j11805
2748D205675j41211J7235m5436l7003O0030q933j13009m965o581k8336m2776J2395
2736C867085j3591Q6152J43944K09926Q2155P9685P0489M4218j37871q9519k9009
2725D313664j87314m3041L1069k3254j12476j19552J7039n9567l8539k4218j9494
2714C734317q8607n97K6747q1502k10885J39606K9258K0972O8032k3701M6313
2703C659953n419R1166J17428q016P8521L8054j66926k7147j9477j01500j01848
2692C554789j5267K9615j457q4025n9604j33768L8599R3472j2473o0736r6403
2681C252742J7111Q1851j9699M9284l8808J23704P0907J28481r7224j01628R0958
$$ plain form
2759 4498243 4424776 4599179 4626741 4592127 4611397 4505077 4390157 4326155 4328692 4317480 4205675
2748 4205675 4064464 4081699 4036263 3999260 4059290 4050357 3937348 3932383 3925802 3897466 3854690 3867085
2736 3867085 3853494 3939646 4083590 4293516 4375671 4455356 4525845 4570063 4432192 4342673 4313664
2725 4313664 4126350 4083309 4114378 4091124 3978648 3859096 3876135 3816568 3778029 3753811 3734317
2714 3734317 3645710 3645113 3671860 3590358 3379473 3519079 3548337 3569309 3637341 3613640 3659953
2703 3659953 3654534 3745700 3863128 3855112 3933633 3971687 3804761 3777614 3758137 3656637 3554789
2692 3554789 3539522 3569137 3567680 3483655 3424051 3290283 3328882 3422354 3409881 3349145 3252742
2681 3252742 3269853 3351704 3332005 3381289 3342481 3466185 3537092 3665573 3568349 3466721 3557679
2670C557679j5981j2932P5048n2610r9029r5267q629K335j9283M6719n1714r6998
2658C229338l4921J9160J5856R2573K6416M0407q2768K0691j2704O6408J9278
2647C399734K5534m5681j25682J01579j4640L9990p1081l0041o9254m5208q272
2636C156978J13758q3889m0231J62910P0108k03457j80030j4204M7912J8015O7087
2625C114957m587o2537R3019Q852N104O8206Q5801p0695j2186m6868O0746J5639
2613C255451K4003L5065M1823Q4888n3134n7535l9372l5083L2938k4888P3201
2602C337357M6466K0476J1287M9213j872n7676p6746J5962O9140j3901k05161
2591C194545j34447N1792J39370L5948j88638j11334M064J05738O0038j9028p3367
$$ plain form
2670 3557679 3541698 3528766 3603814 3551204 3452175 3356908 3348279 3350614 3331331 3378050 3326336 3229338
2658 3229338 3194417 3213577 3229433 3322006 3348422 3388829 3306061 3326752 3314048 3380456 3399734
2647 3399734 3425268 3379587 3253905 3355484 3340844 3380834 3309753 3279712 3210458 3165250 3156978
2636 3156978 3270736 3186847 3146616 3309526 3379634 3176177 2996147 2981943 3029855 3047870 3114957
2625 3114957 3110370 3047833 3140852 3149704 3154808 3223014 3308815 3238120 3225934 3179066 3239812 3255451
2613 3255451 3279454 3314519 3356342 3441230 3388096 3330561 3291189 3256106 3289044 3264156 3337357
2602 3337357 3383823 3404299 3415586 3464799 3462927 3405251 3328505 3344467 3413607 3399706 3194545
2591 3194545 3060098 3111890 3251260 3287208 3098570 2987236 2991300 3097038 3157076 3138048 3064681
2580C064681M7069m4841P011J51527q1360o3659J1622N4364j15658o6703J23039
2569C087092r6521l9620k1955K4934J1007J9352p0171L2438l8492k1013j72234
2558B714817m6494K3707O9694N5267k6153j6752J2605R6866J6855m8541J8049
2547B869920L71R924K9268o9479o6660q7761J927R9429J6057j01415J0080J436
2535B713097N0810O9760q09r2191o7270P483J02190P1281O545n0567O4136L679
2523B878144j9294p8139j03999L6976O8388l766J6719J231n3983K4690k3039n237
2511B738691N1576P902J18922J3541o7969R619l5284P8305J18251L108L2409l0631
2499C038440j9697N7055L474p0626k8271j03654M6222K9495o481m7139j14869
$$ plain form
2580 3064681 3111750 3066909 3073920 3225447 3144087 3080428 3092050 3146414 3030756 2964053 3087092
2569 3087092 2990571 2950951 2928996 2953930 2964937 2984289 2914118 2946556 2908064 2887051 2714817
2558 2714817 2668323 2692030 2761724 2816991 2790838 2774086 2786691 2883557 2900412 2851871 2869920
2547 2869920 2870291 2880215 2909483 2840004 2773344 2685583 2687510 2786939 2802996 2701581 2711661 2713097
2535 2713097 2763907 2833667 2832858 2740667 2673397 2680880 2783070 2854351 2860896 2810329 2874465 2878144
2523 2878144 2858850 2780711 2676712 2713688 2782076 2778310 2795029 2796260 2742277 2766967 2743928 2738691
2511 2738691 2790267 2798169 2917091 2930632 2862663 2872282 2836998 2915303 3033554 3036662 3069071 3038440
2499 3038440 3018743 3075798 3079272 3008646 2980375 2876721 2922943 2952438 2945957 2898818 2783949
2488B783949K1105L5602L4247K6891q5503m6537O6415j63J947N0819o8481N0437
2476B870728O4595J39416K0674r2789j6980J29170R1780j49217m4754j5581J4681
2465C011723O6175k2661L694M3928j381K0090j4947k3111p9448l5847O7356L6698
2453C072269m1465j9293P3395J58098J2773P5840J3538j75886j01887J47288R3680
2442C308350l6450o0645m115J5313L2359O6154J7442p8542P5774J55915N6974
2431C548529q9569l6972p311n2192P8459p72j4565M6053Q3147k9612R3551J5387
2419C634133j804q5742l3733Q5292l0571l4579J01156j947o1845J09917l0856
2408C649421p1014K6580J50614O8248o1280J14873K1178l6745J31149k0819p0097
$$ plain form
2488 2783949 2805054 2840656 2874903 2901794 2816291 2769754 2836169 2836006 2837953 2888772 2820291 2870728
2476 2870728 2935323 3074739 3095413 3002624 2985644 3114814 3206594 3057377 3012623 2997042 3011723
2465 3011723 3077898 3055237 3058931 3102859 3101478 3121568 3106621 3083510 3004062 2968215 3035571 3072269
2453 3072269 3030804 3011511 3084906 3243004 3255777 3331617 3345155 3169269 3067382 3214670 3308350
2442 3308350 3271900 3211255 3207140 3222453 3254812 3320966 3338408 3259866 3335640 3491555 3548529
2431 3548529 3458960 3421988 3414677 3362485 3440944 3440172 3425607 3471660 3554807 3525195 3618746 3634133
2419 3634133 3632329 3546587 3512854 3598146 3567575 3532996 3634152 3632205 3570360 3680277 3649421
2408 3649421 3578407 3604987 3755601 3823849 3762569 3877442 3898620 3861875 3993024 3972205 3902108
2397C902108l136O7097N6461j15352R1848M4090j1432K184O6121M3348j06431
2386D036906J22259P7684K4750m528j14100L0876J72507J8932P4271J1560L6372
2375D487489P7492l6338N6273L7560k7448J05911K1412P3156J41356l4950J910
2364D903823Q5269J27261j2548k5012m1248l8738R4777J71453L1602l0144J79324
2353E445819K4036O5532J00834J39676n5680J16973J40863N3169n5530q372O2890
2342F030210Q1684O1508J10632l8441n1583J89191J18047N6979O4929M2429M3533
2331F709118J88974K26393M5436J0805J6531R3557R5448P5633Q2251P2927n4004
2320G563069J63062K39161J48L0439N6690J72704Q1979J67745J48445O3748R6520
$$ plain form
2397 3902108 3898972 3966069 4022530 3907178 3999026 4043116 4031684 4033868 4099989 4143337 4036906
2386 4036906 4159165 4236849 4261599 4257071 4142971 4173847 4346354 4365286 4439557 4451117 4487489
2375 4487489 4564981 4528643 4584916 4622476 4595028 4700939 4722351 4795507 4936863 4901913 4903823
2364 4903823 4989092 5116353 5103805 5078793 5037545 4998807 5093584 5265037 5296639 5266495 5445819
2353 5445819 5469855 5535387 5636221 5775897 5720217 5837190 5978053 6031222 5975692 5967320 6030210
2342 6030210 6111894 6173402 6284034 6245593 6194010 6383201 6501248 6558227 6623156 6665585 6709118
2331 6709118 6898092 7124485 7169921 7180726 7197257 7290814 7386262 7461895 7544146 7617073 7563069
2320 7563069 7726131 7965292 7965440 7995879 8052569 8225273 8307252 8474997 8623442 8687190 8783710
2309H783710K47291K3469R8220J43258K54138J21610J92122K41920J18059K34283
2299A0458080K45404K65547P6683R5536J93903J53417K76522L10881J08098J05875
2289A2289946K93062J88644K41372K83376K66518J23888J36829M24558L01948
2280A4550141J94794J70327M20828L44686L64352L96836K61725L17887M32453
2271A7454029M69772L27560L63743M19635N33833K55674M49706N25662M56873
2262B1256487M38694M16403N02381M42119M28553N65596M13610N08962M34038
2253B5406843L62862L87477O03792O11493M55718N09603O52187P75968P62551
2244C0528494Q79037Q14379Q01404R04957J018754J070018J037472J276996J382594
$$ plain form
2309 8783710 9031001 9054470 9152690 9295948 9550086 9671696 9863818 10105738 10223797 10458080
2299 10458080 10703484 10969031 11045714 11141250 11335153 11488570 11765092 12075973 12184071 12289946
2289 12289946 12583008 12771652 13013024 13296400 13562918 13686806 13823635 14248193 14550141
2280 14550141 14744935 14915262 15336090 15680776 16045128 16441964 16703689 17021576 17454029
2271 17454029 17923801 18251361 18615104 19034739 19568572 19824246 20273952 20799614 21256487
2262 21256487 21695181 22111584 22613965 23056084 23484637 24050233 24463843 24972805 25406843
2253 25406843 25769705 26157182 26760974 27372467 27828185 28337788 28989975 29765943 30528494
2244 30528494 31407531 32221910 33023314 33928271 34947025 36017043 37054515 38331511 39714105
2235C9714105J398340J672574J883752J840672J901583K334063K597829K707295
2227E6050213K916067L288380L477498L847058M148927M252484M088709L979733
2219H6049069M118730L984450L557906K884588J557022k16628j878675l469827
2211I6586635m850624n251557m971539m515501m010975l451649l054762k781188
2203F3698840k381657j968401j818820j783986j685562j404426j263826j029292
2195E0362870j037053j101542r94717q54949p41972q18273p70996q07818r00722
2186D2334828p49817q08228r28962r00299q76746p96938q27932q46435q50391
2177C4749080p75787q28285q36000o37608p48074q30144o97497o33758o26344
$$ plain form
2235 39714105 41112445 42785019 44668771 46509443 48411026 50745089 53342918 56050213
2227 56050213 58966280 62254660 65732158 69579216 73728143 77980627 82069336 86049069
2219 86049069 90167799 94152249 97710155 100594743 102151765 101935137 100056462 96586635
2211 96586635 91736011 86484454 81512915 76997414 72986439 69534790 66480028 63698840
2203 63698840 61317183 59348782 57529962 55745976 54060414 52655988 51392162 50362870
2195 50362870 49325817 48224275 47229558 46374609 45632637 44814364 44043368 43235550 42334828
2186 42334828 41585011 40776783 39847821 38947522 38070776 37273838 36445906 35599471 34749080
2177 34749080 33973293 33145008 32309008 31671400 30923326 30093182 29395685 28761927 28135583
2168B8135583o64233o43703n65274n74575m24798m73262m40268m98881m65212
2159B3385377m04986m50091l26685m88502l83592k38017k30585l36179k57354
2150B0269386j97613l11649k98548k45529k49976l22224k35249j36482j90237
2141A8081879j88805j36941j56518j76357q7356p0j31783j13430q8931j52404
2131A6849284k9288O5694L1223N6300O8243K90610K81054L10300N24918P18698
2121A9167036R08315J130660O48264m78170j255580j503365j109067q67115o23299
2112A6017679m80646l41717k85946k09949k73383j77915r3341m8729l461n3173
2102A4049419j14781p7168K5147Q9957K20584m084J47393K33276M19514M76277
$$ plain form
2168 28135583 27471350 26827647 26262373 25687798 25263000 24789738 24349470 23850589 23385377
2159 23385377 22980391 22530300 22203615 21715113 21331521 21093504 20862919 20526740 20269386
2150 20269386 20071773 19760124 19461576 19216047 18966071 18643847 18408598 18272116 18081879
2141 18081879 17893074 17756133 17599615 17423258 17335902 17335832 17204049 17090619 17001688 16849284
2131 16849284 16819996 16885690 16916913 16973213 17041456 17332066 17613120 17923420 18448338 19167036
2121 19167036 20075351 21206011 21854275 21376105 20120525 18617160 17508093 16640978 16017679
2112 16017679 15537033 15195316 14909370 14699421 14426038 14248123 14154782 14106053 14102592 14049419
2102 14049419 13934638 13857470 13882617 13972574 14193158 14189074 14336467 14569743 14989257 15465534
2092A5465534N24102M96402P61062J236044J677895J948525K318109J052857r99850
2083B4480680k557818k919243k086723j479269r98208p18424l72816m79649m74297
2074A2394233l97481k30208k00404k0722m7621j72780k6662O0760j55289j21367
2064A1082459J28878R8160r6103J34176J17329J52528K59929L04332M06322M80249
2054A3068259P65780J021071J008711L68741o21829j265738j501930j104037p05208
2045A1033820m28530l80738l76569k38889j97636j12398k5545j54319k63234j32353
2035H723609j08251q462k4078j30038j41838j52015Q5224K68k71736j29420m3691
2024G799572n2935q6305j28899q4062j53958j40204o7517n1074l5451k6569k6351
$$ plain form
2092 15465534 15989636 16486038 17247100 18483144 20161039 22109564 24427673 25480530 24480680
2083 24480680 21922862 19003619 16916896 15437627 14439419 13720995 13348179 12868530 12394233
2074 12394233 11996752 11766544 11566140 11545418 11497797 11325017 11298355 11359115 11203826 11082459
2064 11082459 11211337 11309497 11213394 11347570 11464899 11617427 11877356 12181688 12588010 13068259
2054 13068259 13834039 14855110 15863821 16232562 15610733 14344995 12843065 11739028 11033820
2045 11033820 10605290 10224552 9847983 9609094 9411458 9299060 9273515 9119196 8855962 8723609
2035 8723609 8615358 8606896 8582818 8452780 8310942 8158927 8244151 8244419 7972683 7843263 7799572
2024 7799572 7746637 7660332 7531433 7447371 7293413 7153209 7085692 7034618 6999167 6972598 6946247
2013F946247L9008m2987k7498k9384k280n3716j0185k2717j01686r1612n5555
2002F547635L940L2447j81227j41884K5046o8431j11191o3255J8949r9880j4670
1991E947479Q669p9428q7954J248L8117J38079n6317n6693o949K2596J19822Q8461
1979F077130P3199L5017J89J04650K00869J16577J5054P9082Q4973J39063J6603
1968F942406M9627m2377N8990k2150M8847K4329o7103j36311J7188J3929k9390
1957F857985J03764L8281J3028J23251Q8165j64701J2278m5038L6706j2170n4856
1946F996693N5363R7912j9544P8261J07594J19508J54723K42229K85871K69325
1936H387935L03202L76453L40908L29682N56521M88503K80018J31726O1672P0222
$$ plain form
2013 6946247 6985255 6942268 6914770 6885386 6883106 6829390 6819205 6796488 6694802 6603190 6547635
2002 6547635 6551575 6584022 6402795 6260911 6285957 6217526 6106335 6043080 6062029 5962149 5947479
1991 5947479 5956148 5876720 5788766 5790014 5828131 5966210 5909893 5853200 5846251 5868847 5988669 6077130
1979 6077130 6150329 6185346 6185535 6290185 6491054 6607631 6622685 6701767 6786740 6925803 6942406
1968 6942406 6992033 6949656 7008646 6986496 7035343 7059672 6992569 6856258 6873446 6887375 6857985
1957 6857985 6961749 7000030 7013058 7136309 7224474 7059773 7072051 7027013 7063719 7051549 6996693
1946 6996693 7052056 7149968 7130424 7208685 7316279 7435787 7590510 7832739 8118610 8387935
1936 8387935 8691137 9067590 9408498 9738180 10294701 10783204 11063222 11194948 11256620 11326842
1926A1326842k10796m13790l81317j99502j13227k640N8575Q7069R0277R7191
1916A0338682J87002L7035l3820j30201k13235q3640o6068k07284n6635J7095
1906I788931J04309K7196J49529K50622P6768K14756L75594L21171J62053K41515
1896A1712444M08556M62308M49885L18123M21219L14206K90799L06290J43058
1887A4826888J57856L42426L98460L23555L31458M25265L07364L54537M37664
1878A7905473L18211K75740N9495o5873O9109Q8186n5405K5305M9562J43876K32692
1867A9046371K90207L59062L75084L15165M82768O55608O68251O96631O81984
1858B3571131R70968R84541R03372J070803R93727J077488J099035J112941R29438
$$ plain form
1926 11326842 11116046 10702256 10320939 10121437 10008210 10005570 10064145 10151214 10241491 10338682
1916 10338682 10525684 10562719 10528899 10398698 10185463 10101823 10035755 9828471 9771836 9788931
1906 9788931 9893240 9920436 10069965 10320587 10397355 10612111 10987705 11308876 11470929 11712444
1896 11712444 12121000 12583308 13033193 13351316 13772535 14086741 14377540 14683830 14826888
1887 14826888 14984744 15327170 15725630 16049185 16380643 16805908 17113272 17467809 17905473
1878 17905473 18223684 18499424 18558919 18493046 18562155 18650341 18594936 18620241 18669803 18813679 19046371
1867 19046371 19336578 19695640 20070724 20385889 20868657 21524265 22192516 22889147 23571131
1858 23571131 24542099 25526640 26430012 27500815 28494542 29572030 30671065 31784006 32713444
1849C2713444Q17763N23136K33109k62882j012994j385180j389730r05708n88307
1840B8742651m69259l14548j3508J30089L31558L73289M13616M26538N35973O53343
1830C0809742N65396O01212N90576O67088O54945N46260M55007J74081l4147k25652
1820C4804508l55379n96641o38698m68288m95503o25191p77844j091463j187239
1811B8568262j040716q83664m81270n21915l61768k19621k06545j54917P1501
1802B4769347J10881N2091N4707m4918j83441k15310m43724m37947m95119p53781
1792B2412786o88000j000619j129683r02248r11236q16288p27712o58803p71130
1783A4807067o64709m15055m73505m74235m89126n08865l38952k53979k38276
$$ plain form
1849 32713444 33531207 34054343 34287452 34024570 33011576 31626396 30236666 29330958 28742651
1840 28742651 28273392 27958844 27945336 28075425 28406983 28780272 29193888 29620426 30156399 30809742
1830 30809742 31375138 31976350 32566926 33234014 33888959 34435219 34890226 35064307 35030160 34804508
1820 34804508 34449129 33852488 33213790 32745502 32249999 31624808 30846964 29755501 28568262
1811 28568262 27527546 26643882 26162612 25640697 25278929 25059308 24852763 24697846 24769347
1802 24769347 24880228 24932319 24987026 24942108 24758667 24543357 24099633 23661686 23166567 22412786
1792 22412786 21724786 20724167 19594484 18692236 17781000 16964712 16237000 15578197 14807067
1783 14807067 14142358 13727303 13253798 12779563 12290437 11781572 11442620 11188641 10950365
1774A0950365k23859l80639k18928j71032k03284k97604j34709k55623k38972
1765H825715j88887k83123k49557j83211j16970k20587k05303j75645k89492k59523
1755F653417m2386j56515j20287k13708j94966j2422j70631k32655k17447k21424
1745E070976j23670o6896n2637k45683J3161j08775m1310p318o1284o4340p2332
1734D239892J35147K9856k03979j75255n7643r6332r7049k08m7987j73292r0377
1723C462773m5637j10398n7438m5576p8194l5605p7159l7775j50772l4410l074
1712B786735p5002j21688p56r6256L2796J0016L7982n6476j27929J0639j9083
1701B380978p8382q3185R974n7233n5354l335o8580n0475j50671j1846k8540l2091
$$ plain form
1774 10950365 10726506 10345867 10126939 9955907 9752623 9455019 9320310 9064687 8825715
1765 8825715 8636828 8353705 8104148 7920937 7803967 7583380 7378077 7202432 6912940 6653417
1755 6653417 6611031 6454516 6334229 6120521 5925555 5913133 5742502 5509847 5292400 5070976
1745 5070976 4947306 4880410 4827773 4582090 4595251 4486476 4445166 4437848 4376564 4312224 4239892
1734 4239892 4375039 4404895 4200916 4025661 3968018 3871686 3774637 3774429 3726442 3553150 3462773
1723 3462773 3417136 3306738 3249300 3203724 3125530 3089925 3012766 2974991 2824219 2789809 2786735
1712 2786735 2711733 2590045 2589289 2493033 2525829 2535845 2573827 2517351 2389422 2400061 2380978
1701 2380978 2302596 2219411 2229385 2172152 2116798 2113463 2044883 1994408 1843737 1831891 1803351 1771260
1689A771260q7722j330p3182j8582Q1980l4444k559r5982n8993l8503N6405K6366
1677A524714j71414j46402J7696k653m3485j9949J269j30656n0915J04228Q0814
1666A163247r0563k3530J00521j1825j27015l3752K3160r0100N0916L6018j37875
1655H59202p9168N6791o3702n2338k2601l2124L5708R7666Q7541j38311o3191
1644F85473K2539N3826J7416L018k3935r8415l4949L3822K908K9724m4582j4838
1632F32007O6196J66734J09673j93184j02052l6341N0814l5055O744l310n6138
1621F06088m9338P4462J15637j47431l1388J69216n05o3223P9369O5331k9382
1610G88836N3745j7267K9051j08237n8224J06088r7972l15R3683o362j69585N6464
$$ plain form
1689 1771260 1683538 1682208 1609026 1590444 1672424 1637980 1635421 1539439 1480446 1441943 1498348 1524714
1677 1524714 1353300 1206898 1224594 1221941 1178456 1158507 1159776 1029120 978205 1082433 1163247
1666 1163247 1072684 1049154 1149675 1137850 1010835 977083 1000243 910143 961059 997077 859202
1655 859202 780034 836825 773123 720785 698184 666060 701768 799434 886975 748664 685473
1644 685473 708012 761838 779254 782272 758337 659922 624973 658795 661703 691427 646845 632007
1632 632007 698203 864937 974610 781426 679374 643033 693847 658792 665536 662226 606088
1621 606088 556750 631212 746849 599418 568030 737246 736741 673518 752887 818218 788836
1610 788836 842581 825314 854365 746128 687904 793992 696020 695705 789388 783026 613441 669905
1598F69905L4431K2974n3716O2741N1868J36720J62591M2461j48250P1752J49076
1587A202553j9198o0338N3034P2791o0705j3983N0416l9540j51501P9775n859
1576A107445O5262K2485r0607L4586N4183K22085K5817m3558J00952J44357n0676
1565A592331J2857P104j3987l2609Q1427K6185p3366m0133K1701j9476j32504
1554A429530J12440P681K2721Q4189J35518O498L0162N7180M2529N4330J0054
1543A992832J2690j8510j22902J75214L3334q5992N0435M5404J7996O5792J89899
1532B356192M5383O6429Q6455R8878j01124j29351l036j6320j43317l9035j19992
1521B101162j54870p4076p1265R928O0979N6512m265j10975n700N2969j5662O4524
$$ plain form
1598 669905 704336 727310 673594 736335 788203 924923 1087514 1129975 981725 1053477 1202553
1587 1202553 1183355 1123017 1176051 1248842 1188137 1174154 1224570 1185030 1033529 1113304 1107445
1576 1107445 1172707 1195192 1104585 1139171 1193354 1415439 1441256 1397698 1498650 1643007 1592331
1565 1592331 1605188 1612292 1598305 1565696 1647123 1673308 1599942 1559809 1581510 1562034 1429530
1554 1429530 1541970 1549651 1572372 1656561 1792079 1798577 1828739 1885919 1928448 1982778 1992832
1543 1992832 2005522 1987012 1864110 2039324 2072658 1986666 2037101 2082505 2100501 2166293 2356192
1532 2356192 2401575 2468004 2554459 2653337 2552213 2422862 2419826 2403506 2260189 2221154 2101162
1521 2101162 1946292 1872216 1800951 1810879 1871858 1928370 1924105 1813130 1807430 1860399 1844737 1909261
1509A909261R6627q2166j26025K4344L2911p4648j13323K5697q1914j6666N5641
1498A649739M7771m4917j6790J07938N7763k9211J48216J21758J5301j95158m4718
1487A817692m5677j69382j7271p8212k25305j34407k580r8287j10412o2660r0347
1476G83152j35450m607J64260p2660k3667O8444L2601p829K4343O5178l6653n0038
1464H07074J35452j06671j39784k1443L1950j26156n2500P1260K9495m4669l5234
1453E48774Q1579j15467L363j4139k9178j69582j1493O6547j09189q0528R4559
1442B65246q8317j24314J53841N1213j56970l7980k3393l4509n7884L7791N4043
1431C8767n9705O6641L5703j20970m6208N2091K9456n0009k8561M8985l7968o7115
$$ plain form
1509 1909261 2005888 1923722 1797697 1822041 1854952 1780304 1666981 1692678 1610764 1594098 1649739
1498 1649739 1697510 1652593 1635803 1743741 1801504 1772293 1920509 2042267 2057568 1862410 1817692
1487 1817692 1772015 1602633 1585362 1507150 1281845 1147438 1144858 1046571 936159 873499 783152
1476 783152 647702 643095 807355 734695 711028 779472 812073 804244 828587 893765 857112 807074
1464 807074 942526 835855 696071 674628 706578 580422 527922 599182 628677 584008 548774
1453 548774 630353 514886 518249 504110 474932 305350 293857 360404 251215 170687 265246
1442 265246 176929 52615 206456 257669 100699 62719 39326 4817 -53067 -15276 38767
1431 38767 -20938 45703 81406 -39564 -85772 -33681 -4225 -54234 -82795 -33810 -71778 -138893
1419a38893K371j2398j41425K094J36692k0100M874Q959j00283m4194J23283J12309
1407f6711j57215j05877K6025m4182O250R5684L3681m8132K884l5833J6904K6768
1395b49754J23065k5559q2971j3175J0894o563k5367R3776J4415j43538k01O0816
1383b44162j2682k9344N065o9k612j5524O5112N8278m8641J3479M896P3806n3517
1370a85915r938l7179M1471L9961j36247j95547Q2895R9826m3343K3394N7048
1359b63574K3912j12396L3285K2834N1116K130K4566k8362k238j0496r081j7528
1347b85832J3742k9157q6995M4244L5359N1889j5200R4860p5949j99268J1444
1336d40863N1736k0189o8782j6684L2320r2080P1609J11196k0331p785N9913j4398
$$ plain form
1419 -138893 -136522 -148920 -290345 -288251 -151559 -171659 -166785 -157826 -258109 -302303 -179020 -66711
1407 -66711 -223926 -329803 -303778 -347960 -341710 -246026 -212345 -260477 -257593 -293426 -276522 -249754
1395 -249754 -126689 -152248 -235219 -248394 -237500 -244063 -269430 -175654 -161239 -304777 -304978 -244162
1383 -244162 -256844 -286188 -281123 -281192 -283804 -299328 -234216 -175938 -224579 -211100 -206204 -132398 -185915
1370 -185915 -195853 -233032 -191561 -151600 -287847 -483394 -400499 -300673 -344016 -320622 -263574
1359 -263574 -239662 -352058 -318773 -295939 -244823 -242693 -218127 -246489 -248727 -259223 -268304 -285832
1347 -285832 -272090 -301247 -388242 -343998 -308639 -256750 -271950 -177090 -253039 -452307 -440863
1336 -440863 -389127 -409316 -478098 -494782 -462462 -554542 -482933 -371737 -392068 -399853 -339940 -354338
1324c54338l5139P0984O461p0974l1063J13543m1439j03178n6896n4006N2881
1313e03164Q111O2571L6716j30217M0391M6556L6938M0173N7180j9589r6474O6354
1301c54454J1210j01525O5941q5L4161l9944k3998j6956R779o896J1415r9567
1289e10919r5277J8848J14015Q0585N5829J4347n3656j4047J932p1854k9740J02127
1277c87810K3911K8627k0672N6008j8296q4553k3526K7602k2362j9626J5554j4463
1265d39606r8546J1504j3216n2403M3618R5055K7045m5141P3802J6415n1257M7397
1253c85333m7119L3335n7421Q1740L7298n5032R9682O1615j33445K5441K0967
1242c18272o3639o9727Q8438N4819j34600j28222K5968q574m0222O0613J31081
$$ plain form
1324 -354338 -389477 -318493 -312032 -383006 -414069 -300526 -341965 -445143 -502039 -556045 -503164
1313 -503164 -495053 -432482 -395766 -525983 -485592 -439036 -402098 -361925 -304745 -324334 -420808 -354454
1301 -354454 -343244 -444769 -378828 -378913 -344752 -384696 -408694 -425650 -415871 -422767 -411352 -510919
1289 -510919 -606196 -587348 -473333 -392748 -336919 -322572 -376228 -390275 -388343 -460197 -489937 -387810
1277 -387810 -363899 -335272 -355944 -299936 -318232 -402785 -426311 -398709 -421071 -440697 -425143 -439606
1265 -439606 -538152 -526648 -539864 -592267 -548649 -453594 -426549 -471690 -397888 -381473 -432730 -385333
1253 -385333 -432452 -399117 -456538 -374798 -337500 -392532 -292850 -231235 -364680 -339239 -318272
1242 -318272 -381911 -451638 -363200 -308381 -442981 -571203 -545235 -553809 -594031 -533418 -402337
1231d02337j6715N4685J16029R05j09410k7637N8884p9360N3495J39107q1550
1220b93904o4283M7794q4056m1952l0658m7597M1703l0693Q0160L1667m1852k9472
1208d63143l7421l5173P2099K0748l8960J0042P7060M3534n26O881o2996M786
1196d03069R551J18607k880m1373n4809k1161j4766q8716l3738P435k8255J8284
1184e34890M8268O9506J2200L7056J1272O0968k1765N143m0409J1657O8192L7082
1172b35720n3711J64393j9363o2127k8139r611r6290o9995k5397J7648J1230M106
1160d02976K1871m9722m591N8812J7221L4939M086m0248n59n2612J37724m4522
1148c20577M3931N3941r041k7964j0888N2753m970o1196j21006k2949J02183m676
$$ plain form
1231 -402337 -419052 -364367 -248338 -247433 -356843 -384480 -325596 -404956 -351461 -212354 -293904
1220 -293904 -358187 -310393 -394449 -436401 -467059 -514656 -472953 -503646 -423486 -391819 -433671 -463143
1208 -463143 -500564 -535737 -463638 -442890 -481850 -471808 -394748 -351214 -351740 -344859 -407855 -403069
1196 -403069 -393518 -274911 -277791 -319164 -373973 -395134 -409900 -498616 -532354 -524919 -553174 -534890
1184 -534890 -486622 -417116 -404916 -367860 -356588 -295620 -317385 -312242 -352651 -340994 -272802 -235720
1172 -235720 -289431 -125038 -144401 -206528 -234667 -244278 -340568 -410563 -435960 -418312 -407082 -402976
1160 -402976 -381105 -430827 -435418 -376606 -359385 -324446 -320360 -360608 -361167 -413779 -276055 -320577
1148 -320577 -276646 -222705 -231746 -259710 -270598 -217845 -222815 -284011 -405017 -427966 -325783 -330459
1136c30459Q1526R427l1687o059K6037l0870n9305O7780K0382p3925k0000R9094
1124b48059Q6006j0853k1652M082k494R6891P2981j02061j55684K9311j3716J0860
1112b54388k112Q8427n7478L9596Q1722L204k1929j2628N3258K5601m6615N801
1100i7541P2819m8126P6459R216o4902j429j9864L3379l0310p3303l2373J9191
1088a56784J6504R8880r378o7753J22902Q2355r289L9368N5309o9314k5427N7961
1076A35334o8254N941R8991m6177N6235Q6788J91001j22944o1461J4174k5737
1065B63891j8183Q9186J38606j40287l4245Q8839k917n752L71k1428J0344K6544
1053C94969J58559K3909M4548O9942K3608j6173L6782Q0658m4486p9518Q8798
$$ plain form
1136 -330459 -248933 -239506 -271193 -277252 -251215 -282085 -341390 -273610 -253228 -327153 -347153 -248059
1124 -248059 -162053 -172906 -194558 -190476 -192970 -96079 -23098 -125159 -280843 -251532 -265248 -254388
1112 -254388 -256500 -168073 -225551 -185955 -104233 -101029 -122958 -135586 -82328 -56727 -103342 -97541
1100 -97541 -24722 -72848 3611 12827 -52075 -53504 -73368 -39989 -70299 -143602 -175975 -156784
1088 -156784 -140280 -41400 -50778 -118531 4371 86726 77437 116805 172114 102800 77373 135334
1076 135334 67080 73021 172012 125835 182070 268858 459859 336915 275454 289628 263891
1065 263891 245708 334894 473500 333213 298968 387807 384890 379138 379509 358081 368425 394969
1053 394969 553528 577437 621985 691927 715535 699362 736144 816802 772316 692798 781596
1042G81596Q0810r835P9018J34885j9236k9661N4359J34448P0248J03401J32288
1031A512321n0482M7196J28220J95784J77200K53250J03972O9821J11110K74066
1021B822458K11509J39897L04839M72724M26384N59783N89485J70862q7991L82109
1011E992059N37850P67331Q28248J048763J382993J739600K110206K617293L068197
1002B0092540M887346P356921J1223734J279875j1652848r586648n882234l586336
994A4132350k450536j758590j491755q72484p58015q14438n56692l20626m83358
985D625856k19742j4094j51265n77189l67611k80581k47165j78707m9964k24523
975B315015k84918o3710q7621k09880p9822l5930o026j15545L170j41181j13154
$$ plain form
1042 781596 862406 852571 931589 1066474 1047238 1017577 1071936 1206384 1276632 1380033 1512321
1031 1512321 1461839 1509035 1637255 1833039 2010239 2263489 2367461 2437282 2548392 2822458
1021 2822458 3033967 3173864 3478703 3951427 4377811 4937594 5527079 5697941 5609950 5992059
1011 5992059 6529909 7297240 8125488 9174251 10557244 12296844 14407050 17024343 20092540
1002 20092540 24979886 32336807 43560541 44840416 33187568 23600920 17718686 14132350
994 14132350 11681814 9923224 8431469 7558985 6800970 5986532 5429840 5109214 4625856
985 4625856 4406114 4392020 4240755 3663566 3295955 3015374 2768209 2589502 2539538 2315015
975 2315015 2030097 1966387 1878766 1668886 1589064 1553134 1547108 1431563 1434733 1293552 1180398
964A180398j1513o779K8334j16220j5693r1968l0942N2994m6818P171q8722o2558
952G97684o1997n2249J40992L7835j04682q6159K8912j01131P150R215j8471J1255
940F08354o6381R557m1800m3514L6246k2351q1613L4351l5608p67r8218j05599
928A92657N3692q691J1061n6107j02275m8346J51301l4829Q9521M6508j7248p6926
916B00318m7105R7753j5286p0581J14656o8082r6156k6448O0666K789n7397J10691
904B05818m4393p7811p9713k9698k4447j7450l4611R8229k2768n432J5186k2551
892c9641j44958P7499J19602o2126L3520O0565o8315p4021J52716J1873p8780
881a2066p3897J1757K3600K9840m7838r7128r2272q701J22684J0629q6692Q3986
$$ plain form
964 1180398 1168885 1162106 1190440 1074220 1058527 966559 935617 988611 941793 948964 860242 797684
952 797684 735687 683438 824430 862265 757583 671424 700336 599205 606355 615570 597099 608354
940 608354 541973 551530 509730 466216 502462 480111 398498 432849 397241 396474 298256 192657
928 192657 246349 237658 248719 192612 90337 41991 193292 158463 247984 294492 277244 200318
916 200318 153213 250966 235680 165099 279755 211673 115517 89069 149735 152524 95127 205818
904 205818 161425 83614 3901 -25797 -50244 -67694 -102305 -4076 -26844 -32276 -17090 -39641
892 -39641 -184599 -107100 12502 -49624 -16104 44461 -23854 -97875 54841 66714 -12066
881 -12066 -85963 -74206 -50606 -20766 -68604 -165732 -258004 -266705 -144021 -133392 -220084 -136098
869a36098q1751q9347J17940O9111o8348L6631J4229o573m0822R7230K6499k2930
857h4229n7820n3969K0005j8575L624J7059q0244q5518K8977N3363O8523m3838
845b32642M1058j1911j4193L2628r9484k4768J06227L0546J3615J01542o801L0522
833c3661l9176o4480O4565m6434j10551N7656J754l8050m5700k8012l7554Q7192
821b32451k9554n7172R7520p813J8615K2972K5941j0200n747N0684R1776o4768
809a00197P3308J4549n8661l9174M2617n8742j74057k8265N8677J0100N421J1453
797b42971J0829r2933o708R2043Q0850o5606Q8104L6702l8294J6333R4866l3060
785e9845m4201M5201n4299q5680j03313P0962N0543L3891m6508j11856m9194M7065
$$ plain form
869 -136098 -217849 -307196 -189256 -120145 -188493 -151862 -137633 -144206 -185028 -87798 -61299 -84229
857 -84229 -142049 -196018 -176013 -194588 -190964 -173905 -254149 -339667 -310690 -257327 -188804 -232642
845 -232642 -191584 -203495 -217688 -185060 -284544 -309312 -203085 -172539 -158924 -57382 -64183 -33661
833 -33661 -72837 -137317 -72752 -119186 -229737 -172081 -170327 -208377 -254077 -282089 -319643 -232451
821 -232451 -262005 -319177 -221657 -229470 -210855 -187883 -161942 -172142 -177889 -127205 -35429 -100197
809 -100197 -26889 -12340 -71001 -110175 -67558 -126300 -300357 -328622 -269945 -259845 -254424 -242971
797 -242971 -232142 -325075 -331783 -239740 -158890 -224496 -136392 -99690 -137984 -121651 -26785 -59845
785 -59845 -104046 -58845 -113144 -198824 -302137 -231175 -180632 -146741 -193249 -305105 -354299 -307234
773c07234k5505q9824J2600N4072k9151j6K8246J27550m7590n456J11376k3966
761a94898Q6631N8992p0359r6923M7595N7440k1232J5095o9816m654p8436j312
749b71877O1841j24030n9040J06480J05750J3847j9479l72j6646m4215M9702L6976
737a61063p256J06985l8794n3220R9922K7733q945k20588k6334P7782p6241L7802
725b42217O4278L6437j56651J2197N8773m0564O9575J03270o081K2369J05175
714B6561O4620k5047m948R961j6081N8756k6657o7368q5039m3717L8574q6926
702a57311m0717R024m2850K9182p5025K5240r6272l293J29296R2770m3273l1335
690b04564L4062O9370j2167R6663J23347j14770l0968P3449o9142j36444J07741
$$ plain form
773 -307234 -332739 -422563 -409963 -355891 -385042 -385058 -356812 -229262 -276852 -282308 -170932 -194898
761 -194898 -108267 -49275 -119634 -216557 -168962 -111522 -132754 -117659 -187475 -192129 -270565 -271877
749 -271877 -210036 -334066 -393106 -286626 -180876 -167029 -186508 -186880 -203526 -247741 -198039 -161063
737 -161063 -168319 -61334 -100128 -153348 -53426 -25693 -34638 -255226 -281560 -203778 -280019 -242217
725 -242217 -177939 -141502 -298153 -285956 -227183 -267747 -198172 -94902 -100983 -78614 26561
714 26561 91181 66134 61186 71147 55066 113822 87165 19797 -65242 -108959 -70385 -157311
702 -157311 -198028 -189004 -231854 -202672 -277697 -252457 -348729 -352022 -222726 -129956 -173229 -204564
690 -204564 -170502 -101132 -113299 -16636 106711 -8059 -39027 34422 -34720 -171164 -63423
679f3423k8253j24699J9378N1725j16342N0108P215j23583L0050O3577l2241j1116
667b77604J97971J24729q8198k8799m5153J7249Q2689l1023m2069p65N7546o0705
655i4132n5117N4477p3967k1495m2870M6395L1910L681j27142j6789J23757m2997
643b14289P839O5505M4246q0034P922R8052O3311O321P2424j06123j33297M5419
631a22704j6359j09234J03417M7343r1231M557L5916p8788o0576P3167Q042m4920
619b51370m028J48049L0338k1373N4346m6463K0531o921N2686L7985m4085j04453
607a34758N6363J04257N1403j57467j49262J7372M9496J8626j09086J629K5655
596b25772L6027j35301n816J12208Q24J11181O8870J5552L5734L1864J5344j62391
$$ plain form
679 -63423 -91676 -216375 -196997 -145272 -261614 -211506 -204291 -327874 -297824 -234247 -266488 -277604
667 -277604 -79633 45096 -43102 -71901 -117054 -99805 -17116 -48139 -90208 -90973 -33427 -94132
655 -94132 -149249 -94772 -168739 -190234 -233104 -186709 -154799 -151118 -278260 -295049 -171292 -214289
643 -214289 -206450 -140945 -96699 -176733 -168811 -70759 -7448 -1127 71297 -34826 -168123 -122704
631 -122704 -139063 -248297 -144880 -97537 -188768 -184211 -148295 -227083 -287659 -214492 -206450 -251370
619 -251370 -255398 -107349 -77011 -98384 -44038 -90501 -69970 -76891 -24205 13780 -30305 -134758
607 -134758 -78395 25862 77265 -80202 -229464 -212092 -162596 -143970 -253056 -251427 -225772
596 -225772 -189745 -325046 -330862 -218654 -217830 -106649 -37779 -22227 13507 45371 60715 -101676
584a01676k2040P8103j7610p4077J5419l016m9486j0274k6629j04347K0182J71876
572a23575J451j05113P1021J10852n030N5021O8002m9192j1645L5152j2577m4187
560i820o473n5279K8881m7645Q8603l1047j27852L0580J10832j03817p377R441
548a20973n8716o227L1540J53529q9362M2278j1374N2295L4462L5960O7192m7241
536H3363j39155N2291j0899O1433j4968l5426m0091j55382J24954m9070o9334
525a92284j2326Q9481r5684r852J06445P6857M2484l9517M233o8686J34492J20971
513A56614r1499o5540J22035L4361j43002l0570j3792l8053R677J45K8783r2227
501a23068o3553J05131o1664M9107N5540r1707J4373o452J44800K0540r7702j006
$$ plain form
584 -101676 -123716 -45613 -63223 -137300 -121881 -124897 -174383 -184657 -211286 -315633 -295451 -123575
572 -123575 -122124 -227237 -156216 -45364 -50394 4627 72629 23437 11792 46944 34367 -9820
560 -9820 -16293 -71572 -42691 -90336 -1733 -32780 -160632 -130052 -19220 -123037 -130414 -120973
548 -120973 -179689 -185916 -154376 -847 -90209 -47931 -59305 -7010 27452 63412 130604 83363
536 83363 -55792 -3501 -14400 47033 32065 -3361 -43452 -198834 -73880 -122950 -192284
525 -192284 -204610 -115129 -210813 -220665 -114220 -37363 5121 -34396 -30163 -98849 35643 156614
513 156614 65115 -425 121610 155971 12969 -17601 -31393 -69446 -59769 -59624 -30841 -123068
501 -123068 -186621 -81490 -143154 -94047 -38507 -130214 -115841 -122293 22507 43047 -54655 -55661
489e5661K2914k5248j0245K7943Q6407r4300J01958O6409p0104P664l2217j08859
477h3339N0790K6962n2844n8963N9241L7231r4836j5112J07885q7808K3114Q1752
$$ plain form
489 -55661 -32747 -57995 -68240 -40297 46110 -48190 53768 120177 50073 57737 25520 -83339
477 -83339 -32549 -5587 -58431 -117394 -58153 -20922 -115758 -130870 -22985 -110793 -87679 -5927
$$ [...]
##END NTUPLES=NMR SPECTRUM
##END=
