##TITLE=1H_EC-3238(2)
 CDCl3, 8 sc, 
 18.11.2020
##JCAMPDX= 6.0         $$ Bruker NMR JCAMP-DX V2.0
##DATA TYPE= NMR SPECTRUM
##DATA CLASS= NTUPLES
##ORIGIN= UXNMR, Bruker Analytische Messtechnik GmbH
##OWNER= root
$$ XWIN-NMR		Version 3.5
$$ Wed Nov 18 13:01:07 2020 Russian Standard Time (UT+4h)  she@DPX200
##.OBSERVE FREQUENCY= 200.1315066352
##.OBSERVE NUCLEUS= ^1H
##.ACQUISITION MODE= SIMULTANEOUS
##.ACQUISITION SCHEME= undefined
##.AVERAGES= 8
##.DIGITISER RES= 18
##SPECTROMETER/DATA SYSTEM= spect
##.PULSE SEQUENCE= zg30
##.SOLVENT NAME= CDCl3
##.SHIFT REFERENCE= (INTERNAL, CDCl3, 0, 15.9761)
##AUDIT TRAIL= $$ (NUMBER, WHEN, WHO, WHERE, WHAT)
$$ ##TITLE= Audit trail, XWIN-NMR		Version 3.5
$$ ##JCAMPDX= 5.01
$$ ##ORIGIN= Bruker BioSpin GmbH
$$ ##OWNER= she
$$ F:/spectra/data/she/nmr/H-F/1/pdata/1/auditp.txt
$$ ##AUDIT TRAIL=  $$ (NUMBER, WHEN, WHO, WHERE, WHAT)
(   1,<2020-11-18 12:58:54.40 +0400>,<she>,<DPX200>,
      <created by zg, POWCHK disabled, PULCHK disabled
       configuration hash MD5:
       00 E9 B6 7A A2 85 ED C7 34 08 36 98 17 FE 4E 26
       data hash MD5: 16K
       E1 9C 8E E0 98 58 0D 5E 14 97 55 84 61 59 60 AE>)
(   2,<2020-11-18 12:58:57.60 +0400>,<she>,<DPX200>,
      <Start of raw data processing
       efp BC_mod = 2 LB = 0.24 FT_mod = 6 PKNL = 1 PHC0 = -11206.38 PHC1 = 14.6009 SI = 16K 
       data hash MD5: 16K
       33 0E B6 DF 14 86 1F 23 FD 96 21 26 BD 94 FB 7A>)
(   3,<2020-11-18 12:59:18.39 +0400>,<she>,<DPX200>,
      <pk PHC0 = 80.73149 PHC1 = -3.2 
       data hash MD5: 16K
       2B 0F 37 05 D8 07 36 62 5B 1F AC 69 49 84 90 5E>)
(   4,<2020-11-18 12:59:21.73 +0400>,<she>,<DPX200>,
      <abs ABSG = 5 
       data hash MD5: 16K
       11 8A 23 44 E0 7C 8B D6 87 DF 75 8F BF 2B F8 9C>)
(   5,<2020-11-18 12:59:42.21 +0400>,<she>,<DPX200>,
      <pk PHC0 = 10.23127 PHC1 = -13.4 
       data hash MD5: 16K
       66 D0 9E A5 8E BF 59 DB 84 2E 17 C4 48 29 82 61>)
(   6,<2020-11-18 12:59:45.67 +0400>,<she>,<DPX200>,
      <abs ABSG = 5 
       data hash MD5: 16K
       0F EF 9E 4E AB 1F 57 F0 F6 F5 97 50 F5 E5 0B 8C>)
(   7,<2020-11-18 13:00:05.89 +0400>,<she>,<DPX200>,
      <pk PHC0 = 0.04626076 PHC1 = 0.2 
       data hash MD5: 16K
       2E 6B 4C 61 A7 97 29 FC F3 E5 C3 8D 46 8C 57 52>)
(   8,<2020-11-18 13:00:09.20 +0400>,<she>,<DPX200>,
      <abs ABSG = 5 
       data hash MD5: 16K
       0E BD 35 1E 86 A2 28 B4 3E 76 B4 93 2B 85 1D 23>)
$$ ##END=
$$ 
$$ hash MD5
$$ D3 A7 A9 43 AC 16 C5 44 A2 95 77 24 D0 C3 AA 95
##$RELAX= 
##$RELAX= 
##$RELAX= 
##$RELAX= 
##$RELAX= 
##$RELAX= 
$$ Bruker specific parameters
$$ --------------------------
##$DU= <F:/spectra>
##$EXPNO= 1
##$NAME= <H-F>
##$PROCNO= 1
##$TYPE= <nmr>
##$USER= <she>
##$AMP= (0..31)
100 100 100 100 100 100 100 100 100 100 100 100 100 100 100 100 100 100 
100 100 100 100 100 100 100 100 100 100 100 100 100 100 
##$AQSEQ= 0
##$AQ_mod= 1
##$AUNM= <au_zg>
##$AUTOPOS= <>
##$BF1= 200.13
##$BF2= 200.13
##$BF3= 200.13
##$BF4= 200.13
##$BF5= 200.13
$$ [...]
##$SUBNAM3= <"">
##$SUBNAM4= <"">
##$SUBNAM5= <"">
##$SUBNAM6= <"">
##$SUBNAM7= <"">
##$SUBNAM8= <"">
##$SUBNAM9= <"">
##$SW= 16.9725356469052
##$SWIBOX= (0..15)
0 0 2 0 0 0 0 0 0 0 0 0 0 0 0 0 
##$SW_h= 3396.73913043478
##$TD= 16384
##$TD0= 1
##$TE= 0
##$TE2= 300
##$TE3= 300
##$TEG= 300
##$TL= (0..7)
0 120 120 120 120 120 120 120 
##$TP= (0..7)
150 150 150 150 150 150 150 150 
##$TP07= 0
##$TPNAME0= <>
##$TPNAME1= <>
##$TPNAME2= <>
##$TPNAME3= <>
##$TPNAME4= <>
##$TPNAME5= <>
##$TPNAME6= <>
##$TPNAME7= <>
##$TPOAL= (0..7)
0.5 0.5 0.5 0.5 0.5 0.5 0.5 0.5 
##$TPOFFS= (0..7)
0 0 0 0 0 0 0 0 
##$TUNHIN= 0
##$TUNHOUT= 0
##$TUNXOUT= 0
##$USERA1= <user>
##$USERA2= <user>
##$USERA3= <user>
##$USERA4= <user>
##$USERA5= <user>
##$V9= 5
##$VALIST= <valist>
##$VCLIST= <CCCCCCCCCCCCCCC>
##$VD= 0
##$VDLIST= <DDDDDDDDDDDDDDD>
##$VPLIST= <PPPPPPPPPPPPPPP>
##$VTLIST= <TTTTTTTTTTTTTTT>
##$WBST= 1024
##$WBSW= 4
##$XGAIN= (0..3)
0 0 0 0 
##$XL= 0
##$YL= 0
##$YMAX_a= 38524
##$YMIN_a= -22276
##$ZGOPTNS= <>
##$ZL1= 120
##$ZL2= 120
##$ZL3= 120
##$ZL4= 120
##$ABSF1= 15.98646
##$ABSF2= -0.9862041
##$ABSG= 5
##$ABSL= 3
##$ALPHA= 0
##$AQORDER= 0
##$ASSFAC= 0
##$ASSFACI= 0
##$ASSFACX= 0
##$ASSWID= 0
##$AUNMP= <proc_1d>
##$AZFE= 0.1
##$AZFW= 0.1
##$BCFW= 0
##$BC_mod= 2
##$BYTORDP= 0
##$COROFFS= 0
##$CY= -3
##$DATMOD= 1
##$DC= 0
##$DFILT= <>
##$DTYPP= 0
##$F1P= 0
##$F2P= 0
##$FCOR= 1
##$FTSIZE= 16384
##$FT_mod= 6
##$GAMMA= 0
##$GB= 0
##$INTBC= 1
##$INTSCL= 1.245715e-10
##$ISEN= 128
##$LB= 0.24
##$LEV0= 0
##$LPBIN= 0
##$MAXI= 10000
##$MC2= 0
##$MEAN= 0
##$ME_mod= 0
##$MI= 1.114404
##$NCOEF= 0
##$NC_proc= -9
##$NLEV= 6
##$NOISF1= 3.799351
##$NOISF2= 2.8
##$NSP= 0
##$NTH_PI= 0
##$NZP= 0
##$OFFSET= 15.9761
##$PC= 1
##$PHC0= -11115.37
##$PHC1= -1.7991
##$PH_mod= 1
##$PKNL= yes
##$PPARMOD= 0
##$PSCAL= 0
##$PSIGN= 0
##$REVERSE= no
##$SF= 200.130007708244
##$SI= 16384
##$SIGF1= 3
##$SIGF2= 2
##$SINO= 5.538805
##$SIOLD= 16384
##$SREGLST= <1H.CDCl3>
##$SSB= 0
##$STSI= 16384
##$STSR= 0
##$SW_p= 3396.73913043478
##$SYMM= 0
##$S_DEV= 0
##$TDeff= 16384
##$TDoff= 0
##$TI= <>
##$TILT= no
##$TM1= 0
##$TM2= 0
##$TOPLEV= 0
##$USERP1= <user>
##$USERP2= <user>
##$USERP3= <user>
##$USERP4= <user>
##$USERP5= <user>
##$WDW= 1
##$XDIM= 16384
##$YMAX_p= 464785677
##$YMIN_p= -627867
$$ End of Bruker specific parameters
$$ ---------------------------------
##NTUPLES= NMR SPECTRUM
##VAR_NAME=  FREQUENCY,     SPECTRUM/REAL,   SPECTRUM/IMAG
##SYMBOL=    X,             R,               I
##VAR_TYPE=  INDEPENDENT,   DEPENDENT,       DEPENDENT
##VAR_FORM=  AFFN,          ASDF,            ASDF
##VAR_DIM=   16384,         16384,           16384
##UNITS=     HZ,            ARBITRARY UNITS, ARBITRARY UNITS
##FACTOR=    0.207333158178281, 1,           1
##FIRST=     3197.29700973482, 0,            0
##LAST=      -199.44212069996, 0,            0
##MIN=       -199.44212069996, -627867,      0
##MAX=       3197.29700973482, 464785677,    0
$$ Real data points
##PAGE= N=1
##DATA TABLE= (X++(R..R)), XYDATA
$$ [...]
6859b16397K744Q896K1202M2578m5896J7773k777o414m8982m1767J0949K1506
6847b36585L4929J08824L4330L7411j6695n4818r803k5344O5003J215l0209J6603
6835g5139K589M367j2873J401Q0321j7791P6324N2365L7801N5073K0365k2078
6823B02725L930O4873J0558l4055L5836K7616n165N5510O4937J6555M7533J6351
6811E07204j974M5904N5586O8190R1381L246n003J08636P9036M3854J05837J37574
6799A239471J02303J29146R7574j02474j19522m0798k9822k5306L5961J05093
6789A391626R3755O9164P4946J05116J29370J01492M2989K4713m4777J5932q589
6778A995737K8929N5786J24071J45558K11002J89655K99990K64862L60175M80891
$$ plain form
6859 -216397 -213653 -204757 -183555 -140977 -186873 -169100 -171877 -178291 -227273 -269040 -258091 -236585
6847 -236585 -201656 -92832 -58502 -21091 -37786 -92604 -102407 -127751 -62748 -61533 -91742 -75139
6835 -75139 -72550 -68183 -81056 -79655 666 -17125 59199 111564 149365 204438 224803 202725
6823 202725 206655 271528 282086 248031 283867 311483 306318 361828 426765 443320 490853 507204
6811 507204 505230 551134 606720 674910 766291 769537 764534 873170 952206 996060 1101897 1239471
6799 1239471 1341774 1470920 1568494 1466020 1346498 1305700 1275878 1250572 1286533 1391626
6789 1391626 1485381 1554545 1629491 1734607 1863977 1965469 2008458 2033171 1988394 2004326 1995737
6778 1995737 2024666 2080452 2204523 2350081 2561083 2750738 3050728 3315590 3675765 4156656
6768D156656L40148J94331J0513p6644j7950J69890K54493K70332M71006O64430
6758F437205P87534R09058Q01132N79077Q5894k50609k61182j94793L8838K67321
6748I199475K88948J98713j18518n33022p75137p92913o46393m28538k07178j00105
6738F085332l6791r2772j55907j88299j59255j60830j50351m9205l8600J386R1081
6727E145789J50052K09854L02366K76782M27518M77197L25235J73550j67151l31025
6717F990167k69717k61646j98299k28997k37482j61283j76941r4987J8928R9577
6707E479320J14727J64158J67329N8191M5118o6996j07876j63918q8477n1951
6697E549625n2250L972J11525K06928L22483L34549M04895L58055K30344K57482
$$ plain form
6768 4156656 4496804 4691135 4701648 4625004 4607054 4776944 5031437 5301769 5772775 6437205
6758 6437205 7224739 8133797 8934929 9514006 9599900 9349291 9088109 8893316 8932154 9199475
6748 9199475 9488423 9687136 9568618 9035596 8260459 7467546 6821153 6392615 6185437 6085332
6738 6085332 6048541 5955769 5799862 5611563 5452308 5291478 5141127 5091922 5053322 5054708 5145789
6727 5145789 5295841 5505695 5808061 6084843 6512361 6989558 7314793 7488343 7321192 6990167
6717 6990167 6720450 6458804 6260505 6031508 5794026 5632743 5455802 5360815 5379743 5479320
6707 5479320 5594047 5758205 5925534 5983725 6028843 5961847 5853971 5690053 5601576 5549625
6697 5549625 5497375 5501347 5612872 5819800 6142283 6476832 6881727 7239782 7470126 7727608
6687G727608J90027J25891o9332j81699j97667k25192n6706J00085J63182K43167
6677G819364N02483O03556P19200R51928J027735Q10356O35279J20556l50271
6668A2840186n41500o29761l59554j16476J11693K78133J46864k12016n27028
6659A0990541o63434m83643k44869r4599q3285j42043k61511l88943m95843m55793
6649G676578m13277j96174r6229N4279J38779J77554K81312L86937M96280M52344
6639H958383L99372J58866l74594o23027p76255o76230m78865l62820k80814j80632
6629E763384j48661q2545m3397k5960K6501M1368O6878K1552n1494j05542j80381
6618E281703j75268j77233j32820r6165o8270J05557J10313K00362J85046K33997
$$ plain form
6687 7727608 7917635 8043526 7974194 7792495 7594828 7369636 7312930 7413015 7576197 7819364
6677 7819364 8321847 8925403 9644603 10596531 11624266 12434622 13069901 13190457 12840186
6668 12840186 12298686 11668925 11309371 11192895 11304588 11582721 11729585 11517569 10990541
6659 10990541 10327107 9843464 9598595 9503996 9420711 9278668 9017157 8628214 8132371 7676578
6649 7676578 7263301 7067127 6970898 7025177 7163956 7341510 7622822 8009759 8506039 8958383
6639 8958383 9357755 9516621 9142027 8519000 7742745 7066515 6587650 6224830 5944016 5763384
6629 5763384 5614723 5532178 5488781 5462821 5489322 5530690 5597568 5619120 5567626 5462084 5281703
6618 5281703 5106435 4929202 4796382 4700217 4631947 4737504 4847817 5048179 5233225 5467222
6608E467222J68225M3863j48636k81327k89687l03265k07993k00092j16774n5450
6598D076086K0846N3889N9106O5542J24357K71545L29108L36751J38588j07523
6588E368295k83527m42841l79957j91116j98714j41483p6497p949J1033L1625
6578C688869J39134M200n2205j18444j43142q8585p9603j8773l593K8109Q34r0411
6566C266390r0821j52478j8089k4972l6126J48934M0660p791q4802j19749j97221
6555B723935j41652j25921j46503j63137j30166r2317j20760r7480p5699m6490
6545A583810j4165m0533j0157q6166q2204j3862l3334l8004o5027J1583J1063
6534A223004k9081k1679k7412n0378n1069j8933q065k0191k1362l1547k4061n1171
$$ plain form
6608 5467222 5635447 5679310 5530674 5249347 4959660 4656395 4448402 4248310 4131536 4076086
6598 4076086 4096932 4150821 4209927 4275469 4399826 4671371 5000479 5337230 5475818 5368295
6588 5368295 5084768 4641927 4261970 4070854 3872140 3730657 3654160 3646211 3657244 3688869
6578 3688869 3828003 3832203 3779998 3661554 3518412 3429827 3350224 3331451 3327858 3355967 3356801 3266390
6566 3266390 3175569 3023091 3005002 2980030 2943904 3092838 3133498 3125707 3040905 2921156 2723935
6555 2723935 2582283 2456362 2309859 2146722 2016556 1924239 1803479 1705999 1630300 1583810
6545 1583810 1569645 1529112 1518955 1432789 1350585 1336723 1303389 1265385 1200358 1211941 1223004
6534 1223004 1193923 1172244 1144832 1094454 1043385 1024452 1016387 996196 974834 943287 919226 868055
6522H68055O515p678n444k1764J6753M1310p796n1038q460l0124L537k9498l2901
6509G41467j4899J7562o082r9484j14517P4919J01889J1989k1932K0572P3938
6498G85422q149n8235o0442L755j4628j9794k679m6375n0945L0051m214M2616
6486E96383k4919k1216K3401P8812l40M0904q670m0581K49K3579o799o0768O074
6473F06109N253L3165K6987p7718m8310K0822J2735n815j7846r835j37N0217J473
6460E97100L581p870o0078j3164J3363N239j4778N1963j6442n3853M5482j8183
6448E32360R893K2523l23M4726J9404m470L1094N6192J0840K740K7749M6731L8290
6435H37749L8171J7170k2722P6990j0025M8042M4696j2417N5668Q9672O5707L0727
$$ plain form
6522 868055 874570 866892 861448 839684 856437 897747 889951 838913 830453 800329 803866 774368 741467
6509 741467 726568 744130 738048 638564 524047 598966 700855 712844 690912 711484 785422
6498 785422 777273 719038 658596 662351 647723 627929 625250 578875 527930 557981 553767 596383
6486 596383 571464 550248 573649 652461 652121 693025 684355 643774 644023 667602 660803 600035 606109
6473 606109 611362 644527 671514 593796 545486 566308 579043 573228 555382 545547 545410 595627 597100
6460 597100 600681 592811 532733 519569 532932 538171 523393 575356 558914 505061 550543 532360
6448 532360 542253 564776 564453 609179 628583 624113 655207 711399 722239 724979 752728 799459 837749
6435 837749 875920 893090 870368 947358 937333 985375 1030071 1017654 1073322 1162994 1228701 1259428
6423A259428J4335O1910L8895N9131N4224J9525R0803Q6288R2280J14892J79400
6412B071111K23583K84191K82181L46232L40849M15014M76321M51184M67453M91655
6402E849774N54720O28280N26821J69585k32674n45204m63383l03812j00344J75729
6392F259492K71931K45795j40621n24674p02565p48648o36135n10553l76645k85887
6382B851490k43492j47573o8169j35550j14772p1146p6648j1066q0705k9006o2616
6371A810747Q169L7728k8526L4221L2827P2018K9828j7393O5342M1243q864R1910
6359B169250k5244L4466Q3031O3796J20963J28817J69825K13054J77218K42182
6349C377358L39371L40483M73803N40373P47094P20829M20173P5674k86409l34643
$$ plain form
6423 1259428 1273763 1335673 1374568 1433699 1487923 1507448 1598251 1684539 1776819 1891711 2071111
6412 2071111 2294694 2578885 2861066 3207298 3548147 3963161 4439482 4890666 5358119 5849774
6402 5849774 6404494 7032774 7559595 7729180 7496506 6951302 6487919 6184107 6083763 6259492
6392 6259492 6531423 6777218 6636597 6111923 5409358 4660710 4024575 3514022 3137377 2851490
6382 2851490 2607998 2460425 2392256 2256706 2141934 2070788 1994140 1983074 1902369 1873363 1810747
6371 1810747 1818916 1856644 1828118 1862339 1895166 1967184 1997012 1979619 2044961 2086204 2077340 2169250
6359 2169250 2144006 2178472 2261503 2325299 2446262 2575079 2744904 2957958 3135176 3377358
6349 3377358 3716729 4057212 4531015 5071388 5818482 6539311 6959484 7035158 6748749 6414106
6339F414106j89622M164K80507N12030M95923K38680l60789o64503q24922p53206
6329E152368m66834k47061j59918L4777p7559j35109o9961j82088o2868j00243
6319C685504j32175j82404j97973j59247k77045k00787j80019j51895q6219j12545
6309B005195r3557n4923r0813o1540o6416n7801K4735o1276p0425l0819o6834
6298A375526j1032l1377m3671O1417J3061k437m9771k4923M1466L8648n441P243
6286A368709N2273N9396k543O6307J02937O6123J15800J62512J51502O2094r6047
6275B109063j61257r6021l9679q482J3633J25583J41298k9649o8849j28501j73202
6264A683937j30851j40418j00435j11914r7121o356j11190J4224m4643p2533N044
$$ plain form
6339 6414106 6224484 6228648 6509155 7021185 7517108 7755788 7394999 6730496 5905574 5152368
6329 5152368 4685534 4438473 4278555 4313332 4235773 4100664 4030703 3848615 3785747 3685504
6319 3685504 3553329 3370925 3172952 3013705 2736660 2535873 2355854 2203959 2117740 2005195
6309 2005195 1911638 1856715 1765902 1704362 1637946 1580145 1604880 1543604 1473179 1442360 1375526
6298 1375526 1364494 1333117 1289446 1350863 1363924 1361487 1311716 1286793 1328259 1366907 1361466 1368709
6286 1368709 1420982 1480378 1477835 1544142 1647079 1713202 1829002 1991514 2143016 2205110 2109063
6275 2109063 1947806 1851785 1812106 1803624 1817257 1942840 2084138 2054489 1985640 1857139 1683937
6264 1683937 1553086 1412668 1312233 1200319 1103198 1096842 985652 999876 955233 882700 887744
6253H87744J0050P958p679j0636J7198k9636m1038m8011p4611m1642m6267k0394
6241F03036k1577n5176J3371j7642l7874K5564m0431N117k8300k4036k0909o3800
6229C37343J0810o080K7220L4981p9104N520O4012k3521l8362q4058l5328K6270
6217B39703k63k1468M0043l0492j9099L8223J5274n397J5499J5679p235j1325
6205B69142j9217p9506m1203M0200j03620K5864L886k5010k0269r569K5912K139
6193F8749Q0217r456r3657r675J0843K9041k3006k9607L7221l4505n3535L7884
6181A0514K3643n435K0904m3642m93l9706k1638r917l4604k047j3358L1606L1732
6168e2441k5114j7739O362J1316j9700k4855J3248K600M2265k8552p506o822m373
$$ plain form
6253 887744 897794 905752 898073 887437 904635 874999 833961 785950 711339 669697 623430 603036
6241 603036 581459 526283 539654 522012 484138 509702 469271 474388 446088 422052 401143 337343
6229 337343 348153 342073 369293 404274 325170 330690 394702 371181 332819 248761 213433 239703
6217 239703 239440 217972 258015 227523 208424 246647 261921 256524 272023 287702 280467 269142
6205 269142 249925 170419 129216 169416 65796 91660 95546 70536 50267 40698 66610 68749
6193 68749 148966 139510 45853 36178 47021 76062 53056 23449 60670 26165 -27370 10514
6181 10514 34157 28722 49626 5984 5491 -34215 -55853 -65770 -100374 -102421 -115779 -84173 -52441
6168 -52441 -77555 -95294 -88932 -77616 -97316 -122171 -108923 -106323 -64058 -92610 -100116 -106938 -111311
6155a11311M1104K0267J1395j8927m58L2659j5730N5421k9730l5254l6824j9662
6143a07050k3444l4448R92l49m430O2358K0865M4743O9746l7747m152j7435k1700
6130e2051M9466l0842J8622J5086j0006P4194M7476p466J4064n9453L321J6094
6118G8505l0082m319K4407j6311m0110J8338L0501r001M6355R52l3494K0644K7883
6105A14268l3196p630K7277j9241M0910o852J2912M4649P5057M4372K2837k106
6093C13257K9930l455N0087k699k9267N1634r357j1326L1172M5444L7526K8150
6081E31096L6157J1787R6031Q5574M2329M9233R985L8360R1326O0610J50083J21134
6069A323705J03267J61841K04627K18260J72901J20640J45327n9468m7434j45327
$$ plain form
6155 -111311 -70207 -49940 -38545 -57472 -57930 -25271 -41001 14420 -15310 -50564 -87388 -107050
6143 -107050 -130494 -164942 -163950 -164299 -168729 -106371 -85506 -40763 28983 -8764 -12916 -30351 -52051
6130 -52051 -2585 -33427 -14805 281 -9725 64469 111945 104479 118543 59090 62411 78505
6118 78505 48423 44104 68511 52200 12090 30428 60929 51928 98283 99235 65741 86385 114268
6105 114268 81072 73442 100719 81478 122388 115536 128448 173097 248154 292526 315363 313257
6093 313257 343187 339732 389819 387120 357853 409487 400130 388804 419976 465420 502946 531096
6081 531096 567253 579040 675071 760645 802974 852207 862192 900552 991878 1052488 1202571 1323705
6069 1323705 1426972 1588813 1793440 2011700 2184601 2305241 2450568 2391100 2343666 2198339
6059B198339j56696j26035r2764o7046q2616j9166J3549k1494L4784o465K3719
6048A698109K0440K3285J34943K6141K0384R6262J73038J15756J21422K20153
6038B649933J76604J92040J97387K12488K33532J65895K52164K72378L43728M53186
6028E149335M10516M59027M46082L86791L62649L90946M62821M51256N54554M15934
6018I489911L21320J04256N5186M2602R3503K14030K80454K23153R8992o6692
6008A0856715l97892o04277o89686o98830n46342m18167m16621m29230m40258
5999F215412m20510l50415l63249k36347j96809j33790j11466k34754j80064p5757
5989C912251p4327p1625q5083o7479n8027r495R188L9673K9510n1998l2041k9742
$$ plain form
6059 2198339 2041643 1915608 1822844 1755798 1673182 1654016 1667565 1646071 1680855 1674390 1698109
6048 1698109 1718549 1741834 1876777 1902918 1923302 2019564 2192602 2308358 2429780 2649933
6038 2649933 2826537 3018577 3215964 3428452 3661984 3827879 4080043 4352421 4696149 5149335
6028 5149335 5559851 6018878 6464960 6851751 7214400 7605346 8068167 8519423 9073977 9489911
6018 9489911 9811231 9915487 9970673 10013275 10106778 10320808 10601262 10824415 10923407 10856715
6008 10856715 10458823 9854546 9164860 8466030 7919688 7501521 7084900 6655670 6215412
5999 6215412 5794902 5444487 5081238 4844891 4648082 4514292 4402826 4168072 3988008 3912251
5989 3912251 3837924 3766299 3681216 3613737 3555710 3546215 3555403 3595076 3624586 3572588 3540547 3510805
5977C510805n8974K4361N0731n7754O723p676n9003O3959R6101O6179R1387N8886
5965C785725R2840M0378R9642J13777J22459K02608J79778J24370K78130K29831
5955E269538K68535K92436K49217K44040K28705K61699K69218L17577L80172M07160
5945H188297N52793N20431M34323M22399L88880N25226N80488O61941P84810P36010
5935A3795598N91066M63474K85939L08971L76657N40633N50263L84579J01399
5926A7398579j98986m60637n01261m87360m97889m12410m21689l85583n43224
5917A3489540o27505o84887p19258n63285n21667m10362m25757l77751l44378
5908H814690l28423l26262j92308j48471j30012l8402j39633j18744m8008l5102
$$ plain form
5977 3510805 3451831 3476192 3526923 3469169 3475892 3468216 3409213 3473172 3569273 3635452 3726839 3785725
5965 3785725 3878565 3918943 4018585 4132362 4254821 4457429 4637207 4761577 5039707 5269538
5955 5269538 5538073 5830509 6079726 6323766 6552471 6814170 7083388 7400965 7781137 8188297
5945 8188297 8741090 9261521 9695844 10118243 10507123 11032349 11612837 12274778 13059588 13795598
5935 13795598 14386664 14850138 15136077 15445048 15821705 16362338 16912601 17297180 17398579
5926 17398579 17199593 16738956 16237695 15750335 15252446 14840036 14418347 14032764 13489540
5917 13489540 12862035 12177148 11457890 10894605 10372938 9962576 9536819 9159068 8814690
5908 8814690 8486267 8160005 7967697 7819226 7689214 7650812 7511179 7392435 7344427 7309325
5898G309325K2262j7835J3837M3148J01453J34346J02628J93956K08107K27457
5888H338684L36377M11162N50487N90038M70713N03184M32666M16220M13514K87072
5878A2750117K28280K50450K63594L21532J25758j42383l83729m25799l46904
5869A2640916l24318k32083j43665j74200j68854n57909q63104r37059q21172
5860H418552o17527m42630k68543k80400l07569l63028l77681l65656k74047k86556
5850D834915k39802j67700j58931j58642j29174j18624m9538j05861q7681o1879
5840C557083o1858n4551p1791r1642m6049q3533J7533m8659n8590m0572j05634
5829B911737j3050L602N926K0197k5608m7964j0481m0021n4929J8527J6282j5775
$$ plain form
5898 7309325 7331587 7313752 7327589 7370737 7472190 7606536 7709164 7903120 8111227 8338684
5888 8338684 8675061 9086223 9636710 10226748 10697461 11200645 11633311 12049531 12463045 12750117
5878 12750117 12978397 13228847 13492441 13813973 13939731 13797348 13413619 12987820 12640916
5869 12640916 12316598 12084515 11940850 11766650 11597796 11039887 10176783 9239724 8418552
5860 8418552 7801025 7358395 7089852 6809452 6501883 6138855 5761174 5395518 5121471 4834915
5850 4834915 4595113 4427413 4268482 4109840 3980666 3862042 3812504 3706643 3618962 3557083
5840 3557083 3495225 3440674 3368883 3277241 3231192 3147659 3165192 3116533 3057943 3017371 2911737
5829 2911737 2898687 2902289 2908215 2928412 2902804 2854840 2844359 2804338 2749409 2767936 2784218 2768443
5817B768443k9901L2544P1333K8475J9012l757N3471P1681O6407J15558J10969
5806C304235J58941J14348J41647K95451L16411L59204L46150K73456K84713L21358
5796E915914K89727L83684M52061N78506N85357M95028K72101j6408j56366k35746
5786H563858j48463J22328J94386K42314l9429k88189n20243o94199o68349n26467
5776F237547m09330k22477j88272k89206l83875m51013l74459l38829k89762k17831
5766C072493j83238j27849r7553r3309m2668p0690n4620J7155k4761p021P524
5755B395463K2884J32945J11638J33558K64719K56194J80069R1553L7749Q3954
5745C710726J88706L05835L72014L38763J51131r4909k05832k18317j39400l8450
$$ plain form
5817 2768443 2738542 2771086 2842419 2870894 2889906 2886149 2939620 3011301 3077708 3193266 3304235
5806 3304235 3463176 3577524 3719171 4014622 4331033 4690237 5036387 5309843 5594556 5915914
5796 5915914 6205641 6589325 7041386 7619892 8205249 8700277 8972378 8955970 8799604 8563858
5786 8563858 8415395 8537723 8732109 8974423 8934994 8646805 8126562 7432363 6764014 6237547
5776 6237547 5828217 5605740 5417468 5128262 4744387 4293374 3918915 3580086 3290324 3072493
5766 3072493 2889255 2761406 2663853 2570544 2527876 2457186 2402566 2419721 2394960 2387939 2395463
5755 2395463 2418347 2551292 2662930 2796488 3061207 3317401 3497470 3589023 3626772 3710726
5745 3710726 3899432 4205267 4577281 4916044 5067175 4972266 4766434 4548117 4408717 4370267
5735D370267N6269M7906k3627j55670k80607l39658m01855l28880k08163n4823
5725B681159p5851j62543k38624k84614j56288j62692j54779p0896j23800q335
5715A242737l5394j34056j8781l1806L884K4432k7802m0954m5253J8979o192M7014
5703I96808j8649R774k735L3977M7620P9356K5158M7951k642K8707j4655R1994
5691A322664P3536R8634O4566K7831J9637q776l6331k9545J3760k4023o512l3259
5679A482182J2282r5577r5101j5901o4477p9696l8197l9141n9753j1152J7994
5668A013463j37196m9756k1216m3481m3845p0312j2809J7842m2100q602L9061
5657F41049j5081l6774l5856l701L3509K3740o1035p6843N1986J7481j8136k9838
$$ plain form
5735 4370267 4426536 4474442 4450815 4295145 4014538 3674880 3273025 2944145 2735982 2681159
5725 2681159 2605308 2442765 2204141 1919527 1763239 1600547 1445768 1374872 1251072 1242737
5715 1242737 1207343 1073287 1054506 1022700 1026584 1051016 1023214 982260 937007 955986 949794 996808
5703 996808 978159 987933 985198 1019175 1066795 1146151 1171309 1219260 1216618 1245325 1230670 1322664
5691 1322664 1396200 1494834 1559400 1587231 1606868 1598092 1561761 1532216 1545976 1521953 1515441 1482182
5679 1482182 1494464 1398887 1303786 1287885 1223408 1143712 1105515 1066374 1006621 995469 1013463
5668 1013463 876267 826511 805295 761814 717969 647657 634848 652690 610590 601988 641049
5657 641049 625968 589194 553338 549637 583146 606886 545851 469008 520994 538475 520339 490501
5645D90501k3270J4946L9357n9218k4970J7399K2342J5943n1108J2573K3098O4281
5633E41874q830k3926M0707k441J0643J1759J1302J02678K8821k263K2262q831
5621G23755k7395Q4055P8402O5106J15166M8828O5227k614M8646J3219K0755J9985
5609A253135K3064K7915J32769M3401J7767K9390k6504J3655Q1713K9792K2260
5598A648357K315o4321k9136J9803m4507q4376L703k1390L519m8526q36K8417
5586A413022M270j05573p7427o493j1747O1152K2979K1230J4355N2370J815l494
5574A386459J020K9585N8030q968r5O4926R2396Q1718M2112N4314J27848J93591
5562B122936K13950J02248R0769L9272Q1732P7030J9376M256Q5906J87772K04637
$$ plain form
5645 490501 467231 482177 521534 462316 437346 454745 477087 493030 441922 454495 477593 541874
5633 541874 533044 509118 549825 547384 558027 569786 581088 683766 712587 710324 732586 723755
5621 723755 696360 780415 858817 923923 1039089 1087917 1153144 1150530 1199176 1212395 1233150 1253135
5609 1253135 1276199 1304114 1436883 1480284 1498051 1527441 1500937 1514592 1596305 1626097 1648357
5598 1648357 1650672 1586351 1557215 1577018 1532511 1448135 1451838 1430448 1433967 1385441 1384605 1413022
5586 1413022 1417292 1311719 1234292 1227799 1216052 1277204 1300183 1321413 1335768 1388138 1389953 1386459
5574 1386459 1387479 1417064 1475094 1466126 1466031 1530957 1623353 1705071 1747183 1801497 1929345 2122936
5562 2122936 2336886 2439134 2529903 2569175 2650907 2727937 2747313 2751569 2837475 3025247 3229884
5551C229884J69377O0690m455o3625q4306r0972n4341J18403M2413J24150R9975
5540C547193K2881J57023j407k3859p0588j6332k8198N2721J22559J19959Q2046
5529C963998K0501j7218o8417j74289p5025j6230J8263P5477N8855Q2145M7958
5518C916018j981j10566j08210j32872j43863j32851j63748j29691j5444M242
5508B981034m1747P389Q3670P4704O113l483L2705K0764N8926K3812Q7898J77944
5496C509729J00446O2893R4303J22715J42988J84744K69412J91066K35868K58255
5486E172419K21845K31998K86804K98476L16359M02958M65828N48179O61489P21973
5476I328328Q97729J023921J217834J614943J985174K324582K787811K946309
$$ plain form
5551 3229884 3399261 3459951 3455496 3391871 3307565 3216593 3162252 3280655 3323068 3447218 3547193
5540 3547193 3570074 3727097 3725690 3701831 3631243 3614911 3586713 3639434 3761993 3881952 3963998
5529 3963998 3984499 3967281 3898864 3724575 3649550 3633320 3651583 3727060 3785915 3868060 3916018
5518 3916018 3914037 3803471 3695261 3562389 3418526 3285675 3121927 2992236 2976792 2981034
5508 2981034 2939287 2946676 3030346 3105050 3111163 3107680 3140385 3161149 3220075 3243887 3331785 3509729
5496 3509729 3610175 3673068 3767371 3890086 4033074 4217818 4487230 4678296 4914164 5172419
5486 5172419 5394264 5626262 5913066 6211542 6527901 6930859 7396687 7944866 8606355 9328328
5476 9328328 10226057 11249978 12467812 14082755 16067929 18392511 21180322 24126631
5468B4126631K531571J573404J17143j266979k219257k789118k848710k486287
5460A6738398j966692j621640j237931r89933p75443p25026o55052n74277n91922
5451G600482n30429n61677m30622m81094m25070k79924k67852k97815j48251k09220
5441C968528k28813j89871j46274r8197j46033j03291q3434r6979q2483p8475
5431B714678q2826j03602j17273l6315J614P739j390k3461o7826m7691k857k4112
5419B216678o6287r1751j18585o1852j6421J5874k3630n8854m4406m1230m2543
5408A666993k4191J0444j9020m6891q4743l1143k9714m2112m3293l6592k081o5779
5396A251878n1598M964K3342M2685J3274j6916l5893l8443j3682l8881p2462j11021
$$ plain form
5468 24126631 26658202 28231606 28348749 27081770 24862513 22073395 19224685 16738398
5460 16738398 14771706 13150066 11912135 10922202 10146759 9421733 8766681 8192404 7600482
5451 7600482 7070053 6508376 6077754 5596660 5171590 4891666 4623814 4325999 4177748 3968528
5441 3968528 3739715 3549844 3403570 3305373 3159340 3056049 2972615 2875636 2793153 2714678
5431 2714678 2631852 2528250 2410977 2374662 2376276 2384015 2382625 2359164 2291338 2243647 2240790 2216678
5419 2216678 2150391 2058640 1940055 1878203 1861782 1877656 1854026 1795172 1750766 1709536 1666993
5408 1666993 1642802 1653246 1634226 1587335 1502592 1471449 1441735 1399623 1356330 1319738 1317657 1251878
5396 1251878 1200280 1205244 1228586 1271271 1284545 1267629 1231736 1193293 1179611 1140730 1068268 957247
5384I57247l5733L9694j2508J9937O423n0283o5674j0212m8058m129m0478q3273
5372F72953L368J9349J3271n2331m1201m3983K0992M5304j0965L3859L7504O630
5360G04750J4562L417j04320l4957m1377KP4910O511K1116k8024O335M0139p014
5347F56050k4453N284N1534j9831n5373l154j4938q258j4002j9589N2528M2378
5335F48176L1844M7895R802j72l5920m5066L8093Q799j0730J9227J6643K9478
5323G58069M6072j4550J0750J12381l360l3403J6429J8198j4252q4326n8748M562
5311G57822P611M1115L9870L3777k4082N8439q021m3968L5935n839k4773j7303
5299H50583k6695k4476L4797J11521N5178N0272J6431Q828N7459L7613L4126j6222
$$ plain form
5384 957247 921514 961208 948700 968637 975060 924777 859103 848891 800833 796704 756226 672953
5372 672953 676321 695670 708941 656610 615409 571426 592418 637722 626757 660616 698120 704750
5360 704750 719312 722729 618409 583452 542075 542077 616987 623498 644614 616590 622925 663064 656050
5347 656050 631597 636881 688415 668584 613211 610057 595119 586861 572859 553270 605798 648176
5335 648176 680020 727915 737717 737545 701625 656559 694652 703451 692721 711948 728591 758069
5323 758069 804141 789591 800341 912722 909362 875959 892388 910586 896334 812008 753260 757822
5311 757822 765433 806548 846418 880195 856113 914552 906531 862563 898498 892659 867886 850583
5299 850583 823888 799412 834209 945730 1000908 1051180 1067611 1076439 1133898 1171511 1205637 1189415
5287A189415O514p3254K303J3507P666N2163M2092L039j9941J4472Q4795j3394
5275A309377K4005n5823K1315Q9765M4697M0991O5158J736K9199K1116M5051N1798
5263A688385N3234Q0407p7855j3148Q374M678R666M176L9673R0405N2063L6938
5251A976996Q2116N9689j3190J5794J2202O5938K6924J287q864J2505N2523N2606
5239B336526O2391L7182Q2162Q1898q402o540O7070M1835m1910l9030N1732J14297
5227B779211J06370J23411J29658J50930J56390N4839O4025J06561N5094J24932
5217C851421N3941R0235Q3491P1305J47046P8079J11972J50127J75579J47720
5207D960916N8830J36598J25073O9046O2718Q7604J26605J91038J87117J94295
$$ plain form
5287 1189415 1195929 1122675 1124978 1138485 1146151 1198314 1240406 1243445 1223504 1237976 1322771 1309377
5275 1309377 1333382 1277559 1298874 1388639 1433336 1474327 1539485 1541221 1570420 1591536 1636587 1688385
5263 1688385 1741619 1822026 1744171 1731023 1739397 1744075 1753741 1757917 1797590 1887995 1940058 1976996
5251 1976996 2059112 2118801 2105611 2121405 2133607 2199545 2226469 2227756 2218892 2231397 2283920 2336526
5239 2336526 2398917 2436099 2518261 2600159 2591757 2585217 2652287 2694122 2652212 2613182 2664914 2779211
5227 2779211 2885581 3008992 3138650 3289580 3445970 3500809 3564834 3671395 3726489 3851421
5217 3851421 3905362 3995597 4079088 4150393 4297439 4375518 4487490 4637617 4813196 4960916
5207 4960916 5019746 5156344 5281417 5350463 5413181 5500785 5627390 5818428 6005545 6199840
5197F199840K19813K56067L28612K63249K32575K38991K95802K70244K03815K11082
5187H720090K89934K90782K97236K65350L08729L86194L41157M00275M17878M07884
5177A2125509L80024M40518M99568N30135O13005O56058P03440Q37261R72396
5168A7757914J068731J205581J364446J473659J768158J951123K215321K489719
5160C1294652K879348L490970M245909N235168O604851Q208539R531788Q729463
5152H0220688M202488j483630m267234o629912p928795o437767m628954l233261
5144D9813623k163241j255725o73634j86422O2830L72553O69935J040046J535291
5135D9215256K088584K620837L241704M084101N260609O770138Q805083J1233366
$$ plain form
5197 6199840 6419653 6675720 7004332 7267581 7500156 7739147 8034949 8305193 8509008 8720090
5187 8720090 9010024 9300806 9598042 9863392 10172121 10558315 10899472 11299747 11717625 12125509
5177 12125509 12505533 12946051 13445619 13975754 14588759 15244817 15948257 16785518 17757914
5168 17757914 18826645 20032226 21396672 22870331 24638489 26589612 28804933 31294652
5160 31294652 34174000 37664970 41910879 47146047 53750898 61959437 71491225 80220688
5152 80220688 84423176 82939546 78672312 72042400 64113605 57675838 53046884 49813623
5144 49813623 47650382 46394657 45721023 45534601 45597431 45969984 46639919 47679965 49215256
5135 49215256 51303840 53924677 57166381 61250482 66511091 73281229 82086312 93319678
5127I3319678J3916800J5871551J4901512R385939m1428p485786j2457161j5902565
5119A11508540j5193992j2387803r525250p150532n159051l581014k393534j533166
5111E4584198q63209m23653j66191j11441j24683o3072J56721K69459P97894J672143
5101E5728166K620041L932336N528980P169149Q186567O567149R89464m726466
5093H5995386p081929r390009r969992q070258o171954m794001l768553l011984
5085C3736706k314129j781331j424182j125794r63022o98900n58131m68100l62746
5076B4040371m41085n66672o13250q18935q92838r67537j003458r00605r13071
5067A6922920q29090p28444o27723n89309n71760n11013m57380m19500m12777
$$ plain form
5127 93319678 107236478 123108029 138009541 147395480 147354052 139868266 127411105 111508540
5119 111508540 96314548 83926745 74401495 67250963 62091912 58510898 56117364 54584198
5111 54584198 53720989 53297336 53131145 53019704 52895021 52831949 52988670 53258129 54056023 55728166
5101 55728166 58348207 62280543 67809523 74978672 83165239 89732388 90721852 85995386
5093 85995386 78913457 69523448 59553456 51483198 45311244 40517243 36748690 33736706
5085 33736706 31422577 29641246 28217064 27091270 26128248 25429348 24871217 24403117 24040371
5076 24040371 23599286 23032614 22419364 21600429 20707591 19740054 18736596 17835991 16922920
5067 16922920 16093830 15365386 14737663 14148354 13576594 13065581 12608201 12188701 11775924
5058A1775924m65668l94982k30524l39750k07773k21438k40737j79409j46963
5049I348680k02586j40346j74071j45173j36370j93302j53355j43088j42872j79884
5039G737633j07130r9842k09560j13921j51790j96865r8054j48104j28535j27702
5029F356130k06016j20243m6763p3618m7462q1323p9980L4042q7269k7697o0457
5018E559344m960O6936j24992r2968r7954j03568o8355r4334j04266o7186m6784
5007D820913k7344m037m0621o5512p1465o358l0134p103L1712j9970l5121n9675
4995D485285l3963M1597J46k8425r688N653K0992P7103M9339R7807L5162K0688
4983D761696r3950j19033j4119j0550j02144j5860j5488J9973p1833r86P2589
$$ plain form
5058 11775924 11310256 10915274 10684750 10345000 10137227 9915789 9675052 9495643 9348680
5049 9348680 9146094 9005748 8831677 8686504 8550134 8356832 8203477 8060389 7917517 7737633
5039 7737633 7630503 7530661 7321101 7207180 7055390 6858525 6760471 6612367 6483832 6356130
5029 6356130 6150114 6029871 5983108 5909490 5862028 5780705 5700725 5734767 5647498 5619801 5559344
5018 5559344 5554384 5621320 5496328 5403360 5305406 5201838 5133483 5039149 4934883 4867697 4820913
5007 4820913 4793569 4789532 4748911 4683399 4611934 4605576 4575442 4568339 4600051 4580081 4544960 4485285
4995 4485285 4451322 4492919 4493065 4464640 4454952 4460605 4481597 4558700 4608039 4705846 4741008 4761696
4983 4761696 4667746 4548713 4534594 4524044 4421900 4406040 4390552 4410525 4338692 4337706 4410295
4972D410295j7977N1857J3052N3661P0053K594M5205l6487k2484J14666O0111
4961D744546N9956L1262M7228J02342K6731O5989K0533J4051N7537n771M2155
4950E206559k9730K3057P4738Q5506N8650J67298J71891J66329K25424K53863
4940F403585L21628L41827M00163M49386N20037O78294O60107N70575L75753L2238
4930A0753593j86155l65454m51826m66840m75261l57095k85609k03778j12931
4921G848644m1631l5638o39P3431J86567K04066K43688L67303L84188M68461N59843
4910A0258283O83177Q79255J057950J105662J223759J001567O59847J47600m33818
4901A6583282r62070j233542j220226j275681j112116q82708p08905o49903m23281
$$ plain form
4972 4410295 4392318 4444175 4457227 4510888 4580941 4583535 4628740 4592253 4569769 4684435 4744546
4961 4744546 4804502 4835764 4882992 4985334 5012065 5078054 5098587 5112638 5170175 5164404 5206559
4950 5206559 5176829 5199886 5274624 5360130 5418780 5586078 5757969 5924298 6149722 6403585
4940 6403585 6725213 7067040 7467203 7916589 8436626 9114920 9775027 10345602 10721355 10753593
4930 10753593 10567438 10201984 9750158 9283318 8808057 8450962 8165353 7961575 7848644
4921 7848644 7807013 7771375 7770736 7844167 8030734 8234800 8478488 8845791 9229979 9698440 10258283
4910 10258283 10941460 11820715 12878665 13984327 15208086 16209653 16869500 17017100 16583282
4901 16583282 15621212 14387670 13167444 11891763 10779647 9896939 9188034 8538131 8114850
4892H114850l85973k84303j92236j41422r6794p048N1742O5799K10981K22649
4882G558245K88567M24158L67492M48007N29479M06315K32943j240k89784n63250
4872I400932p86378q05796p77452o54365n51877m61573m19373l78645l09727k20715
4862D035031k72233k28834j62337j60901j25218p8669j53017j38416j02810n3641
4852B558955l9337q4186j15905m5776j15903j37462n2240k3903q204N432k14o4224
4840A877033l6331j600m8211q3616m6368J5339o2459r7488p8143n8627j5274J4515
4828A378770k2195K4625n972k8030L0392N000r9976k3403k8829m835l154n7367
4816A165026m2877J4526L3016J043L6827m8675M5268j000M9922j1778p31n6507
$$ plain form
4892 8114850 7728877 7444574 7252338 7110916 7014122 7007074 7058816 7124615 7335596 7558245
4882 7558245 7846812 8270970 8638462 9086469 9615948 10022263 10255206 10253966 9964182 9400932
4872 9400932 8614554 7808758 7031306 6376941 5825064 5363491 4944118 4565473 4255746 4035031
4862 4035031 3762798 3533964 3371627 3210726 3085508 3006839 2853822 2715406 2612596 2558955
4852 2558955 2519618 2435432 2319527 2273751 2157848 2020386 1968146 1944243 1936039 1941471 1941257 1877033
4840 1877033 1840702 1839102 1790891 1707275 1660907 1676246 1613787 1516299 1438156 1379529 1364255 1378770
4828 1378770 1356575 1381200 1375228 1347198 1377590 1382590 1282614 1259211 1230382 1225547 1222393 1165026
4816 1165026 1122149 1136675 1169691 1170734 1207561 1158886 1204154 1203154 1253076 1241298 1240567 1184060
4804A184060o8147o140N821o990K0997j7877J140J5716J0220N98J3462J9075J4986
4791A186921M4783J9692j404K9032M31R4559M2377k5277m1012k3678m2625j5812
4779A267987n0407o5088q9234m1365k5499l422K3130q346j3254M1045L4596K5581
4767A095724j1681j6078j6167L0389L1997j8853M6812Q3883l930O7533L0878k122
4755A318385J0534o905p7343p8625p3599o3549j0494q1550p1428m9659j3529k2475
4743G79763r636k8727k156J7389M395n909J5453J075O51M4389j1907l0011P2091
4730H46860P1297P0022M571L290J4566j3234m4087o4501q321o3543j00323m5820
4718F70777j3167l986n5761p3182J8923L416N3407M9340n2704p582J2597K1611
$$ plain form
4804 1184060 1115913 1109773 1115594 1108604 1129601 1111724 1112864 1128580 1138800 1139398 1152860 1171935 1186921
4791 1186921 1231704 1251396 1249992 1279024 1279455 1374014 1416391 1391114 1350102 1326424 1283799 1267987
4779 1267987 1217580 1152492 1063258 1021893 996394 992972 1016102 1007756 994502 1035547 1070143 1095724
4767 1095724 1084043 1067965 1051798 1082187 1114184 1095331 1142143 1226026 1222096 1289629 1320507 1318385
4755 1318385 1328919 1322014 1244671 1166046 1092447 1028898 1018404 936854 865426 815767 802238 779763
4743 779763 770127 741400 739244 756633 761028 755119 770572 771647 772298 816687 804780 774769 846860
4730 846860 918157 988179 992750 996040 1010606 997372 953285 888784 880463 816920 716597 670777
4718 670777 657610 653624 597863 524681 543604 547020 600427 649767 597063 589481 602078 623689
4706F23689j0302j9504k7957q3524k679K6905j972J0908J5338L0667K6691n029
4694E83231O1265O7330l7559k2021M795L1339j4036L690j301L438J3465l983m2775
4681F46878K3758M4330k5533m7171m5962m0343n1419K6401j9558k1090K8477N6119
4669E74887O6986m0282j016J4530p105m0020o0837l9049j0904j9441N8107M296
4657E00152M5866M2383K1573L0485O9847M967J8376J167K2949M7214J6169k1073
4645H00075K0286L2005l983o826J0554J8809N6487K171k9730O3824O3242K1373
4633A048287k5665O7862K8720k2692m2636j522Q3663l8087r456L3525N8045K0690
4621A200734k4342k8271j9300l9618J2752k2806j2644N2327M4919P2451q821k6506
$$ plain form
4706 623689 613387 593883 565926 482402 479723 506628 504656 515564 530902 561569 588260 583231
4694 583231 644496 711826 674267 652246 657041 688380 674344 678034 676733 680171 693636 689653 646878
4681 646878 670636 714966 689433 642262 596300 555957 504538 530939 511381 490291 518768 574887
4669 574887 641873 601591 600575 615105 608000 567980 507143 468094 457190 437749 495856 500152
4657 500152 546018 588401 609974 640459 710306 715273 733649 734816 757765 804979 821148 800075
4645 800075 820361 852366 848383 841557 852111 870920 927407 929578 899848 963672 1026914 1048287
4633 1048287 1022622 1090484 1119204 1096512 1053876 1052354 1136017 1097930 1088474 1121999 1180044 1200734
4621 1200734 1176392 1148121 1128821 1089203 1101955 1079149 1066505 1118832 1163751 1236202 1227381 1200875
4609A200875K2681L3670J307l8277M1238o0774j3924M0954j1696Q434J7119j9246
4597A222361P442N7048K5046j1736n8131j067J1736Q597L6510Q1201O9397K5879
4585A474283k5350K3022J3740K1336J2666k92K9033J12628K8051J081K2061k4299
4573A687960K6334N5822k5286N7945P4083O1171L8706l3683l0291M9408o063O318
4561A962424R3753J5673J2242L6853N3580O8136M3263L0690J5596L2856k2807
4550B342259J505L3730M4212q5537m744N2692j546O9872O6898M0238O3396P9685
4538B702660J16263L962K7518O4829R3397J22727P6087J20378J20812K8930J27105
4527C604668O5528l0414O6830P115J7675Q9154R3179P8482R9763J56393J69167
$$ plain form
4609 1200875 1223556 1257226 1258533 1220256 1261494 1200720 1186796 1227750 1216054 1224488 1241607 1222361
4597 1222361 1229803 1286851 1311897 1300161 1242030 1240963 1252699 1261296 1297806 1379007 1448404 1474283
4585 1474283 1448933 1471955 1485695 1507031 1519697 1519405 1548438 1661066 1689117 1690198 1712259 1687960
4573 1687960 1714294 1770116 1744830 1802775 1876858 1938029 1976735 1943052 1912761 1962169 1956106 1962424
4561 1962424 2056177 2071850 2084092 2120945 2174525 2242661 2285924 2316614 2332210 2365066 2342259
4550 2342259 2343764 2377494 2421706 2336169 2331425 2384117 2382571 2452443 2519341 2559579 2622975 2702660
4538 2702660 2818923 2822885 2850403 2915232 3008629 3131356 3207443 3327821 3448633 3477563 3604668
4527 3604668 3670196 3639782 3706612 3713727 3731402 3820556 3913735 3992217 4091980 4248373 4417540
4516D417540K13782K12796K32767K48538L15165K74971K85795L84883L43301L81930
4506G311468M15904M42820N78273N95089N67530O14999P37770R04599J100031
4497A3268483J282955J395546J346478J133002O69970R6894m46832q35212j013788
4488A6897496q66588p11760l71469j29677Q9582L10644L91753N77114O86791Q65028
4478A7738914J014272J286728J622055J929159K286824K417762K288148J753183
4470C2337045M88211q38706j925368k648079k801239k566752k156585j776882
4462A8111645j500531j211929j135848r99040r15681q76633q03180o41343n42150
4453I485310n44797n21998m96652m00908l18616k38798k29022k71725k55423k32158
$$ plain form
4516 4417540 4631322 4844118 5076885 5325423 5640588 5915559 6201354 6586237 6929538 7311468
4506 7311468 7727372 8170192 8748465 9343554 9911084 10526083 11263853 12168452 13268483
4497 13268483 14551438 15946984 17293462 18426464 19096434 19193328 18746496 17911284 16897496
4488 16897496 16030908 15319148 14947679 14818002 14907584 15218228 15609981 16187095 16873886 17738914
4478 17738914 18753186 20039914 21661969 23591128 25877952 28295714 30583862 32337045
4470 32337045 32825256 31986550 30061182 27413103 24611864 22045112 19888527 18111645
4462 18111645 16611114 15399185 14263337 13264297 12348616 11471983 10668803 10027460 9485310
4453 9485310 8940513 8418515 7921863 7520955 7202339 6963541 6734519 6462794 6207371 5975213
4443E975213j87039j68328j67941j41643j48358j69440j78948j76384q1990r2675
4433D462467j21500q2148p3014m0882k7786r0712o0933r3253r1695j28537j11411
4422C540596o7060j51593j27639n2633j29912m4873n2034l0867q2169j30414j3776
4411B657626l2089q4836l0710j06228k4162q268J3733p949l0456l4151k9812m8070
4399B234628j6552l1297J1616J4832k6192k6517L4043k6352p4229k5727k0699
4388B047554j8143m4181o2704j3288M4169l0697m9827N3327K2361j0681O017m3261
4376A900646n0190k4149k7543K4019L909J2321O682j9583P0532P279o322q243
4364A889358j3184J7460j6316L223M0183j2838k4344j0380K6148O2061K7112Q373
$$ plain form
4443 5975213 5788174 5619846 5451905 5310262 5161904 4992464 4813516 4637132 4555142 4462467
4433 4462467 4340967 4258819 4185805 4144923 4117137 4026425 3965492 3872239 3780544 3652007 3540596
4422 3540596 3473536 3321943 3194304 3141671 3011759 2966886 2914852 2883985 2801816 2671402 2657626
4411 2657626 2625537 2540701 2509991 2403763 2379601 2371333 2385066 2377117 2346661 2312510 2282698 2234628
4399 2234628 2218076 2186779 2198395 2213227 2187035 2160518 2194561 2168209 2093980 2068253 2047554
4388 2047554 2029411 1985230 1922526 1909238 1953407 1922710 1872883 1926210 1948571 1937890 1943907 1900646
4376 1900646 1850456 1826307 1798764 1822783 1826692 1839013 1845695 1826112 1896644 1903923 1897601 1889358
4364 1889358 1876174 1893634 1877318 1880541 1920724 1907886 1883542 1873162 1899310 1961371 1988483 1996856
4352A996856j3271o3319l5060k1474n4550j139K1457k587K300L5536O6106j0604
4340A920251j065M3590m0482O8505M539k8999l8534o4541L9784M8532O3453j1528
4328B003505J0657M4226J8469J5731M0767L7202L0913j0045n7668L063R4444q971
4316B222293K7188L1814J09967P5680J36172J17790J06982J15539J09385R4547
4306C147357J77268J48238J50922J61749J62869K02231K61258L19488M11098M44439
4296E586917N52050O04704P09034O03793M68037L41912K96935K37161L99346N37625
4286A0337514O84003N78397K26960j29090m49615n57047m83950l73369j96852
4277I636951k04028k83038l59414m70190m52364l78379k60074j15607l8492J54568
$$ plain form
4352 1996856 1983585 1920266 1885206 1863732 1809182 1808043 1829500 1826913 1829213 1864749 1930855 1920251
4340 1920251 1919186 1962776 1922294 1990799 1995338 1966339 1927805 1863264 1903048 1951580 2015033 2003505
4328 2003505 2014162 2058388 2076857 2092588 2133355 2170557 2201470 2191425 2133757 2136820 2231264 2222293
4316 2222293 2249481 2281295 2391262 2466942 2603114 2720904 2827886 2943425 3052810 3147357
4306 3147357 3324625 3472863 3623785 3785534 3948403 4150634 4411892 4731380 5142478 5586917
4296 5586917 6138967 6743671 7452705 8056498 8524535 8866447 9163382 9400543 9799889 10337514
4286 10337514 11021517 11599914 11826874 11697784 11248169 10691122 10207172 9833803 9636951
4277 9636951 9432923 9149885 8790471 8320281 7867917 7489538 7229464 7113857 7075365 7229933
4267G229933K15564L34862L91836L96113M39245L88262K30997J25609K25755K74689
4257A0252865M01169N09236L84583O0566l76464o29242p06694n72240l76966l32079
4247H614734l28085m23104n28867o24665o21970n52277n03382l33544l36489l19715
4237D042636k07844j49841j49573j30301j05744j03663r5505j32559r1619q6584
4227B789403j18021p4507p0664n9866m7865q5960m9724j00170o6198n4052J3975
4216B076351q380j2731Q843M7945J7834P1183q4801Q832M882J8767P5088J68987
4204B392800R2166R6397J63111K44164K28225L31315K68672J1304j80294l02306
4194C345554m49609k61576k73251k59401j28505p0142q7187n8867j6373m1376
$$ plain form
4267 7229933 7445497 7780359 8172195 8568308 9007553 9395815 9626812 9752421 9978176 10252865
4257 10252865 10654034 11163270 11547853 11608419 11231955 10602713 9896019 9323779 8946813 8614734
4247 8614734 8286649 7863545 7334678 6710013 6088043 5535766 5032384 4698840 4362351 4042636
4237 4042636 3834792 3684951 3535378 3405077 3299333 3195670 3100165 2967606 2875987 2789403
4227 2789403 2671382 2596875 2526211 2466345 2418480 2332520 2282796 2182626 2116428 2062376 2076351
4216 2076351 2067971 2055240 2064083 2112028 2129862 2201045 2116244 2125076 2129958 2148725 2223813 2392800
4204 2392800 2484966 2581363 2744474 2988638 3216863 3548178 3816850 3828154 3647860 3345554
4194 3345554 2895945 2634369 2361118 2101717 1973212 1903070 1815883 1757016 1740643 1699267
4184A699267n0270j3664m7468O430j15889o1651j282o9428k8953n250k1731j7863
4172A272248j0634K1051J8252O150l5789M174l5031K6461m4047j9187K1653K2277
4160A247578l7582j5081r044M0147p1051l1612K3997m8120l4733N098r562L6456
4148A096491J9573R750n5839M8018k342m7525O01j4877k6285p073k1335L7767
4136A036924r562n1815L2997k677K6087L7162M7063n2438J43L7395j500p874N6263
4123A148168J7726K537j7771j1703p3490j6011l924Q551l7916Q273n8255J2063
4111I78248K2412l4l9115O8217R44M1777j833Q5406L7412k4611O805O8028L3281
4098A276937O4932J323M8349k5912J34719q320q8180M5839Q531k9901J2457k5277
$$ plain form
4184 1699267 1648997 1635333 1587865 1594295 1478406 1416755 1415473 1346045 1317092 1311842 1290111 1272248
4172 1272248 1261614 1282665 1300917 1307067 1271278 1275452 1240421 1266882 1222835 1203648 1225301 1247578
4160 1247578 1209996 1194915 1185871 1226018 1154967 1123355 1147352 1099232 1064499 1069597 1060035 1096491
4148 1096491 1116064 1125814 1069975 1117993 1115651 1068126 1068727 1053850 1027565 1020492 999157 1036924
4136 1036924 1027362 975547 1008544 1005867 1031954 1069116 1116179 1063741 1063884 1101279 1099779 1091905 1148168
4123 1148168 1165894 1168431 1150660 1138957 1065467 1049456 1045532 1054083 1016167 1024440 966185 978248
4111 978248 1000660 1000626 961511 1029728 1030672 1072449 1070616 1156022 1193434 1168823 1175628 1243656 1276937
4098 1276937 1341869 1343192 1391541 1365629 1500348 1492028 1403848 1449687 1458218 1428317 1440774 1415497
4086A415497N0360M1114l9722m5346K4256j2070p510m0831L7552J4306K2923k4598
4074A435931J0682O1120N3774j4508N4084p239P202k9189P4222O7268P623L4998
4062A755968J32407Q632j0859K5310N2162j2550L257j8619l145M6481l0112L1724
4050A980656K1483J6261l4274l7189P8297n096K8318k623N3899L5196R8186Q4005
4038B317119r539M9061O4527N4153O3952M8039L1302Q0737K1338J0768L1243N8949
4026B821649O2197M9075k1662O823K4600O5478J12349O4376m9607J4625R6219
4015C246122O8038R3145Q3724N075j8443k3477J0521N9651J0339L6563P1858j5296
4003C627820k8811K3702L1474J3968Q2643K930N5572L4294J06280O4714J31252
$$ plain form
4086 1415497 1465857 1506971 1467249 1421903 1446159 1434089 1426579 1385748 1423300 1437606 1460529 1435931
4074 1435931 1446613 1507733 1561507 1546999 1601083 1593844 1601046 1571857 1646079 1713347 1720970 1755968
4062 1755968 1888375 1897007 1886148 1911458 1963620 1951070 1954327 1935708 1932563 1979044 1948932 1980656
4050 1980656 2002139 2018400 1984126 1946937 2025234 2020138 2048456 2045833 2099732 2134928 2233114 2317119
4038 2317119 2307580 2356641 2421168 2475321 2539273 2587312 2618614 2699351 2720689 2731457 2762700 2821649
4026 2821649 2883846 2932921 2911259 2918082 2942682 3008160 3120509 3184885 3135278 3149903 3246122
4015 3246122 3314160 3407305 3491029 3496104 3477661 3454184 3464705 3524356 3534695 3571258 3643116 3627820
4003 3627820 3599009 3622711 3654185 3668153 3750796 3753726 3809298 3843592 3949872 4014586 4145838
3992D145838J16663R2217N4134J52938J00338K10803R0146J20890J28355J45377
3982E357699J98435J99146P3565J38136R2491J80282J30857J83568J76520J47321
3972F878020P7408K20457J51740K50351K47727K51048K71666L34546L51762L27656
3962I362381L26165M46022M34621M84977M64457N77203O21538O73099P24609Q29800
3952A4944872P70077R53568R80826J113593J035108J090727R47647Q05494O70077
3943B3311989P79940O54566N23517K50298K5612k03261j93994j75187l2978k09668
3933B4730834j82923k62996k00127j83293m7707j0402J90014K08733L50197L61788
3923B4954118M53091M84736N10128N62612O87470P05096P84626P54308P56515
$$ plain form
3992 4145838 4262501 4354718 4408852 4561790 4662128 4872931 4963077 5083967 5212322 5357699
3982 5357699 5556134 5755280 5828845 5966981 6059472 6239754 6370611 6554179 6730699 6878020
3972 6878020 6955428 7175885 7327625 7577976 7825703 8076751 8348417 8682963 9034725 9362381
3962 9362381 9688546 10134568 10569189 11054166 11518623 12095826 12717364 13390463 14115072 14944872
3952 14944872 15714949 16668517 17649343 18762936 19798044 20888771 21836418 22641912 23311989
3943 23311989 24091929 24746495 25270012 25520310 25545922 25342661 25148667 24973480 24940502 24730834
3933 24730834 24547911 24284915 24084788 23901495 23853788 23843386 24033400 24242133 24592330 24954118
3923 24954118 25407209 25891945 26402073 26964685 27652155 28357251 29141877 29896185 30652700
3914C0652700O89564O44127O70893O75580O75621M79686J10583n8728n6022n3571
3904C4430433Q3858J43577J97792J95810J73423K14168L71826N51144P12405O01802
3894C7676238O72464Q21580R70749R55836J037746J148783J491476J624549K137232
3885D8536653K312075K670154K865839L265765L559954M137377M748025N802187
3877G7898029O436018Q265508R459449J0592984J1496599J3893090J6837721K2254914
3869A77134312K8087268L6443350M7662612O3320475O8485319M3652341j6850582
3862D47935095l8892295n7918645p3183286n3131739l9194104k7969685k2132056
3855A35513285j6075353j3171920r910007q517900o869693o150455m757220m695285
$$ plain form
3914 30652700 31342264 31986391 32657284 33332864 34008485 34488171 34598754 34540026 34484004 34430433
3904 34430433 34514291 34657868 34855660 35051470 35224893 35439061 35810887 36362031 37074436 37676238
3894 37676238 38348702 39170282 40141031 41096867 42134613 43283396 44774872 46399421 48536653
3885 48536653 50848728 53518882 56384721 59650486 63210440 67347817 72095842 77898029
3877 77898029 84334047 92599555 102059004 112651988 124148587 138041677 154879398 177134312
3869 177134312 205221580 241664930 289327542 352648017 421133336 464785677 447935095
3862 447935095 409042800 351124155 277940869 224809130 185615026 157645341 135513285
3855 135513285 119437932 106266012 96356005 87838105 80968412 74817957 70060737 65365452
3847F5365452l820957l601119k768758k555239j885899j949380j664287j839140
3839D5280673j633408j730086j318059j266656r11388q91791o24897p82839p84217
3830C5337332r52628p51201r41225o32670o49335k98943k86041q1562q447K27840
3820C0963120K19495N18253N31539P27698Q29103J065360J218199J505344J663778
3811C9241889J961146K111073K380512K589454K840370L021078K890283K200893
3803E9236698R72816o60786k032943l138705l663692l832287l730808l493314
3795C9656979l162235k760477k225088j734426j287406j323464j408740j268123
3787B4487020j421198j267044j036234q92906p94111o63952n23334m64691m01672
$$ plain form
3847 65365452 61544495 57943376 55174618 52619379 50733480 48784100 47119813 45280673
3839 45280673 43647265 41917179 40599120 39332464 38421076 37529285 36904388 36121549 35337332
3830 35337332 34384704 33633503 32692278 32059608 31410273 31111330 30825289 30743727 30735280 30963120
3820 30963120 31182615 31700868 32232407 32960105 33789208 34854568 36072767 37578111 39241889
3811 39241889 41203035 43314108 45694620 48284074 51124444 54145522 57035805 59236698
3803 59236698 60209514 59548728 57515785 54377080 50713388 46881101 43150293 39656979
3795 39656979 36494744 33734267 31509179 29774753 28487347 27163883 25755143 24487020
3787 24487020 23065822 21798778 20762544 19869638 19075527 18411575 17888241 17423550 17021878
3778A7021878l08450l01618k60041j52211k00250j98334k20806l02498k15779
3769A4861891k56468j45627j68920q8145r0999K609K2326J27052P4647l260K4356
3758A4359462L1941L7454L8914O7756J02615n7848j09321j33967L4606P0901J33791
3747A4576304L09118L70825M43426N70655O36975Q26683R37322J154666J259501
3738B1085475J337144J570593J836880K453910L143193M078594N330416P258911
3730D8095116Q760729P658571J114726m631826p118411r665129p745086n705054
3722C0763636m178146l231423k390755j946161j430320j130766q86034q03077
3714A4766954n88138n67011m88776n22672m30592m67660l87000l80225k69747
$$ plain form
3778 17021878 16713428 16411810 16151769 15999558 15799308 15600974 15380168 15077670 14861891
3769 14861891 14605423 14459796 14290876 14202731 14111732 14114341 14136667 14263719 14338366 14335106 14359462
3758 14359462 14391403 14428857 14467771 14535527 14638142 14580294 14470973 14337006 14371612 14442513 14576304
3747 14576304 14885422 15256247 15699673 16270328 16907303 17733986 18671308 19825974 21085475
3738 21085475 22422619 23993212 25830092 28284002 31427195 35505789 40836205 48095116
3730 48095116 56855845 64514416 65629142 60997316 53878905 44213776 36468690 30763636
3722 30763636 26585490 23354067 20963312 19017151 17586831 16456065 15570031 14766954
3714 14766954 14178816 13611805 13123029 12600357 12169765 11702105 11315105 10934880 10665133
3705A0665133k56926k69377k72262k73067k88676k20762k18413j20125j08245
3696H637280j77752j42824p3981j05054p7894n9276j2584n4690K4205N0379J7708
3685H025517O5126L4498n758J2643L6939o2861r5387m8405q7338j33668j10617
3674G630689j21785r6671j08730j54304j49864j81952k44193j21537j75212j36004
3664F140437p7383k4398p7753j26836j16516j19718j32685q2969j85700r1681
3654E104798l9435p4181M012K6920p4633j9653j6667L4453M6171M0459j6824k452
3642E012968l4347O0658M2277K0112M9574R2831J08854J42805R0840O5437O9288
3631E721297L6743K5795J46935J34536K68568L27871M25852O09805P95864Q22960
$$ plain form
3705 10665133 10408207 10138830 9866568 9593501 9304825 9084063 8865650 8745525 8637280
3696 8637280 8459528 8316704 8242723 8137669 8059775 8000499 7987915 7933225 7957430 8007809 8025517
3685 8025517 8090643 8125141 8119383 8132026 8168965 8106104 8010717 7962312 7874974 7741306 7630689
3674 7630689 7508904 7412233 7303503 7149199 6999335 6817383 6573190 6451653 6276441 6140437
3664 6140437 6063054 6038656 5960903 5834067 5717551 5597833 5465148 5382179 5196479 5104798
3654 5104798 5065363 4991182 4995194 5022114 4947481 4927828 4911161 4945614 4991785 5032244 5015420 5012968
3642 5012968 4978621 5039279 5081556 5101668 5151242 5244073 5352927 5495732 5586572 5652009 5721297
3631 5721297 5758040 5783835 5930770 6065306 6333874 6661745 7087597 7697402 8493266 9316226
3621I316226O43317K1373l12627o13116p58748q19078p34361o67558n77277m22846
3611E075305l40795l37106k23479j43037j40392j19897j65579j06711J244j01221
3601C398332p3220n3057r872p1445n3265K1932j3832o9616J1185o0964k9786p4990
3589B921402l4624o8413o2420l8103j5271m0418n2357k1130Q421j3246n2190k3009
3577B508642k2043p2902K7505M1841n8814k0617n1173o6016p7176p8056K9014
3566B160205m2569k9569p801l6962j7193j1109K3362K6119o9956K0374J2878n0277
3554A977502K4079n3600p2317j4659O2214q791l7567j1748M5153k5287O0046M3429
3542A988454L8955N2410j7271J08397J40860R4053P1785O1261J09339J00305J37562
$$ plain form
3621 9316226 9959543 9980916 9668289 9055173 8296425 7477347 6742986 6075428 5498151 5075305
3611 5075305 4734510 4397404 4173925 4030888 3890496 3770599 3605020 3498309 3499553 3398332
3601 3398332 3325112 3272055 3262183 3190738 3137473 3159405 3145573 3075957 3087142 3026178 2996392 2921402
3589 2921402 2886778 2818365 2755945 2717842 2702571 2662153 2609796 2588666 2597087 2583841 2531651 2508642
3577 2508642 2486599 2413697 2441202 2483043 2424229 2403612 2352439 2286423 2209247 2131191 2160205
3566 2160205 2117636 2088067 2080266 2043304 2026111 2015002 2038364 2064483 1994527 2014901 2027779 1977502
3554 1977502 2001581 1947981 1875664 1861005 1923219 1914428 1876861 1865113 1910266 1884979 1945025 1988454
3542 1988454 2027409 2079819 2062548 2170945 2311805 2405858 2477643 2538904 2648243 2748548 2886110
3531B886110J58728K04237L07161L41742K32163L1279k02495k99715m06628l07591
3521B944991k56715j44614j29350o9598m8437q1725p7734q1000m2942j7220l2344
3510A963312m1144J5540l977p0202o4267l179L7883L0115k0181k3358P6367k2386
3498A874523N2549M7896j8196K2876k9213l4777M5551J2829Q4815K7490O2529
3487B148872O8380J4859J01871N9547l2317N5234n6040k6364K114O01Q1561K0638
3475B438956J2032R1599R3823J07987K0040K1454K8106m058J7850L3352J5673
3464B876814J9568P9387K7670j779M9979Q2524P9016L6145N1627L5840N1306K9465
3452C417562J02405J12986R2054J26008J20466J25729J68381J43641K11248J22837
$$ plain form
3531 2886110 3044838 3249075 3556236 3897978 4130141 4161420 3958925 3659210 3252582 2944991
3521 2944991 2688276 2543662 2414312 2344714 2296277 2214552 2136818 2055818 2012876 1995656 1963312
3510 1963312 1922168 1937708 1933731 1863529 1799262 1796083 1833966 1864081 1843900 1820542 1896909 1874523
3498 1874523 1927072 1974968 1956772 1979648 1950435 1915658 1961209 1974038 2058853 2086343 2148872
3487 2148872 2217252 2232111 2333982 2393529 2361212 2416446 2360406 2334042 2336156 2336757 2418318 2438956
3475 2438956 2450988 2542587 2636410 2744397 2764437 2785891 2813997 2809939 2827789 2861141 2876814
3464 2876814 2896382 2975769 3003439 3001660 3051639 3134163 3213179 3249324 3300951 3336791 3388097 3417562
3452 3417562 3519967 3632953 3725007 3851015 3971481 4097210 4265591 4409232 4620480 4743317
3442D743317J63361J99877K07733K34007J96764K30206K48800K96439L83204M04210
3432G307918L78635M70381N61347O04791P39387Q35821R02392J006250J102197
3423A3909119J309523J447630J719123J988070K298469K818040L352877L957579
3415C2800430M614983N111368M399700J570174j920307m014062n556906n859639
3407C1145741m867157l800598k949957k324274j801299j470021j139432r54277
3399A1838726p61160o69680n96120n52265m26245m13753l82625l29207k61871
3390G445800l20332k44745k67169k15517k14300j67977j42221n8421l3242l0921
3380E750955m5696n0960k9806n2730j04105q2948q0311k3364n3638o7969j85405
$$ plain form
3442 4743317 4906678 5106555 5314288 5548295 5745059 5975265 6224065 6520504 6903708 7307918
3432 7307918 7686553 8156934 8718281 9323072 10062459 10898280 11800672 12806922 13909119
3423 13909119 15218642 16666272 18385395 20373465 22671934 25489974 28842851 32800430
3415 32800430 37415413 42526781 46926481 48496655 46576348 42562286 37005380 31145741
3407 31145741 26278584 22477986 19528029 17203755 15402456 13932435 12793003 11838726
3399 11838726 11077566 10407886 9811766 9259501 8833256 8419503 8036878 7707671 7445800
3390 7445800 7125468 6880723 6613554 6398037 6183737 6015760 5873539 5815118 5781876 5750955
3380 5750955 5705259 5654299 5624493 5571763 5467658 5384710 5304399 5281035 5227397 5159428 4974023
3369D974023j30868j46492j33804j51256k16211j63986j53157r3764j39268j65706
3359C479511j12401r6401r5549q3572m7981l8967p1938j07979j0391j2794J2065
3348B813603n1215k8651q2314j9831j7657R973J6638J14447J9568M1180R544Q57
3336B826142M7717l447J6794m6032n0946R415k1129n7311P46o2015k7673p0586
3324B561675m5372n7613N124K8553j035q046K9080N8764M3660o8369q7579l2200
3312B426642m0334k8034n8983m1284m5628M041m1794o2156k5197o1465k6068r828
3300A989912q825o018Q0132O431J0918K7804Jl7729j3884L2596l4938l6192K3172
3287B033380q2383l0918K6945K9940O62K8172l7984o3611M400J9435r256k5686
$$ plain form
3369 4974023 4843155 4696663 4562859 4411603 4195392 4031406 3878249 3784485 3645217 3479511
3359 3479511 3367110 3270709 3175160 3091588 3043607 3004640 2932702 2824723 2814332 2801538 2813603
3348 2813603 2762388 2733737 2651423 2631592 2613935 2623908 2640546 2754993 2774561 2815741 2825285 2826142
3336 2826142 2873859 2870412 2887206 2841174 2790228 2799643 2778514 2721203 2721949 2659934 2632261 2561675
3324 2561675 2516303 2458690 2463814 2492367 2491332 2483286 2512366 2571130 2614790 2546421 2458842 2426642
3312 2426642 2386308 2358274 2299291 2258007 2212379 2216420 2174626 2112470 2087273 2025808 1999740 1989912
3300 1989912 1981087 1975069 2055201 2061632 2072550 2100354 2100355 2062626 2048742 2081338 2046400 2010208 2033380
3287 2033380 1950997 1920079 1947024 1976964 1977626 2005798 1967814 1904203 1908603 1928038 1918782 1893096
3275A893096j773J6895m0091o116J385M6353O0458k8844J9786K5565Q5486O4788
3263B136988k5200M3117p071Q577J3225l577J1197N2535P998J32817J00823P3078
3251B544507P1646N0469j0356K266L304P8360N2703P1418J3937J45645J58889
3240C182788J17198K00216J81343J55344J41269J43474L12913K71663K39898M3382
3230D989488j91731k57383l26055l43175k69071j63616j83876q1246p8749m4868
3220C049718m2376n4323J0516l7523n8004K6126k1609p800q3426j9274j7749n3854
3208B690422L7811J0434J0267k789n6198m339p860K8926O7679Q9475R8173R2065
3196C054066Q7433Q7617O369k1778k1912l9646n2632n6040l1037L1199m2581l4273
$$ plain form
3275 1893096 1891323 1908218 1868127 1862011 1863396 1909749 1970207 1941363 1961149 1986714 2072200 2136988
3263 2136988 2111788 2154905 2147834 2156411 2169636 2166059 2177256 2229791 2237789 2370606 2471429 2544507
3251 2544507 2616153 2666622 2656266 2658532 2661836 2740196 2792899 2864317 2878254 3023899 3182788
3240 3182788 3299986 3500202 3681545 3836889 3978158 4121632 4434545 4706208 4946106 4989488
3230 4989488 4797757 4540374 4214319 3871144 3602073 3438457 3254581 3173335 3094586 3049718
3220 3049718 3007342 2953019 2963535 2926012 2868008 2894134 2872525 2864725 2781299 2762025 2744276 2690422
3208 2690422 2728233 2738667 2748934 2746145 2689947 2685608 2677748 2706674 2774353 2863828 2962001 3054066
3196 3054066 3141499 3229116 3235485 3213707 3191795 3152149 3099517 3043477 3012440 3043639 3001058 2966785
3184B966785K9k8042Q4102O1032M9104O5772n8317j7942O584L1163K9324K7489
3172C217083L4138L5916Q5714J23647M6518N7338M4284Q0551P0718N8536P9612
3161C934055J00490J08033J09094M5698O4897Q5496K2572L6711Q8253N8904O2694
3150D716897Q51N1367J12213L2051N6018O9325J54907J18513J26099J32565O7379
3139E638185J28245J43073J83428J61088J09423J66459J50786J43630K06934J98202
3129G229453K53433K39674K46410K86920K58951K27587L27495L11858K92367M24256
3119A0098404K81459K31566K46115K44838K84823K63475K58152L12407L24631
3110A2545870L32737L60952M29849M77127M22029M12183L68019N32905N22874
$$ plain form
3184 2966785 2966814 2938772 3022874 3083906 3133010 3198782 3140465 3122523 3129107 3160270 3189594 3217083
3172 3217083 3251221 3287137 3372851 3496498 3543016 3600354 3644638 3725189 3795907 3854443 3934055
3161 3934055 4034545 4142578 4251672 4297370 4362267 4447763 4470335 4507046 4595299 4654203 4716897
3150 4716897 4717748 4769115 4881328 4913379 4969397 5038722 5193629 5312142 5438241 5570806 5638185
3139 5638185 5766430 5909503 6092931 6254019 6363442 6529901 6680687 6824317 7031251 7229453
3129 7229453 7482886 7722560 7968970 8255890 8514841 8742428 9069923 9381781 9674148 10098404
3119 10098404 10379863 10611429 10857544 11102382 11387205 11650680 11908832 12221239 12545870
3110 12545870 12878607 13239559 13669408 14146535 14568564 14980747 15348766 15881671 16404545
3101A6404545N15783N54547O00635P35624Q77361R47828J072203J156373J306062
3092B4170961J351725J492508J701298J777523J942052K066799K050318J719705
3084C8272889J149206P38957O66374O01122Q82486J454148J924173K352381K534620
3075E0576356K588249K605577K834057L326134L842369M143172L847624K556548
3067G6320086P30947r27771j973193k160869j841940j224852n25198K22744R62920
3058F9582874J279934N62261j022437k941654m433591n183010n334927m797772
3050D7711678l995925l180523k482272j990521j442239j168543q37789m99706
3042C2114160j50730J44986L42024O50276R87598J229101J691553K124619K778635
$$ plain form
3101 16404545 16920328 17474875 18075510 18811134 19688495 20636323 21708526 22864899 24170961
3092 24170961 25522686 27015194 28716492 30494015 32436067 34502866 36553184 38272889
3084 38272889 39422095 40161052 40827426 41428548 42311034 43765182 45689355 48041736 50576356
3075 50576356 53164605 55770182 58604239 61930373 65772742 69915914 73763538 76320086
3067 76320086 77051033 76123262 74150069 71989200 70147260 68922408 68397210 68619954 69582874
3058 69582874 70862808 71425069 70402632 67460978 63027387 57844377 52509450 47711678
3050 47711678 43715753 40535230 38052958 36062437 34620198 33451655 32613866 32114160
3042 32114160 31963430 32108416 32450440 33100716 34088314 35317415 37008968 39133587 41912222
3033D1912222L661789M234002M583473M286933L668106K007614q05117k576153
3025F0972869m236084n412212n228120m781472m075822l216178k600854k074267
3017B9347860j678994j280581r40533o98797m23349k53566o2646K59131M44495
3008B4713020P24851J019489J395049J887882K416319K926133L170685K704171
3000D0957599J708430J82142j774699l146643l649369l789881l525210k830943
2992B4131426k242695j865676j525462j270517j050799q02613o54427n31964m37112
2983A3750161l38323k36332k49253j25515J8844J07784J98687K90295M58928O38817
2973A4514093O25315M86277O00o18214q27613j048766j106892r61355q27295o68249
$$ plain form
3033 41912222 45574011 49808013 54391486 58678419 62346525 64354139 63549022 60972869
3025 60972869 56736785 51324573 46096453 41314981 37239159 34022981 31422127 29347860
3017 29347860 27668866 26388285 25447752 24748955 24325606 24072040 24009394 24268525 24713020
3008 24713020 25437871 26457360 27852409 29740291 32156610 35082743 38253428 40957599
3000 40957599 42666029 42848171 41073472 37926829 34277460 30487579 26962369 24131426
2992 24131426 21888731 20023055 18497593 17227076 16176277 15373664 14719237 14187273 13750161
2983 13750161 13411838 13175506 12926253 12800738 12819582 12927366 13126053 13416348 13875276 14514093
2973 14514093 15139408 15625685 15626285 15008071 14180458 13131692 12024800 11063445 10236150 9567901
2963I567901n57563m41514l49353l27114k51558k49443k03951j82613j32869j29445
2953F742478j44922j91099j11410j96846j76715n0015j37687j09952q9606j40120
2943E394106j21545n6664m0449j19042j12224j35178j02003p4911q4133j14672
2933D433285o5619n8592m7137j6041m384j9828J5482j5080j4718O247l0292J4813
2921D198136j8953j08409p5405K9947o3582j29289r3724r4127j41962q3691p1748
2910C347193o8062l9795k8110j9610k8015l1743n0619l5028j1246q838q650R421
2898C026898k4244q875P7618K609o726N3707J4051J2564K0738L7521n0771q9691
2886C065399j16358j14521n3897p352k290m7875o1764l4131j5740m1385l0634
$$ plain form
2963 9567901 9010338 8568824 8219471 7892357 7640799 7391356 7187405 7004792 6871923 6742478
2953 6742478 6597556 6406457 6295047 6098201 5921486 5871471 5733784 5623832 5534226 5394106
2943 5394106 5272561 5215897 5175448 5056406 4944182 4809004 4707001 4632090 4547957 4433285
2933 4433285 4367666 4309074 4261937 4245896 4241512 4221684 4237166 4222086 4207368 4213615 4183323 4198136
2921 4198136 4179183 4070774 3995369 4025316 3961734 3832445 3738721 3644594 3502632 3418941 3347193
2910 3347193 3279131 3239336 3211226 3191616 3163601 3131858 3081239 3046211 3034965 3026127 3017477 3026898
2898 3026898 3002654 2993779 3071397 3074006 3067280 3120987 3135038 3147602 3168340 3205861 3155090 3065399
2886 3065399 2949041 2834520 2780623 2773271 2770981 2723106 2661342 2627211 2611471 2570086 2539452
2875B539452R503K1947M9168m7139O2933N9293K4231R3459K4800N7445P5031p704
2863B962419r307k7130P1j6969j57297r2921n448o9359k8777n8969l7252R4l0385
2850B428770m4462l5549m8773n3152n9660j6131p9894p6167K5055m5660k022k4301
2838A968054k0753L2669L1367J1057P073L8757k4614o5445J1926l5333j5854j6042
2826A922862l0762R314n2708m0385k4501m6572m4285n1830n101K3048J685J0519
2814A671284k7693p3943r604j5632M1428k812q0192J4242p306j8421k6714r428
2802A455209J2480j7966K557q712L7489k7007o4056k5463j7116j3736N534L8399
2790A377612M6161o6834K3124l8344k20Q166J3818j8427j7176K0090N0614M9641
$$ plain form
2875 2539452 2548955 2570902 2620070 2572931 2635864 2695157 2719388 2812847 2837647 2895092 2970123 2962419
2863 2962419 2953112 2925982 2926053 2909084 2751787 2658866 2653418 2584059 2555282 2496313 2459061 2459155 2428770
2850 2428770 2384308 2348759 2299986 2246834 2187174 2171043 2091149 2014982 2040037 1994377 1992355 1968054
2838 1968054 1947301 1979970 2011337 2022394 2029467 2068224 2043610 1978165 1990091 1954758 1938904 1922862
2826 1922862 1892100 1901414 1848706 1808321 1783820 1737248 1692963 1641133 1636032 1659080 1660765 1671284
2814 1671284 1643591 1569648 1560044 1544412 1585840 1583028 1502836 1517078 1509772 1491351 1464637 1455209
2802 1455209 1467689 1449723 1452280 1443568 1481057 1454050 1389994 1364531 1347415 1333679 1339213 1377612
2790 1377612 1423773 1356939 1380063 1341719 1341499 1349665 1363483 1345056 1327880 1347970 1398584 1448225
2778A448225l1968k7019J2445k6683m7056L6019L0715r149k5382k5174m1195L0495
2766A324273J1161j0304M5489M4555j7149q1184k1572j3282J2991m3790k597K8821
2754A277412L3517k968o453K6345k4914K6147N4461J01298K7621K283n364j8320
2742A491065k7921l0584k3949n4273o6093k0163j5468j437m1330k2211l276O276
2730A190636j3260n980J8437k4530k1631j8655o1194o6002j7043L5458Q0817p479
2718A089574o337N664P3133O9382m9829j9689l274j8970l1738p3600k3442l7918
2706I72956n8447l9522l4556J1707o7749J31M5826J332L9784J594n2196J0057
2694H30917J4804o1948N16J9500L7099j9831j4700K4688J3235K2043n9601l4818
$$ plain form
2778 1448225 1416257 1389238 1401683 1375000 1327944 1363963 1394678 1385529 1360147 1334973 1293778 1324273
2766 1324273 1335434 1325130 1370619 1415174 1398025 1316841 1295269 1281987 1294978 1251188 1248591 1277412
2754 1277412 1310929 1307961 1301508 1327853 1302939 1329086 1383547 1484845 1512466 1514749 1509385 1491065
2742 1491065 1463144 1432560 1408611 1354338 1288245 1268082 1252614 1251177 1209847 1187636 1184360 1190636
2730 1190636 1177376 1171396 1189833 1165303 1143672 1125017 1063823 997821 980778 1016236 1097053 1089574
2718 1089574 1083237 1088901 1162034 1231416 1181587 1161898 1158624 1139654 1107916 1034316 1010874 972956
2706 972956 914509 874987 840431 852138 784389 784520 830346 831678 871462 873056 820860 830917
2694 830917 845721 783773 784289 803789 840888 821057 806357 831045 844280 866323 806722 771904
2682G71904J2536K9289J0396N291J0345K259k5942r769n5121L1344K42k1126n5419
2669G06229J3093N6038j384k9602K5401K1190K8630L379O9678k7747k6287J4317
2657H52935k7570n4388M4813K7391l5872j5954l5194L1218J5358k4843P3207K9046
2645H80147n3782m8556k5559O8828k3306j0171r041j3489J1492K6361j0345J5640
2633H08219r766k6117p7603n4883J9567L5896O2778N2951J748l549O321P818j9298
2620H04082P437j3792N5634j4113m4604K8175j4057n7031k0760J2324K2062R90
2608G66347J7673m2997k4519r892q1893J6977N3853o918J3797J35409M9513L2841
2596I20191N9761K356P234o0064N9839l1726k7644N148J7113O2151p3883k070
$$ plain form
2682 771904 784440 813729 824125 829416 839761 842020 816078 806309 751188 782532 782774 761648 706229
2669 706229 719322 775360 773976 744374 769775 790965 819595 822974 892652 864905 838618 852935
2657 852935 825365 770977 815790 843181 807309 791355 756161 787379 802737 777894 851101 880147
2645 880147 826365 777809 752250 821078 797772 787601 778560 765071 776563 802924 792579 808219
2633 808219 798453 772336 694733 639850 659417 695313 758091 811042 812790 809241 815562 823380 804082
2620 804082 811519 797727 853361 839248 794644 822819 808762 751731 730971 743295 765357 766347
2608 766347 784020 741023 716504 706612 624719 641696 695549 688631 702428 837837 887350 920191
2596 920191 979952 982308 989542 929478 989317 957591 929947 935095 952208 1014359 940476 938406
2584I38406m1472o063K0485K438K2373k6872J797K7051j7996K8521m1005K4809
2572I32472J6684L839L6366N177K934N9639O30m2706J5245J6189M6055K3032o3892
2559A051664q899L579n0589O6730J0900J8077j1357k2770M9208l4624l0042K7442
2547A069319l5205o896M1190l6042o8690l6081K488k4075P987P1396j8572M4875
2535A011694j6920m7782K2081M2451m6164m9837L8466L2531k5436K592K7520K2988
2523A014184N2854m7646l4522m282j8817L328m2040K2898l8201j5689M4098K866
2511I39031k757k4728k1713Q6863N6636l1049j1124J3249m8897l1503m0211J4066
2499H97863J0075r769O939k470M7824m7602M3914R1020M990J0615k1698m2656
$$ plain form
2584 938406 896934 890871 911356 913794 936167 909295 911092 938143 920147 948668 907663 932472
2572 932472 949156 952995 989361 994538 997472 1057111 1057741 1015035 1030280 1046469 1092524 1115556 1051664
2559 1051664 1042765 1046344 995755 1062485 1073385 1091462 1080105 1057335 1106543 1071919 1041877 1069319
2547 1069319 1034114 1027218 1068408 1032366 963676 927595 930083 906008 913995 985391 966819 1011694
2535 1011694 994774 946992 969073 1011524 965360 915523 953989 986520 961084 963676 991196 1014184
2523 1014184 1067038 1019392 984870 980588 961771 965099 923059 945957 907756 892067 936165 939031
2511 939031 936274 911546 889833 976696 1033332 1002283 991159 1004408 955511 924008 883797 897863
2499 897863 907938 898169 905108 902638 950462 902860 946774 1037794 1042784 1053399 1031701 989045
2487I89045R251L1860K4835l8278j4032J6162K7942L385L621k0663n336L3967
2475A061759j4890j7716m059N3696K07r2511J2873K3800P094P5762O215M0714
2463A152944J2084R11N1810l8235k848m3821q2223K2856R946P3128R7564j5976
2451A238140l4881n2529Q70O1673l061j1362K2076m7910O128l903J9394M4793
2439A239428k2459j1268K5892M5342J5415K9L0642m4916k8792K1059J3488K0650
2427A304510J0303N78L6512K5521L8745M2249j3910n3992p1976K313N5874j7062
2415A359665K0926q001p1196k8547L6592L4802M4523J8333M7226p8032J0843K7810
2403A414944j2423L9984n459l8232O612L8591J2038j16K5171L3845n9941N3569
$$ plain form
2487 989045 998296 1030156 1054991 1016713 1002681 1018843 1046785 1050170 1053791 1033128 1027792 1061759
2475 1061759 1046869 1029153 1025094 1078790 1078997 986486 999359 1023159 1030253 1106015 1112230 1152944
2463 1152944 1165028 1165939 1217749 1179514 1176666 1132845 1050622 1073478 1083424 1156552 1254116 1238140
2451 1238140 1203259 1150730 1151600 1213273 1210212 1198850 1220926 1173016 1179144 1175241 1194635 1239428
2439 1239428 1216969 1205701 1231593 1276935 1292350 1292379 1323021 1278105 1249313 1270372 1283860 1304510
2427 1304510 1314813 1315391 1351903 1377424 1416169 1458418 1444508 1390516 1318540 1320853 1376727 1359665
2415 1359665 1380591 1372590 1301394 1272847 1309439 1344241 1388764 1407097 1454323 1376291 1387134 1414944
2403 1414944 1402521 1442505 1437046 1398814 1405426 1444017 1456055 1455939 1481110 1514955 1455014 1508583
2391A508583K6889J494O3946p6278k3604K6961j9177L9269J3144L7374N1722p5187
2379A575136L261k6059L9780Q9233o5608J8722R109J0612M1539P929k258M2905
2367A744301l101R954Q1784L2769K947k8191j6220N797l1236O122j4305J2714
2355A803335M4929K2199N6774O0187o212L5098L9199K586n2530j860N6091M4234
2343B104030Q595K2328J2864L4733J8772k165M5630N2688L9586q55k3902M2996
2331B355300l9295P8673L507J1584R8001J1579N7270J7248P505N2055j3480J3798
2319B653745M6418N6996P4077L6956L3021j4899k300L7159O0573M6110L4804K9384
2307C092044L6930M1551M4560P6300m0182M3380R6467J5547O7584M6010J0923
$$ plain form
2391 1508583 1535472 1536966 1600912 1524634 1501030 1527991 1508814 1548083 1561227 1598601 1650323 1575136
2379 1575136 1578397 1552338 1592118 1681351 1615743 1634465 1643574 1654186 1695725 1703654 1701396 1744301
2367 1744301 1741200 1751154 1832938 1865707 1868654 1840463 1824243 1830040 1798804 1804926 1790621 1803335
2355 1803335 1848264 1870463 1927237 1987424 1981212 2016310 2055509 2058095 2005565 2003705 2059796 2104030
2343 2104030 2112625 2134953 2147817 2182550 2201322 2199157 2244787 2297475 2337061 2336206 2312304 2355300
2331 2355300 2316005 2394678 2398185 2409769 2507770 2519349 2576619 2593867 2601372 2653427 2639947 2653745
2319 2653745 2700163 2757159 2831236 2868192 2901213 2886314 2884014 2921173 2981746 3027856 3062660 3092044
2307 3092044 3128974 3170525 3215085 3291385 3251203 3294583 3391050 3406597 3474181 3520191 3531114
2296C531114N4690N7974Q3568J35880K3789N8551Q0148K3454K9304N2679J10513
2285D241664K1875o875R7014N1081Q9961Q2584L3473O7887N7284J4193M0044J09320
2273D899505Q0544O4974R8642M9555K0873J05471J10932R8683P7031P1307P4265
2262E751782J02078J25268J00553J01100Q4101J19558J43542J35606J61563J45693
2252F970844J76584J61225J43743J40339J20142J73553J12504J40286J27809J51170
2242H418199J25386J44615K23164J65991J04617K27008K45541J65263J91678K42605
2232A0254067J92857K07431K06796K27229K91928K67827K01855J64158J96445
2223A2210593K20083K79641K87775K28501K26956L10006L48129L22020K86808
$$ plain form
2296 3531114 3585804 3643778 3727346 3863226 3887015 3945566 4025714 4049168 4078472 4131151 4241664
2285 4241664 4263539 4256664 4353678 4404759 4494720 4577304 4610777 4678664 4735948 4750141 4790185 4899505
2273 4899505 4980049 5045023 5143665 5193220 5214093 5319564 5430496 5529179 5606210 5677517 5751782
2262 5751782 5853860 5979128 6079681 6180781 6264882 6384440 6527982 6663588 6825151 6970844
2252 6970844 7147428 7308653 7452396 7592735 7712877 7886430 7998934 8139220 8267029 8418199
2242 8418199 8543585 8688200 8911364 9077355 9181972 9408980 9654521 9819784 10011462 10254067
2232 10254067 10446924 10654355 10861151 11088380 11380308 11648135 11849990 12014148 12210593
2223 12210593 12430676 12710317 12998092 13226593 13453549 13763555 14111684 14433704 14720512
2214A4720512K94397K95973L28442L52759L82169L92681L89765L85516M04929
2205A7947143M65879N08621N21256N55872N58500O52756P49034P41768Q68148
2196B3568977R22988R26275J043721J156946J278315J315160J490572J640150
2188C3343104J662434J839101J944885K095928K233514K340909K372419K405639
2180E0237933K350314K183472J717609J075098K74278o37640j559143k308691
2172E3333230k684834k878532k691047k376370k128148j899114j706417j527818
2164C5440950j238353j151694j092242r68664q97311q05291p54953o58084o65605
2155B7208753n82915m34194m85796m69887m41855l86043l79397m31144l78046
$$ plain form
2214 14720512 15014909 15310882 15639324 15992083 16374252 16766933 17156698 17542214 17947143
2205 17947143 18413022 18921643 19442899 19998771 20557271 21210027 21959061 22700829 23568977
2196 23568977 24491965 25418240 26461961 27618907 28897222 30212382 31702954 33343104
2188 33343104 35005538 36844639 38789524 40885452 43118966 45459875 47832294 50237933
2180 50237933 52588247 54771719 56489328 57564426 57838704 57201064 55641921 53333230
2172 53333230 50648396 47769864 45078817 42702447 40574299 38675185 36968768 35440950
2164 35440950 34202597 33050903 31958661 30989997 30092686 29287395 28532442 27874358 27208753
2155 27208753 26625838 26191644 25705848 25235961 24794106 24408063 24028666 23597522 23219476
2146B3219476l07091l19864k47434k69311l07644l79450m98090n26558n85753
2137A9778281n45738n46109n37981n07235m03197m72621m57390m09066m02205
2128A5496739l66397l17865l15709l14075k79210l05337k59298k44751k59005
2119A2835092j81726j40878j41322j85754j78666j07600o0615m1270k9361Q5267
2109A1853167J88514J42671j63646k85556l03211m64600m47817l76990l19002
2100I823530k03297k06900j61714j35548j22698j08729j78380j30858q3303r3112
2090H398991j42191q1697p3781r4737q1028p2065n7594n8936l0518m6382l9725
2079G620337o1681l4556M8300P1387O8130M8502o8407j27583j94370k06733k23257
$$ plain form
2146 23219476 22912385 22592521 22345087 22075776 21768132 21388682 20890592 20364034 19778281
2137 19778281 19232543 18686434 18148453 17641218 17238021 16765400 16308010 15898944 15496739
2128 15496739 15130342 14812477 14496768 14182693 13903483 13598146 13338848 13094097 12835092
2119 12835092 12653366 12512488 12371166 12185412 12006746 11899146 11838531 11797261 11767900 11853167
2109 11853167 12041681 12184352 12020706 11735150 11431939 10967339 10519522 10142532 9823530
2100 9823530 9620233 9413333 9251619 9116071 8993373 8884644 8706264 8575406 8492103 8398991
2090 8398991 8256800 8175103 8101322 8006585 7925557 7853492 7795898 7736962 7706444 7660062 7620337
2079 7620337 7558656 7524100 7572400 7643787 7711917 7760419 7692012 7564429 7370059 7163326 6940069
2068F940069j99642j83938j49194j42710r5113l3906m7296q7680m4968q0630j07433
2057E767559r9206o9931n8286r6191l4639m1810l3130k4066p2139k9541n9550
2046E149070j9634m8514n0843j9295l2247l3903m9555j6913m2445l4808j7735
2035D783178M365o8603l7697M516n4548l8308l8763k4436l7628m5557p310k954
2023D436255K0609k9686O791j7147o5089j1643m7176l5785j2825L2968k7444j8596
2011D231232o744n2833l932J1024Q151J3485n7369O349M8911m7518n4201n1537
1999D045018k2374p8872n5189K8178j8794o0386q5245n5327k3810M625m3280m1938
1987C592606K049p9956m4994k6924k9314L352R568k2227M398M0909k9102k6762
$$ plain form
2068 6940069 6740427 6556489 6407295 6264585 6169472 6135566 6088270 6000590 5955622 5874992 5767559
2057 5767559 5668353 5598422 5540136 5443945 5409306 5367496 5334366 5310300 5238161 5208620 5149070
2046 5149070 5129436 5080922 5030079 5010784 4978537 4944634 4895079 4878166 4835721 4800913 4783178
2035 4783178 4787543 4718940 4681243 4685759 4631211 4592903 4554140 4529704 4492076 4446519 4439209 4436255
2023 4436255 4456864 4427178 4433969 4416822 4351733 4340090 4292914 4257129 4244304 4277272 4249828 4231232
2011 4231232 4224488 4171655 4167723 4178747 4186898 4200383 4143014 4149363 4198274 4150756 4096555 4045018
1999 4045018 4022644 3943772 3888583 3916761 3897967 3837581 3752336 3697009 3673199 3677824 3634544 3592606
1987 3592606 3594655 3514699 3469705 3442781 3413467 3416819 3426387 3404160 3408558 3449467 3420365 3393603
1975C393603j1611o2879n2270L1652K0535n6613j4850j6859l0571n0833m9648
1964C099656J3774q681p027l0000k9575K175q2328j0113n5741j3359k7565J6140
1952B867356k408l7630N327l6508L4092j1494L3384j3309p7989O4974O4243L3369
1940B923407L790L4961K5298J5231N4378O0145J09496J37443L8629M0860J06723
1929C550361J07976M8344P7655K3900L1338K5577L1251j5544k2681k6519m8714
1918C782944K5433K2539L887N1097J4308l9390K6023k6046j2755L3128j2869q763
1906C859536M3352N5296m1144L6735P9330N9490Q8330J13020J22949J93939J73070
1895D783903J56794J89694K41881K21122K15447K94759K59560J71811O3956N2447
$$ plain form
1975 3393603 3381992 3319113 3266843 3298495 3319030 3262417 3247567 3230708 3200137 3149304 3099656
1964 3099656 3113430 3104749 3097722 3067722 3038147 3040322 2957994 2947881 2892140 2878781 2851216 2867356
1952 2867356 2864948 2827318 2832645 2796137 2830229 2818735 2852119 2838810 2760821 2825795 2890038 2923407
1940 2923407 2927197 2962158 2987456 3002687 3057065 3117210 3226706 3364149 3402778 3443638 3550361
1929 3550361 3658337 3706681 3784336 3808236 3839574 3865151 3896402 3880858 3858177 3831658 3782944
1918 3782944 3808377 3830916 3834803 3885900 3900208 3860818 3886841 3860795 3848040 3881168 3868299 3859536
1906 3859536 3902888 3958184 3917040 3953775 4033105 4092595 4180925 4293945 4416894 4610833 4783903
1895 4783903 4940697 5130391 5372272 5593394 5808841 6103600 6363160 6534971 6598927 6651374
1885F651374q8506j43145j89474j64631p3419j3584p565R0582N3528P5768k9927
1874F161001k9037K3760o2115j14327j31949j44589l2142o471o821N3264J22839
1863E833413Q9307J17473J82701J58622J24151J63357J98160K24848K35116K53391
1853G580539L20600L08057L39028L05298K15796K43717J38667J42411J62850J53598
1843I910561J52518J54470J43207J40271J34361P7939Q9650L3871j1696M4651
1833A0869803J4647J4106M7603P7892R0372J26162J72640K11876K59833L22683
1823A2207617M09306M42752M45595M42470N36561N35874O00737O36610O07834
1814A6865356O24048N56122M73248L62209J71074q2139l54851o29207o86740o52966
$$ plain form
1885 6651374 6562868 6419723 6230249 6065618 5992199 5978615 5971050 6061632 6115160 6190928 6161001
1874 6161001 6131964 6155724 6093609 5979282 5847333 5702744 5670602 5664131 5657310 5710574 5833413
1863 5833413 5922720 6040193 6222894 6381516 6505667 6669024 6867184 7092032 7327148 7580539
1853 7580539 7901139 8209196 8548224 8853522 9069318 9313035 9451702 9594113 9756963 9910561
1843 9910561 10063079 10217549 10360756 10501027 10635388 10713327 10802977 10836848 10825152 10869803
1833 10869803 10884450 10898556 10946159 11024051 11114423 11240585 11413225 11625101 11884934 12207617
1823 12207617 12616923 13059675 13505270 13947740 14484301 15020175 15620912 16257522 16865356
1814 16865356 17489404 18045526 18518774 18880983 19052057 18969918 18615067 17985860 17299120 16646154
1804A6646154m97130l70410k34112j14122p4124M2234J16739J67823K68054K67447
1794A6218553L03637M23672L54291M18521L73679L74948M04557L52319L01831
1785A9526008K37870K5117m6777j95000k99305l08116m43982l84582m44990n34819
1775A7131424n95823o84970n91504n41985l94207l44382k29813p2439q0005j01945
1765A3494351l6246M7887O9096M0376j7606l7281r0936j47543k27066l07390l11501
1754A2476141l71963m45040n45502n98765n87737m86719m56411m72440l88655
1745H122909m15086l70238k85948k75247k62433k82238j91740j85012j84284j56135
1735E514548j77038r0430j11514j34821q6671j41764j04343j56578j28333j85430
$$ plain form
1804 16646154 16149024 15778614 15544502 15430380 15356256 15398490 15515229 15683052 15951106 16218553
1794 16218553 16522190 16945862 17300153 17718674 18092353 18467301 18871858 19224177 19526008
1785 19526008 19763878 19788995 19742218 19547218 19247913 18939797 18495815 18111233 17666243 17131424
1775 17131424 16535601 15850631 15259127 14717142 14322935 13978553 13748740 13676301 13596296 13494351
1765 13494351 13458105 13505992 13575088 13615464 13597858 13560577 13469641 13322098 13095032 12787642 12476141
1754 12476141 12104178 11659138 11113636 10514871 9927134 9440415 8984004 8511564 8122909
1745 8122909 7707823 7337585 7051637 6776390 6513957 6231719 6039979 5854967 5670683 5514548
1735 5514548 5337510 5247080 5135566 5000745 4914074 4772310 4667967 4511389 4383056 4197626
1725D197626j13573j15146j25596j34870r3379j31973j52749r7018j57289p4888
1715C001145j07491p8799j15223n5525r3096j17949l1853p6245o5574p4403q1885
1704B103102j7169k4603n538r8314o5290J455l3233n6237o4127r815j9546n1319
1692A659366K7607o2048l7405n7359m7535K4205n4496n8632q0196p0895n2585
1681A190027l711o3485m7039k254k9558p6294j9230k9698k3594n0727n3801j4697
1669G75939j3475P576m0118m0018r476J5865j7963J3575k4175j6553j9312n1198
1657E80667o5182j7187J7992m6897n6429Q434n4299N811M625k4004k9911J8956
1645C42576k8581k7914p995j9293k5172J5532n5280k1053r118m5242j4668M764
$$ plain form
1725 4197626 4084053 3968907 3843311 3708441 3615062 3483089 3330340 3233322 3076033 3001145
1715 3001145 2893654 2814855 2699632 2644107 2551011 2433062 2401209 2324964 2259390 2184987 2103102
1704 2103102 2085933 2061330 2055792 1957478 1892188 1893643 1860410 1804173 1740046 1730231 1710685 1659366
1692 1659366 1686973 1624925 1587520 1530161 1482626 1506831 1452335 1393703 1313507 1242612 1190027
1681 1190027 1186316 1122831 1075792 1073538 1043980 967686 948456 918758 895164 844437 790636 775939
1669 775939 762464 770040 729922 689904 680428 696293 678330 691905 667730 651177 631865 580667
1657 580667 515485 498298 516290 469393 412964 421398 367099 372910 377535 353531 323620 342576
1645 342576 313995 286081 278086 258793 233621 249153 193873 172820 163702 118460 103792 108556
1633A08556j3781K3779n771o993m8879J4444l4786j3271L0279m5782N324P167
1621B0286q5125J122K3795L8087j4337k1036R502o3462M2676k4077Q562k2138
1609h6145J5869K6591J1775p0282N3436K1872J2783l4074r43j1018l3541K7735
1597f5942M3938j4801j2189l0282J8358k3647M1200L260k6967K0650l2240K3553
1585e5109J049l1411j7401l9718K5902P1309n259m7197r037N165j0248O0715N338
1572d5902l2320k4398l3393O4656L2519k9388L9243L3388N0027k1592j0911L6385
1560E8314K0524n6900p899L963N3011K2085k1410L8573J9578O6461M202L6044
1548B36546L5131l585K9046q133n222J6105L0050Q337k3283j1719k4964K3237
$$ plain form
1633 108556 94775 118554 112783 105790 56911 71355 36569 23298 53577 7795 13119 20286
1621 20286 -64839 -63717 -39922 -1835 -16172 -37208 -27706 -91168 -48492 -72569 -64007 -86145
1609 -86145 -70276 -43685 -31910 -102192 -48756 -26884 -14101 -48175 -49118 -60136 -93677 -65942
1597 -65942 -22004 -36805 -48994 -79276 -60918 -84565 -43365 -40105 -67072 -46422 -78662 -55109
1585 -55109 -54060 -85471 -102872 -142590 -116688 -45379 -50638 -97835 -106872 -101707 -111955 -51240 -45902
1572 -45902 -78222 -102620 -136013 -71357 -38838 -68226 -28983 4405 54432 32840 21929 58314
1560 58314 78838 21938 14039 18002 71013 93098 71688 110261 129839 196300 200502 236546
1548 236546 271677 268092 297138 289005 283783 299888 329938 338275 314992 303273 278309 301546
1536C01546N9961L9954K0390K8405r105J0296R1312J8545m3799O2728J11845j4630
1524F77448n4203j9569N8672K5611l9927K048j1996J6394L3455m7000K1098M7695
1512G09726N9478K9309N4162J05986P419k4579j8829m6658k1829J755K7979p013
1500H76906k5105J0224m4923K4671L0573K582N8722K6555O5842Q6249O8679M1039
1488A222014K6700Q572l1954m9847q0707n4903m5169p0433q2324K962m1420k1839
1476G81652l7014m5413L6945m6926P2848N2327j275j3621j3070l6886j8654N0432
1464G81345L0020l0453o0095n5709o6139k228J9499k3439N5407L4250q679N0966
1452G24745K4580K8067J9780K9784o1115p7976m2294j9872j5917j00236n4320
$$ plain form
1536 301546 361507 401461 421851 450256 441151 451447 542759 561304 517505 580233 692078 677448
1524 677448 623245 603676 662348 687959 648032 650080 638084 654478 687933 640933 662031 709726
1512 709726 769204 798513 852675 958661 966080 941501 922672 876014 854185 855940 883919 876906
1500 876906 851801 862025 817102 841773 872346 874928 933650 960205 1026047 1112296 1180975 1222014
1488 1222014 1248714 1257286 1225332 1175485 1094778 1039875 994706 924273 841949 844911 803491 781652
1476 781652 744638 699225 736170 689244 762092 814419 813144 799523 786453 749567 730913 781345
1464 781345 811365 780912 720817 665108 598969 596741 616240 592801 648208 682458 673779 724745
1452 724745 749325 777392 797172 826956 765841 687865 645571 625699 609782 509546 455226
1441D55226j25072r2503K789n6319J2129j6967n876l792o0063J8917J922l9756
1429I0635j1857m1533O1901j3883K3866j6059q1872J4120o6363Q990J7129n7884
1417g2810R257l1282m0172J5287O896K2754l2696j1472L3113K1950J5551o1370
1405a24994j5103o7966m1543o2813l0649M0012k2539m2281k8101N3716J9673l4616
1393c57204m3114L8318M7890m4172m3619N0459k3897m3688J4810J526l1191k7729
1381d61611l385N8904J2105o50l3418q340Q410L9003R076j7911K3835l71o286
1368c80639k7366m9341m81M5875J4173L7949p252k2296j7546k6204Q726Q040j6460
1355d32822M480M810J7705k294p8513k457m3604N4068J5577p2972M3580K9441
$$ plain form
1441 455226 330154 237651 240440 184121 196250 179283 173407 169615 109552 128469 130391 90635
1429 90635 78778 37245 99146 85263 109129 93070 11198 25318 -41045 -32055 -14926 -72810
1417 -72810 -63553 -94835 -135007 -119720 -112824 -90070 -122766 -134238 -101125 -79175 -63624 -124994
1405 -124994 -140097 -208063 -249606 -312419 -343068 -303056 -325595 -367876 -395977 -342261 -322588 -357204
1393 -357204 -400318 -362000 -314110 -358282 -401901 -351442 -375339 -419027 -404217 -402691 -433882 -461611
1381 -461611 -464996 -406092 -393987 -394637 -428055 -436395 -427985 -388982 -379906 -397817 -373982 -374353 -380639
1368 -380639 -408005 -457346 -457827 -411952 -397779 -359830 -367082 -389378 -406924 -433128 -424402 -416362 -432822
1355 -432822 -428342 -423532 -405827 -408121 -486634 -489091 -532695 -478627 -463050 -536022 -492442 -463001
1343d63001K1986l6421M215J3150j9787J437J1073Q907L5077p7015j5793m8259
1331e64431m066j8206m0895N1475L5618J9352L854o0360L921j8164l024N7789
1319e37137l2821K8939j7715N4041J6343j8414N618l0515N279o3416J1972N6880
1307e20946q439k0532K181j9834N80O062M2210J8242m2516m3658k1583N5828M4273
1294e08132l5459n2507k2033N7284K0431j1334Q824j4667K0306j3304M8185k1870
1282e24276o374o5481M475j156L7388m1834L8117P852k9962m6616J3749M1572
1270e72546L7832K5736n7041l9200j7749O2741K2101K4642L979J9878o9434L6196
1258e22865K5600j3905K9569k8477J0307K4020m604J1164l858J1919n0231L0603
$$ plain form
1343 -463001 -441015 -477436 -473221 -460071 -479858 -478421 -467348 -458441 -423364 -500379 -516172 -564431
1331 -564431 -568497 -586703 -627598 -576123 -540505 -521153 -517299 -577659 -573738 -591902 -594926 -537137
1319 -537137 -569958 -541019 -558734 -504693 -488350 -506764 -501146 -531661 -526382 -589798 -577826 -520946
1307 -520946 -529385 -549917 -547736 -567570 -566990 -560928 -518718 -500476 -542992 -586650 -608233 -552405 -508132
1294 -508132 -543591 -596098 -618131 -560847 -540416 -551750 -542926 -557593 -537287 -550591 -502406 -524276
1282 -524276 -530650 -596131 -591656 -592812 -555424 -597258 -559141 -551289 -581251 -627867 -614118 -572546
1270 -572546 -534714 -508978 -566019 -605219 -622968 -560227 -538126 -513484 -509505 -489627 -559061 -522865
1258 -522865 -497265 -511170 -481601 -510078 -499771 -475751 -480355 -469191 -473049 -461130 -511361 -480758
1246d80758K1356k6649L0008k9454k0569K9523K9648N002k7385k4084l3338J7060
1234e09640J4173n7561L6839J7545m2390K4313j228K5564O4697O865l9556j5534
1222d75913L1847K9337o5039l6469m1088P744Q249L7380J7811l9512m375J3274
1210e16754L7258J6997m2806j5800M460j4414K5157l4695K9788N246k1844R7214
1198d30193r260P837j5575l8766j9096j5342N343l3493N0035L025k4887O0016
1186d60356l1272j750K9401P981K6650o9775K0134K8350k3971R704m3343n40O944
1173e01843j3136O1812L1464l4432J097o708K4567R612L9582r818k8804L8788
1161c87819p3199M4726J0743k5559J112o9140l905K1864N8310K3574k2354l7710
$$ plain form
1246 -480758 -459402 -486051 -456043 -485497 -506066 -476543 -446895 -441893 -469278 -493362 -526700 -509640
1234 -509640 -495467 -553028 -516189 -498644 -541034 -516721 -517949 -492385 -427688 -420823 -460379 -475913
1222 -475913 -444066 -414729 -479768 -516237 -557325 -549581 -541332 -503952 -486141 -525653 -530028 -516754
1210 -516754 -479496 -462499 -505305 -521105 -516645 -531059 -505902 -540597 -510809 -505563 -527407 -430193
1198 -430193 -439453 -431616 -447191 -485957 -505053 -520395 -515052 -548545 -498510 -495485 -520372 -460356
1186 -460356 -491628 -493378 -463977 -455996 -429346 -499121 -478987 -450637 -474608 -464904 -508247 -508787 -501843
1173 -501843 -514979 -453167 -421703 -456135 -455038 -461746 -437179 -427567 -387985 -397803 -426607 -387819
1161 -387819 -461018 -416292 -405549 -431108 -429996 -499136 -503041 -481177 -422867 -399293 -421647 -459357
1149d59357o9937M377O7233n232J9950j8755p225n948M6395N8204k9703j9423
1137d19421n7584J6828N7548m131m4717K0536J5217n4890N3393P6690K2999J3059
1125c04473n0700j00757l4459M2551m858J765K7285Q858N36m5759J121Q9754k8375
1112c97511m8894K3317L9789k2161J0408n9868n841Q5382k6949N8792j9453o4108
1100d27097L0486l3397M8747N356O619Q750j3859n4004l4978J6624O7351k5119
1088d04521K1803j0566m7056N2478j2967P6395o633l2487J4632O0656k8128m1803
1076c58197M1385n558j8321R1224M5911k8578j8102j6929N7344o2081J5522L1026
1064b25354J2758L3685O040k764k6350k1201n7607k9283M7991l795L4236N4738
$$ plain form
1149 -459357 -529294 -524917 -457684 -462916 -442966 -461721 -468946 -474894 -428499 -370295 -399998 -419421
1137 -419421 -477005 -460177 -402629 -406760 -451477 -430941 -415724 -470614 -417221 -340531 -317532 -304473
1125 -304473 -355173 -455930 -490389 -447838 -452696 -450931 -423646 -414788 -414252 -460011 -458890 -369136 -397511
1112 -397511 -446405 -423088 -383299 -405460 -395052 -454920 -460761 -375379 -402328 -343536 -362989 -427097
1100 -427097 -396611 -430008 -381261 -375905 -369286 -360536 -374395 -428399 -463377 -446753 -379402 -404521
1088 -404521 -382718 -393284 -440340 -387862 -400829 -324434 -331067 -363554 -348922 -288266 -316394 -358197
1076 -358197 -316812 -322370 -340691 -249467 -203556 -232134 -250236 -267165 -209821 -271902 -256380 -225354
1064 -225354 -212596 -178911 -172871 -175635 -201985 -223186 -280793 -310076 -262085 -265880 -231644 -176906
1052a76906k2468M965m1984j1315K8082l857O364l1635N2339P321O4249M2148
1040h2697l2738k622m525J2381N8502k2711Q78O1891l2999K515L3101O4586J3804
1027F9366k833M0482l0336k0946M0104n797L5401l7621p429L7617O3457L1019
1015B12484m402J2127J9395l0220m5436L5470P5698q226N5785M9071k7014L2900
1003C77632O3097j5907K4448M5101O8108Q5081N6684O1783k4799O412N2592N9963
991H60195Q1874P2912O3137R1245P5675R3067Q7827J16582J20284J25005K32875
980B020678K42936K47891J79230K02886J66188J75730L16850L91650M69120N13111
970D926270N43547Q33058J008591J382099J707069K405726L438648L823386R43550
$$ plain form
1052 -176906 -199374 -194409 -236393 -247708 -219626 -223483 -217119 -248754 -196415 -189094 -124845 -82697
1040 -82697 -115435 -118057 -122582 -110201 -51699 -74410 -73532 -11641 -44640 -42125 -9024 55562 69366
1027 69366 66533 107015 76679 55733 95837 90040 125441 87820 80391 118008 181465 212484
1015 212484 208082 220209 239604 209384 163948 199418 275116 266890 322675 371746 344732 377632
1003 377632 440729 424822 449270 494371 562479 647560 704244 766027 741228 747640 800232 860195
991 860195 942069 1014981 1078118 1169363 1245038 1338105 1425932 1542514 1662798 1787803 2020678
980 2020678 2263614 2511505 2690735 2893621 3059809 3235539 3552389 3944039 4413159 4926270
970 4926270 5469817 6302875 7311466 8693565 10400634 12806360 16245008 20068394 21011944
961B1011944k525350m382635l798590k240656j639203j074938r18326o10318m99223
952C322705m03459l56070k04928j75882j18190m7218j19801j71814j43712k00535
942A381096r9864j55243q7797n1602j19395j01783m2131k8290k456o6502m8053
931E77980r1924M63k6413p4179k7485k6783n183M9326o8870l4459k5511j6080
919B30882J501k6819N202j2369n8505m6213l6274L7625j141j9226m5738m7362
907a8437n380K8332k9082k8675N4266M0995j9182n938j6994M96J8739k6007N290
894a577L051l3887l7051j0342O3154J0776o9930L0782Q102j7040o5064R101K5645
881h4280K1443L5453j7091o8296m540l4729J9152J0823m1558j7791K5009O2018
$$ plain form
961 21011944 18486594 14103959 10305369 8064713 6425510 5350572 4432246 3821928 3322705
952 3322705 2919246 2563176 2358248 2182366 2064176 2016958 1897157 1725343 1581631 1381096
942 1381096 1281232 1125989 1038192 986590 867195 765412 723281 694991 692535 626033 577980
931 577980 486056 486519 460106 385927 358442 331659 326476 375802 306932 272473 246962 230882
919 230882 232383 205564 210766 198397 139892 93679 57405 95030 93889 74663 28925 -18437
907 -18437 -23817 4515 -24567 -53242 1024 42019 22837 16899 -95 401 19140 -6867 -1577
894 -1577 1474 -32413 -69464 -79806 -16652 -5876 -75806 -45024 -36922 -53962 -119026 -109925 -84280
881 -84280 -62837 -27384 -44475 -112771 -117311 -152040 -132888 -122065 -163623 -181414 -156405 -94387
869i4387m194k1891R813m6029j5722n348Q3346j1156n1648O2271k7930J7456K9975
856g5444k2638M42k6205k4884j2569o841j2692l6202J7835n316K977K5016O527
843a69994j2993l3930K2880m0067O800J4991j0300O2306l4070j2657o504J1104
831b02434j5422J6345R348l8473p939L7764l8761J4489N3716n5946J1261l7678
819b53730J3O5044k9813O56k2273m3445P2303j599k7140n450J1561R896r1951
$$ plain form
869 -94387 -98581 -120472 -110659 -156688 -172410 -177758 -94412 -105568 -157216 -94945 -122875 -105419 -75444
856 -75444 -98082 -97640 -123845 -148729 -161298 -168139 -180831 -217033 -199198 -204514 -201537 -176521 -169994
843 -169994 -182987 -216917 -194037 -234104 -227304 -212313 -222613 -160307 -194377 -207034 -213538 -202434
831 -202434 -217856 -201511 -192163 -230636 -238575 -200811 -239572 -225083 -171367 -227313 -216052 -253730
819 -253730 -253717 -188673 -218486 -217830 -240103 -283548 -211245 -212844 -239984 -245434 -233873 -223977 -315928
$$ [...]
##END NTUPLES=NMR SPECTRUM
##END=
