##TITLE=1H_EC-3238(1)
 CDCl3, 8 sc, 
 18.11.2020
##JCAMPDX= 6.0         $$ Bruker NMR JCAMP-DX V2.0
##DATA TYPE= NMR SPECTRUM
##DATA CLASS= NTUPLES
##ORIGIN= UXNMR, Bruker Analytische Messtechnik GmbH
##OWNER= root
$$ XWIN-NMR		Version 3.5
$$ Wed Nov 18 13:22:27 2020 Russian Standard Time (UT+4h)  she@DPX200
##.OBSERVE FREQUENCY= 200.1315066352
##.OBSERVE NUCLEUS= ^1H
##.ACQUISITION MODE= SIMULTANEOUS
##.ACQUISITION SCHEME= undefined
##.AVERAGES= 8
##.DIGITISER RES= 18
##SPECTROMETER/DATA SYSTEM= spect
##.PULSE SEQUENCE= zg30
##.SOLVENT NAME= CDCl3
##.SHIFT REFERENCE= (INTERNAL, CDCl3, 0, 15.9347)
##AUDIT TRAIL= $$ (NUMBER, WHEN, WHO, WHERE, WHAT)
$$ ##TITLE= Audit trail, XWIN-NMR		Version 3.5
$$ ##JCAMPDX= 5.01
$$ ##ORIGIN= Bruker BioSpin GmbH
$$ ##OWNER= she
$$ F:/spectra/data/she/nmr/H-F/1/pdata/1/auditp.txt
$$ ##AUDIT TRAIL=  $$ (NUMBER, WHEN, WHO, WHERE, WHAT)
(   1,<2020-11-18 13:20:45.43 +0400>,<she>,<DPX200>,
      <created by zg, POWCHK disabled, PULCHK disabled
       configuration hash MD5:
       00 E9 B6 7A A2 85 ED C7 34 08 36 98 17 FE 4E 26
       data hash MD5: 16K
       4F 39 7E E0 92 2B EA EE F1 82 5C F6 94 90 FA 01>)
(   2,<2020-11-18 13:20:48.73 +0400>,<she>,<DPX200>,
      <Start of raw data processing
       efp BC_mod = 2 LB = 0.24 FT_mod = 6 PKNL = 1 PHC0 = -11041.89 PHC1 = 5.4009 SI = 16K 
       data hash MD5: 16K
       06 5C 5E 9B 34 9A E1 31 C2 EB 9A 75 49 07 4E 83>)
(   3,<2020-11-18 13:21:10.35 +0400>,<she>,<DPX200>,
      <pk PHC0 = -5.507784 PHC1 = 4.8 
       data hash MD5: 16K
       E6 6B BD C6 27 76 A2 23 87 ED B6 2D 2A F6 F1 79>)
(   4,<2020-11-18 13:21:13.57 +0400>,<she>,<DPX200>,
      <abs ABSG = 5 
       data hash MD5: 16K
       BA 0F B8 67 57 E4 80 73 40 98 DB B5 EB F6 26 E7>)
(   5,<2020-11-18 13:21:33.53 +0400>,<she>,<DPX200>,
      <pk PHC0 = 5.845128 PHC1 = -7.399997 
       data hash MD5: 16K
       F2 F2 A8 75 B4 73 57 75 A1 19 98 3F 26 B5 3D A6>)
(   6,<2020-11-18 13:21:36.67 +0400>,<she>,<DPX200>,
      <abs ABSG = 5 
       data hash MD5: 16K
       DB 96 AE 53 21 B3 0F DC 44 50 E6 4E C5 2F C5 8A>)
$$ ##END=
$$ 
$$ hash MD5
$$ CF E7 EF 20 DC F9 94 20 A4 60 29 A9 5C 17 23 6B
##$RELAX= 
##$RELAX= 
##$RELAX= 
##$RELAX= 
##$RELAX= 
##$RELAX= 
$$ Bruker specific parameters
$$ --------------------------
##$DU= <F:/spectra>
##$EXPNO= 1
##$NAME= <H-F>
##$PROCNO= 1
##$TYPE= <nmr>
##$USER= <she>
##$AMP= (0..31)
100 100 100 100 100 100 100 100 100 100 100 100 100 100 100 100 100 100 
100 100 100 100 100 100 100 100 100 100 100 100 100 100 
##$AQSEQ= 0
##$AQ_mod= 1
##$AUNM= <au_zg>
##$AUTOPOS= <>
##$BF1= 200.13
##$BF2= 200.13
##$BF3= 200.13
##$BF4= 200.13
##$BF5= 200.13
##$BF6= 200.13
##$BF7= 200.13
##$BF8= 200.13
##$BYTORDA= 1
##$CFDGTYP= 0
##$CFRGTYP= 5
##$CHEMSTR= <none>
##$CNST= (0..31)
1 1 145 1 1 1 1 1 1 1 1 1 1 1 1 1 1 1 1 1 1 1 1 1 1 1 1 1 1 1 1 1 
##$CPDPRG= <>
##$CPDPRG1= <>
##$CPDPRG2= <>
##$CPDPRG3= <>
##$CPDPRG4= <mlev>
##$CPDPRG5= <mlev>
##$CPDPRG6= <mlev>
##$CPDPRG7= <mlev>
$$ [...]
##$SUBNAM3= <"">
##$SUBNAM4= <"">
##$SUBNAM5= <"">
##$SUBNAM6= <"">
##$SUBNAM7= <"">
##$SUBNAM8= <"">
##$SUBNAM9= <"">
##$SW= 16.9725356469052
##$SWIBOX= (0..15)
0 0 2 0 0 0 0 0 0 0 0 0 0 0 0 0 
##$SW_h= 3396.73913043478
##$TD= 16384
##$TD0= 1
##$TE= 0
##$TE2= 300
##$TE3= 300
##$TEG= 300
##$TL= (0..7)
0 120 120 120 120 120 120 120 
##$TP= (0..7)
150 150 150 150 150 150 150 150 
##$TP07= 0
##$TPNAME0= <>
##$TPNAME1= <>
##$TPNAME2= <>
##$TPNAME3= <>
##$TPNAME4= <>
##$TPNAME5= <>
##$TPNAME6= <>
##$TPNAME7= <>
##$TPOAL= (0..7)
0.5 0.5 0.5 0.5 0.5 0.5 0.5 0.5 
##$TPOFFS= (0..7)
0 0 0 0 0 0 0 0 
##$TUNHIN= 0
##$TUNHOUT= 0
##$TUNXOUT= 0
##$USERA1= <user>
##$USERA2= <user>
##$USERA3= <user>
##$USERA4= <user>
##$USERA5= <user>
##$V9= 5
##$VALIST= <valist>
##$VCLIST= <CCCCCCCCCCCCCCC>
##$VD= 0
##$VDLIST= <DDDDDDDDDDDDDDD>
##$VPLIST= <PPPPPPPPPPPPPPP>
##$VTLIST= <TTTTTTTTTTTTTTT>
##$WBST= 1024
##$WBSW= 4
##$XGAIN= (0..3)
0 0 0 0 
##$XL= 0
##$YL= 0
##$YMAX_a= 828511
##$YMIN_a= -803544
##$ZGOPTNS= <>
##$ZL1= 120
##$ZL2= 120
##$ZL3= 120
##$ZL4= 120
##$ABSF1= 15.98335
##$ABSF2= -0.9893122
##$ABSG= 5
##$ABSL= 3
##$ALPHA= 0
##$AQORDER= 0
##$ASSFAC= 0
##$ASSFACI= 0
##$ASSFACX= 0
##$ASSWID= 0
##$AUNMP= <proc_1d>
##$AZFE= 0.1
##$AZFW= 0.1
##$BCFW= 0
##$BC_mod= 2
##$BYTORDP= 0
##$COROFFS= 0
##$CY= -3
##$DATMOD= 1
##$DC= 0
##$DFILT= <>
##$DTYPP= 0
##$F1P= 0
##$F2P= 0
##$FCOR= 1
##$FTSIZE= 16384
##$FT_mod= 6
##$GAMMA= 0
##$GB= 0
##$INTBC= 1
##$INTSCL= 1.245715e-10
##$ISEN= 128
##$LB= 0.24
##$LEV0= 0
##$LPBIN= 0
##$MAXI= 10000
##$MC2= 0
##$MEAN= 0
##$ME_mod= 0
##$MI= 1.114404
##$NCOEF= 0
##$NC_proc= -4
##$NLEV= 6
##$NOISF1= 3.799351
##$NOISF2= 2.8
##$NSP= 0
##$NTH_PI= 0
##$NZP= 0
##$OFFSET= 15.93466
##$PC= 1
##$PHC0= -11041.56
##$PHC1= 2.800903
##$PH_mod= 1
##$PKNL= yes
##$PPARMOD= 0
##$PSCAL= 0
##$PSIGN= 0
##$REVERSE= no
##$SF= 200.130016001114
##$SI= 16384
##$SIGF1= 3
##$SIGF2= 2
##$SINO= 5.538805
##$SIOLD= 16384
##$SREGLST= <1H.CDCl3>
##$SSB= 0
##$STSI= 16384
##$STSR= 0
##$SW_p= 3396.73913043478
##$SYMM= 0
##$S_DEV= 0
##$TDeff= 16384
##$TDoff= 0
##$TI= <>
##$TILT= no
##$TM1= 0
##$TM2= 0
##$TOPLEV= 0
##$USERP1= <user>
##$USERP2= <user>
##$USERP3= <user>
##$USERP4= <user>
##$USERP5= <user>
##$WDW= 1
##$XDIM= 16384
##$YMAX_p= 412898912
##$YMIN_p= -661693
$$ End of Bruker specific parameters
$$ ---------------------------------
##NTUPLES= NMR SPECTRUM
##VAR_NAME=  FREQUENCY,     SPECTRUM/REAL,   SPECTRUM/IMAG
##SYMBOL=    X,             R,               I
##VAR_TYPE=  INDEPENDENT,   DEPENDENT,       DEPENDENT
##VAR_FORM=  AFFN,          ASDF,            ASDF
##VAR_DIM=   16384,         16384,           16384
##UNITS=     HZ,            ARBITRARY UNITS, ARBITRARY UNITS
##FACTOR=    0.207333158178281, 1,           1
##FIRST=     3189.00375234398, 0,            0
##LAST=      -207.735378090796, 0,           0
##MIN=       -207.735378090796, -661693,     0
##MAX=       3189.00375234398, 412898912,    0
$$ Real data points
##PAGE= N=1
##DATA TABLE= (X++(R..R)), XYDATA
$$ [...]
6946c39041n403j7462J0116L189p812O899N083J0492J9503l3909q884M0416N145
$$ -339041 -344444 -361906 -351790 -348601 -356413 -349514 -344431 -333939 -314436 -348345 -357229 -316813 -311668
6933c11668K2401m030J2448p429j2929J2524M006J4040k5087k367J8254O262k1547
$$ -311668 -289267 -293297 -280849 -288278 -301207 -288683 -284677 -270637 -295724 -298091 -279837 -273575 -295122
6920b95122j202O428R162K8400J2034l850k4761J8102K9511j4003J4344K4089
$$ -295122 -296324 -289896 -280734 -252334 -240300 -244150 -268911 -250809 -221298 -235301 -220957 -196868
6908a96868K2572p799R344Q400N300q225k524J4950L0845l929R591J660j6552
$$ -196868 -174296 -182095 -172751 -164351 -159051 -167276 -169800 -154850 -124005 -127934 -118343 -116683 -133235
6895a33235K6134n321j0390P605J3690L1905j3298l4016k899J8090J6494J8291
$$ -133235 -107101 -112422 -122812 -115207 -101517 -69612 -82910 -116926 -119825 -101735 -85241 -66950
6883f6950K5786Q129k4648P225M2943J8899O627J767L1520M8861P879L070k127
$$ -66950 -41164 -33035 -57683 -50458 -7515 11384 18011 19778 51298 100159 108038 111108 108981
6870A08981Q825K6255L9529J8421J3345N5399J1452J6209L6465K4254K3613M2008
$$ 108981 117806 144061 183590 202011 215356 270755 282207 298416 334881 359135 382748 424756
6858D24756J2536L4809M0253J9868K6634P2043O6320N5066M5678O6049J03206
$$ 424756 437292 472101 512354 532222 558856 630899 697219 752285 797963 864012 967218
6847I67218J01724J13488J44665J61211J76554K22855K76613L61395M58552N67787
$$ 967218 1068942 1182430 1327095 1488306 1664860 1887715 2164328 2525723 2984275 3552062
6837C552062M49602o9685m44107m78887l83843k85690j92588j33662p4750m8928
$$ 3552062 4001664 3931979 3487872 3008985 2625142 2339452 2146864 2013202 1938452 1889524
6827A889524l0813L199J5059L5280O8447O4413P7687J30162J62009J60945K15311
$$ 1889524 1858711 1861910 1876969 1912249 1980696 2045109 2122796 2252958 2414967 2575912 2791223
6816B791223K43535K42841L26181L77125M74786N41622P08117R67067J191302
$$ 2791223 3034758 3277599 3603780 3980905 4455691 4997313 5705430 6672497 7863799
6807G863799P43307m78944j204596j112985p61305m93892l56404k15439q0780
$$ 7863799 8607106 8128162 6923566 5810581 5049276 4555384 4198980 3983541 3902761
6798C902761j0228O508N9482J60242K20565L06574M23695N59471O94066N33250
$$ 3902761 3892533 3899041 3958523 4118765 4339330 4645904 5069599 5629070 6323136 6856386
6788F856386K0109l43891l89402l14199j47135r0821k2006J37236L43311M59277
$$ 6856386 6876495 6532604 6143202 5829003 5681868 5591047 5569041 5706277 6049588 6508865
6778F508865M96516J17011l78600n90457n21708l34562k05926m9699K5209J14266
$$ 6508865 7005381 7122392 6743792 6153335 5631627 5297065 5091139 5041440 5066649 5180915
6768E180915K29109K59067L05365L40386N13165P16757R61013J222476J465222
$$ 5180915 5410024 5669091 5974456 6314842 6828007 7544764 8505777 9728253 11193475
6759A1193475R33042l87548r44774o52467l65704o20709r57292r49456p67568
$$ 11193475 12126517 11738969 10794195 10141728 9776024 9155315 8198023 7248567 6480999
6750F480999n70790m19285l34130k67738j47352o8218l7964L942L7049J17255
$$ 6480999 5910209 5490924 5156794 4889056 4741704 4673486 4635522 4639464 4676513 4793768
6740D793768J29061J62320K17920K90317L47682L66352M45570N77692P11605Q99063
$$ 4793768 4922829 5085149 5303069 5593386 5941068 6307420 6752990 7330682 8042287 8941350
6730H941350J010654O59406L15473M18146Q72305O26216q29749j766192j616406
$$ 8941350 9952004 10611410 10926883 11345029 12217334 12843550 12013801 10247609 8631203
6721H631203j126366p39092m93066l32075k56513j34802m3808O607P5532J59940
$$ 8631203 7504837 6765745 6272679 5940604 5684091 5549289 5505481 5512088 5587620 5747560
6711E747560K61734M38130N82274P04937N87366J1773m52992n03637l31336j25685
$$ 5747560 6009294 6447424 7029698 7734635 8322001 8333774 7880782 7377145 7045809 6920124
6701F920124k2679M2319J08902K90294N29695O47617K74943l69483p00487o39420
$$ 6920124 6897445 6939764 7048666 7338960 7868655 8516272 8791215 8421732 7721245 7081825
6691G081825m85783l47789j67917L749J02165J90485J95755J45694K10954L35021
$$ 7081825 6596042 6248253 6080336 6084085 6186250 6376735 6572490 6718184 6929138 7264159
6681G264159N38184Q09063J112870J321935P55707q64148j790253j641086j206566
$$ 7264159 7802343 8611406 9724276 11046211 11801918 10937770 9147517 7506431 6299865
6672F299865q61377n65668m06803l35753k79208k46214k02855j46687j43605j29472
$$ 6299865 5438488 4872820 4466017 4130264 3851056 3604842 3401987 3255300 3111695 2982223
6662B982223m7477n5569n622P3877N0640M0484N7355J46950J66953J73079K59549
$$ 2982223 2934746 2879177 2873555 2947432 2998072 3038556 3095911 3242861 3409814 3582893 3842442
6651C842442K79736L93068N35426N41502P0931n90404q40953p45509n50460l81374
$$ 3842442 4122178 4515246 5050672 5592174 5663105 5072701 4231748 3486239 2935779 2554405
6641B554405k96286k28335j54926j04916j09818q8432q7749q5395r4265j22829
$$ 2554405 2258119 2029784 1874858 1769942 1660124 1571692 1483943 1398548 1304283 1181454
6631A181454p9293p7437l7786j1196l263m1072k0778j8975j9130K0518k0347m1562
$$ 1181454 1102161 1024724 986938 975742 972479 931407 910629 891654 872524 893042 872695 831133
6619H31133l2806l4270k0869K573k1889K4071M7993L5475L3865J02539R6317L3535
$$ 831133 798327 764057 743188 745761 723872 747943 795936 831411 865276 967815 1064132 1097667
6607A097667n7004p3381l5195k9065O265K9227J6919k1870o9533j09914j23059
$$ 1097667 1040663 967282 932087 903022 909287 938514 955433 933563 864030 754116 631057
6596F31057j09407o8695m8896m8868m9258m8614k7260l7101j4330n033m500l7663
$$ 631057 521650 452955 404059 355191 305933 257319 230059 192958 178628 173595 169095 131432
6584A31432m0803k4017p628m431j9970j2718L3400N558m4404l0793j1937k5721
$$ 131432 90629 66612 58984 54553 34583 21865 55265 60823 16419 -14374 -26311 -52032
6572e2032j3197k8272j2440K0103R059j4288k1586k6631j0420J214j1196k5094
$$ -52032 -65229 -93501 -105941 -85838 -76779 -91067 -112653 -139284 -149704 -148490 -159686 -184780
6560a84780K6710j0269j8281J8078M597k8578k9968J2691k909L860O322r786J0997
$$ -184780 -158070 -168339 -186620 -168542 -163945 -192523 -222491 -209800 -212709 -208849 -202527 -212313 -201316
6547b01316o343k4530o339Q4l205j0968J1846o490O731j1085K4232l1000j9595
$$ -201316 -207659 -232189 -238528 -238444 -241649 -252617 -240771 -247261 -240530 -251615 -227383 -258383 -277978
6534b77978p025J9065m743j8308K2982n456j6180J05J0709O759l121J2952m201
$$ -277978 -285003 -265938 -270681 -288989 -266007 -271463 -287643 -287538 -276829 -270070 -273191 -260239 -264440
6521b64440k4242j1469l104M486q303Q10m500M707o079R650J3436k6881j6022
$$ -264440 -288682 -300151 -303255 -298769 -307072 -306262 -310762 -306055 -312134 -302484 -289048 -315929 -331951
6508c31951L1707O817k2761r390j5923R363r437j9085m091L0574j0191m182K5731
$$ -331951 -300244 -293427 -316188 -325578 -341501 -332138 -341575 -360660 -364751 -334177 -344368 -348550 -322819
6495c22819P15O304r76k9123r742K6075m301P32M600k9402j4154K1447J108k7596
$$ -322819 -322104 -315800 -316776 -345899 -355641 -329566 -333867 -333135 -328535 -357937 -372091 -350644 -349536 -377132
6481c77132J5484K579k0122K0104j482n758K3116M420p75L7682n90j3087n936
$$ -377132 -361648 -359069 -379191 -359087 -360569 -366327 -343211 -338791 -339566 -301884 -302474 -315561 -321497
6468c21497q942K8546O037j7903P227k892j6054j5497l185K9315j0388P071R398
$$ -321497 -330439 -301893 -295856 -313759 -306532 -309424 -325478 -340975 -344160 -314845 -325233 -318162 -308764
6455c08764J8030O535p829Q289L2539Q023K9203M6509K7623O3767L3744N3212
$$ -308764 -290734 -284199 -292028 -283739 -251200 -243177 -213974 -167465 -139842 -76075 -42331 10881
6443A0881P5735R2588Q4238O6668J7031m2970o8924m4311k6985K6122N3534M5374
$$ 10881 86616 179204 263442 330110 347141 304171 235247 190936 163951 190073 243607 288981
6431B88981L348n0596p7030l7803r0600q3307k9902r436k7998l3986p899j731
$$ 288981 292329 241733 164703 126900 36300 -47007 -76909 -86345 -114343 -148329 -156228 -157959
6419a57959O775P076q217j5526j2076O532n36n0489k054L2655J6461l242J7820
$$ -157959 -151184 -144108 -152325 -167851 -179927 -173395 -173931 -224420 -226474 -193819 -177358 -180600 -162780
6406a62780L965l6834O985K8131m942n014J1489J6959L4629K6259j0877j4080
$$ -162780 -158815 -195649 -188664 -160533 -165475 -170489 -159000 -142041 -107412 -81153 -92030 -106110
6394a06110J0632N1261N0268M1943K7903O2273R1178O2659Q2563Q1746P6587L8398
$$ -106110 -95478 -44217 6051 47994 75897 138170 229348 292007 374570 456316 532903 571301
6382E71301K7807R825L816P4184J27045J56170J60870p654j22057j25034j21796
$$ 571301 599108 608933 612749 686933 813978 970148 1131018 1123364 1001307 876273 754477
6371G54477j03409l3479J9431n113m561q4226j30024j40055j09028o3649m7982
$$ 754477 651068 617589 637020 631907 627346 543120 413096 273041 164013 100364 52382
6360E2382n5796o839j2300j6859k2127l7375k751K4505R292m2981l8933j2225
$$ 52382 -3414 -10253 -22553 -39412 -61539 -98914 -101665 -77160 -67868 -110849 -149782 -162007
6348a62007j0066j2794R758q011N883K7803m90j4825O567L0643j13M386j8129
$$ -162007 -172073 -184867 -175109 -183120 -177237 -149434 -149924 -164749 -158182 -127539 -127652 -123266 -141395
6335a41395J80J1140K1774K4861J6326m902P406L8098L0049K0949M9451P4099
$$ -141395 -141215 -130075 -108301 -83440 -67114 -72016 -64610 -26512 3537 24486 73937 148036
6323A48036P5262P8856J03300J03654L5731l0868p4736q3368l2468J7995L1497
$$ 148036 223298 302154 405454 509108 544839 513971 439235 355867 323399 341394 372891
6312C72891L6153O2660K0536j01446j53264j07007n9919l8579o3536n5942l8466
$$ 372891 409044 471704 492240 390794 237530 130523 70604 32025 -31511 -87453 -125919
6301a25919l0294k1888j1488j3233j2397j2606O024J4955k2965N8771J2491j9121
$$ -125919 -156213 -178101 -189589 -202822 -215219 -227825 -221801 -206846 -229811 -171040 -158549 -177670
6289a77670M733L5405K2286K789O889m407J5883J8766K4072M9921N291l7421J2383
$$ -177670 -172937 -137532 -115246 -112457 -105568 -109975 -94092 -75326 -51254 -1333 3958 -33463 -21080
6276b1080K3626J6979J4693o794j202k2062l6055l6943k0721M832o142m6916m0369
$$ -21080 2546 19525 34218 27424 26222 4160 -31895 -68838 -89559 -84727 -90869 -137785 -178154
6263a78154k4053J665k8883p395k1769k4984J381n654k171j466K0882j1027k3477
$$ -178154 -202207 -200542 -229425 -236820 -258589 -283573 -282192 -287846 -290017 -291483 -270601 -281628 -305105
6250c05105k3509M289o848J260j9350j5857m1319n746J5843m542n357J2797J4711
$$ -305105 -328614 -324325 -331173 -329913 -349263 -365120 -406439 -412185 -396342 -400884 -406241 -393444 -378733
6237c78733j3783r801P463N978L3616L0050j3105j0259p00M434Q85l336j7857
$$ -378733 -392516 -402317 -394854 -388876 -355260 -325210 -338315 -348574 -349274 -344840 -343955 -347291 -365148
6224c65148q837j0705m0602R768L1815J5263j6525J1505j3135j1877Q123j1705
$$ -365148 -373985 -384690 -425292 -415524 -383709 -368446 -384971 -373466 -386601 -398478 -390355 -402060
6212d02060J5539l0368J1241M6448J8782j7831O388K0048P332J775K6399j3169
$$ -402060 -386521 -416889 -405648 -359200 -340418 -358249 -351861 -331813 -324481 -322706 -296307 -309476
6200c09476j3224K2890J4963j9958n684r632j6006k1437j0789r256K1163j7737
$$ -309476 -322700 -299810 -284847 -304805 -310489 -320121 -336127 -357564 -368353 -377609 -356446 -374183
6188c74183o834j5899l6011R351M492L2674K8110N482j0146k8583O135J4856j5037
$$ -374183 -381017 -396916 -432927 -423576 -419084 -386410 -358300 -352818 -362964 -391547 -385412 -370556 -385593
6175c85593j0512O305J4992j0435Q941K7158R965Q338J2299J1335k8358j3588
$$ -385593 -396105 -389800 -374808 -385243 -376302 -349144 -339179 -330841 -318542 -307207 -335565 -349153
6163c49153K9814R919r722J5220k0672k448j019j0374j2715j1786K1546J4636
$$ -349153 -319339 -309420 -319142 -303922 -324594 -327042 -328061 -338435 -351150 -362936 -341390 -326754
6151c26754K3226j951m722q406J975O299J6280P394N144N841k7681P365J7270
$$ -326754 -303528 -305479 -310201 -318607 -316632 -310333 -294053 -286659 -281515 -275674 -303355 -295990 -278720
6138b78720K17J038k5675J3194j1847l6175k8634M8110N85j6264J8410j8749l1910
$$ -278720 -278503 -277465 -303140 -289946 -301793 -337968 -366602 -318492 -317907 -334171 -315761 -334510 -366420
6125c66420J2380L308J979J7973K0816j940K5179R945R410P069n529M755J2706
$$ -366420 -354040 -350732 -348753 -330780 -309964 -311904 -286725 -276780 -267370 -260301 -265830 -261075 -248369
6112b48369J4934K6317M18Q297j3459o332j755J6033O476K141J1905j6455P013
$$ -248369 -233435 -207118 -206700 -198403 -211862 -218194 -219949 -203916 -197440 -195299 -183394 -199849 -192836
6099a92836k824K1522L0390J0340o912L6307K3220K4915n454J5292L6432K465
$$ -192836 -195660 -174138 -143748 -133408 -140320 -104013 -80793 -55878 -61332 -46040 -9608 -7143
6087g143J4791M0045L3855K2244L8598L0454M7049K5076N2854P6902O2808N1935
$$ -7143 7648 47693 81548 103792 142390 172844 219893 244969 297823 374725 437533 489468
6075D89468M8949O1664P5126N9396P5669O4832O7133P0545J16650J01429Q3865
$$ 489468 538417 600081 675207 734603 810272 875104 942237 1012782 1129432 1230861 1314726
6064A314726J34717L0559J1747p058L6177L6953j386K6682N6575r974n7251r7706
$$ 1314726 1449443 1480002 1491749 1484691 1520868 1557821 1556435 1583117 1639692 1629718 1572467 1474761
6052A474761q9818p8227r3611q1498p9792p6775p1344j05808p3844o0247l4146
$$ 1474761 1384943 1306716 1213105 1131607 1051815 975040 903696 797888 724044 663797 629651
6041F29651l6257l8943l4500m0073l1238q700m064K1184K728j3310N278l956o005
$$ 629651 593394 554451 519951 479878 448640 439940 435876 457060 459788 446478 451756 447800 441795
6028D41795q504O899Q665J0481K9471o246o967J2919K0964k466J7877K8211K5550
$$ 441795 433291 440190 448855 459336 488807 482561 475594 488513 509477 507011 524888 553099 578649
6015E78649Q349j8780J3456L2942K7916K4532K404K6201M6383J0629M0496M7449
$$ 578649 586998 568218 581674 614616 642532 667064 669468 695669 742052 752681 793177 840626
6003H40626K5625J6876L2397M9383M0079O9115P1382Q4428R9154Q0300J03898
$$ 840626 866251 883127 915524 964907 1004986 1074101 1145483 1229911 1329065 1409365 1513263
5992A513263J23198J34283J38206J37633J23367J44862J75654J51619J71793K22641
$$ 1513263 1636461 1770744 1908950 2046583 2169950 2314812 2490466 2642085 2813878 3036519
5982C036519K04864J79553J43317J00270O1198Q6480Q0775P2216O4841P1407K3226
$$ 3036519 3241383 3420936 3564253 3664523 3725721 3812201 3892976 3965192 4030033 4101440 4124666
5971D124666l2262q7532j31131j14991r8904n2895o2657j64354j76675j35345
$$ 4124666 4092404 4004872 3873741 3758750 3659846 3606951 3544294 3379940 3203265 3067920
5961C067920j30389j03421j08158r6112n0043l9446j9315l5308j613L941K3415
$$ 3067920 2937531 2834110 2725952 2629840 2579797 2540351 2521036 2485728 2484115 2488056 2511471
5950B511471K4460M3273N0804P2952Q0453Q2804J07413J16079J48559J45504J67030
$$ 2511471 2535931 2579204 2630008 2702960 2783413 2866217 2973630 3089709 3238268 3383772 3550802
5939C550802J73117J93677K06775J85372K30162K81222L26892L25124L54470L23575
$$ 3550802 3723919 3917596 4124371 4309743 4539905 4821127 5148019 5473143 5827613 6151188
5929F151188L70134M22655M90549N73884P19536R11554J040538R33836M46730
$$ 6151188 6521322 6943977 7434526 8008410 8727946 9639500 10680038 11613874 12060604
5920A2060604J36432J79055M72013Q91204J372679J925590J986286R20447m47937
$$ 12060604 12197036 12376091 12848104 13739308 15111987 17037577 19023863 19944310 19496373
5911A9496373j230790j222497o56980L8921P33375J229507J331785M74698j377798
$$ 19496373 18265583 17043086 16386106 16425027 17158402 18387909 19719694 20194392 18816594
5902A8816594k376401k210975j593384q94138m59617q2572l9468n75079j105633
$$ 18816594 16440193 14229218 12635834 11741696 11282079 11199507 11160039 10584960 9479327
5893I479327j195765j028296p42505n71832m11340l28187l09126k65186j98061
$$ 9479327 8283562 7255266 6512761 5940929 5529589 5201402 4892276 4627090 4429029
5884D429029j48685r8414j12911q9943p4612m8579l7211m3877l5165j8034j2534
$$ 4429029 4280344 4181930 4069019 3979076 3904464 3855885 3818674 3774797 3739632 3721598 3709064
5873C709064J5701L2612M2552M7140K9832N4587R3635J08054Q6904J39402J30772
$$ 3709064 3724765 3757377 3799929 3847069 3876901 3931488 4025123 4133177 4220081 4359483 4490255
5862D490255J49861J53207J78372J92418J94444K11595K25802K46471K72665L05443
$$ 4490255 4640116 4793323 4971695 5164113 5358557 5570152 5795954 6042425 6315090 6620533
5852F620533L06676L20070L32826L47178L86567L98405M91502N98972P51179R10088
$$ 6620533 6927209 7247279 7580105 7927283 8313850 8712255 9203757 9802729 10553908 11463996
5842A1463996J144647J455250J544471J377697J345603J387880J126084R77090
$$ 11463996 12608643 14063893 15608364 16986061 18331664 19719544 20845628 21822718
5834B1822718J362887K186029K918489K739730J900156J32723j330886j393136
$$ 21822718 23185605 25371634 28290123 31029853 32930009 33062732 31731846 30338710
5826C0338710r53879r7794Q69703J492398J005591p03754j990272k914350l159373
$$ 30338710 29384831 29287037 30156740 31649138 32654729 31950975 29960703 27046353 23886980
5817B3886980k577516j703975q15802m07424o42652j371805j833222j820786j483529
$$ 23886980 21309464 19605489 18789687 18382263 17739611 16367806 14534584 12713798 11230269
5808A1230269j109582q05638o08732m54254l39776k59408j95451j37268q2376
$$ 11230269 10120687 9315049 8706317 8252063 7912287 7652879 7457428 7320160 7237784
5799G237784J1010L0384J01936J50196K31371L10369M75723N96695P96227J014876
$$ 7237784 7248794 7279178 7381114 7531310 7762681 8073050 8548773 9145468 9941695 10956571
5789A0956571R38751M99574P9603J40776N19333J016071J589234J791015P17472
$$ 10956571 11895322 12394896 12474499 12615275 13134608 14150679 15739913 17530928 18248400
5780A8248400m84256q60416r35393o99643j96231K63411L13533J42286j38540
$$ 18248400 17764144 16903728 15968335 15268692 15072461 15335872 15649405 15791691 15653151
5771A5653151j095153j810079j652681j225162p33631l97686k57952n42636q97523
$$ 15653151 14557998 12747919 11095238 9870076 9136445 8738759 8480807 7938171 7040648
5762G040648r46311q29689o36909m97587l63001l11660k63331k11405j79472j32196
$$ 7040648 6094337 5264648 4627739 4130152 3767151 3455491 3192160 2980755 2801283 2669087
5752B669087j35835j16684j43969r2443o5425r5177j15971l0854l9653n6319p7884
$$ 2669087 2533252 2416568 2272599 2180156 2114731 2019554 1903583 1872729 1833076 1776757 1698873
5741A698873n0973n0212m4386l4849m5142j0960n556l2775K4561M0178q800j5553
$$ 1698873 1647900 1597688 1553302 1518453 1473311 1462351 1456795 1424020 1448581 1488759 1479959 1464406
5729A464406J51r236N308L2665J6689L7300L7534j4246q9814m8776k1717J8039
$$ 1464406 1464557 1455321 1460629 1493294 1509983 1547283 1584817 1570571 1480757 1431981 1410264 1428303
5717A428303K8301n1282j06826p1493o5059r7961q3710n3153k6746l3345l0038
$$ 1428303 1456604 1405322 1298496 1227003 1161944 1063983 980273 927120 900374 867029 836991
5706H36991o1101p0205o5222l7797l2382m5362k7074l6683m3187k9039n1k9211
$$ 836991 775890 705685 640463 602666 570284 524922 497848 461165 417978 388939 388888 359677
5694C59677J0961j072k3378l0290p708l1601j0982k430J5548k0961k027j6266
$$ 359677 370638 369566 346188 315898 308190 276589 265607 263177 278725 257764 255737 239471
5682B39471J1246r681j9985L657l201m086q989L01p807o664L759o911K8784J9187
$$ 239471 250717 241036 221051 224708 221507 217421 208432 208733 200926 194262 198021 191110 219894 239081
5668B39081J2432L2238K2486M0463K5601J190k2505Q21r474k062K7396K3819J2917
$$ 239081 251513 283751 306237 346700 372301 373491 350986 351807 342333 340271 367667 391486 404403
5655D04403l7735P055K7415L3565K7248K9250M3380N381M3793M4669N3157P1798
$$ 404403 366668 373723 401138 434703 461951 491201 534581 539962 583755 628424 681581 753379
5643G53379O0660L1198O9001K8049L1625j8365k9886m469M1174J9429l2769l3394
$$ 753379 814039 845237 914238 942287 973912 955547 925661 921192 962366 981795 949026 915632
5631I15632q792m8404p0739m0547k3609L922k8548p1824o2603l6373J7043l9056
$$ 915632 906840 858436 787697 747150 723541 727463 698915 627091 564488 528115 545158 506102
5619E06102k3693J267j22P536N591L2627L6432L3091L3079M1489L6048L9833M7634
$$ 506102 482409 483676 483554 491090 496681 529308 565740 598831 631910 673399 709447 749280 796914
5606G96914J8392k265M7703K1647r213K2566j2934M0121J4961L9471P7939N9418
$$ 796914 815306 813041 860744 882391 873178 895744 882810 922931 937892 977363 1055302 1114720
5594A114720R8134N5327Q5832J34174J23409J22168J26781J51920J58136J13688
$$ 1114720 1212854 1268181 1354013 1488187 1611596 1733764 1860545 2012465 2170601 2284289
5584B284289R8844P0985O7598P2336J14931J37462J81426J75115J58120O7160
$$ 2284289 2383133 2454118 2521716 2594052 2708983 2846445 3027871 3202986 3361106 3428266
5574C428266m9960m5328j1008p304O1722J22345J14119J09701Q2618N2654M9903
$$ 3428266 3378306 3332978 3321970 3314666 3376388 3498733 3612852 3722553 3805171 3857825 3907728
5563C907728N781p551L471j0306M4502R6395J20816J70979J51848R4695L764m8281
$$ 3907728 3913509 3905958 3909429 3899123 3943625 4040020 4160836 4331815 4483663 4578358 4582122 4533841
5551D533841m0636Q07N0567J00662J31015J50011J05572Q2901O8287O6586O8799
$$ 4533841 4493205 4494012 4544579 4645241 4776256 4926267 5031839 5114740 5183027 5249613 5318412
5540E318412R4328J08488J47106J57175J77794K05628K66427K74264K64139L06881
$$ 5318412 5412740 5521228 5668334 5825509 6003303 6208931 6475358 6749622 7013761 7320642
5530G320642L01741L35544L73864L67155L87219L81188L74903L72373M23424M72020
$$ 7320642 7622383 7957927 8331791 8698946 9086165 9467353 9842256 10214629 10638053 11110073
5520A1110073N51883O70032O95387P58608Q91393J015098J087801J212395J370337
$$ 11110073 11661956 12331988 13027375 13785983 14677376 15692474 16780275 17992670 19363007
5511A9363007J541597J732262J974224K259490K615513L035428L569841M270913
$$ 19363007 20904604 22636866 24611090 26870580 29486093 32521521 36091362 40362275
5503D0362275N219239O281923P618559R040384J0397245J1381134J0966455P763951
$$ 40362275 45581514 51863437 59481996 68522380 78919625 90300759 101267214 109031165
5495A09031165J283365o708774j2812583j4850049j3603928j1022052q455269
$$ 109031165 110314530 103605756 90793173 75943124 62339196 51317144 42861875
5488D2861875o399375m886868l827105l072057k528556k181464j880265j638466
$$ 42861875 36462500 31575632 27748527 24676470 22147914 19966450 18086185 16447719
5480A6447719j438051j228562j083411r12204p86392p06912o20020n15456m67150
$$ 16447719 15009668 13781106 12697695 11785491 10999099 10292187 9672167 9156711 8689561
5471H689561m33845m05471l95547l66877l77251m10813l27120k57765k20187k16035
$$ 8689561 8255716 7850245 7454698 7087821 6710570 6299757 5972637 5714872 5494685 5278650
5461E278650k06924j92593j84462j67162j36131r5829j40923j46679j54817j57086
$$ 5278650 5071726 4879133 4694671 4527509 4391378 4295549 4154626 4007947 3853130 3696044
5451C696044j05320j03950j01619j50750j35271j11855j05533q5555r5165r3392
$$ 3696044 3590724 3486774 3385155 3234405 3099134 2987279 2881746 2796191 2701026 2607634
5441B607634p9010p4192j13938j17910j02025o9309j18336q1069p9360o8235p8337
$$ 2607634 2528624 2454432 2340494 2222584 2120559 2051250 1932914 1851845 1772485 1704250 1625913
5430A625913m5180l9053n7073m4287q0407m9759k6685n8840r1515n3997n8110
$$ 1625913 1580733 1541680 1484607 1440320 1359913 1310154 1283469 1224629 1133114 1079117 1021007
5419A021007m1323m6814l5003m8088m2635n0974j9550k8382n3652n3393k4468
$$ 1021007 979684 932870 897867 849779 807144 756170 736620 708238 654586 601193 576725
5408E76725l4420n47r312k7592M071p20K1761K2905J2334K428k376l414M41l8406
$$ 576725 542305 541758 532446 504854 508925 508205 529966 552871 565205 567633 565257 561843 562284 523878
5394E23878j1812L8811q314j2331j682l4014k4436m1479l8119m7474O163k026
$$ 523878 512066 550877 542563 530232 528550 494536 470100 428621 390502 343028 349191 347165
5382C47165j0660K4895J5003j6699L8358j5852j0279l0569l3679J1623L727N709
$$ 347165 336505 361400 376403 359704 398062 382210 371931 341362 307683 319306 323033 328742
5370C28742k2201j6404K2728m0507J1886L605k6433P31o181q766j3889k5573K166
$$ 328742 306541 290137 312865 272358 284244 287849 261416 262147 255966 247200 233311 207738 209904
5357B09904k5900r347p57j404J3986l631Q057l1187q378R448R388L467J2647p114
$$ 209904 184004 174657 173900 172496 186482 182851 190908 159721 151343 160791 170179 173646 186293 179179
5343A79179J9239k910R513o611o212K0661r67k9167J2544n194k844j7922K1589
$$ 179179 198418 195508 205021 198410 192198 212859 211892 182725 195269 190075 187231 169309 190898
5330A90898M8060j5346j4632K8784j242n874J6748N867k1578p343J946m031L3373
$$ 190898 238958 223612 208980 237764 236522 230648 247396 253263 231685 224342 226288 222257 255630
5317B55630J6713j4827l248K28L5794P628k5841k4930p734j200J2959L7579J3175
$$ 255630 272343 257516 254268 254496 290290 297918 272077 247147 239413 238213 251172 288751 301926
5304C01926K6863J987K6860M3134K7483J8928K5839M6929q633j6529l153k8805
$$ 301926 328789 330776 357636 400770 428253 447181 473020 519949 511316 494787 491634 462829
5292D62829K5253J279M834R568j1552j0312J919J5863l5886L1201N6356K134L6889
$$ 462829 488082 489361 494195 503763 492211 481899 483818 499681 463795 494996 551352 553486 590375
5279E90375L7749L1414L7565M3006K8362L5903m649K7008n349K2531J557K4907
$$ 590375 628124 659538 697103 740109 768471 804374 799725 826733 821384 843915 845472 870379
5267H70379L9270J2016N3175J167L0929K4234J5563J5229J2950j4235M1401M3513
$$ 870379 909649 921665 974840 976007 1006936 1031170 1046733 1061962 1074912 1060677 1102078 1145591
5255A145591L4617L2482K8654K9304K9337N3076M7499P6007N3568M2793N4407
$$ 1145591 1180208 1212690 1241344 1270648 1299985 1353061 1400560 1476567 1530135 1572928 1627335
5244A627335M2090P8196N0687L6282J5181M4013R1142O5374N9711O4638N0354
$$ 1627335 1669425 1747621 1798308 1834590 1849771 1893784 1984926 2050300 2110011 2174649 2225003
5233B225003M8609O9246O3621N7641O5759P4627P8452J00654P4107M9698R8886
$$ 2225003 2273612 2342858 2406479 2464120 2529879 2604506 2682958 2783612 2857719 2907417 3006303
5222C006303J21654P5371O9879J41560J55591J41218J45848J56222J69624J58513
$$ 3006303 3127957 3203328 3273207 3414767 3570358 3711576 3857424 4013646 4183270 4341783
5212D341783K03441J85930J49648J52713J55185J52308J74895J93458J55234J78677
$$ 4341783 4545224 4731154 4880802 5033515 5188700 5341008 5515903 5709361 5864595 6043272
5202F043272J78690K11051K03716K10990K67421K81889K50937K85571L28859L34753
$$ 6043272 6221962 6433013 6636729 6847719 7115140 7397029 7647966 7933537 8262396 8597149
5192H597149L48674L61100M26631M61320N16795N14953N99438O20951P06340P98655
$$ 8597149 8945823 9306923 9733554 10194874 10711669 11226622 11826060 12447011 13153351 13952006
5182A3952006Q25194Q68826R41307J015379J154325J287565J408001J676736K009582
$$ 13952006 14777200 15646026 16587333 17602712 18757037 20044602 21452603 23129339 25138921
5173B5138921K441809K960020L568085M079143M572838N411590O491558P087817
$$ 25138921 27580730 30540750 34108835 38187978 42760816 48172406 54663964 61751781
5165F1751781N714535J771668l313747p478558q262790o465321m579161l104227
$$ 61751781 67466316 69237984 65924237 58445679 50182889 43717568 39138407 36034180
5157C6034180k006297j185962o37790j82025K08625N22952Q54383J163507J516718
$$ 36034180 34027883 32841921 32204131 32022106 32230731 32753683 33608066 34771573 36288291
5148C6288291J927338K406555K921933L723372M722062N869327O992707Q187679
$$ 36288291 38215629 40622184 43544117 47267489 51989551 57858878 64851585 73039264
5140G3039264R655000J1297801J1943634R901916L930454m325575j2053483j5893567
$$ 73039264 82694264 93992065 105935699 115837615 119768069 115442494 103389011 87495444
5132H7495444j4835086j1834619q687712o184335m415343l243735k391409j819317
$$ 87495444 72660358 60825739 52138027 45953692 41538349 38294614 35903205 34083888
5124C4083888j391589j024727o94297m19457j13664K49334O85028J152209J690327
$$ 34083888 32692299 31667572 30973275 30553818 30440154 30689488 31374516 32526725 34217052
5115C4217052K297492K958144L510508M108770N135648O136522O161721L680917
$$ 34217052 36514544 39472688 42983196 47091966 52227614 58364136 64525857 68206774
5107F8206774j125353o402405r883865r532748p238939n209218l825763k881191
$$ 68206774 67081421 60679016 50795151 41262403 34023464 28814246 24988483 22107292
5099B2107292k218551j764051j428135j181207j039787r07594q44304p66275o52104
$$ 22107292 19888741 18124690 16696555 15515348 14475561 13567967 12723663 11957388 11305284
5090A1305284o64760o15756n31161m60274m56005l96596l93762l49878l63265
$$ 11305284 10640524 10024768 9493607 9033333 8577328 8180732 7786970 7437092 7073827
5081G073827l09756k83036k93946l06477k59237k25125k24492k08749j78131j55217
$$ 7073827 6764071 6481035 6187089 5880612 5621375 5396250 5171758 4963009 4784878 4629661
5071D629661j84058j17116j51346j12108r4411j00745j21553j18141r0835r5817
$$ 4629661 4445603 4328487 4177141 4065033 3970622 3869877 3748324 3630183 3539348 3443531
5061C443531p3670j02394r2516q0884j02426j26437j01687q3946j09056o4754
$$ 3443531 3369861 3267467 3174951 3094067 2991641 2865204 2763517 2679571 2570515 2505761
5051B505761q6650j31636j24950r5152q7588o2204n8073n1354l177k4493k8750
$$ 2505761 2419111 2287475 2162525 2067373 1979785 1917581 1859508 1808154 1804977 1780484 1751734
5040A751734J1488n9039m6891J690k6648j7949j1404k7039n0985o8499p6197p4430
$$ 1751734 1763222 1704183 1657292 1658982 1632334 1614385 1602981 1575942 1524957 1456458 1380261 1305831
5028A305831n1270m6044n6776m4600p694m9260j8206M453p85m441R826k1079j0562
$$ 1305831 1254561 1208517 1151741 1107141 1099447 1050187 1031981 1036434 1035649 1031208 1041034 1019955 1009393
5015A009393j5296Q810M4423J9032j6159j3378n206m5300k4942k9366j6712j5250
$$ 1009393 994097 1002907 1047330 1066362 1050203 1036825 1031619 986319 961377 932011 915299 900049
5003I00049o890l2041l9960l6765k4504l7242k4663k4096J693L127l0344j5704
$$ 900049 893159 861118 821158 784393 759889 722647 697984 673888 675581 678708 648364 632660
4991F32660r903j8859m2180n1735j9420j5643K5879O497K5837N392K165J0348
$$ 632660 622757 603898 561718 509983 490563 474920 500799 507296 533133 538525 540690 551038
4979E51038j9197k9101j3266l5159j994J660P218l0488Q917L7706J3180J8855
$$ 551038 531841 502740 489474 454315 452321 453981 461199 430711 439628 477334 490514 509369
4967E09369K1812M163K2409K6389K743r154j1814l1207l1474J1267k345L0396
$$ 509369 531181 535344 557753 584142 586885 577731 565917 534710 503236 514503 512158 542554
4955E42554N7463P6329N8052Q6210Q4870Q9078J47151J18711J55107J36606N7252
$$ 542554 600017 676346 734398 820608 905478 994556 1141707 1260418 1415525 1552131 1609383
4944A609383k3918n1063p5153o9738l7649p665j2399j3479n0962r6774j26887
$$ 1609383 1585465 1534402 1459249 1389511 1351862 1344197 1331798 1318319 1267357 1170583 1043696
4933A043696q5644p9497n4718J2472k415L8688R039J2812K9653P9891P8840J21628
$$ 1043696 958052 878555 823837 836309 833894 872582 881621 894433 924086 1003977 1082817 1204445
4921A204445J58214J90986K08219J95635J53942O0461o0840j96942j99936k21786
$$ 1204445 1362659 1553645 1761864 1957499 2111441 2171902 2111062 1914120 1714184 1492398
4911A492398j54100j19384p4634l9973p0513n3892l780L4793M7384j9461n9825
$$ 1492398 1338298 1218914 1144280 1104307 1033794 979902 976122 1010915 1058299 1038838 979013
4900I79013p3311j12466r9113q0837Q91k4225j122K9967K5351M3903Q0500N8205
$$ 979013 905702 793236 694123 613286 614177 589952 588830 618797 644148 688051 768551 826756
4888H26756k6253k7181r1410j17322q8895p9278r0399j10318m8316o3066l5383
$$ 826756 800503 773322 681912 564590 475695 396417 306018 195700 147384 84318 48935
4877D8935m4538m3863n2240k2857n2603l6822k2157j4750l5890j5153J36j8449
$$ 48935 4397 -39466 -91706 -114563 -167166 -203988 -226145 -240895 -276785 -291938 -291802 -310251
4865c10251k5507Q598k8210R83j2092k5657j3392Pp720J760K6400j7396k1718
$$ -310251 -335758 -327160 -355370 -354387 -366479 -392136 -405528 -405521 -413241 -411481 -385081 -402477 -424195
4852d24195q804K0890J4013k3105j017j673M314Q086R184M017m568m595k970l1620
$$ -424195 -432999 -412109 -398096 -421201 -422218 -423891 -419577 -411491 -402307 -398290 -402858 -407453 -410423 -442043
4838d42043J0654J7440j2152j9367j8602k7171R455j1156P33L5687j7427J3225
$$ -442043 -431389 -413949 -426101 -445468 -464070 -491241 -481786 -492942 -492209 -456522 -473949 -460724
4826d60724L3676K2705J704J3844J1536Q859J1570j6168K3362j264Q689K4613
$$ -460724 -427048 -404343 -402639 -388795 -377259 -368400 -356830 -372998 -349636 -350900 -342211 -317598
4814c17598o50K2751K666k1105m8370n952k8914M4025o770Q784M4004J6777K6995
$$ -317598 -318248 -295497 -292831 -313936 -362306 -368258 -397172 -353147 -359917 -351133 -307129 -290352 -263357
4801b63357M0571K5553N8278K0682K9673k879l2163l4817l7764O896L2401J14
$$ -263357 -222786 -197233 -138955 -118273 -88600 -91479 -123642 -158459 -196223 -189327 -156926 -156812
4789a56812j5073J5145K0727R613J7927K9327j436r778K7311K7420J9626L2917
$$ -156812 -171885 -156740 -136013 -126400 -108473 -79146 -80582 -90360 -63049 -35629 -16003 16914
4777A6914N1204K0936J2789M5705K0144L9761M8425K9566J9606l2894n9748n1195
$$ 16914 68118 89054 101843 147548 167692 207453 255878 285444 305050 272156 212408 161213
4765A61213m3624m2683j6347L1463K5873J1586j5811k9603K5235O756J347j8480
$$ 161213 117589 74906 58559 90022 115895 127481 111670 82067 107302 114058 115405 96925
4753I6925q522N989J3771l5221l8752l8712p42k5411Q675n498q333L1356L6942
$$ 96925 88403 94392 108163 72942 34190 -4522 -5264 -30675 -22000 -27498 -35831 -4475 32467
4740C2467K5765l1522n3937j7673M102m4125l9862j7304j1039m773K9147J9713
$$ 32467 58232 26710 -27227 -44900 -40798 -84923 -124785 -142089 -153128 -157901 -128754 -109041
4728a09041L1843L4130L3212L4715o614j7988l916K2315j0016J9575j4436j1098
$$ -109041 -77198 -43068 -9856 24859 18245 257 -3659 18656 8640 28215 13779 2681
4716B681j0582k1605l0169l3449R683K173J7588J2972L024L0756J7287j4406p737
$$ 2681 -7901 -29506 -59675 -93124 -83441 -81268 -63680 -50708 -47684 -16928 359 -14047 -21784
4703b1784J7280K3254O43L2912p869k6138k4917R610k4853m3228m5952j0630L916
$$ -21784 -4504 18750 19393 52305 44436 18298 -6619 2991 -21862 -65090 -111042 -121672 -117756
4690a17756k4361J5760K210k0177J5860L909j9509j6673K0745K6739J4326O901
$$ -117756 -142117 -126357 -124147 -144324 -128464 -124555 -144064 -160737 -139992 -113253 -98927 -92026
4678i2026J1331K1857K0831M314J6805L2517J5165l595J349n663L9938q559K5937
$$ -92026 -80695 -58838 -38007 -33693 -16888 15629 30794 27199 28548 22885 62823 54264 80201
4665H0201K924o258N496L8115J92K5897K1916k2641k0557K2660N9903K7369K2382
$$ 80201 83125 76867 82363 120478 120670 146567 168483 145842 125285 147945 207848 235217 257599
4652B57599L3729K6805L5350K1296K2178M1983R195p45K2135R490L0801M2596
$$ 257599 291328 318133 353483 374779 396957 438940 448135 447390 469525 479015 509816 552412
4640E52412M9368l437L1576j404j4457M0747N0187L0429O1578O6419L9192P7991
$$ 552412 601780 598343 629919 628515 614058 654805 704992 735421 796999 863418 902610 980601
4628I80601M6614P5582J06451J03735J16515J23277J35058N7160m0841n7645j4057
$$ 980601 1027215 1102797 1209248 1312983 1429498 1552775 1687833 1744993 1704152 1646507 1632450
4617A632450k4898m3412n9850k3878K2734L0967M2774M7552K2738L8739N0864
$$ 1632450 1607552 1564140 1504290 1480412 1503146 1534113 1576887 1624439 1647177 1685916 1736780
4606A736780O2630J21752P3968Q9036Q8983N8246o146k2272J6762N3755Q1644
$$ 1736780 1799410 1921162 1995130 2084166 2173149 2231395 2225249 2202977 2219739 2273494 2355138
4595B355138R8145J30378J24449J35745K14094K50041Q4946k20604k77958j51443
$$ 2355138 2453283 2583661 2708110 2843855 3057949 3307990 3392936 3172332 2894374 2742931
4585B742931p7025r2425j11234q0473l8635k6377M105J0310p313k0163N696K9157
$$ 2742931 2665906 2573481 2462247 2381774 2343139 2316762 2320867 2331177 2323864 2303701 2309397 2338554
4573B338554K6213J5558P0821J25046J02038N4612Q7312J13772J55684K03593
$$ 2338554 2364767 2380325 2451146 2576192 2678230 2732842 2820154 2933926 3089610 3293203
4563C293203K43166K22129J88238J50044J53220P5319k586k28013k85239k83460
$$ 3293203 3536369 3758498 3946736 4096780 4250000 4325319 4322733 4094720 3809481 3526021
4553C526021k81182j94740j62238j66159j59464j50784j08569j03508m6346l2883
$$ 3526021 3244839 3050099 2887861 2721702 2562238 2411454 2302885 2199377 2153031 2120148
4543B120148m5877n7515J2405L753M3006M8360N4918N5305N6864N5189Q4191J10793
$$ 2120148 2074271 2016756 2029161 2032914 2075920 2124280 2179198 2234503 2291367 2346556 2430747 2541540
4531B541540O7831M4874K8998k6057r2107j10454j33942j55063j92768j68193
$$ 2541540 2609371 2654245 2683243 2657186 2565079 2454625 2320683 2165620 1972852 1804659
4521A804659j44438j25703j40227j49715j18257o5628q9185q1438n7369m9411
$$ 1804659 1660221 1534518 1394291 1244576 1126319 1060691 971506 890068 832699 783288
4511G83288o5979q2754p1684m8153p5400m4323j6456k1511M745r352M12l042o30
$$ 783288 717309 634555 562871 514718 439318 394995 378539 357028 361773 352421 352833 349791 349161
4498C49161k1981k9244j4817k805j2173l9557m8439l7892J4113j36k6007J899
$$ 349161 327180 297936 283119 280314 268141 228584 180145 142253 156366 156230 130223 132122
4486A32122Q86k1081J3209M211J7059p743J2715j9322K430p173K731n853J1464
$$ 132122 133008 111927 125136 129347 146406 138663 151378 132056 134486 127313 130044 124191 135655
4473A35655q797j4821j0615k448n572R821j1766K278L9147n282j7318K3013n27
$$ 135655 126858 112037 101422 98974 93402 103223 91457 93735 132882 127600 110282 133295 132768
4460A32768j516r134k0170j5117l9435K4063N1084J3753q035r671L350J5198K4721
$$ 132768 131252 122118 101948 86831 47396 71459 122543 136296 128261 118590 121940 137138 161859
4447A61859k4633J2908M1370k0357l8024k146j9149J6410M1222J4112K691K1193
$$ 161859 137226 150134 191504 171147 133123 130977 111828 128238 169460 183572 186263 207456
4435B07456K1732K764J0204K4496L3569J2558J9940M7061Q793J559l1490K8983
$$ 207456 229188 231952 242156 266652 300221 312779 332719 379780 388573 390132 358642 387625
4423C87625J324M5219K3935M4780L8794j295L5172O9863Q7565O0344N7597P8171
$$ 387625 388949 434168 458103 502883 541677 540382 575554 645417 732982 793326 850923 929094
4411I29094R4262R6892Q3475K2826K0396j9438r944k0376J2348J3336Q647K6647
$$ 929094 1023356 1120248 1203723 1226549 1246945 1227507 1217563 1197187 1209535 1222871 1231518 1258165
4399A258165N8091L7093K8933L4876O1130N9605N3118Q0484O6785Q1419O2789
$$ 1258165 1316256 1353349 1382282 1417158 1478288 1537893 1591011 1671495 1738280 1819699 1882488
4388A882488Q3130P7389R1867J11432J04102J45562J13368J45874J65469P6035
$$ 1882488 1965618 2043007 2134874 2246306 2350408 2495970 2609338 2755212 2920681 2996716
4378B996716J9657M829p646K7357L7899O1365Q1606Q7533P3609Q5124Q0357P7242
$$ 2996716 3016373 3021202 3013556 3040913 3078812 3140177 3221783 3309316 3382925 3468049 3548406 3625648
4366C625648R2927J30696J19305J07043J52359J42957J41466J53151J87192K18091
$$ 3625648 3718575 3849271 3968576 4075619 4227978 4370935 4512401 4665552 4852744 5070835
4356E070835K40376K63509K85428K93430L44265L76154L12322L04290L24311L72019
$$ 5070835 5311211 5574720 5860148 6153578 6497843 6873997 7186319 7490609 7814920 8186939
4346H186939L81826M48646M64613N28225N82752O96934P65955Q68285J010206
$$ 8186939 8568765 9017411 9482024 10010249 10593001 11289935 12055890 12924175 13934381
4337A3934381J149965J321538J617440J928281K342858K684043K795978K462095
$$ 13934381 15084346 16405884 18023324 19951605 22294463 24978506 27774484 30236579
4329C0236579J588191Q06556P08492J188849J999573K639750K610963J440748
$$ 30236579 31824770 32631326 33339818 34528667 36528240 39167990 41778953 43219701
4321D3219701n78203k233868k730271k305208j404579n87343l02144p10471j542678
$$ 43219701 42641498 40407630 37677359 35372151 33967572 33380229 33078085 32367614 30824936
4312C0824936k079833k080090j735175j170197o22854j75128K80266P22342J194479
$$ 30824936 28745103 26665013 24929838 23759641 23136787 22961659 23241925 23964267 25158746
4303B5158746J649632K038478K061980J581990P61406J86068K56452Q68540J686499
$$ 25158746 26808378 28846856 30908836 32490826 33252232 33438300 33694752 34563292 36249791
4294C6249791K258420J913889M32169j545532k874624l050516k510087j656312
$$ 36249791 38508211 40422100 40854269 39308737 36434113 33383597 30873510 29217198
4286B9217198r64837q74056j459575k304578k753336k722844k345930j884091
$$ 29217198 28252361 27378305 25918730 23614152 20860816 18137972 15792042 13907951
4278A3907951j514488j235533r72400q30698p10966o42979n64773n09356m98846
$$ 13907951 12393463 11157930 10185530 9354832 8643866 8000887 7436114 6926758 6427912
4269F427912m21388l23471l03554k92382k89257k77884k41662j99068j32562j44536
$$ 6427912 6006524 5683053 5379499 5087117 4797860 4519976 4278314 4079246 3946684 3802148
4259C802148j42108j69518j52287j23295j63596j15430p4045j31608j31879j13971
$$ 3802148 3660040 3490522 3338235 3214940 3051344 2935914 2861869 2730261 2598382 2484411
4249B484411j42416r3475q7380p7586o2416m2572l6328o5606k6091j3540m54j4569
$$ 2484411 2341995 2248520 2161140 2083554 2021138 1978566 1942238 1876632 1850541 1837001 1836547 1821978
4237A821978l4714m9961j8845q466m1598m4426l3926k0119j7282K5672J6508k4982
$$ 1821978 1787264 1737303 1718458 1709992 1668394 1623968 1590042 1569923 1552641 1578313 1594821 1569839
4225A569839j9721m816o17k3979M086M6312N0905Q3191J17722J46881J73765K22062
$$ 1569839 1550118 1545302 1544685 1520706 1524792 1571104 1622009 1705200 1822922 1969803 2143568 2365630
4213B365630K78566K81157N6722k50419m74145l92502k62845j78766j18688p6323
$$ 2365630 2644196 2925353 2982075 2731656 2257511 1865009 1602164 1423398 1304710 1228387
4203A228387r6793k2481M48J2352L1113L0157m7862q0415o6008m3507l2995j4069
$$ 1228387 1131594 1109113 1109561 1121913 1153026 1183183 1135321 1054906 988898 945391 912396 898327
4191H98327L425m014J0929M0579M7004K8229r918k9466n0365l4707l6361r769
$$ 898327 901752 897738 908667 949246 996250 1024479 1014561 985095 934730 900023 863662 853893
4179H53893l068k6040k9346K01L7752l495j4931J6332k5205k1696m1257k3842
$$ 853893 850825 824785 795439 795640 833392 829897 814966 831298 806093 784397 743140 719298
4167G19298j8669n0533m5589k0845m392j5956n937p57K017K1567L6405L6001L5831
$$ 719298 700629 650096 604507 583662 579270 563314 557377 556620 558637 580204 616609 652610 688441
4154F88441P3620Q1399L6640J7287L0930M8794J9559l0221p1612o2226o4290j7729
$$ 688441 762061 843460 880100 897387 928317 977111 996670 966449 894837 832611 768321 750592
4142G50592k4992L087p77K6421K5115N7926O3793M9815N7557R4170J08914R4396
$$ 750592 725600 728687 727910 754331 779446 837372 901165 950980 1008537 1102707 1211621 1306017
4130A306017M9097R837L3974K3432J6509L3987l369p06m947j9891n3765k7116
$$ 1306017 1355114 1364951 1398925 1422357 1438866 1472853 1469484 1468778 1463831 1443940 1390175 1363059
4118A363059o4551n7976m1504m5839m1921k4771k3750n4298l5669k755k0441j5478
$$ 1363059 1298508 1240532 1199028 1153189 1111268 1086497 1062747 1008449 972780 970025 949584 934106
4106I34106l5307j2986q930k0305K532K7288l6090k9691j1058L1176P505J0379
$$ 934106 898799 885813 876883 856578 859110 886398 850308 820617 809559 840735 848240 858619
4094H58619J0410j0028m6049k2815o626M1961J0430K7709O150R012j418l627J9014
$$ 858619 869029 859001 812952 790137 783511 825472 835902 863611 869761 878773 877355 873728 892742
4081H92742j8616k9507l302k124P934K6486N999K9371L8949J8565M0643M1547
$$ 892742 874126 844619 841317 839193 847127 873613 879612 908983 947932 966497 1007140 1048687
4069A048687M6823M8592N3290R0949M4002L7024K145l6120j3809q965l8384J540
$$ 1048687 1095510 1144102 1197392 1288341 1332343 1369367 1371512 1335392 1321583 1312618 1274234 1275774
4057A275774L790l1822j240m733J0776M9276P1558M4210K5709O0140N4919O3601
$$ 1275774 1279564 1247742 1246502 1241769 1252545 1301821 1373379 1417589 1443298 1503438 1558357 1621958
4045A621958M5998O4249M6850J6858L7437L8536L632l762n320L8700J1036p593
$$ 1621958 1667956 1732205 1779055 1795913 1833350 1871886 1875518 1871756 1866436 1905136 1916172 1908579
4033A908579K9043J7178K4959Q1029J18109R4432J07444J20527J21006P6152L8723
$$ 1908579 1937622 1954800 1979759 2060788 2178897 2273329 2380773 2501300 2622306 2698458 2737181
4022B737181R6717L8630N7718Q2743M9715P8499J01621Q6164P5512N7147N4186
$$ 2737181 2833898 2872528 2930246 3012989 3062704 3141203 3242824 3328988 3404500 3461647 3515833
4011C515833P0762R0938J07154J00956P9894J10938J40424J66078J60417J32364
$$ 3515833 3586595 3677533 3784687 3885643 3965537 4076475 4216899 4382977 4543394 4675758
4001D675758Q6261O7843Q8725O3753M0746N6685L2658Q2727M9157O3896P6902
$$ 4675758 4762019 4829862 4918587 4982340 5023086 5079771 5112429 5195156 5244313 5308209 5385111
3990E385111P1109n73j8344J1112j2001q9743m8824o2449J2631J11368J94575
$$ 5385111 5456220 5455647 5437303 5448415 5436414 5346671 5297847 5235398 5248029 5359397 5553972
3979E553972J99475K51938K71233J88713J18089J35844J26202J75429J71347J84260
$$ 5553972 5753447 6005385 6276618 6465331 6583420 6719264 6845466 7020895 7192242 7376502
3969G376502J98780J76405O9120P3377N0673K3161J3835N4840J09350J49992R8908
$$ 7376502 7575282 7751687 7820807 7894184 7944857 7968018 7981853 8036693 8146043 8296035 8394943
3958H394943M3712R4646J27051J20966J46967R6673J14420J16273R1444O2256
$$ 8394943 8438655 8533301 8660352 8781318 8928285 9024958 9139378 9255651 9347095 9409351
3948I409351J01949J25297J03053J29186J65331J71415J75706J78932J95400K09463
$$ 9409351 9511300 9636597 9739650 9868836 10034167 10205582 10381288 10560220 10755620 10965083
3938A0965083K63978K58077K49397K94622L16351L38563L55076M00575M91073
$$ 10965083 11229061 11487138 11736535 12031157 12347508 12686071 13041147 13441722 13932795
3929A3932795M88285M95527N07620N31086N20725M83886M70119M77356N03502
$$ 13932795 14421080 14916607 15424227 15955313 16476038 16959924 17430043 17907399 18410901
3920A8410901N73454O96455O74605P32103Q42438R52071R99920J012775J015175
$$ 18410901 18984355 19680810 20355415 21087518 21929956 22882027 23881947 24894722 25909897
3911B5909897J106569J204646J298064J315393J253420J241808J327123J396049
$$ 25909897 27016466 28221112 29519176 30834569 32087989 33329797 34656920 36052969
3903C6052969J614666J899123K117684K305319K595240K890400L202083L456493
$$ 36052969 37667635 39566758 41684442 43989761 46585001 49475401 52677484 56133977
3895E6133977L774997M093935M565530N072180N718801O421782P653641R131837
$$ 56133977 59908974 64002909 68568439 73640619 79359420 85781202 93434843 102566680
3887A02566680J0918131J3254475J6820232K1242487K6745402L1038366L6672171
$$ 102566680 113484811 126739286 143559518 164802005 191547407 222585773 259257944
3880B59257944M7915139N9306500M6419329p363418o9326786q1907046n8337379
$$ 259257944 307173083 366479583 412898912 405535494 336208708 254301662 195964283
3873A95964283l8319356k6104095j8622861j3316873j0071583p592403o079699
$$ 195964283 157644927 131540832 112917971 99601098 89529515 81937112 75857413
3866G5857413m910873m120039l200814k538208j880892j442770j128662j310161
$$ 75857413 70946540 66826501 63625687 61087479 59206587 57763817 56635155 55324994
3858E5324994j440141j230485p11531l85108N9720L78126P20915R34090J207498
$$ 55324994 53884853 52654368 51942837 51557729 51617449 51995575 52716490 53650580 54858078
3849E4858078J521366K144550K804022L550068L876639L767130L679548M350840
$$ 54858078 56379444 58523994 61328016 64878084 68754723 72521853 76201401 80552241
3841H0552241N397471O455577P478775Q381242Q797644Q989554R193284R797107
$$ 80552241 85949712 92405289 99884064 108265306 117062950 126052504 135245788 145042895
3833A45042895J0483023J0423573Q243408L056534m386793j1202979j4801076
$$ 145042895 155525918 165949491 174192899 177249433 172862640 161659661 146858585
3826A46858585j4828718j2958515j1077573j0083749r836971r703978r189944
$$ 146858585 132029867 119071352 107993779 97910030 88073059 78369081 69179137
3819F9179137q127944o717641n454126m421867l736165l225230k807860k442503
$$ 69179137 61051193 54333552 48879426 44457559 40721394 37496164 34688304 32245801
3811C2245801k077260j780479j594523j414096j258366j102857r83770r01366
$$ 32245801 30168541 28388062 26793539 25379443 24121077 23018220 22034450 21133084
3803B1133084q53244q13717p44832o33807n63719n21582n37998n75634n94403
$$ 21133084 20279840 19466123 18721291 18087484 17523765 17002183 16464185 15888551 15294148
3794A5294148o36530o60904n77949n54997n08824m59334n01450m63928k85090
$$ 15294148 14657618 13996714 13418765 12863768 12354944 11895610 11394160 10930232 10645142
3785A0645142k00603k14360k01936k10969k54845k37473j63222j43595r2877o5512
$$ 10645142 10444539 10230179 10028243 9817274 9562429 9324956 9161734 9018139 8925262 8859750
3775H859750j09484j49613j46394j90897k24235k54240k36472k10675j77181q7770
$$ 8859750 8750266 8600653 8454259 8263362 8039127 7784887 7548415 7337740 7160559 7072789
3765G072789n1923n740j7852o0662j43997k39165k64016k45938k06232j60447
$$ 7072789 7020866 7015126 6997274 6936612 6792615 6553450 6289434 6043496 5837264 5676817
3755E676817r0927j20366l4311j1233J1880N2720J32152J22407K21734L01555
$$ 5676817 5585890 5465524 5431213 5419980 5431860 5484580 5616732 5739139 5960873 6262428
3745F262428M09380N38601O97338Q80676Q72310J63389r30712j387355j137638
$$ 6262428 6671808 7210409 7907747 8788423 9660733 9824122 8893410 7506055 6368417
3736F368417q33524n91220m75098m10637l27347k69489k51532k00615j39394q3984
$$ 6368417 5534893 4943673 4468575 4057938 3730591 3461102 3209570 3008955 2869561 2785577
3726B785577r6370n7379o3736n0552p7410j03648j16061n2581l9250n9056n0961
$$ 2785577 2689207 2631828 2568092 2517540 2440130 2336482 2220421 2167840 2128590 2069534 2018573
3715B018573J05j004J436K848k6291m8734o1442q2041n8350l0983j5295j3269
$$ 2018573 2018678 2017674 2019110 2021958 1995667 1946933 1885491 1803450 1745100 1714117 1698822 1685553
3703A685553J3219L0463L1322O7408J4190m4000o6482j48675j48946j04996r7049
$$ 1685553 1698772 1729235 1760557 1827965 1842155 1798155 1731673 1582998 1434052 1329056 1232007
3692A232007j19179p1059j4617j4193q641J9954J6005N745p554J581N956J3949
$$ 1232007 1112828 1041769 1027152 1012959 1004318 1024272 1040277 1046022 1038468 1040049 1046005 1059954
3680A059954M9537N5048M8896K4240K9976M2464J1429l8345j20320j13008j07251
$$ 1059954 1109491 1164539 1213435 1237675 1267651 1310115 1321544 1283199 1162879 1049871 942620
3669I42620q0873o5847q3337m4936m6481o4878k9841J2719N3086J1593N0790L6787
$$ 942620 861747 795900 712563 667627 621146 556268 526427 539146 592232 603825 654615 691402
3657F91402l370L1330Q0776Q0725J26316J69036J41379K14760K54375K50206L3007
$$ 691402 688032 719362 800138 880863 1007179 1176215 1317594 1532354 1786729 2036935 2069942
3646B069942l01436l76648l27731k52005j98554j28344q4766n8678m3090n9522
$$ 2069942 1768506 1391858 1064127 812122 613568 485224 400458 341780 298690 239168
3636B39168j8652p915J6991l445M230j9469K2214l0375k4941r05J1994k0489o057
$$ 239168 220516 212601 229592 226147 230377 210908 233122 202747 177806 176901 188895 168406 162349
3623A62349j0647j9526k0528j1402m2438k947j803l590M6649O8936M0217L4182
$$ 162349 151702 132176 111648 100246 57808 54861 53058 49468 96117 165053 205270 239452
3611B39452q883j5053J517k025k624l4299m4124l9049m6849k2660j5566k3410
$$ 239452 230569 215516 217033 215008 212384 178085 133961 94912 48063 25403 9837 -13573
3599a3573j2008j8907m902K3891M7751O6483L1110l842m252O1478K7657O6542
$$ -13573 -25581 -44488 -49390 -25499 22252 88735 119845 116003 111751 173229 200886 267428
3587B67428N5993K2481P018J8986M836j8842j7904q907j8234j6698o921m3718
$$ 267428 323421 345902 352920 371906 376742 357900 339996 331089 312855 296157 289236 245518
3575B45518l2687j2456M0K1153Q844K5347K2619J6169L5596L8752M2294L1563
$$ 245518 212831 200375 200415 221568 230412 255759 278378 294547 330143 368895 411189 442752
3563D42752K4254N8223K8011L9751P2533M3250O8891P2647O0018N9222J1473P3848
$$ 442752 467006 525229 553240 592991 665524 708774 777665 850312 910330 969552 981025 1054873
3551A054873O9311O6360J05862R2843P6635R9527J75970K35724K79631L18858
$$ 1054873 1124184 1190544 1296406 1389249 1465884 1565411 1741381 1977105 2256736 2575594
3541B575594L28283J23451j98984l69129k82343j92187r7189n8947n0200M031
$$ 2575594 2903877 3027328 2828344 2459215 2176872 1984685 1887496 1828549 1778349 1782380
3531A782380M5945L8854M9348O9561K7166O0189J28511J08175J34080J17038J03154
$$ 1782380 1828325 1867179 1916527 1986088 2013254 2073443 2201954 2310129 2444209 2561247 2664401
3520B664401P2135Q4192P5241M6470L6444L3099M7325L7872O6117P0737O5216
$$ 2664401 2736536 2820728 2895969 2942439 2978883 3011982 3059307 3097179 3163296 3234033 3299249
3509C299249N0666N9759R9769J02178J17562J24144J35233J30057J40625J47132
$$ 3299249 3349915 3409674 3509443 3611621 3729183 3853327 3988560 4118617 4259242 4406374
3499D406374K18043J94545J77059J73107J70455J95697J77270J90770J93622K06350
$$ 4406374 4624417 4818962 4996021 5169128 5339583 5535280 5712550 5903320 6096942 6303292
3489F303292K15526J65932J94014J89235K10165K32788K24328K65316K87001L38305
$$ 6303292 6518818 6684750 6878764 7067999 7278164 7510952 7735280 8000596 8287597 8625902
3479H625902L90895M44954M58912M60043M66270M96904N90712O38531O19591O09002
$$ 8625902 9016797 9461751 9920663 10380706 10846976 11343880 11934592 12573123 13192714 13801716
3469A3801716O11762O27402O98935P95164R66654J048707J172161J300379J476517
$$ 13801716 14413478 15040880 15739815 16534979 17501633 18550340 19722501 21022880 22499397
3460B2499397J591316J770743J930977K153174K386338K673622K971441L341088
$$ 22499397 24090713 25861456 27792433 29945607 32331945 35005567 37977008 41318096
3452D1318096L846988M455933N326438O510594Q024857J0013325J2371640J5028296
$$ 41318096 45165084 49621017 54947455 61458049 69482906 79496231 91867871 106896167
3444A06896167J7906830K1052474K2202434J4474453o332118k6223193l0312319
$$ 106896167 124802997 145855471 168057905 182532358 176200240 149977047 119664728
3437A19664728k4584736j8097294j3228068r774285p385550n755074m578183l749072
$$ 119664728 95079992 76982698 63754630 53980345 46594795 40839721 36261538 32512466
3429C2512466l178065k723671k378694k098510j877320j664672j444026j245451
$$ 32512466 29334401 26610730 24232036 22133526 20256206 18591534 17147508 15902057
3421A5902057j082539r43509q46147p80446p02651o34345n94072n83200n64030
$$ 15902057 14819518 13876009 13029862 12249416 11546765 10912420 10318348 9735148 9171118
3412I171118m76339m28060l71842l25318k89002k77503l13122l12603k98208k29605
$$ 9171118 8694779 8266719 7894877 7569559 7280557 7003054 6689932 6377329 6079121 5849516
3402E849516j78161k01609j88986j85794j54877j45890j91397j75346r6010j26094
$$ 5849516 5671355 5469746 5280760 5094966 4940089 4794199 4602802 4427456 4331446 4205352
3392D205352j31990j33493j10225j33801j31568j29514j48762j24524j39924j22806
$$ 4205352 4073362 3939869 3829644 3695843 3564275 3434761 3285999 3161475 3021551 2898745
3382B898745j28296j52920j21177j09315r0037j09321j28961j04744o5824m1806
$$ 2898745 2770449 2617529 2496352 2387037 2297000 2187679 2058718 1953974 1888150 1846344
3372A846344m6026n4234q1535r1041l5958o0775o0324j02451o6326m0948n7601
$$ 1846344 1800318 1746084 1664549 1573508 1537550 1476775 1416451 1314000 1247674 1206726 1149125
3361A149125l8801o0104m6843p7111r5718p1216m0502m3453l1978k0009j3218
$$ 1149125 1110324 1050220 1003377 926266 830548 759332 718830 675377 643399 623390 610172
3350F10172K4594L854K7591j60O515k4593n8343m2695R702l604J0138N164j3407
$$ 610172 634766 638620 666211 666051 672566 647973 589630 546935 556637 553033 563171 568335 554928
3337E54928n02m806l6714n6732o5620m2430j7319k9480J5640M4186J7643r341
$$ 554928 554426 549620 512906 456174 390554 348124 330805 301325 316965 361151 378794 369453
3325C69453J816o071J7651j5107r060m2295m8864o5503o4779l7052l6185j8708
$$ 369453 371269 365198 382849 367742 358682 316387 267523 202020 137241 100189 64004 45296
3313D5296j3398p787P680K0573M016k7470O97M870o998j4825m557K0909j3184
$$ 45296 31898 24111 31791 52364 56380 28910 29607 34477 27479 12654 8097 29006 15822
3300A5822q226q707O002j7507n3900m4135l1232k4463k2910k0401k1227m246J5794
$$ 15822 7596 -1111 4891 -12616 -66516 -110651 -141883 -166346 -189256 -209657 -230884 -235130 -219336
3287b19336P892j633M2839J3305K0753R216J5893n237R643J3605j8507L140J5341
$$ -219336 -211444 -213077 -170238 -156933 -136180 -126964 -111071 -116308 -106665 -93060 -111567 -108427 -93086
3274i3086J2528J9249j0588j7418j2655J7044j732m533k4128j7878J2284L288
$$ -93086 -80558 -61309 -71897 -89315 -101970 -84926 -86658 -91191 -115319 -133197 -120913 -117625
3262a17625L1181n137m3009l0351j4241p199k4371l1083l5458j6303J3238K0065
$$ -117625 -86444 -91581 -134590 -164941 -179182 -186381 -210752 -241835 -277293 -293596 -280358 -260293
3250b60293J7522L3457J6177l532K4796L9111L9358L2209Q623J3305l871J1882
$$ -260293 -242771 -209314 -193137 -196669 -171873 -132762 -93404 -61195 -52572 -39267 -43138 -31256
3238c1256j4180j3180k9850j9500j456j9949j4210J5423K8656l3256l3495K8658
$$ -31256 -45436 -58616 -88466 -107966 -109422 -129371 -143581 -128158 -99502 -132758 -166253 -137595
3226a37595K391j6057N1810O2320l483J2152K2057K3929J7878L9072J5873J6297
$$ -137595 -135204 -151261 -99451 -37131 -40614 -28462 -6405 17524 35402 74474 90347 106644
3214A06644L0988N127O219P88K796J2950l999p27j3968j1885k9360k0361L0371
$$ 106644 137632 142759 148978 149766 152562 165512 161513 160786 146818 134933 105573 85212 115583
3201A15583P390L5392L1319L9648P990K4607O192J8216L3513L2243K0619j6132
$$ 115583 122973 158365 189684 229332 237322 261929 268121 286337 319850 352093 372712 356580
3189C56580j517K2398K6306K4094L3381L0925K2554M4382n420j5568K1235M4747
$$ 356580 355063 377461 403767 427861 461242 492167 514721 559103 553683 538115 559350 604097
3177F04097N0458M2604M0740L6153J9096L8128L2974L7639L2121k1227J6526N8264
$$ 604097 654555 697159 737899 774052 793148 831276 864250 901889 934010 912783 929309 987573
3165I87573O3401M4620J2808M5376P6092J15693J04284J00874Q1314P7158N8642
$$ 987573 1050974 1095594 1108402 1153778 1229870 1345563 1449847 1550721 1632035 1709193 1767835
3154A767835P5748J40287J09739J26535J16265J27871J46803J53141J68931J74195
$$ 1767835 1843583 1983870 2093609 2220144 2336409 2464280 2611083 2764224 2933155 3107350
3144C107350J74812J95016K17606K19762K50842K91584K97544L36853L96071M57726
$$ 3107350 3282162 3477178 3694784 3914546 4165388 4456972 4754516 5091369 5487440 5945166
3134E945166N53087O09920O65298P03165P06471N83210L34906M5425j86891k82411
$$ 5945166 6498253 7108173 7773471 8476636 9183107 9766317 10101223 10146648 9959757 9677346
3124I677346k48200j28191J5479J48880K33078K32988J53309j8996j92703l81516
$$ 9677346 9429146 9300955 9316434 9465314 9698392 9931380 10084689 10065693 9872990 9491474
3114I491474m58527m50579l60182k88941j92546p7554J2276L0048R8362J56995
$$ 9491474 9032947 8582368 8222186 7933245 7740699 7663145 7675421 7705469 7803831 7960826
3104G960826K03966K69835L34766M48783N50559O51369P57523Q10158O25887K02069
$$ 7960826 8164792 8434627 8769393 9218176 9768735 10420104 11177627 11987785 12613672 12815741
3094A2815741l34355p59154q44664p25780n11904k98001j21433j4310R7694J71565
$$ 12815741 12481386 11722232 10877568 10151788 9639884 9341883 9220450 9206140 9303834 9475399
3084I475399K41620K99088L91378M56747N49258O50385P80228R39680J127205
$$ 9475399 9717019 10016107 10407485 10864232 11413490 12063875 12844103 13783783 14910988
3075A4910988J342291J563829J857747K090111K424159K781837K866665K271808
$$ 14910988 16253279 17817108 19674855 21764966 24189125 26970962 29837627 32109435
3067C2109435R27599j002508k690699l546512l445770k689183j909707j295101
$$ 32109435 33037034 32034526 29343827 25797315 22351545 19662362 17752655 16457554
3059A6457554q84499n83684l29069j38683J0360J61729L45527M92113O74965Q82968
$$ 16457554 15573055 14989371 14660302 14521619 14531979 14693708 15039235 15531348 16206313 17089281
3049A7089281J133362J409339J681723K022040K425201K793340L214417L368262
$$ 17089281 18222643 19631982 21313705 23335745 25760946 28554286 31768703 35136965
3041C5136965L195175K498392J111453o45172k539015m129221m572473m309791
$$ 35136965 38332140 40830532 41941985 41296813 38757798 34628577 30056104 25746313
3033B5746313l612891k717714j972437j450172j062529p76198n71095l86424k21381
$$ 25746313 22133422 19415708 17443271 15993099 14930570 14154372 13583277 13196853 12975472
3024A2975472n1881Q2149K71472M33109O10675Q31929J041606J262820J550591
$$ 12975472 12923591 13005740 13277212 13710321 14320996 15152925 16194531 17457351 19007942
3015A9007942J850818K130633K292481K027574J259318o5211j678100k923439
$$ 19007942 20858760 22989393 25281874 27309448 28568766 28503555 26825455 23902016
3007B3902016l509717l395251k657682j955573j470624j094641q52762o62976
$$ 23902016 20392299 16997048 14339366 12383793 10913169 9818528 8965766 8302790
2999H302790n50361m55794l57104k84036k02260j50723j00108k4076J4730J52076
$$ 8302790 7752429 7296635 6939531 6655495 6453235 6302512 6202404 6178328 6193058 6345134
2989F345134K27549K43082L20584M25742M62575M50261M08271P4117m21987q13432
$$ 6345134 6572683 6815765 7136349 7562091 8024666 8474927 8883198 8957315 8535328 7721896
2979G721896j035773r54216p82054o06307m61283l33426k40703j81522j96374
$$ 7721896 6686123 5731907 4949853 4343546 3882263 3548837 3308134 3126612 2930238
2970B930238j91042j74268j76462j24392j25880p5660l3395o5759o1452l3414
$$ 2930238 2739196 2564928 2388466 2264074 2138194 2062534 2029139 1963380 1901928 1868514
2960A868514o4226n2975k6087p6777n0662m4872l5679l2186m8670k0235j6515
$$ 1868514 1804288 1751313 1725226 1648449 1597787 1552915 1517236 1485050 1436380 1416145 1399630
2949A399630j8859M391J8269l4164q2047q9750j04948m2084l1849m1041m8848
$$ 1399630 1380771 1385162 1403431 1369267 1287220 1197470 1092522 1050438 1018589 977548 928700
2938I28700J9342j945K0912j4836j0053j1856l1996m6717j5938l580m1606j0710
$$ 928700 948042 946097 967009 952173 942120 930264 898268 851551 835613 832033 790427 779717
2926G79717J2973n832O2933Q8035M0401L1096M721J1556k0861n224m2799p6694
$$ 779717 792690 786858 849791 937826 978227 1009323 1014044 1025600 1004739 999515 956716 880022
2914H80022r0077j01403n4211j994l7558m5935k9967q016l2145k4001k8913m5906
$$ 880022 789945 688542 634331 632337 594779 548844 518877 510861 478716 454715 425802 379896
2902C79896k9680j5289l50Q789L7481K4735M123M1054M8142N8433P1101N5511
$$ 379896 350216 334927 334577 343366 380847 405582 409705 450759 498901 557334 628435 683946
2890F83946M6591m743l3375n8389j17130q9695q0208r4335q2435m0856n3599l9416
$$ 683946 730537 725794 692419 634030 516900 427205 346997 252662 170227 129371 75772 36356
2878C6356m647k902j1142J933m786l5680J3276M720q508r212q389L6132J2800
$$ 36356 31709 28807 17665 19598 14812 -20868 -7592 -2872 -11380 -20592 -28981 7151 19951
2865A9951q618Q843O1052M2967L2839L9306J2295m8163n6549p0250q1484m0626
$$ 19951 11333 20176 81228 124195 157034 196340 208635 160472 103923 33673 -47811 -88437
2853h8437n7788l3803m2455k2529m40K1976K3257n648J2033o334l6388P545k9629
$$ -88437 -146225 -180028 -222483 -245012 -245452 -223476 -200219 -205867 -193834 -200168 -236556 -229011 -258640
2840b58640J849l30o419K5944J0313k1271J6503K2639J8575p911n878Q620j2316
$$ -258640 -256791 -257121 -263540 -237596 -227283 -248554 -232051 -209412 -190837 -198748 -204626 -196006 -208322
2827b08322j4544O749j9394k1386L185L0549p279j8137j4839q250J5707j7481
$$ -208322 -222866 -216117 -235511 -256897 -253712 -223163 -230442 -248579 -263418 -271668 -255961 -273442
2815b73442q659o112M6330J4078N7709L8068K4096M1442N1431L4186J3573M301
$$ -273442 -282101 -288213 -241883 -227805 -170096 -132028 -107932 -66490 -15059 19127 32700 37001
2803C7001N5384M4217N1033K5257J7714K2480M9200N9228P4496J00009J37661
$$ 37001 92385 136602 187635 212892 230606 253086 302286 361514 436010 536019 673680
2792F73680J39125Q323j02505m5447j4183l2214k5091l848M1747N7917Q0123R7743
$$ 673680 812805 821128 718623 673176 658993 626779 601688 597840 639587 697504 777627 875370
2780H75370J08129N5937P2507M4490P567J5839j5005j2617r099j1145j4881R002
$$ 875370 983499 1039436 1111943 1156433 1164000 1179839 1164834 1152217 1143118 1131973 1117092 1126094
2768A126094K1626J1238N8891R3745J68093K05837K81195L15651K36577p6631
$$ 1126094 1147720 1158958 1217849 1311594 1479687 1685524 1966719 2282370 2518947 2442316
2758B442316l71677l65444k57837j83428j13079m7978m5926m0711o977O132j8828
$$ 2442316 2070639 1705195 1447358 1263930 1150851 1102873 1056947 1016236 1009259 1015391 996563
2747I96563L1038J9004j9545J3305q605n7836q3413q9813j13476j30236o6434
$$ 996563 1027601 1046605 1027060 1040365 1031760 973924 890511 800698 687222 556986 490552
2736D90552l8076J4673J2605K4303O2788L9237K0933M3505P7866k4653j21717
$$ 490552 452476 467149 479754 504057 566845 606082 627015 670520 748386 723733 602016
2725F02016j39204r8007l2975n327l7300n0661n4066l2949m0538n7838k1554l3288
$$ 602016 462812 364805 331830 326503 289203 238542 184476 151527 110989 53151 31597 -1691
2713a691j8781l2400l2328K4323k2209m816L293n622j1695J0282J7688J127J7067
$$ -1691 -20472 -52872 -85200 -60877 -83086 -87902 -84609 -90231 -101926 -91644 -73956 -72829 -55762
2700e5762n347J7053N4348K0010J3130k8429j6413k2778j9229j3158n0539j0523
$$ -55762 -61109 -44056 10292 30302 43432 15003 -1410 -24188 -43417 -56575 -107114 -117637
2688a17637k4143J810p930J878L913N199P106n248j9199k5280m975Q819k2274
$$ -117637 -141780 -139970 -147900 -146022 -142109 -136910 -129804 -135052 -154251 -179531 -184506 -175687 -197961
2675a97961j4132n906P883K8789o402j187J646j196k4656l282o066l278j3025
$$ -197961 -212093 -217999 -210116 -181327 -187729 -188916 -187270 -188466 -213122 -216404 -222470 -225748 -238773
2662b38773m990P600J4209j1636K6397M5966J5235n731l0114j9889j9409N298
$$ -238773 -243763 -236163 -221954 -233590 -207193 -161227 -145992 -151723 -181837 -201726 -221135 -215837
2650b15837r382j2974j1468o771j5763j6650j6030j4279J16j9976R998O051J2915
$$ -215837 -225219 -238193 -249661 -256432 -272195 -288845 -304875 -319154 -319038 -339014 -329016 -322965 -310050
2637c10050M2331J0213M4443l122J834K4593k233j3107K093o555l9278k176J0756
$$ -310050 -267719 -257506 -213063 -216185 -214351 -189758 -191991 -205098 -203005 -209560 -248838 -251014 -240258
2624b40258j0908k97R565J4018L6402j2708J6755M225n0088J0827q412J9787L7730
$$ -240258 -251166 -251463 -241898 -227880 -191478 -204186 -187431 -183206 -233294 -222467 -230879 -211092 -173362
2611a73362K3896k0659j0144K6491L0996J0768J8449J6901K6066R642P742J7587
$$ -173362 -149466 -170125 -180269 -153778 -122782 -112014 -93565 -76664 -50598 -40956 -33214 -15627
2599a5627Q379L7673k9103j1654m0329p013J6169j7388k0362J1714l2832m638
$$ -15627 -7248 30425 1322 -10332 -50661 -57674 -41505 -58893 -79255 -67541 -100373 -105011
2587a05011J1814K2430M632J3314K7994J2491N5028K4110L9106K9011k8097J3224
$$ -105011 -93197 -70767 -66135 -52821 -24827 -12336 42692 66802 105908 134919 106822 120046
2575A20046o871l8637J0049K3503j4028l2958l7268j7058o49k147o085K8479J0642
$$ 120046 113175 74538 84587 108090 94062 61104 23836 6778 6129 3982 -2103 26376 37018
2562C7018J1255M9250L7147J5683K444j1602m732J1152j0141q31J7143o43L875
$$ 37018 48273 97523 134670 150353 152797 141195 136463 147615 137474 136643 153786 153143 157018
2549A57018k1572j6493K7260L357j1815O978Q372l371J0799K0584K8419j7894
$$ 157018 135446 118953 146213 149570 137755 144733 153105 149734 160533 181117 209536 191642
2537A91642j1138j9434k8051J340J4562j5430K486n319J6282p576j9k0860j6191
$$ 191642 180504 161070 133019 134359 148921 133491 135977 130658 146940 139364 139345 118485 102294
2524A02294J4930k767J5186M4007o292J2603o667j92j8361m8471m191J5529q034
$$ 102294 117224 114457 129643 173650 167358 179961 173294 173102 154741 106270 102079 117608 109574
2511A09574n251j076L076j1920K72J6340L031k0066N90K2558L8419K1911K4883
$$ 109574 104323 103247 106323 94403 94675 111015 114046 93980 94570 117128 155547 177458 202341
2498B02341J6934K465k1825L590p817p0701j9337j6754J5255L834k7571j6519
$$ 202341 219275 221740 199915 203505 195688 124987 105650 88896 104151 107985 80414 63895
2486F3895k400K3161K362j1989M5581N338j6066l253R04J6257K8883j7687r204
$$ 63895 61495 84656 87018 75029 120610 125948 109882 106629 107533 123790 152673 134986 125782
2473A25782j0365N193j0926l887j116q458K0954m025K9869j346J5354P488n661
$$ 125782 115417 120610 109684 105797 104681 96223 117177 113152 143021 141675 157029 164517 158856
2460A58856J3551j2940J0943k6253N25O478J0623M178m978k5150m962R06j9120
$$ 158856 172407 159467 170410 144157 144682 151160 161783 165961 160983 135833 130871 131777 112657
2447A12657J1624N4198Q998j8975J0807K9986J4579Q806L1979N443N12M6724l402
$$ 112657 124281 178479 187477 168502 179309 209295 223874 232680 264659 270102 270614 317338 313936
2434C13936j610k71j9472P087j3300K0692j1852k5178J4718j7568J1618j7756
$$ 313936 312326 312055 292583 299670 286370 307062 295210 270032 284750 267182 278800 261044
2422B61044r953K5766J6844L7495p006J6570K2219k0547k072r27J6054K0404K4994
$$ 261044 251091 276857 293701 331196 324190 340760 362979 342432 340360 339433 355487 375891 400885
2409D00885Q325J0686J2628j4505J7823K2253J0799P277Q010j3922n56K4976P740
$$ 400885 409210 419896 432524 418019 435842 458095 468894 476171 484181 470259 469703 494679 502419
2396E02419J1636K1690J32L1144J2272J7611O35j6849j7075N275K8708K0239M761
$$ 502419 514055 535745 535877 567021 579293 596904 597539 580690 563615 568890 597598 617837 622598
2383F22598K009J4062J831J8649J3516J4223M1091J1103N572K8888L1025L7002
$$ 622598 624607 638669 640500 659149 672665 686888 727979 739082 744654 773542 804567 841569
2371H41569K7455Q32K0872M3763M1516M4756j918L7663O0434N7519K7856N9285
$$ 841569 869024 869856 890728 934491 976007 1020763 1018845 1056508 1116942 1174461 1202317 1261602
2359A261602l071j5210m144L2224K1706J5879K5427J3966J9778N2903J0229J9872
$$ 1261602 1258531 1243321 1239177 1271401 1293107 1308986 1334413 1348379 1368157 1421060 1431289 1451161
2347A451161K1045j503L8439O620M3277o153j6999K6844M0096L3630P2965M1206
$$ 1451161 1472206 1470703 1509142 1515762 1559039 1552886 1535887 1562731 1602827 1636457 1709422 1750628
2335A750628K3979O4913L7534O9519O9590M2780O3733P0149Q9504M8895J4631
$$ 1750628 1774607 1839520 1877054 1946573 2016163 2058943 2122676 2192825 2282329 2331224 2345855
2324B345855n1429k5894P314K4017L3817M9753K9604N354L8098M6776J9798N6553
$$ 2345855 2294426 2268532 2275846 2299863 2333680 2383433 2413037 2418391 2456489 2503265 2523063 2579616
2312B579616N1934L9596N6292O8363M4042N5396Q6720O8591L5126M0196N2385
$$ 2579616 2631550 2671146 2727438 2795801 2839843 2895239 2981959 3050550 3085676 3125872 3178257
2301C178257P1327O1284M9672N4497P0879R5030R4624N2863J11034Q5419M4249
$$ 3178257 3249584 3310868 3360540 3415037 3485916 3580946 3675570 3728433 3839467 3924886 3969135
2290C969135P2550O2840Q6872O8909O5840P1521P9784R3576O8625O3609Q0197
$$ 3969135 4041685 4104525 4191397 4260306 4326146 4397667 4477451 4571027 4639652 4703261 4783458
2279D783458O6978O5865R0246P8630J04837J31339J30934J12039J21990J35345
$$ 4783458 4850436 4916301 5006547 5085177 5190014 5321353 5452287 5564326 5686316 5821661
2269E821661J24514J48718J51911J53802J46677J46221J45821J12207J52793J72870
$$ 5821661 5946175 6094893 6246804 6400606 6547283 6693504 6839325 6951532 7104325 7277195
2259G277195J22737J35468J51656J76110J91515J96610K02219K12989K05527K15386
$$ 7277195 7399932 7535400 7687056 7863166 8054681 8251291 8453510 8666499 8872026 9087412
2249I087412K18564K09245K13261K67797K70015K72627L09729K89881L23254L73119
$$ 9087412 9305976 9515221 9728482 9996279 10266294 10538921 10848650 11138531 11461785 11834904
2239A1834904L93098M11043M11154M66009N08578N18861N87344O51190P07117
$$ 11834904 12228002 12639045 13050199 13516208 14024786 14543647 15130991 15782181 16489298
2230A6489298P25255Q08368R01014R73358J069454J155084J185880J263056J363882
$$ 16489298 17214553 18022921 18923935 19897293 20966747 22121831 23307711 24570767 25934649
2221B5934649J383410J430574J438928J309468J136505Q55750M24133j40188p28095
$$ 25934649 27318059 28748633 30187561 31497029 32633534 33489284 33913417 33773229 33045134
2212C3045134j233188j623621j712574j692497j523702j379650j223686j097675
$$ 33045134 31811946 30188325 28475751 26783254 25259552 23879902 22656216 21558541
2204B1558541r81507q86366p97467p09794o50301n86208n02407m62025m48624
$$ 21558541 20577034 19690668 18893201 18183407 17533106 16946898 16444491 15982466 15533842
2195A5533842l89056l57409l55937l14036l02149k99436k85017k32494k13464
$$ 15533842 15144786 14787377 14431440 14117404 13815255 13515819 13230802 12998308 12784844
2186A2784844k16107k65758k35537k00647k43872k74997k36125k31210k36478
$$ 12784844 12568737 12302979 12067442 11866795 11622923 11347926 11111801 10880591 10644113
2177A0644113k36616k78322k10581k20237k07692k53427k35062k09043k11472
$$ 10644113 10407497 10129175 9918594 9698357 9490665 9237238 9002176 8793133 8581661
2168H581661k44893k60781k55779k16981k26783k37129j98144j75584j30547j45174
$$ 8581661 8336768 8075987 7820208 7603227 7376444 7139315 6941171 6765587 6635040 6489866
2158F489866j51467j55128j10501j16759r5530j16203j18398r7234r8642r9950
$$ 6489866 6338399 6183271 6072770 5956011 5860481 5744278 5625880 5528646 5430004 5330054
2148E330054r5868q8233r4897o3340m6463o8988r3449p2520m8418o1413k4736
$$ 5330054 5234186 5145953 5051056 4987716 4941253 4872265 4778816 4706296 4657878 4596465 4571729
2137D571729k6960j6983l9112l7978n5937j12143j37947j17713j11610j02009
$$ 4571729 4544769 4527786 4488674 4450696 4394759 4282616 4144669 4026956 3915346 3813337
2127C813337p8366o4630q9763m5913k7394l6814m1144m6915n9995l9074j3341
$$ 3813337 3734971 3670341 3580578 3534665 3507271 3470457 3429313 3382398 3322403 3283329 3269988
2116C269988m6354k4923n5792n6462r117j0330m0527j2551l7347l2848l9258k1864
$$ 3269988 3223634 3198711 3142919 3086457 3077340 3067010 3026483 3013932 2976585 2943737 2904479 2882615
2104B882615l0982l365l1607k1809q505j7437k9529n3790o9389m7707n7574l5283
$$ 2882615 2851633 2848268 2816661 2794852 2786347 2768910 2739381 2685591 2616202 2568495 2510921 2475638
2092B475638n3647r651k7629l5866k3431k6900o2996n661m0551n2228j9522k3422
$$ 2475638 2421991 2412340 2384711 2348845 2325414 2298514 2235518 2229857 2189306 2137078 2117556 2094134
2080B094134r435p222j5814k2242n181K302k2521J489M535m5803k9532j6376o28
$$ 2094134 2084699 2077477 2061663 2039421 2034240 2036542 2014021 2015510 2020045 1974242 1944710 1928334 1927706
2067A927706J978L784k9234J3226k1225l8165m6285q664J6214l083k7255j6921
$$ 1927706 1929684 1933468 1904234 1917460 1896235 1858070 1811785 1803121 1819335 1816252 1788997 1772076
2055A772076k1454J2785j3404k4926L471j9754k389J3847N504j1113r608j0891
$$ 1772076 1750622 1763407 1750003 1725077 1728548 1708794 1706405 1720252 1725756 1714643 1705035 1694144
2043A694144j4282J4100m2163j2250K208k7646j5281l8236j3455l4189p59j4175
$$ 1694144 1679862 1693962 1651799 1639549 1641757 1614111 1598830 1560594 1547139 1512950 1512191 1498016
2031A498016l0291p10l0329m2306k6660j9181j0172J3828J0544j9508l8814k4750
$$ 1498016 1467725 1467015 1436686 1394380 1367720 1348539 1338367 1352195 1362739 1343231 1304417 1279667
2019A279667Q393n362K3537k2790l3919R705j1046J3170J526J815j4537j5534
$$ 1279667 1288060 1282698 1306235 1283445 1249526 1259231 1248185 1261355 1262881 1264696 1250159 1234625
2007A234625k0143j0524r352l1159k3319K5690m942j7306n929M429q849m9896
$$ 1234625 1214482 1203958 1194606 1163447 1140128 1165818 1160876 1143570 1137641 1142070 1133221 1083325
1995A083325m358K1034J3907O408L0973k2535k1139j8618l159K7306J1520N549
$$ 1083325 1078967 1100001 1113908 1120316 1151289 1128754 1107615 1088997 1085838 1113144 1124664 1130213
1983A130213K7060N784J4995L2640Q366K3024K2805L0076N8371K5685L4245N3870
$$ 1130213 1157273 1163057 1178052 1210692 1219058 1242082 1264887 1294963 1353334 1379019 1413264 1467134
1971A467134K6584L5877M6284O3833N9936K4345j1538J5094M984j527L70j5784
$$ 1467134 1493718 1529595 1575879 1639712 1699648 1723993 1712455 1727549 1732533 1731006 1731376 1715592
1959A715592o087K8175q626J8092k7481J8650J3575l262J8147R694P681k0637
$$ 1715592 1709505 1737680 1729054 1747146 1719665 1738315 1751890 1748628 1766775 1776469 1784150 1763513
1947A763513k4377M31K1717K5630R594L5133L4500M5140P2000Q2210J01589J11530
$$ 1763513 1739136 1739567 1761284 1786914 1796508 1831641 1866141 1911281 1983281 2065491 2167080 2278610
1935B278610J17607J20238J24447J30547J48547J15791J46297J27307N8331O6445
$$ 2278610 2396217 2516455 2640902 2771449 2919996 3035787 3182084 3309391 3367722 3434167
1925C434167q568j02495r7352q0343r4313j1700K8082J2275j0660K6620L8557
$$ 3434167 3425599 3323104 3225752 3145409 3051096 3039396 3067478 3079753 3069093 3095713 3134270
1914C134270J0397J5978j4649n0989o9063m1851l8191l947l532K8679N5626O8241
$$ 3134270 3144667 3160645 3145996 3095007 3025944 2984093 2945902 2941955 2938423 2967102 3022728 3090969
1902C090969J12337O7181P8516Q7576J08281J08800J40647J17961J22536J82643
$$ 3090969 3203306 3270487 3349003 3436579 3544860 3653660 3794307 3912268 4034804 4217447
1892D217447J74986J52028J32833J95698J12163R8544R7336Q7108N6190P9705
$$ 4217447 4392433 4544461 4677294 4872992 4985155 5083699 5181035 5268143 5324333 5404038
1882E404038P8838P7478Q2067R3869Q1508k104K4625L0361J1952J4607K9596K5861
$$ 5404038 5482876 5560354 5642421 5736290 5817798 5815694 5840319 5870680 5882632 5897239 5926835 5952696
1870E952696K9130K4444P4062R2194Q3851J46182J52532J75164K22192K80546
$$ 5952696 5981826 6006270 6080332 6172526 6256377 6402559 6555091 6730255 6952447 7232993
1860G232993K46339K62511K97467L09394L18678L54405L98161L88461L05352K60332
$$ 7232993 7479332 7741843 8039310 8348704 8667382 9021787 9419948 9808409 10113761 10374093
1850A0374093J37184J9485j61647l51774m29624m03405l20309k80425k04554j30776
$$ 10374093 10511277 10530762 10369115 10017341 9587717 9184312 8864003 8583578 8379024 8248248
1840H248248m5975J8983L6346P6372J48878J67214J51143K38958K28137K25725
$$ 8248248 8202273 8221256 8257602 8333974 8482852 8650066 8801209 9040167 9268304 9494029
1830I494029J98636K36518K20810K48194K03079J82425J39650M418n3334j83175
$$ 9494029 9692665 9929183 10149993 10398187 10601266 10783691 10923341 10927759 10874425 10691250
1820A0691250k14104k16393k19061k65167l21700l90979m13761l93778l27397
$$ 10691250 10477146 10260753 10041692 9776525 9454825 9063846 8650085 8256307 7928910
1811G928910k63850j92309j55803j01135o4732n6834j9228N705L2342K0841K2677
$$ 7928910 7665060 7472751 7316948 7215813 7151081 7094247 7075019 7080724 7113066 7133907 7156584
1800G156584M914j2880q4857j07766j16078j78373j78676k44377k93171l45062
$$ 7156584 7161498 7148618 7063761 6955995 6839917 6661544 6482868 6238491 5945320 5600258
1790E600258l40457l27336k89093k52495k58372k35306k11791j85436j84117k02039
$$ 5600258 5259801 4932465 4643372 4390877 4132505 3897199 3685408 3499972 3315855 3113816
1780C113816j59747j01376j31468j19826r8540q0035n9533o2107p7062o6908o3876
$$ 3113816 2954069 2852693 2721225 2601399 2502859 2422824 2363291 2301184 2224122 2157214 2093338
1769B093338p3051n9531q3457p6695p5250m3923r5496p4846p3189p3197p5030
$$ 2093338 2020287 1960756 1877299 1800604 1725354 1681431 1585935 1511089 1437900 1364703 1289673
1758A289673n3493r4898o2080n9413o8689n3478k7236k5673m4460k3781j9295
$$ 1289673 1236180 1141282 1079202 1019789 951100 897622 870386 844713 800253 776472 757177
1747G57177n9176m2142k9255m3317k7192l2273m5536k6137l0188k2710J0395j2121
$$ 757177 698001 655859 626604 583287 556095 523822 478286 452149 421961 399251 409646 397525
1735C97525j8460K0918j0235l7805j3289k4229k2287Q836j4484k4222k0345j1867
$$ 397525 379065 399983 389748 351943 338654 314425 292138 300974 286490 262268 241923 230056
1723B30056j1961k1920k3265j9926l1680m4781q744q648r101k0996L047j5985
$$ 230056 218095 196175 172910 152984 121304 76523 67779 59131 50030 29034 32081 16096
1711A6096o2507l413j9580k2865J851l421k7150j3876o783J3983j3373K676Q29
$$ 16096 -46411 -49824 -69404 -92269 -90418 -93839 -120989 -134865 -141648 -127665 -141038 -138362 -137533
1698a37533k5593j6576J0681K223j2069l3212l3587L70k7581k5933r681k842o358
$$ -137533 -163126 -179702 -169021 -166798 -178867 -212079 -245666 -245296 -272877 -298810 -308491 -311333 -317691
1685c17691r943r872M771m8379m31l0760j6454M884m749j6086Q96l4835J2403
$$ -317691 -327634 -337506 -332735 -381114 -381545 -412305 -428759 -423875 -428624 -444710 -443814 -478649 -466246
1672d66246J2118J113j4457j2016j6288J0831k463m018k3523m515O249K6165m467
$$ -466246 -454128 -453015 -467472 -479488 -495776 -484945 -487408 -491426 -514949 -519464 -513215 -487050 -491517
1659d91517k7490p351R336j4171k3637J983q177J0204j718l920j2088J4763L6051
$$ -491517 -519007 -526358 -517022 -531193 -554830 -552847 -561024 -550820 -552538 -556458 -568546 -553783 -517732
1646e17732K5519j390k2077p077m219N860N529k811m232O61K3018n180j5420J0723
$$ -517732 -492213 -493603 -515680 -522757 -526976 -521116 -515587 -518398 -522630 -521969 -498951 -504131 -519551 -508828
1632e08828j77O715k1506K5914L8203j21l6472j5359K686l1540M505L7672P588
$$ -508828 -509005 -502290 -523796 -497882 -459679 -459800 -496272 -511631 -508945 -540485 -535980 -498308 -490720
1619d90720j1650K7316J748O55m2529R831o637J5056P271n647R411J3689J3087
$$ -490720 -502370 -475054 -473306 -472651 -515180 -505349 -511986 -496930 -489659 -495306 -485895 -472206 -459119
1606d59119J2983J5397r795j043q26j466J2570K7612K334p71J0641Q648k986K4689
$$ -459119 -446136 -430739 -440534 -441577 -442403 -443869 -431299 -403687 -401353 -402124 -391483 -382835 -385821 -361132
1592c61132K8900m457L589L264K3266K3231J6746K3151p10k087J0966R430q53
$$ -361132 -332232 -336689 -333100 -329836 -306570 -283339 -266593 -243442 -244152 -246239 -235273 -225843 -226696
1579b26696J9421J336k4685p715j208P698l191K6746L3403k3580K2903M6694L8460
$$ -226696 -207275 -205939 -230624 -238339 -239547 -231849 -235040 -208294 -174891 -198471 -175568 -128874 -90414
1566i0414L3392N694p290O994K5922J8523q662l3848o862J9494K5588N167L283
$$ -90414 -57022 -51328 -58618 -51624 -25702 -7179 -15841 -49689 -56551 -37057 -11469 -6302 -3019
1553c019l268R321P531K9538L4754L4277K5996O987J1602j2527P017m391k258
$$ -3019 -6287 3034 10565 40103 74857 109134 135130 142117 153719 141192 148209 143818 141560
1540A41560l24l4488P862J9691J6897J1597j7921J1193O9692L6395M5592M4831
$$ 141560 141236 106748 114610 134301 151198 162795 144874 156067 225759 262154 307746 352577
1528C52577M6949K0165n697j5887l2013j2077m7962m2774l3047j7561m1998l7351
$$ 352577 399526 419691 413994 398107 366094 354017 306055 263281 230234 212673 170675 133324
1516A33324l8446m0258j5694L694K3385m90J6336J4667n918O83RL534K3056n0345
$$ 133324 94878 54620 38926 42620 66005 65515 81851 96518 90600 91283 91292 94826 117882 67537
1502F7537j0397J0922j6076n41J4624k0392J891k4392J1761j6517Q452M3153K3062
$$ 67537 57140 68062 51986 51445 66069 45677 47568 23176 34937 18420 26872 70025 93087
1489I3087K6307O994j6760o7301n2848j6978j4452n4861l2862m8976m7032n0116
$$ 93087 119394 126388 109628 42327 -10521 -27499 -41951 -96812 -129674 -178650 -225682 -275798
1477b75798p009K0990m469j169j4564l083r979j8853J9221j0996j8366N318K3561
$$ -275798 -282807 -261817 -266286 -267455 -282019 -285102 -295081 -313934 -294713 -305709 -324075 -318757 -295196
1464b95196j4616j6389j2826q002j5067l4p103N623n316K4283j5507o199N26q085
$$ -295196 -309812 -326201 -339027 -347029 -362096 -362130 -369233 -363610 -368926 -344643 -360150 -366349 -365823 -373908
1450c73908l7973k97J2297O782J5449j2644k1385k4369k6908n3490K6368N003
$$ -373908 -411881 -412178 -399881 -393099 -377650 -390294 -411679 -436048 -462956 -516446 -490078 -485075
1438d85075j6040j3113n576P221k089k4241J043k239j8661J7172m358J7367l5296
$$ -485075 -501115 -514228 -519804 -512583 -514672 -538913 -537870 -540109 -558770 -541598 -545956 -528589 -563885
1425e63885o722J8733j0275n591j6035O941l1169k496o162P530j5553J641J6524
$$ -563885 -570607 -551874 -562149 -567740 -583775 -576834 -608003 -610499 -616661 -609131 -624684 -623043 -606519
1412f06519k3249k9005J4191L0342K5934J4l8407N0J5160j530j3381J4934R662
$$ -606519 -629768 -658773 -644582 -614240 -588306 -588292 -626699 -626649 -611489 -613019 -626400 -611466 -601804
1399f01804j8704k749J3184j7378K4021M641k1261l0654K3809J2519M15o941j508
$$ -601804 -620508 -623257 -610073 -627451 -603430 -598789 -620050 -650704 -626895 -614376 -613961 -620902 -622410
1386f22410R032K648n704k605J8524l890q020J4214l542j9841j3161j0756j0280
$$ -622410 -613378 -610730 -616434 -619039 -600515 -604405 -612425 -598211 -601753 -621594 -634755 -645511 -655791
1373f55791K6883L2815j73l9789p811O601J2978J2769J481N864k4375M934J4822
$$ -655791 -628908 -596093 -596266 -636055 -643866 -637265 -624287 -611518 -610037 -604173 -628548 -623614 -608792
1360f08792J9008k5134k0003J5318M099K38o328m0099J7687K7414J6405j6419
$$ -608792 -589784 -614918 -634921 -619603 -615504 -615266 -621594 -661693 -644006 -616592 -600187 -616606
1348f16606P750J1104j820K4329n953r852J587j155R254q634l003J0561l297k4516
$$ -616606 -608856 -597752 -599572 -575243 -581196 -591048 -589461 -590616 -581362 -589996 -592999 -582438 -585735 -610251
1334f10251j5264j1194N308J6960o750m296k011n016J4827R918K0945j8487L771
$$ -610251 -625515 -636709 -631401 -614441 -621191 -625487 -627498 -632514 -617687 -607769 -586824 -605311 -601540
1321f01540J3561l3054j3770L8317J5129m980J568Q134N699k7012k6854J2860
$$ -601540 -587979 -621033 -634803 -596486 -581357 -586337 -584769 -576635 -570936 -597948 -624802 -611942
1309f11942k624m442O778n68L1100N520k9511J8253j0704R179K7763O677o391
$$ -611942 -614566 -619008 -612230 -612798 -581698 -576178 -605689 -587436 -598140 -588961 -561198 -554521 -560912
1296e60912j9544R965J8499M749M610O781j201J2847L119K0237j17L687L436P880
$$ -560912 -580456 -570491 -551992 -547243 -542633 -535852 -537053 -524206 -521087 -500850 -500967 -497280 -493844 -485964
1282d85964K984l3333L761M253j7630k02q17Q03l1806j4064M439j230L346L8859
$$ -485964 -482980 -516313 -512552 -508299 -525929 -526131 -526948 -526145 -557951 -572015 -567576 -568806 -565460 -526601
1268e26601j2876k4214M281J4226J6876J4809k2328n924J8281O354L456r158j2642
$$ -526601 -539477 -563691 -559410 -545184 -528308 -513499 -535827 -541751 -523470 -517116 -513660 -522818 -535460
1255e35460j650o484M936n592K112K5609k3177k6117Q984J0579M640K5745k6577
$$ -535460 -537110 -543594 -538658 -544250 -542138 -516529 -539706 -565823 -556839 -546260 -541620 -515875 -542452
1242e42452J218m891J1938j2788P827k0699p942J5214K1776K1845j258K513j3206
$$ -542452 -541234 -546125 -534187 -546975 -539148 -559847 -567789 -552575 -530799 -508954 -510212 -507699 -520905
1229e20905p199N702K1455l092J360m93o05k1027r155k4540J2277j6495j421L1277
$$ -520905 -528104 -522402 -500947 -504039 -502679 -503172 -503777 -524804 -533959 -558499 -546222 -562717 -564138 -532861
1215e32861J4622J8184n360q294J3910o715n358J9158L7439j2685k8094k7058
$$ -532861 -518239 -500055 -505415 -513709 -499799 -506514 -511872 -492714 -455275 -467960 -496054 -523112
1203e23112J4030J6318K6j6967j3151r305J611J7636M901J5741K8220J0351l9158
$$ -523112 -509082 -492764 -492738 -509705 -522856 -532161 -530550 -512914 -508013 -492272 -464052 -453701 -492859
1190d92859R408J5419O083J9314p046J031K907J253J4555L730k5089Q000j66L977
$$ -492859 -483451 -468032 -461949 -442635 -449681 -448650 -445743 -444490 -429935 -426205 -451294 -443294 -443460 -439483
1176d39483N453P951j5440J589q53O018R615m289j5045j2626K4126N592j3607
$$ -439483 -434030 -426079 -441519 -439930 -440783 -434765 -425150 -429439 -444484 -457110 -432984 -427392 -440999
1163d40999m730m013J5981M6530p346n949k4881j0248M897K7055J9703K036N22
$$ -440999 -445729 -449742 -433761 -387231 -394577 -400526 -425407 -435655 -430758 -403703 -384000 -381964 -381442
1150c81442p298j1892J556K3973p848l3762K1258j830k925J0109j8120n758K9031
$$ -381442 -388740 -400632 -399076 -375103 -382951 -416713 -395455 -397285 -400210 -390101 -408221 -413979 -384948
1137c84948j2179J6430o494k6434R978L206J0214L4279J3433p505K384J423j8427
$$ -384948 -397127 -380697 -387191 -413625 -403647 -400441 -390227 -355948 -342515 -350020 -347636 -346213 -364640
1124c64640j1601K7491R967j6245K1699K0184j6240j1160J0020K1016O234o792
$$ -364640 -376241 -348750 -338783 -355028 -333329 -313145 -329385 -340545 -330525 -309509 -303275 -310067
1112c10067Q962J9764j3252J1153P559O340J5143l3355N606J0240K5317J3166
$$ -310067 -301105 -281341 -294593 -283440 -275881 -269541 -254398 -287753 -282147 -271907 -246590 -233424
1100b33424M514n096O930K0412L8457O158o085R888M8605m827k3975K0640j825
$$ -233424 -228910 -234006 -227076 -206664 -168207 -162049 -168134 -158246 -109641 -114468 -138443 -117803 -119628
1087a19628L7485K3813J2701j1850l389m963r014m7o509J4838N4636J123o483
$$ -119628 -82143 -58330 -45629 -57479 -60868 -65831 -74845 -74892 -81401 -66563 -11927 -10804 -17287
1074a7287N796J0195J1033k6543K1100L3831j0939j16j0094R014J2548L2404n112
$$ -17287 -11491 -1296 9737 -16806 4294 38125 27186 27070 16976 25990 38538 70942 65830
1061F5830K6165j5223L4061J8103J7232J3334L5652q944K564q65J5447M1922J6128
$$ 65830 91995 76772 110833 128936 146168 159502 195154 186210 188774 187909 203356 245278 261406
1048B61406K0117K7285J9114K001J4802M778M6858N5655M8287M3280L9638N5739
$$ 261406 281523 308808 327922 329923 344725 349503 396361 452016 500303 543583 583221 638960
1036F38960K4705J7712N4599O5358N4760R4144O6551Q3861M1773R4736R3514J13527
$$ 638960 663665 681377 735976 801334 856094 950238 1016789 1100650 1142423 1237159 1330673 1444200
1024A444200J33824J09164J24227J66826J94796K38183K73839J55499J36668J50706
$$ 1444200 1578024 1687188 1811415 1978241 2173037 2411220 2685059 2840558 2977226 3127932
1014C127932K04942K86630L78304M77137N55285O63111Q10060J080024J432854
$$ 3127932 3332874 3619504 3997808 4474945 5030230 5693341 6503401 7583425 9016279
1005I016279J910503K677104M028560L217434j715060l204343l465862l214986
$$ 9016279 10926782 13603886 17632446 20849880 19134820 15930477 12464615 9249629
997I249629j935812j393049r51928p97213n55545m76341l36526l26748k12010
$$ 9249629 7313817 5920768 4968840 4171627 3616082 3139741 2803215 2476467 2264457
988B264457j78949o5655r2772j82742k12575j78583j87571j03776p7047n7612
$$ 2264457 2085508 2019853 1927081 1744339 1531764 1353181 1165610 1061834 984787 927175
978I27175j07781m9854n6535l4418p3357k2973p7745j7542l8208O704l1813j4866
$$ 927175 819394 769540 713005 678587 605230 582257 504512 486970 448762 455466 423653 408787
966D08787k4036l2403k5229l8081m2954L205q231l2604l8772l633m689k1741m418
$$ 408787 384751 352348 327119 289038 246084 249289 241058 208454 169682 166049 161360 139619 135201
953A35201k1300j92R536m9255J1913j9228q360q37k2496k486M976m5636q196O916
$$ 135201 113901 113709 123245 73990 85903 66675 58315 57478 34982 32496 37472 -8164 -16360 -9444
939i444k3746j7168Q832K0689p486J3270j2795j9230j7997j5260j6349l937R186
$$ -9444 -33190 -50358 -41526 -20837 -28323 -15053 -27848 -47078 -65075 -80335 -96684 -100621 -91435
926i1435J455o832R255o331n312Q027J595j8298j4692j0117J4254m072o006M06
$$ -91435 -89980 -96812 -87557 -93888 -99200 -91173 -89578 -107876 -122568 -132685 -118431 -122503 -128509 -128103
912a28103k1139p936K2676K2397k7069r968K941K322Q250j4368Q059K347j5150
$$ -128103 -149242 -157178 -134502 -112105 -139174 -149142 -146201 -143879 -135629 -149997 -141938 -139591 -154741
899a54741J9022r40m1075O614o371R20L75K9014q95j2155J7070J514J3198m975
$$ -154741 -135719 -136659 -177734 -171120 -177491 -176571 -176196 -147182 -148077 -160232 -143162 -141648 -128450 -133425
885a33425k0121j3995L766O7j3865L3105j6848j6515R780J1647l8094J1898K78
$$ -133425 -153546 -167541 -163775 -163708 -177573 -144468 -161316 -177831 -168051 -156404 -194498 -182600 -182322
872a82322O990k0077n53O441J7274Q641N794m89j5787J4124q912k965K5732J3828
$$ -182322 -175332 -195409 -195962 -189521 -172247 -163606 -157812 -158301 -174088 -159964 -168876 -171841 -146109 -132281
858a32281j2513j2425j5120J5447l916j6650j0997J8735M4314n314j6569q848
$$ -132281 -144794 -157219 -172339 -156892 -160808 -177458 -188455 -169720 -125406 -130720 -147289 -156137
846a56137k8079L9K5644j1767J0602J6919j5072M270j542m450m423k0915L7101
$$ -156137 -184216 -184177 -158533 -170300 -159698 -142779 -157851 -153581 -155123 -159573 -163996 -184911 -147810
833a47810K8688j6903Q168k2433j3278J3582J119r720J8746N097m0297l2435K6396
$$ -147810 -119122 -136025 -127857 -150290 -163568 -149986 -148867 -158587 -139841 -134744 -175041 -207476 -181080
820a81080L7694m600j5680q566J2066J1803k0241J2616K4599N010j9390L439m819
$$ -181080 -143386 -147986 -163666 -172232 -160166 -148363 -168604 -155988 -131389 -126379 -145769 -142330 -147149
807a47149m737J1639O703j5345J3967k1915O563o781N472M177k1787L1281K8257
$$ -147149 -151886 -140247 -133544 -148889 -134922 -156837 -150274 -157055 -151583 -147406 -169193 -137912 -109655
794a09655J379k0331K160j3696L51j4108L132J334n442K3341K7317k8080N91O027
$$ -109655 -108276 -128607 -126447 -140143 -139792 -153900 -150768 -149434 -154876 -131535 -104218 -132298 -131707 -125680
780a25680M002J9885r567k1906K33K3275J2958J3701r678j4722Q238J2538k5493
$$ -125680 -121678 -101793 -111360 -133266 -133033 -109758 -96800 -83099 -92777 -107499 -99261 -86723 -112216
767a12216J239j966k364r823m222o277J2010Q024J0825j7606n960P543j1464J6928
$$ -112216 -110977 -112943 -115307 -125130 -129352 -135629 -123619 -115595 -104770 -122376 -128336 -120793 -132257 -115329
753a15329J682L7781K2860j5588q697j1279K728N794j2107J9102q955j1571Q402
$$ -115329 -113647 -75866 -53006 -68594 -77291 -88570 -85842 -80048 -92155 -73053 -82008 -93579 -85177
740h5177N534J7918n288R701j1781K413M832j9988j064j7495K7881J0189O503
$$ -85177 -79643 -61725 -67013 -57312 -69093 -66680 -61848 -81836 -82900 -100395 -72514 -62325 -55822
727e5822L2496n657J1302N643L819j9614R846L8052P60k464l705j102J514J8883
$$ -55822 -23326 -28983 -17681 -12038 -8219 -27833 -17987 20065 20825 18361 14656 13554 15068 33951
713C3951j8505m5728k1418o979P53K2332K534j2171N052K1184J587j4121o996
$$ 33951 15446 -30282 -51700 -58679 -57926 -35594 -33060 -45231 -40179 -18995 -17408 -31529 -38525
$$ [...]
##END NTUPLES=NMR SPECTRUM
##END=
