##TITLE=1H_EC-3237(34)
 CDCl3, 8 sc, 
 17.11.2020
##JCAMPDX= 6.0         $$ Bruker NMR JCAMP-DX V2.0
##DATA TYPE= NMR FID
##DATA CLASS= NTUPLES
##ORIGIN= UXNMR, Bruker Analytische Messtechnik GmbH
##OWNER= root
$$ XWIN-NMR		Version 3.5
$$ Tue Nov 17 12:36:28 2020 Russian Standard Time (UT+4h)  she@DPX200
##.OBSERVE FREQUENCY= 200.1315066352
##.OBSERVE NUCLEUS= ^1H
##.DELAY= (6, 6)
##.ACQUISITION MODE= SIMULTANEOUS
##.ACQUISITION SCHEME= undefined
##.AVERAGES= 8
##.DIGITISER RES= 18
##SPECTROMETER/DATA SYSTEM= spect
##.PULSE SEQUENCE= zg30
##.SOLVENT NAME= CDCl3
##.SHIFT REFERENCE= (INTERNAL, CDCl3, 0, 15.7039)
##AUDIT TRAIL= $$ (NUMBER, WHEN, WHO, WHERE, WHAT)
$$ ##TITLE= Audit trail, XWIN-NMR		Version 3.5
$$ ##JCAMPDX= 5.01
$$ ##ORIGIN= Bruker BioSpin GmbH
$$ ##OWNER= she
$$ F:/spectra/data/she/nmr/H-F/1/audita.txt
$$ ##AUDIT TRAIL=  $$ (NUMBER, WHEN, WHO, WHERE, WHAT)
(   1,<2020-11-17 12:34:41.29 +0400>,<she>,<DPX200>,
      <created by zg, POWCHK disabled, PULCHK disabled
       configuration hash MD5:
       00 E9 B6 7A A2 85 ED C7 34 08 36 98 17 FE 4E 26
       data hash MD5: 16K
       C6 1F 72 8C A4 7D 6E 9B 2D CA 3B 61 B2 F9 B8 9B>)
$$ ##END=
$$ 
$$ hash MD5
$$ 3E 4A 7C A7 1B 33 33 47 EC 2B B9 97 D9 BA 7C F6
##$RELAX= 
##$RELAX= 
##$RELAX= 
##$RELAX= 
##$RELAX= 
##$RELAX= 
$$ Bruker specific parameters
$$ --------------------------
##$DU= <F:/spectra>
##$EXPNO= 1
##$NAME= <H-F>
##$PROCNO= 1
##$TYPE= <nmr>
##$USER= <she>
##$AMP= (0..31)
100 100 100 100 100 100 100 100 100 100 100 100 100 100 100 100 100 100 
100 100 100 100 100 100 100 100 100 100 100 100 100 100 
##$AQSEQ= 0
##$AQ_mod= 1
##$AUNM= <au_zg>
##$AUTOPOS= <>
##$BF1= 200.13
##$BF2= 200.13
##$BF3= 200.13
##$BF4= 200.13
##$BF5= 200.13
##$BF6= 200.13
##$BF7= 200.13
##$BF8= 200.13
##$BYTORDA= 1
##$CFDGTYP= 0
##$CFRGTYP= 5
##$CHEMSTR= <none>
##$CNST= (0..31)
1 1 145 1 1 1 1 1 1 1 1 1 1 1 1 1 1 1 1 1 1 1 1 1 1 1 1 1 1 1 1 1 
##$CPDPRG= <>
##$CPDPRG1= <>
##$CPDPRG2= <>
##$CPDPRG3= <>
##$CPDPRG4= <mlev>
##$CPDPRG5= <mlev>
##$CPDPRG6= <mlev>
##$CPDPRG7= <mlev>
##$CPDPRG8= <mlev>
##$CPDPRGB= <>
##$CPDPRGT= <>
##$D= (0..31)
0 1.2 0 0 0 0 0 0 0 0.06 0 0.03 0 0 0 0 0.0002 0 0 0 0 0 0 0 0 0 0 0 0 
0 0 0 
##$DATE= 1605602080
##$DBL= (0..7)
120 120 120 120 120 120 120 120 
##$DBP= (0..7)
150 150 150 150 150 150 150 150 
##$DBP07= 0
##$DBPNAM0= <>
##$DBPNAM1= <>
##$DBPNAM2= <>
##$DBPNAM3= <>
##$DBPNAM4= <>
##$DBPNAM5= <>
##$DBPNAM6= <>
##$DBPNAM7= <>
##$DBPOAL= (0..7)
0.5 0.5 0.5 0.5 0.5 0.5 0.5 0.5 
##$DBPOFFS= (0..7)
0 0 0 0 0 0 0 0 
##$DE= 6
##$DECBNUC= <off>
##$DECIM= 32
##$DECNUC= <off>
##$DECSTAT= 4
##$DIGMOD= 1
##$DIGTYP= 9
##$DL= (0..7)
0 120 120 120 120 120 120 120 
##$DP= (0..7)
150 150 150 150 150 150 150 150 
##$DP07= 0
##$DPNAME0= <>
##$DPNAME1= <>
##$DPNAME2= <>
##$DPNAME3= <>
##$DPNAME4= <>
##$DPNAME5= <>
##$DPNAME6= <>
##$DPNAME7= <>
##$DPOAL= (0..7)
0.5 0.5 0.5 0.5 0.5 0.5 0.5 0.5 
##$DPOFFS= (0..7)
0 0 0 0 0 0 0 0 
##$DQDMODE= 0
##$DR= 18
##$DS= 0
##$DSLIST= <SSSSSSSSSSSSSSS>
$$ [...]
##$SUBNAM2= <"">
##$SUBNAM3= <"">
##$SUBNAM4= <"">
##$SUBNAM5= <"">
##$SUBNAM6= <"">
##$SUBNAM7= <"">
##$SUBNAM8= <"">
##$SUBNAM9= <"">
##$SW= 16.9725356469052
##$SWIBOX= (0..15)
0 0 2 0 0 0 0 0 0 0 0 0 0 0 0 0 
##$SW_h= 3396.73913043478
##$TD= 16384
##$TD0= 1
##$TE= 0
##$TE2= 300
##$TE3= 300
##$TEG= 300
##$TL= (0..7)
0 120 120 120 120 120 120 120 
##$TP= (0..7)
150 150 150 150 150 150 150 150 
##$TP07= 0
##$TPNAME0= <>
##$TPNAME1= <>
##$TPNAME2= <>
##$TPNAME3= <>
##$TPNAME4= <>
##$TPNAME5= <>
##$TPNAME6= <>
##$TPNAME7= <>
##$TPOAL= (0..7)
0.5 0.5 0.5 0.5 0.5 0.5 0.5 0.5 
##$TPOFFS= (0..7)
0 0 0 0 0 0 0 0 
##$TUNHIN= 0
##$TUNHOUT= 0
##$TUNXOUT= 0
##$USERA1= <user>
##$USERA2= <user>
##$USERA3= <user>
##$USERA4= <user>
##$USERA5= <user>
##$V9= 5
##$VALIST= <valist>
##$VCLIST= <CCCCCCCCCCCCCCC>
##$VD= 0
##$VDLIST= <DDDDDDDDDDDDDDD>
##$VPLIST= <PPPPPPPPPPPPPPP>
##$VTLIST= <TTTTTTTTTTTTTTT>
##$WBST= 1024
##$WBSW= 4
##$XGAIN= (0..3)
0 0 0 0 
##$XL= 0
##$YL= 0
##$YMAX_a= 16209
##$YMIN_a= -9654
##$ZGOPTNS= <>
##$ZL1= 120
##$ZL2= 120
##$ZL3= 120
##$ZL4= 120
##$ABSF1= 10
##$ABSF2= 0
##$ABSG= 5
##$ABSL= 3
##$ALPHA= 0
##$AQORDER= 0
##$ASSFAC= 0
##$ASSFACI= 0
##$ASSFACX= 0
##$ASSWID= 0
##$AUNMP= <proc_1d>
##$AZFE= 0.1
##$AZFW= 0.1
##$BCFW= 1
##$BC_mod= 2
##$BYTORDP= 1
##$COROFFS= 0
##$CY= 11.3945322036743
##$DATMOD= 1
##$DC= 2
##$DFILT= <>
##$DTYPP= 0
##$F1P= 15.9154993809931
##$F2P= -4.1035820241983
##$FCOR= 0.5
##$FTSIZE= 0
##$FT_mod= 4
##$GAMMA= 1
##$GB= 0.15
##$INTBC= 1
##$INTSCL= 1
##$ISEN= 128
##$LB= 0.24
##$LEV0= 0
##$LPBIN= 0
##$MAXI= 10000
##$MC2= 0
##$MEAN= 0
##$ME_mod= 0
##$MI= 1.114404
##$NCOEF= 0
##$NC_proc= 0
##$NLEV= 6
##$NOISF1= 3.799351
##$NOISF2= 2.8
##$NSP= 1
##$NTH_PI= 0
##$NZP= 0
##$OFFSET= 15.70392
##$PC= 1
##$PHC0= -11125.36
##$PHC1= 8.400891
##$PH_mod= 1
##$PKNL= yes
##$PPARMOD= 0
##$PSCAL= 0
##$PSIGN= 0
##$REVERSE= no
##$SF= 200.130013532006
##$SI= 16384
##$SIGF1= 3
##$SIGF2= 2
##$SINO= 400
##$SIOLD= 16384
##$SREGLST= <1H.CDCl3>
##$SSB= 0
##$STSI= 0
##$STSR= 0
##$SW_p= 3612.71676300578
##$SYMM= 0
##$S_DEV= 0
##$TDeff= 0
##$TDoff= 0
##$TI= <>
##$TILT= no
##$TM1= 0
##$TM2= 0
##$TOPLEV= 0
##$USERP1= <user>
##$USERP2= <user>
##$USERP3= <user>
##$USERP4= <user>
##$USERP5= <user>
##$WDW= 1
##$XDIM= 8192
##$YMAX_p= 0
##$YMIN_p= 0
$$ End of Bruker specific parameters
$$ ---------------------------------
##NTUPLES= NMR FID
##VAR_NAME=  TIME,          FID/REAL,        FID/IMAG
##SYMBOL=    X,             R,               I
##VAR_TYPE=  INDEPENDENT,   DEPENDENT,       DEPENDENT
##VAR_FORM=  AFFN,          ASDF,            ASDF
##VAR_DIM=   8192,          8192,            8192
##UNITS=     SECONDS,       ARBITRARY UNITS, ARBITRARY UNITS
##FACTOR=    0.0002944,     1,               1
##FIRST=     0,             0,               0
##LAST=      2.4114304,     0,               0
##MIN=       0,             -9654,           0
##MAX=       2.4114304,     16209,           0
$$ Real data points
##PAGE= N=1
##DATA TABLE= (X++(R..R)), XYDATA
0 0 0 0 0 0 0 0 0 0 0 0 0 0 0 0 0 0 0 0 0 0 0 0 0 8 -8 8 -8 8 -8 8 -8 16 -16 16 -16 24 -24 24 -32 32 -40 40 -48 48
44 48 -56 64 -70 75 -83 91 -102 112 -123 136 -150 166 -184 206 -230 260 -296 340 -396 471 -570
65 -570 723 -964 1424 -2570 11243 16209 -9117 5283 6158 -460 787 5281 4375 -533 2278
80 2278 6705 -2747 938 5695 -2606 992 2672 -2280 -352 986 -594 -333 2981 264 -1433 -1119
96 -1119 1490 -518 -3997 1979 2268 -2128 60 -161 -1927 2024 147 -681 -206 -3229 1978 -1314
112 -1314 -2311 3342 -734 -1239 6 -1347 -334 -1145 -1078 1156 -2352 40 2110 -3373 -495 1082
128 1082 -533 -804 97 540 -827 -381 89 1171 326 687 -258 -741 2225 515 -1002 1531 1182 -994
146 -994 1808 619 -243 1494 215 1372 -839 449 2475 -836 305 1530 -149 862 934 -691
162 -691 1566 192 -51 1160 -202 1040 -422 -92 1046 184 -63 94 -333 -254 851 -754 18 1
180 1 -776 105 -581 -863 -79 143 -1158 -256 -800 -303 -85 -1506 111 -914 -170 177 -1464 -63 375
199 375 -1433 -415 927 -1097 -345 -266 6 -171 -508 1098 -765 -474 925 -158 -886 880 638 -525
217 -525 766 -85 170 447 645 312 -129 942 735 -48 109 1418 -46 497 1168 25 907 63 444
236 444 622 306 713 654 -108 441 736 -569 722 242 162 219 -264 311 -556 187 563 -516 -792 853
256 853 -407 -1399 528 -268 -648 -560 94 -512 -1036 81 -223 -977 -360 447 -1429 -364 286 -910 -123
275 -123 -207 -214 -604 -170 -181 -428 -280 266 -155 -736 838 -345 -339 421 -45 105 248 465 -116 100 163 695
297 695 -47 305 1046 -337 441 451 326 362 521 555 407 338 418 938 -181 657 553 6 606 201 462
318 462 164 173 133 325 -176 6 41 -351 518 -456 -66 43 -608 -304 63 -176 -612 33 -452 -380 -677 -44
340 -44 -117 -1093 216 -327 -877 -257 -3 -852 -436 -13 -575 -179 -497 -3 -650 -247 239 -690 -69 51 -411
361 -411 -321 639 -284 -182 322 -225 144 28 635 47 -33 548 262 -38 434 803 -103 588 262 347 494
382 494 102 690 234 307 469 392 -54 512 383 66 566 -37 338 -173 124 381 -189 195 186 -348 -454 423
404 423 -400 -249 -1 -301 -205 -677 -17 -318 -427 -230 -300 -575 -212 -106 -828 -57 -481 -275 -171 -471 -109
425 -109 -389 -231 -167 -86 -483 -15 -298 -314 112 -232 387 -349 -196 281 -96 -127 342 292 -140 409 -18 284
447 284 228 356 487 -179 589 397 42 264 578 -3 310 651 -64 380 164 417 5 91 647 36 -47
468 -47 319 393 -161 406 -99 -66 255 -227 229 -148 76 -53 -256 -87 -5 -266 -284 7 -592 49 -304 -395
490 -395 -212 -545 -72 -361 -454 -402 -112 -579 -419 -182 -302 -103 -561 46 -309 -379 92 -110 -285 -67 173
511 173 -325 254 1 71 68 -162 387 -3 246 161 56 172 422 136 195 387 -56 622 34 189 537 91
533 91 250 248 461 193 268 188 316 85 254 369 -152 508 73 -42 188 176 -86 -9 256 -426 34 82 -55
556 -55 -415 -131 199 -604 -212 114 -274 -624 49 -227 -362 -95 -486 -98 -460 -37 -141 -466 -107 -300 -221
577 -221 -150 -130 -370 51 -287 -194 48 -227 70 -314 60 -11 -26 7 -22 127 -62 266 -85 183 170 120 182 77
601 77 335 253 271 48 515 171 231 448 116 499 85 414 303 148 410 219 66 193 409 13 199 -145
623 -145 120 183 -102 99 -220 91 -251 -137 -3 -127 -224 -251 3 -425 -64 -152 -342 -289 -70 -159 -431 -70
645 -70 -365 -152 -362 -176 -289 -399 152 -506 -298 -1 -128 -338 -137 -111 -229 -14 -75 133 -238 176 19
666 19 -222 271 41 125 -1 271 94 175 221 61 241 143 363 66 265 291 261 157 207 466 74 364 60
689 60 292 237 110 396 -48 176 256 149 -69 173 100 -38 -42 -87 174 -345 78 -27 -284 -4 -130 -131 -351
712 -351 -35 -209 -221 -208 -110 -120 -397 -94 -360 -127 -263 -247 -261 -171 -178 -423 -55 -314 -76 -143 -229 44 -263 -28
736 -28 -81 -52 -63 162 -50 -41 99 35 275 -136 283 186 26 217 215 244 99 264 95 170 107 353 235 30 347
761 347 158 246 73 243 147 160 157 27 334 -35 178 4 71 111 -21 145 -86 -30 -32 136 -268 -18 39 -252
785 -252 -37 -206 36 -284 -156 -148 -256 -172 -211 -179 -364 -52 -380 -227 -170 -321 -138 -303 -142 -316 -46 -158
807 -158 -192 -199 -97 56 -303 69 -75 -9 -45 21 129 -63 99 73 205 -84 309 209 -45 266 166 262 46
830 46 342 184 86 235 253 149 81 447 -40 179 319 109 79 114 266 -64 203 134 49 -73 182 91 -289
853 -289 236 -7 -120 -127 74 -85 -229 24 -186 -155 -255 56 -296 -289 -47 -344 -183 -228 -112 -335 -177 -233 -219
876 -219 -153 -253 -78 -367 25 -158 -201 -49 -92 -58 -164 78 -113 34 -62 85 19 -117 276 1 72 31 235
899 235 112 61 252 155 170 32 406 77 159 313 105 194 159 314 36 240 151 158 150 130 218 -67 280 -10 26
924 26 149 59 -30 -45 113 -164 46 -90 -28 -144 -125 19 -303 -17 -174 -126 -180 -119 -193 -199 -90 -328 -49 -226
948 -226 -157 -214 -170 -131 -290 -39 -211 -117 -173 -10 -197 -182 94 -165 9 -117 45 -24 10 29 -2 123 -17 184
972 184 5 191 42 118 234 9 266 112 190 98 241 147 152 244 73 266 81 247 56 179 192 5 183
995 183 68 145 -27 214 5 -38 136 -11 -9 -154 136 -97 -80 -30 -36 -111 -190 52 -257 -52 -106 -96 -170 -224 0
1020 0 -251 -130 -219 -101 -225 -146 -163 -255 -48 -275 -88 -182 -27 -160 -189 -15 -152 -16 -124 84 -118 -12 100
1043 100 -22 27 -35 228 -46 68 103 188 106 80 309 -4 205 174 194 86 187 275 49 227 169 226 11 214
1067 214 139 39 215 -3 115 35 182 -44 19 100 -55 31 -86 64 -152 55 -31 -142 -40 -94 -48 -265 -39
1090 -39 -181 -104 -163 -177 -43 -263 -90 -218 -97 -214 -147 -127 -206 -95 -176 -24 -255 -34 -106 -130 -51 -158 16 -112
1114 -112 20 -102 49 18 -41 56 -13 151 -39 143 37 76 178 118 141 52 266 60 189 135 147 200 82 256
1138 256 81 224 117 154 121 152 132 17 227 16 145 11 61 54 -34 112 -89 12 -49 50 -127 -88 -47 -150
1162 -150 -35 -191 -35 -211 -117 -125 -161 -119 -198 -65 -281 -74 -172 -125 -118 -171 -53 -209 -36 -205 -77 -166 -123 -119 -114 69
1188 69 -131 -3 -111 42 -6 -54 100 -30 51 5 148 -35 123 162 50 121 63 262 8 159 169 133 137 133 231
1213 231 44 220 69 163 131 139 159 31 157 39 159 9 74 30 31 77 -101 83 -85 29 -73 -89 -24 -92
1237 -92 -63 -150 -23 -210 -71 -140 -171 -137 -176 -56 -303 -95 -126 -182 -207 -118 -71 -230 -41 -186 -58 -113 -52 -66 -110
1262 -110 39 -95 23 -78 41 -10 30 39 -32 174 -29 91 50 114 81 93 152 39 198 58 197 89 173 132
1286 132 71 220 40 177 84 132 46 151 148 -7 144 49 128 -36 89 68 -34 57 -28 40 -98 79 -72 -64 -55
1311 -55 -92 -11 -180 -20 -134 -91 -140 -104 -116 -171 -82 -215 -48 -188 -96 -148 -148 -50 -171 -69 -149 -33 -137 -49 -78 -85
1337 -85 17 -88 42 -137 30 -1 -24 25 12 79 -50 143 8 74 64 102 109 20 205 44 132 99 164 91 109 164
1363 164 36 190 48 141 84 133 132 20 139 37 120 12 101 4 50 70 -48 72 -75 41 -53 -27 -64 -75 -29
1388 -29 -171 -39 -124 -75 -192 -69 -89 -211 -55 -156 -100 -195 -71 -160 -142 -66 -162 -65 -177 -36 -135 -61 -83 -101 -1
1413 -1 -89 -10 -72 57 -78 21 63 -4 70 -8 128 6 120 77 61 131 79 141 34 155 31 138 128 64 132 88
1439 88 175 7 170 93 82 87 86 117 8 163 28 64 30 55 29 -40 59 -66 46 -82 8 -31 -64 -34 -118 -15 -140
1466 -140 -56 -126 -72 -97 -135 -71 -170 -52 -184 -99 -146 -124 -99 -146 -54 -180 -41 -117 -80 -106 -74 -25 -128 17 -48 0 -64
1493 -64 58 21 -21 99 -2 73 -14 145 64 61 137 60 124 46 152 54 139 98 87 160 73 150 36 161 46 88 105
1520 105 61 80 8 139 -26 80 32 28 24 -25 60 -41 32 -79 16 -44 -59 -15 -80 -26 -157 -15 -100 -118 -85 -96 -101 -159
1548 -159 -43 -166 -80 -145 -99 -80 -128 -57 -150 -34 -130 -56 -77 -90 -69 -75 17 -130 15 -35 -7 -23 -1 50 -37 88 12
1575 12 94 21 98 79 41 130 41 175 72 126 102 122 112 68 163 61 139 41 128 85 46 145 21 73 8 118 2
1602 2 3 16 1 25 -84 64 -62 -27 -57 -38 -23 -83 -13 -131 -39 -114 -41 -99 -117 -52 -161 -51 -144 -80 -126 -73 -107 -141
1630 -141 -42 -113 -55 -171 -13 -99 -110 -13 -62 -34 -91 43 -78 -32 3 21 -15 -28 129 -19 60 37 73 74 64 119 38
1657 38 150 55 136 77 111 117 68 164 48 132 64 113 67 91 126 32 94 7 123 -1 32 44 12 23 -46 59 -62 -5
1685 -5 -53 -19 -75 -86 25 -144 -46 -90 -32 -121 -97 -49 -145 -68 -130 -56 -136 -65 -104 -123 -32 -135 -39 -116 -51 -105 -32 -17 -82
1714 -82 4 -64 12 -83 34 3 -23 7 -8 69 -13 79 4 74 49 41 117 31 111 63 147 51 113 138 71 90 74 181 27
1743 27 123 83 86 90 38 123 -10 85 10 64 16 11 55 -27 37 -63 30 -66 -44 -42 -52 -25 -118 -8 -113 -36 -110 -92 -74 -122
1773 -122 -41 -132 -47 -116 -55 -93 -97 -83 -117 -25 -143 -37 -66 -41 -78 -80 9 -109 -20 -53 10 -65 12 29 -50 53 5 69 -9
1802 -9 78 46 38 82 27 121 45 130 50 107 99 41 130 52 128 53 122 55 69 99 40 106 7 102 12 81 27 22 58 -24 23 -36
1834 -36 43 -87 -19 -22 -70 -38 -89 -32 -151 -39 -87 -99 -98 -97 -44 -145 -55 -124 -62 -97 -88 -72 -106 -34 -127 -35 -95 -46 -56 -66
1864 -66 -15 -83 21 -79 8 -19 1 1 -26 63 -18 75 -17 67 35 56 67 27 116 12 109 45 82 64 64 113 31 129 66 121
1894 121 41 87 78 51 106 28 108 14 74 20 33 49 -14 54 -37 22 -41 7 -41 -51 -10 -86 -24 -111 -24 -94 -73 -72 -101 -50 -130
1925 -130 -47 -129 -57 -116 -102 -64 -121 -53 -112 -25 -111 -36 -41 -63 -31 -51 27 -78 30 -25 -2 6 -2 53 -36 79 -4 56 2 58
1955 58 64 10 103 6 115 33 82 54 80 85 36 112 42 105 32 93 70 39 96 21 88 0 77 35 31 22 1 64 -57 62 -27
1986 -27 -2 -46 -28 -16 -78 1 -80 -37 -121 -44 -71 -104 -48 -129 -48 -139 -55 -97 -82 -78 -106 -58 -124 -22 -106 -24 -70 -48 -15 -74
2016 -74 10 -64 21 -40 18 -3 8 39 -33 81 0 70 16 57 72 34 103 45 105 15 112 73 54 83 45 99 -3 105 52
2045 52 52 52 54 67 23 96 -3 71 12 62 55 -1 61 -27 41 -24 26 -32 -13 -23 -62 10 -81 -7 -95 -33 -68 -90 -46 -94 -34 -126
2077 -126 -29 -97 -80 -75 -88 -33 -126 -22 -94 -71 -79 -38 -43 -75 18 -65 0 -38 25 0 -2 43 -9 57 7 90 26 61 32 40 96 23
2109 23 88 21 93 52 74 83 46 91 33 106 23 93 42 52 75 5 94 12 63 7 53 29 -4 47 -7 26 -54 53 -37 -17
2139 -17 -3 -57 -12 -81 2 -71 -31 -66 -53 -47 -91 -19 -102 -44 -87 -64 -74 -88 -54 -108 -41 -101 -38 -87 -49 -46 -89 -4 -59 -2 -59
2170 -59 21 -18 -5 29 4 50 -30 73 12 29 57 48 63 28 103 24 77 56 74 68 53 110 23 103 46 80 37 57 76 22 77
2201 77 -5 61 -3 35 18 14 45 -38 33 -34 26 -32 2 -11 -43 4 -67 7 -65 -22 -67 -53 -44 -89 -25 -95 -51 -98 -32 -87 -84 -31
2233 -31 -87 -56 -103 -12 -78 -46 -39 -69 -18 -72 12 -66 -6 -45 -18 11 -24 37 -21 64 -14 51 34 33 60 29 97 32 110 47 79
2264 79 77 59 98 34 98 38 105 44 48 60 50 77 5 87 -9 35 25 21 19 -24 50 -45 17 -36 -10 -21 -52 -6 -74 3 -78 -18
2296 -18 -48 -44 -55 -80 -22 -100 -21 -65 -39 -70 -42 -48 -87 -15 -91 -22 -72 -37 -50 -61 -27 -77 7 -49 -5 -35 0 -5 -46 46 -8 36
2328 36 -7 64 26 32 60 16 61 18 89 24 57 70 61 76 36 104 32 94 48 70 76 34 66 17 76 4 51 27 8 1 -20 33
2360 33 -50 13 -52 -24 -35 -42 -4 -56 -7 -71 -12 -83 -49 -51 -66 -41 -89 -4 -97 -40 -58 -51 -59 -72 -4 -88 -31 -85 -21 -47 -51 -19 -57
2393 -57 1 -65 4 -22 -4 -28 -12 30 -34 48 -2 39 2 24 44 18 61 22 72 22 70 34 74 79 32 105 35 79 34 80 50
2424 50 40 81 24 58 8 77 -3 14 46 -9 20 -20 23 -32 -8 -35 -24 -36 -63 -18 -82 -23 -72 -39 -60 -84 -45 -86 -33 -93
2454 -93 -28 -71 -55 -59 -69 -18 -82 -15 -63 -16 -48 -36 -4 -42 -19 -44 13 -47 1 5 -37 12 -22 41 -17 33 8 39 11 33 50
2485 50 13 79 28 58 38 61 51 28 68 21 96 -4 38 42 52 35 14 55 17 61 37 59 64 24 10 23 11 -32 -2 -26 -37
2516 -37 -12 -61 -11 -84 -32 -65 -39 -77 -61 -33 -96 -35 -83 -33 -80 -43 -35 -65 -41 -65 -29 -79 -16 -46 -26 -25 -46 1 -42 6 -22
2547 -22 6 -6 -6 17 -9 37 -18 52 -1 34 40 18 51 3 66 16 45 18 38 58 17 65 24 77 20 60 43 31 49 35 62
2578 62 2 58 17 39 18 7 33 -29 29 -20 26 -26 -23 -9 -25 -13 -56 0 -65 -22 -43 -55 -51 -75 -30 -90 -39 -79 -54 -57 -62 -38
2610 -38 -79 -28 -74 -23 -42 -38 -26 -46 -3 -44 17 -15 13 -17 16 29 -11 46 6 37 7 51 40 16 45 23 74 9 64 41 55
2641 55 47 37 79 18 63 22 65 29 44 55 21 55 -3 58 10 39 25 16 28 -17 38 -15 27 -27 4 -11 -30 16 -48 -7 -63
2672 -63 -10 -60 -60 -40 -52 -37 -92 -20 -73 -46 -63 -49 -44 -81 -25 -64 -28 -59 -36 -34 -40 -14 -40 8 -42 4 -13 -10 -1 -1 42 -12 34 9
2706 9 47 21 23 39 34 60 16 64 29 45 40 46 64 7 61 12 42 13 51 27 -3 57 2 34 0 46 17 2 17 -17 39 -18 30
2739 30 -31 -6 -11 -35 2 -52 -16 -61 -7 -49 -40 -31 -52 -31 -78 -28 -73 -36 -57 -58 -45 -67 -28 -60 -25 -63 -31 -47 -53 -22 -50 -9 -50
2772 -50 15 -29 -2 9 7 24 -6 50 9 44 29 46 46 20 62 18 70 17 59 50 38 55 23 64 10 65 23 30 35 30 44 1 35
2805 35 -5 25 9 7 15 -10 30 -23 13 -26 -12 -20 -14 -8 -52 6 -42 -16 -47 -6 -20 -54 -10 -50 -15 -66 -13 -63 -55 -42 -65 -29 -70
2838 -70 -19 -63 -35 -39 -34 -18 -54 4 -37 7 -28 -1 5 -7 14 -20 34 1 29 14 19 31 13 56 9 61 25 70 45 38 73 39 51
2871 51 14 72 21 45 41 33 40 1 55 -7 19 -1 0 -8 -1 17 -32 1 -35 0 -12 -15 -8 -53 -3 -50 -7 -44 -19 -30 -45 -25 -62 -14
2905 -14 -70 -15 -66 -38 -38 -57 -20 -43 -9 -62 -33 -39 -23 -28 -37 17 -46 -10 -36 -6 -18 -20 3 -19 20 -11 31 0 12 31 24 53 6
2938 6 61 17 58 29 40 46 32 57 16 63 26 44 30 33 42 11 59 -5 29 13 19 2 -5 18 -33 15 -32 9 -22 -32 -17 -43 -30
2971 -30 -59 -13 -63 -28 -46 -44 -25 -65 -18 -53 -21 -40 -33 -38 -37 -8 -44 -12 -47 3 -34 -31 -20 -37 -4 -48 0 -41 -13 -18 -3 6 -24 14
3005 14 -31 23 -5 17 28 2 28 1 53 5 49 27 37 33 25 63 16 65 32 43 32 30 49 17 53 1 45 10 30 15 5 8
3037 8 -21 18 -35 -3 -34 -22 -24 -49 -15 -53 -17 -58 -34 -56 -32 -39 -54 -26 -69 -12 -49 -33 -38 -37 -18 -52 -17 -43 -7 -45 -31 -6 -22
3070 -22 -8 -27 15 -35 2 -4 6 -1 -23 26 -11 15 -14 19 -2 6 36 -10 45 15 43 19 35 39 21 55 18 59 9 60 28 35 48
3103 48 16 50 8 42 5 26 25 13 20 -1 27 -27 5 -25 -2 -15 -34 -4 -57 -11 -48 -21 -52 -40 -35 -61 -38 -61 -20 -64 -27 -62
3135 -62 -43 -36 -43 -12 -52 -9 -39 -16 -16 -29 1 -26 11 -29 9 -13 -1 2 -23 35 -18 21 -6 29 3 17 30 1 30 10 44 2
3167 2 28 42 16 35 20 48 -1 42 23 28 28 13 40 2 42 7 50 12 10 24 -1 11 -15 14 -14 -2 -11 -16 -17 -38 -12 -51 -16 -61
3201 -61 -32 -37 -64 -25 -59 -21 -66 -22 -44 -49 -42 -50 -11 -55 -16 -39 -21 -38 -26 -4 -28 4 -27 19 -3 5 1 14 35 -7 34 -3 33
3234 33 17 19 34 4 50 2 33 15 40 20 20 33 11 33 6 42 6 34 32 18 43 1 45 2 33 -2 12 23 -2 22 -14 22
3266 22 -13 10 -1 -21 -7 -20 -4 -47 -23 -26 -17 -41 -46 -4 -71 -26 -112 -8 -41 -37 -19 -55 46 -4 -58 -103 10 -41 -29 -10 -26
3297 -26 14 -20 15 -10 22 14 0 31 3 31 -2 31 11 23 30 17 47 -1 44 22 25 15 31 40 19 31 3 41 14 29 19 7
3329 7 18 3 38 -12 17 -8 13 -4 -12 19 -16 4 -19 11 -16 -15 5 -16 -1 -31 15 -39 -15 -41 -25 -24 -25 -8 -85 -16 -64 -37 -50
3362 -50 -37 -30 -47 -16 -56 -18 -34 -28 -14 -30 5 -40 -1 -17 -2 -13 -6 11 3 35 -1 38 15 28 40 27 46 26 50 19 46 21
3394 21 30 34 12 40 12 34 13 20 11 7 18 -4 24 -15 29 -10 5 8 2 2 -17 17 -6 4 -23 -8 -12 -34 -3 -35 -12 -43 -17 -25 -32 -24
3430 -24 -37 -14 -45 -13 -29 -24 -33 -39 -18 -34 -9 -38 -10 -40 -25 -29 -37 -18 -40 -2 -35 -6 -16 -14 -1 -21 20 -4 24 3 33 17 16 31
3464 31 18 45 6 45 22 17 28 26 40 3 35 12 28 12 19 24 -9 28 -7 14 -3 9 2 -5 6 -24 -3 -18 3 -29 -9 -19 -32
3497 -32 2 -38 -14 -26 3 -20 -22 -9 -20 -9 -45 -7 -47 -17 -32 -34 -20 -45 -8 -42 -10 -45 -23 -30 -39 -10 -24 0 -30 3 -14 -16 -6
3530 -6 -8 5 -16 16 0 15 5 15 32 13 37 19 36 20 40 38 18 43 23 49 25 37 24 24 22 -6 27 -7 18 -17 16 -2 -15
3563 -15 7 -18 -10 -23 6 -26 -18 -12 -22 -21 -41 -5 -28 -17 -34 -26 -25 -40 -16 -42 -20 -36 -14 -29 -24 -23 -28 0 -33 -10 -12 -8 -18 -18 -1 -28
3599 -28 -5 -25 8 -18 -8 -5 -21 4 -24 16 -15 8 5 11 20 5 34 3 32 16 29 23 22 42 24 41 23 42 18 21 21 11 30 11
3633 11 34 4 11 -6 4 12 -12 4 -19 -4 -21 -8 -25 -22 -18 -28 -14 -35 -14 -26 -29 -22 -34 -26 -38 -17 -34 -17 -30 -17 -12 -19 -4 -28 -2
3668 -2 -18 -9 -15 -16 -2 -23 -9 -25 -4 -14 -10 9 -10 2 -17 18 -18 16 1 11 11 4 34 5 26 1 26 5 24 24 3 36 12 38
3702 38 22 26 28 24 25 22 31 -3 18 8 10 10 -3 12 -19 0 -14 -14 -25 -21 -12 -36 -22 -34 -17 -31 -25 -38 -32 -34 -37 -23 -45 -21 -42 -22 -15 -21 -14
3741 -14 -30 -7 -18 -7 -19 -15 -13 -12 16 -17 10 -6 9 -2 1 13 -18 4 -5 11 -3 16 10 -2 18 0 33 -5 14 21 15 27 7 30
3775 30 14 29 27 30 26 34 35 19 33 7 20 11 18 13 2 18 -13 7 -5 -1 -9 -14 -3 -23 3 -19 -11 -30 -11 -30 -36 -21 -51 -27 -46 -19 -32
3812 -32 -12 -19 -30 -18 -39 2 -11 -1 -19 -11 0 -4 23 -4 14 -2 12 -1 5 25 -1 8 -1 53 19 -11 11 25 17 14 30 24 41 14 11
3847 11 24 5 36 11 27 13 24 11 18 35 2 17 11 25 -1 24 18 -2 5 5 30 -3 25 1 0 0 -11 7 -30 -7 -22 -25 -30 -19 -26
3882 -26 -42 -23 -38 -20 -27 -21 -23 -38 -18 -37 -9 -39 -5 -7 -16 -12 -9 11 -17 12 -12 12 10 12 7 13 23 6 29 16 20 25 11 24 15 33 8
3919 8 21 12 16 17 4 17 -1 22 -9 24 7 17 13 5 11 -8 23 -2 6 9 1 13 -1 20 -12 3 -16 -12 -10 -11 -6 -24 -1 -16 -6 -19 -14 -10
3957 -10 -32 -14 -40 -12 -31 -34 -28 -28 -33 -46 -24 -40 -15 -39 -22 -17 -22 -9 -23 -1 -10 0 3 4 25 4 26 1 36 20 21 7 15 30 13 34
3993 34 6 30 5 21 30 14 32 11 32 3 27 14 20 22 17 19 -11 7 -7 -2 -12 3 5 -9 7 -18 2 -10 6 -4 -8 11 -6 8
4027 8 -9 -10 -11 -7 -14 -20 -8 -20 0 -40 -3 -29 -24 -9 -26 -7 -40 -15 -29 -16 -16 -15 -2 -26 -1 -12 -7 -9 5 -4 -8 9 -9 23 -7 26 11
4064 11 21 23 17 39 11 34 19 38 29 24 15 10 37 17 31 9 19 9 -2 9 -16 12 -17 8 -14 -4 3 -13 8 -11 -5 -15 -2 -23
4098 -23 -14 -2 -16 -5 -16 -3 -18 -10 -23 -22 -3 -30 -15 -20 -11 -16 -4 -21 -18 -8 -29 -10 -42 -12 -9 -17 -7 -28 0 -27 -11 -21 -11 -16 -19 4
4134 4 -3 13 -5 14 8 9 29 25 19 21 38 33 22 31 15 21 13 23 21 22 8 20 15 16 16 1 1 1 9 -12 -1 3 -20 -1 -29 -6 -25 -2 -15 -23 -11
4175 -11 -23 -13 -29 0 -26 -7 -19 -6 3 -19 -5 -25 -4 -21 -12 -13 -12 -2 -27 -11 -23 -5 -20 -24 -6 -4 7 -10 4 -12 -1 -11 -5 -7
4209 -7 -8 10 -5 13 -12 15 17 -14 20 7 15 12 28 16 23 29 21 25 17 43 23 23 23 24 24 6 22 3 16 -13 7 -2 -12 -4 -17 6 -12 -11 -13
4248 -13 -9 -8 -20 -4 -22 -10 -27 -3 -20 -16 -15 -22 -9 -23 -4 -16 -8 -14 -8 -8 -17 3 -5 -6 -8 6 4 -20 1 -14 -3 -18 -2 1 -6 -1 -20 2 -6
4287 -6 6 -14 1 6 -1 18 -3 15 -4 21 0 10 21 18 20 12 25 5 24 18 13 26 1 15 9 15 2 20 0 -1 13 -14 -6 -14 -9 -21 -11
4324 -11 -12 -21 -16 -26 -17 -31 -16 -30 -20 -8 -28 -20 -32 -6 -27 -7 -16 -14 -18 -10 9 -12 -4 -17 -8 -6 -3 6 -16 4 -12 9 -5 -1 8 -17 7 -10
4362 -10 10 -9 13 5 5 6 1 13 -3 12 1 8 4 -4 18 0 8 1 25 13 12 22 15 22 18 22 14 25 8 8 11 0 4 -10 -4 -16 -8 -18 -20 -19 -23 -9
4404 -9 -31 -21 -27 -32 -31 -30 -19 -31 -17 -36 -19 -29 -15 -15 -32 -13 -23 -5 -10 -7 -2 -8 -1 -16 11 -10 19 -1 7 7 -1 25 4 14 0 13 -3
4441 -3 9 -1 -8 2 -9 11 -1 0 4 6 -1 -1 12 5 18 6 4 4 5 9 5 26 -1 7 1 10 6 0 4 -9 8 -9 -2 -8 -12 -9 -18 -14 -30 -12 -22 -17 -24 -39
4485 -39 -31 -43 -26 -30 -34 -49 -27 -26 -36 -18 -26 -8 -31 -2 -4 -14 -4 1 16 -7 18 5 3 8 8 12 -3 18 1 9 15 12 22 9 27 12 26
4522 26 -1 15 7 0 7 0 -2 9 8 7 6 6 2 12 -1 6 -4 17 -1 2 7 -2 14 -13 1 2 2 3 2 5 -13 2 -15 -16 -21 -16 -17 -21 -11 -31 -11 -32
4564 -32 -14 -23 -13 -22 -26 -21 -26 -9 -18 -16 -7 -17 -19 -12 8 -11 9 -3 -1 10 6 19 6 27 12 24 22 29 16 13 20 21 24 16 12 20 8 13 3 12 -6 17
4606 17 -5 14 2 -2 12 -6 4 -8 -2 -3 -8 -8 1 1 -9 8 -17 -3 -5 -8 -12 -14 5 -13 -2 -2 -9 -10 -11 -11 -18 -16 -17 -12 -29 -19 -19 -15 -22 -21 -10 -30
4648 -30 -27 -22 -24 -23 -23 -11 -7 -2 -12 -8 2 -7 1 -3 20 9 10 17 18 13 5 31 11 33 11 22 17 16 11 15 23 1 14 5 21 12 -6 12 -12 -2 12 2
4690 2 -9 7 -7 -17 -5 -12 -18 -13 -3 -15 -13 1 -1 3 -11 -1 -15 -9 -6 -9 6 -6 8 -12 -13 -9 -10 -14 -19 -15 -26 -8 -20 -8 -20 -16 -1 -13 0
4729 0 -11 11 -6 0 -8 -3 4 -1 17 -3 8 -12 10 15 20 16 24 26 8 26 13 28 23 5 21 18 12 18 11 5 7 2 -3 9 -5 11 -14 -4 -13 -7 8
4770 8 -10 0 -13 -4 -13 -11 -20 -11 -5 -16 -6 -15 -1 -4 -6 -7 -5 8 -2 -6 -9 2 -4 -2 -7 -5 6 2 4 -8 -2 1 -9 -2 -17 9 -3 -5 -6 -4 -2 -1 8 -14 6
4815 6 5 17 19 1 13 19 18 11 25 17 19 16 12 20 18 29 11 31 14 28 17 13 16 11 13 -6 0 -1 -3 -6 -6 10 -17 -3 -31 -9 -16 -20 -12 -14 -5 -21 -12 -16
4859 -16 -6 -9 -4 4 -19 -3 -9 6 -8 3 0 -9 -1 -4 6 -1 6 -4 4 6 4 -1 5 7 -4 13 3 -2 7 2 6 -2 2 -2 -3 4 21 14 14 10 18 7 -35 -15 40
4904 40 35 21 37 22 11 24 28 13 21 18 7 5 -2 5 8 -5 -7 -10 -6 -10 -15 -16 -20 -16 -7 -10 -13 -15 -19 -17 -14 -16 -21 -11 -15 -19 -19 -3 -6 -11 -12 -4 9 -8 14 -3
4950 -3 9 7 -3 5 8 17 -3 15 -5 11 -1 0 3 -16 16 -2 -3 5 8 0 2 7 -4 13 3 9 11 12 12 12 16 7 20 0 16 9 10 16 6 15 -1 23
4992 23 3 7 10 -1 -7 0 11 -9 10 -9 -12 -7 -21 -4 -20 -16 -24 -3 -4 -20 -16 -22 -5 -25 -11 -23 -18 -5 -8 -2 -5 2 0 -7 -11 5 7 3 17 -3 9
5033 9 2 15 3 -1 -5 3 10 2 15 7 6 8 -1 7 -2 3 -5 -1 -9 0 3 -7 11 -3 6 -17 4 4 11 16 -1 14 5 20 7 6 11 12 12 14 7 0 5 -3 -2 0 -9 -17 -21
5082 -21 -20 -19 -17 -17 -18 -3 -32 -12 -20 -18 -31 -15 -13 -24 5 -19 7 -19 -4 -6 -7 14 -4 6 -7 15 3 16 4 23 18 10 27 10 14 6 2 9
5120 9 -2 11 4 9 -14 8 0 -10 3 -4 3 3 5 -8 4 2 5 -2 5 5 5 13 -2 9 -3 9 8 -5 2 0 -1 1 8 -5 2 -7 -4 5 -5 0 -8 -7 -12 -14 -13 -17
5166 -17 -9 -30 -19 -23 -19 -18 -20 -11 -11 -9 -7 -8 -4 -14 1 0 3 0 8 8 7 0 9 15 20 19 4 25 22 17 19 12 16 21 17 13 12 17 12 9 -3 9 3 0 -4 -7 -1 -16 -5 -7
5216 -7 6 -4 -8 -8 -4 6 3 6 -1 -3 0 -2 -3 8 -4 -3 -1 -5 -16 -10 -5 -6 -10 -15 -10 -9 -18 -12 -31 -16 -10 -18 -19 -20 -16 -11 -6 -5 -13 -10 -31 -14 -18 -3 -8 6 -3 5 7
5265 7 7 24 18 16 20 16 26 20 24 19 22 19 27 12 10 12 -6 9 -9 3 -15 -1 -2 -11 -9 -7 -1 -4 -8 -7 -7 -13 -17 -3 -17 -8 -14 -14 -21 2 -3 -13 -9 -19 -1 -4
5311 -4 5 0 -1 -11 -7 -2 -16 3 -5 -4 -5 -13 -17 -24 -17 -18 -9 -16 -14 -14 -18 1 -4 -4 -11 -3 4 1 -13 -3 7 4 12 4 7 15 18 11 4 12 15 17 18 15 22 14 15 8 18 1 19
5362 19 7 -2 3 -11 -3 -17 -9 -19 -15 -21 -25 -7 -5 -13 -19 -6 -21 -10 -7 -9 -2 -15 -2 5 7 -7 -2 -1 -13 2 -7 7 -9 4 -11 8 -16 -9 4 9
5402 9 -15 -6 -32 13 -19 -19 -24 5 -17 -54 -58 -30 3 -15 9 -5 -34 -10 28 -4 21 55 8 26 21 23 12 24 11 19 27 5 8 5 8 13 12
5439 12 5 -2 -6 -3 -3 -1 -5 -9 -8 -11 -4 -11 -14 -11 -20 -14 -1 -15 -12 -17 -6 -20 -8 -13 -6 -6 -6 -1 -7 11 -4 3 8 9 12 4 11 0 7 13 2 7 0 -4 -5 1 -11 -3 -5 -12
5489 -12 4 3 -3 2 5 -1 2 -2 -3 1 5 9 4 5 10 0 9 2 14 4 15 19 11 9 9 8 -3 13 6 16 4 0 4 3 -1 -7 -10 -15 -13 -18 -18 -22 -19 -25 -21 -13 -22 -8 -11 -9
5539 -9 -10 -6 -1 -7 -2 -10 -6 -5 4 15 7 6 1 0 -4 0 7 -2 7 0 3 5 5 3 13 -4 11 11 -2 -2 -6 5 1 -1 6 -6 2 -3 7 0 -6 6 0 19 2 7 17 10 13
5588 13 11 21 3 22 9 17 4 12 13 -5 -1 1 10 -10 -7 3 -4 -10 -16 -8 -6 -20 -6 -5 -11 -12 -7 -10 -12 -16 -15 -20 -8 -17 -6 -8 1 -3 -1 8 6 8 14 11 8 6 16
5635 16 10 13 13 4 8 4 7 -10 8 0 3 2 -4 2 -10 4 -7 0 5 7 -1 1 8 -8 6 -11 4 -2 4 -1 2 13 0 9 7 7 6 6 10 2 -6 -2 13 8 -2 -5 -4
5682 -4 -6 -11 -14 -15 -5 -17 -15 -15 -20 -15 -22 -7 -17 -10 -21 -5 -4 -12 -5 -7 4 -6 2 6 -1 -3 10 16 2 6 1 21 2 12 9 9 21 9 12 7 13 5 5 4 1 8
5728 8 -2 3 -2 -13 0 -13 -5 -7 -2 -9 2 -4 3 19 3 8 -3 6 22 1 13 14 11 13 5 9 -3 0 13 -6 -2 -3 -10 -15 -9 -4 -7 -10 -20 -18 -19 -15 -8 -18 -21
5773 -21 -6 -8 -4 -10 -10 -12 -6 -18 4 0 2 -3 -5 10 10 19 16 12 23 12 26 8 23 14 16 13 7 13 8 8 -3 7 -1 10 -7 -2 -5 -3 8 -5 12 -5 -5
5816 -5 -5 -6 5 1 -5 0 -5 -8 -2 5 -5 -3 -1 6 3 1 -3 4 7 -7 -4 3 11 6 -10 -11 -18 8 -24 -4 -17 -19 -16 -26 -16 -14 -8 -14 -8 -3 0 -12 -3 -3 7 -1 1 5 5
5865 5 5 12 9 15 9 25 6 12 11 15 12 9 15 14 17 20 23 20 9 7 10 1 -5 -5 -11 -4 -2 -18 -13 -11 -4 -8 -3 -11 -9 -5 -11 -6 1 2 -3 7 2 4 7 -10 8 5 -5 -5 -7 -4 1
5918 1 -8 4 -6 -12 -10 -1 -16 -4 -9 -8 -9 -1 -9 -7 -5 -15 -5 -15 -8 -16 -7 -8 -7 0 -2 11 -7 5 10 17 11 13 26 13 25 20 24 23 19 9 6 12 19 9 7 12
5964 12 2 1 16 -3 -2 -6 -3 -18 -6 5 -8 -7 -10 -22 -19 -19 -8 -9 -11 -2 -4 0 -3 3 -12 2 0 2 7 13 1 10 -6 11 -5 -8 -2 -13 7 -12 -4 -12
6006 -12 0 -16 -11 -4 -15 -3 -5 -2 -3 8 1 -4 9 2 12 -8 13 16 0 16 11 11 4 16 17 19 14 10 21 5 26 27 18 20 18 3 15 -4 3 1 -7 -6
6048 -6 0 -2 -12 -19 -11 -15 -14 -7 -19 -16 -18 -7 -13 0 -21 2 8 0 -10 5 3 -4 4 -10 -1 6 -1 7 4 -1 2 2 2 7 0 0 13 -5 0 -8 8 1 -3 4 3 -2 -9 -9 -5
6097 -5 -1 -4 16 10 -3 10 8 7 9 16 19 5 22 26 30 10 11 16 4 13 13 22 1 5 3 -1 3 -5 4 38 -7 2 -6 -19 -9 -12 -14 -11 -17 -6 -22 -11 -16 -12 -15 -23
6143 -23 -11 -15 -2 -4 0 13 -6 5 14 5 5 9 2 12 12 10 10 4 -2 -4 1 3 -8 -8 2 3 -9 -8 -9 15 -4 1 3 -3 -2 -1 7 9 14 16 18 12 12 9 5 6 10 10 19
6192 19 2 13 8 21 14 14 15 12 -2 1 2 11 -5 2 -2 -31 0 -9 -4 -23 -18 -8 -17 -10 -6 -14 -4 -14 -11 -8 5 5 13 7 -2 -1 8 15 -4 7 10 20 12 -2
6236 -2 16 11 10 12 20 7 11 15 -5 16 6 3 8 18 2 -1 1 -4 -7 -10 5 5 -2 -3 -7 -4 0 5 13 8 6 21 23 8 8 10 4 2 10 9 2 8 9 5 -5 15 -6 -1
6284 -1 4 -8 3 -7 -4 -6 -10 -6 -3 -6 -5 -9 -11 -10 -6 -6 -9 -14 -8 -8 0 4 3 5 13 7 5 12 19 21 14 8 20 10 20 16 12 11 6 -7 5 3 -2 6 3 6 7 -2 1 0 -4 0 34
6337 34 16 6 0 10 -2 21 -5 -15 -40 12 27 19 -25 -3 11 -13 6 16 10 5 1 5 7 35 -11 -32 -6 -14 -4 -44 -5 -4 -58 -49 -1
6372 -1 -24 -9 -7 -4 -12 2 -9 1 -6 16 1 3 1 13 12 8 15 0 6 7 6 22 11 10 -4 16 10 19 21 13 6 5 21 10 14 1 2 -6 0 -4 -12 3 -13
6415 -13 -2 -1 -13 -13 0 9 -9 5 0 5 6 -2 5 9 19 3 18 1 8 0 4 1 -5 -4 -11 8 -9 -1 -9 -2 -16 -13 -3 -12 -10 -3 -13 -13 -22 -10 -12 -5 -9 -6 -12
6460 -12 -3 -1 -3 0 -10 -3 3 7 17 16 7 18 13 11 13 18 18 13 9 12 10 11 7 1 4 8 -5 -1 1 -7 -4 1 -3 0 -12 -13 -9 -8 0 -7 -6 -10 -18 -14 -10 2 -9 -9 3 1 0 -1
6512 -1 8 0 -1 9 -1 4 -3 -7 7 6 4 1 0 -7 -14 -5 -27 -11 -9 -18 -9 -16 -8 -4 -11 3 -7 -5 7 5 8 7 11 7 1 23 5 4 9 15 8 19 19 17 19 16 11 15 10 9
6562 9 -2 9 2 11 4 9 -7 -16 -6 -15 -20 -20 -8 -12 -18 -4 -7 -16 1 -3 -12 -4 -10 0 -5 6 -5 -1 4 4 11 -1 6 7 0 1 8 1 2 -1 9 4 5 -5 -10 -10 -5 0
6610 0 -13 -3 0 -5 -3 -2 -2 -2 -9 -12 2 -5 8 9 11 3 12 17 14 23 15 14 5 21 14 5 16 13 6 9 6 9 7 0 -3 -24 3 5 -8 1 -1 -7 -7 -17 -11 -13 -8 -12 -14 -5 -2
6661 -2 -8 -16 -9 -22 -9 1 -3 4 1 6 2 6 5 8 2 11 11 1 7 6 3 -12 -2 -1 -5 -7 -7 -2 -3 -7 -10 -12 -2 -6 -4 -15 0 9 -11 -2 0 0 9 -4 10 12 6 13 10
6710 10 9 7 4 5 17 22 16 12 6 15 20 11 7 0 6 -3 1 -16 -7 -12 -8 -18 -9 -16 -26 -15 -17 -18 -22 -11 -6 -11 -2 -12 -3 -1 0 1 3 -5 -2 4 5 11 9 -6 2 9 10 -4 11
6761 11 11 7 8 8 8 8 3 2 0 11 -8 -1 -3 -5 -5 -9 -4 -4 -2 2 0 -3 0 -3 6 1 2 10 7 5 8 9 10 12 4 20 18 15 2 2 -6 -20 0 17 4 -34 -50 -12 13
6810 13 -8 6 -3 -2 -17 -14 -4 -2 -23 -6 -12 -13 -17 -11 -11 -18 -7 -2 0 -1 1 18 6 13 6 17 18 19 21 1 11 11 2 11 8 7 -1 5 11 9 7 0 5 1 4 -6 2
6857 2 -1 7 -5 11 2 -7 7 6 0 7 2 1 9 -4 9 -1 4 14 10 12 0 15 13 13 6 13 1 -4 -14 -9 -5 -7 -5 -11 -17 -9 -8 -14 -8 -13 2 -11 1 -8 2 2
6903 2 3 1 -5 -1 2 7 1 5 2 8 7 6 21 9 3 13 18 18 11 -1 22 24 18 6 3 6 3 3 -4 -4 -7 1 -9 -13 5 5 -4 -6 5 -4 -5 6 4 3 10 13 25 16 14 9
6953 9 11 12 1 7 12 11 2 0 1 -2 -2 8 0 5 -3 1 -14 -2 -13 -4 -6 -8 -6 -11 -17 -5 -16 -7 -4 8 -4 -1 4 0 4 14 5 12 16 12 17 11 20 16 11 16 19 6 7 12
7003 12 13 15 9 7 -2 9 4 -6 11 1 -6 -3 4 -5 0 -16 -7 2 4 3 -10 1 -4 5 2 -2 -3 6 8 8 1 5 14 12 6 5 7 16 13 14 3 2 2 -3 4 -4 -11 -13 -10 -15 -7 -17
7055 -17 -3 -5 2 -9 -9 3 9 2 7 -2 15 8 0 0 8 12 8 7 15 12 18 16 17 14 22 16 22 11 32 13 17 20 3 5 6 -8 -5 -2 -22 -29 -18 2 -33 -5 7
7100 7 -2 -8 -2 -3 2 6 0 3 9 16 3 15 9 9 17 1 7 1 4 7 3 10 2 10 -9 7 -3 -11 1 -6 -5 6 -6 5 -8 -6 -4 -6 -11 -6 -2 -12 -6 -9 0 6 -5 10
7148 10 7 7 10 12 13 17 11 18 10 12 10 9 20 13 15 3 11 12 5 7 0 8 1 2 -8 -3 2 -9 -2 -4 5 -9 0 -10 1 0 -3 -3 -5 0 0 -3 3 12 11 8 11 13 22 10 6 13
7200 13 -2 10 12 -2 6 9 4 -2 12 4 -4 0 -7 -14 -9 -2 3 5 -2 -3 -6 1 4 3 9 -11 14 13 3 3 7 13 13 9 8 8 8 14 16 17 18 14 6 13 11 13 3 10 -6 -3 -5
7251 -5 -4 -7 -2 -9 -11 -3 -7 -8 -3 -9 -14 -9 -13 -6 1 -12 2 -3 9 8 5 6 3 4 6 16 6 12 -6 12 1 10 8 10 13 8 11 4 1 -2 -8 3 0 -6 0 10 3 -6 -2 -9 6
7302 6 4 -3 0 2 18 0 19 10 10 4 19 15 28 12 19 20 15 17 -4 12 8 7 2 -2 6 7 16 -4 -9 10 -5 2 -13 -2 -9 -9 -12 -2 -10 -12 -18 -9 -3 -8 -2 3 -9
7349 -9 5 -3 7 7 15 8 9 18 5 4 17 12 0 6 8 7 9 3 2 12 1 10 4 -9 -4 0 -11 1 -6 -7 9 2 -5 10 0 -2 2 3 7 0 6 11 10 12 13 18 12 8
7397 8 4 16 8 9 13 4 17 2 2 10 0 -4 -5 -12 -8 -4 -11 -11 -16 -6 -11 -3 -9 -9 -13 -6 -16 -6 -14 0 -8 1 3 -1 5 5 6 4 3 5 24 11 14 1 10 11 11 15 10 16
7447 16 15 6 4 -8 1 9 -3 -14 -3 -5 -14 -10 -8 -7 -6 11 0 0 -1 0 9 12 17 7 8 1 18 17 -6 -21 38 45 -22 27 -30 -14 -12 2 31 -53 36
7488 36 11 -10 -5 -18 -6 -8 5 -12 -3 -23 -15 -16 -8 -22 -18 -1 -17 0 -3 -6 14 2 24 17 11 13 19 8 4 6 21 12 2 19 6 7 6 12 13 5 12
7529 12 12 2 -3 0 5 4 3 3 -6 3 -7 1 0 10 -2 -4 -8 -6 -8 6 10 -3 11 5 7 5 11 13 10 14 10 6 10 -1 -1 11 -5 -2 -3 -10 -15 -8 -12 -13 -14 -9 -5 -13 -3
7578 -3 -12 0 -3 -7 -5 -3 -5 5 0 6 5 -2 -2 7 27 4 20 31 34 28 2 20 13 18 13 25 15 21 8 5 5 0 2 -9 2 -6 -10 -9 1 -8 -9 -15 -12 -10 0 -2
7624 -2 -4 -5 -3 -5 9 5 5 9 11 11 4 0 1 5 10 -2 10 15 8 3 8 1 -7 10 0 -5 2 -4 0 -7 -9 -8 -5 -6 -13 -3 -14 -14 -3 1 -5 -12 -5 1 10 5 -3 17 1 12
7674 12 5 12 9 8 24 16 25 19 12 10 6 4 3 7 4 10 -1 -1 1 1 -2 -6 -3 0 -1 2 -4 -8 -17 -5 -5 -4 -7 1 -5 0 -1 -3 5 11 13 -2 14 13 5 11 3 0 4 9 7 12 14 7 11
7729 11 5 -2 -10 -9 -1 1 -8 -3 -3 -3 -10 -8 3 -4 -5 2 -11 -5 10 7 6 3 13 9 15 17 18 17 7 23 13 15 8 25 16 12 11 19 18 4 -1 1 8 2 6 -13 -1 -6 -3
7778 -3 5 -3 1 -10 -2 -2 4 1 -2 -8 2 1 -4 2 4 -1 8 0 14 1 3 10 6 14 4 7 4 11 -4 5 0 3 7 -2 -2 -1 -5 4 -3 -7 -15 2 -12 -3 -12 -12 -8 6 9 1 4 4
7830 4 6 10 13 17 12 19 14 14 17 7 19 21 8 4 9 12 12 8 9 -5 11 -5 -2 -1 -9 -13 6 1 -8 -8 -6 -5 -9 -3 2 -7 -2 -3 5 6 5 18 19 12 18 6 5 10 16 14 16 12
7882 12 5 10 3 13 14 3 2 11 -11 -5 -2 -5 -6 1 -8 2 3 -6 -5 -6 8 0 -4 -3 5 0 7 3 -1 2 18 19 12 25 15 12 20 11 13 19 10 16 10 17 11 8 -2 4 1 -8 -11
7933 -11 -12 4 -9 1 -2 -4 -2 -8 -8 -3 -3 -11 -2 -2 4 6 3 8 15 10 8 5 14 5 10 15 17 9 17 20 19 12 14 7 12 11 8 8 8 1 2 4 0 -10 -9 7 -8 -5 1 -9 0 0 -4
7986 -4 5 10 12 18 12 6 14 24 19 13 18 5 20 15 17 5 3 4 14 18 16 9 5 9 15 7 1 -1 -10 -4 3 -17 -11 -8 -13 -11 -15 -19 -8 -11 -5 -8 -1 -7 8 8 -2 2 -1 10 5
8037 5 11 13 8 4 4 12 1 6 8 -4 1 7 10 0 3 9 -7 -13 1 -10 5 -6 -2 0 -6 13 -6 -5 -8 4 1 2 5 -5 5 3 16 19 9 10 13 11 14 17 21 6
8083 6 5 9 13 1 1 5 2 0 -15 -8 -4 -10 -16 -6 -23 -18 -15 -10 -1 -6 1 -8 1 2 14 -8 -4 0 13 5 3 15 12 23 11 12 13 17 17 20 13 17 21 6 1 16 12 6 -5
8132 -5 3 2 3 -7 1 3 -6 2 -13 11 1 -3 -2 -3 4 -3 2 4 6 3 -2 11 1 5 6 0 -1 9 9 0 -1 1 7 8 4 1 3 -9 -5 -12 -4 -8 -6 -20 -6 -23 -13 -10 -21
8181 -21 -11 -15 -14 -1 -15 -16 -12 -4 5 -5
8191e
$$ Imaginary data points
##PAGE= N=2
##DATA TABLE= (X++(I..I)), XYDATA
0 0 0 0 0 0 0 0 0 0 0 0 0 0 0 0 0 0 0 0 0 0 0 0 0 0 -8 8 -8 8 -8 8 -8 10 -16 16 -16 16 -24 24 -27 32 -32 40 -40 48 -56
45 -56 56 -64 72 -80 88 -96 104 -113 128 -142 153 -171 192 -214 239 -269 304 -350 406 -480 584
66 584 -739 1002 -1547 5468 -9654 -3979 9524 -3767 -613 2809 2661 -2922 -1505 3095 -3226
81 -3226 -4897 4060 -3851 -3738 1655 -3601 -2504 649 -933 -1448 1030 -687 -3453 -1472 58 -45
97 -45 -3746 832 2951 -2766 -1462 840 -1608 949 983 -2377 62 -2051 855 1496 -2927 3020 459
114 459 -2738 437 -677 -315 300 -550 1569 -207 -734 3141 -1748 -801 3144 310 87 803 1522
131 1522 182 489 1328 1645 1015 253 648 -357 2000 1259 -1209 1001 1645 -1010 668 1370 -1249
148 -1249 1028 34 -5 -241 -873 2050 -959 -1238 1235 -486 -538 580 -1195 118 415 -1414 642
165 642 -666 -355 -381 -1210 586 -476 -950 -648 -566 -831 214 -735 -1027 141 -1092 -192 -317 -758 -13
184 -13 376 -799 -431 192 -416 636 -863 249 478 -245 1029 -612 157 1243 -376 -171 1751 -91
202 -91 -242 1014 370 792 -51 1214 317 -535 1407 470 -419 904 1360 -496 596 564 -8 811 433
221 433 433 -216 683 671 -201 -135 965 191 -545 993 -452 -21 4 -408 356 -302 -23 -73 -610 -544 260 -981
243 -981 -349 145 -887 -213 -891 -280 -595 -505 248 -784 -1055 209 -6 -1673 374 254 -848 -254 47
262 47 11 -826 319 300 -518 -156 791 -472 -457 1254 -333 121 516 135 81 210 577 116 378 597 592
283 592 -261 963 656 -366 991 412 381 507 596 156 195 534 601 374 -87 985 -271 -126 632 -21
303 -21 195 96 224 -118 -6 -141 309 -410 -384 370 -734 -29 -244 -339 -321 -535 -346 -362 -462 -678 -116 -716
325 -716 -40 -392 -769 26 -749 -405 -49 -154 -664 -111 -186 -491 -207 -165 341 -777 155 366 -664 116
345 116 429 -169 -214 697 -38 195 209 257 272 -40 882 -63 175 698 169 165 882 444 -206 834 212 393
367 393 490 581 434 -129 654 344 33 265 740 -156 32 402 -177 346 -222 201 44 -264 68 -101 -359
388 -359 -173 149 -572 -33 -411 -429 -304 -561 106 -588 -380 -213 -629 -716 92 -233 -723 71 -469 -251 -490
409 -490 -102 76 -432 -10 -122 -192 -116 313 -423 62 273 -151 391 -112 265 143 134 301 279 80 201 449
431 449 7 682 264 486 291 -86 730 280 188 505 590 -23 394 331 111 465 96 444 -215 194 417
452 417 -254 9 243 -59 -226 420 -350 -153 13 -169 -100 -407 295 -247 -480 -57 43 -479 -268 -145 -631
473 -631 79 -444 -200 -189 -376 -139 -502 -207 -182 -266 -455 -8 -421 -193 58 -516 54 -286 23 24 -246 -9
495 -9 167 28 -133 426 117 296 12 259 407 -80 573 339 138 236 558 101 309 495 62 424 14
516 14 476 289 142 334 59 247 318 209 -58 370 -86 239 190 -261 447 -115 -34 49 100 -63 -181 -49
538 -49 -108 -82 -270 93 -472 -97 -64 -573 -101 -219 -345 -449 -37 -527 -371 33 -384 -423 -388 176 -488 -379
560 -379 197 -201 -483 39 188 -391 123 -187 21 49 -9 306 -274 145 114 65 176 171 10 200 268 -48 455
583 455 65 254 118 154 472 127 339 161 366 165 342 223 144 438 99 280 117 327 237 133 14
604 14 188 233 -167 308 -136 85 -57 -146 119 -330 -2 -153 -306 -238 1 -351 -362 -298 -389 10 -474 -235 -387
627 -387 -282 -243 -437 -22 -282 -230 -335 -37 -293 -215 55 -324 -123 -26 54 -306 47 -8 -61 54 -72 182 -161
650 -161 398 34 -125 447 194 40 126 381 107 352 278 342 172 197 468 -90 434 309 172 208 240 286 50
673 50 271 9 209 124 179 77 -16 212 -32 14 -92 181 -149 -120 -52 -212 74 -332 4 -238 -281 11 -208
696 -208 -331 -246 -95 -372 -189 -304 -53 -319 -332 50 -478 -76 -165 -242 -305 -80 -34 -268 -25 -133 3 -245
718 -245 17 -19 -16 68 -57 73 25 252 -90 187 193 90 306 -13 294 112 87 238 220 228 273 267 37 344 140
743 140 362 127 170 410 -95 213 211 191 13 161 75 26 66 -31 126 -213 62 -5 -111 -72 -121 9 -217 -33
767 -33 -271 10 -192 -254 -94 -289 -53 -292 -118 -239 -247 -167 -121 -286 -332 65 -387 -148 -176 -123 -161 -290 -4 -222
791 -222 -49 -102 -29 -156 36 -4 -159 190 -104 126 48 112 89 132 245 9 204 149 371 34 216 349 107
814 107 268 157 354 113 230 236 243 119 182 377 -119 245 178 129 23 92 175 -136 113 40 9 -159 134 -125
838 -125 -243 167 -209 -170 -177 6 -256 -183 -25 -293 -229 -181 -30 -497 -72 -48 -400 -202 -133 -93 -399 -58 -168
861 -168 -200 -160 -44 -78 -350 106 -171 -77 9 26 -33 -56 131 -40 162 6 189 36 162 293 -30 276 157
884 157 209 100 268 213 139 245 139 303 1 356 216 74 198 188 243 2 252 108 105 -1 195 120 -114
907 -114 213 -73 -3 -26 41 -119 -110 16 -195 -37 -207 -39 -275 -123 -109 -347 -26 -213 -222 -278 -66 -269 -210 -101
931 -101 -243 -117 -269 18 -281 -126 -43 -196 -44 -119 -16 -150 60 -130 20 61 -82 84 -33 154 -46
952 -46 171 120 44 131 130 180 -17 359 86 128 167 146 234 84 232 88 247 113 197 159 105 200 15 278 -8
977 -8 150 114 14 76 27 107 -92 89 -110 16 -46 -63 -31 -165 41 -236 -60 -99 -124 -186 -116 -72 -344 -30 -197
1002 -197 -189 -248 -86 -112 -302 -49 -165 -126 -252 13 -153 -158 28 -165 -39 -184 80 -92 -83 10 -39 35 -59 111
1026 111 -88 140 24 44 143 85 171 -28 251 105 164 151 205 213 57 325 93 174 110 278 149 37 254 146
1050 146 175 -9 247 20 17 184 19 60 -43 192 -86 -29 26 -49 -113 -108 50 -232 -5 -170 -137 -94 -117 -133 -275
1075 -275 -15 -243 -146 -184 -145 -163 -171 -34 -286 -88 -149 -97 -217 -91 -37 -146 5 -165 56 -125 -40 1 -49 37
1099 37 -53 114 -30 104 49 115 47 59 224 -2 193 67 188 140 132 193 130 240 40 222 112 210 116 108 197
1124 197 25 232 71 119 13 149 81 -13 127 -45 114 -72 52 -30 -52 -10 -120 -19 -127 -27 -202 -20
1146 -20 -118 -179 -93 -236 -55 -233 -75 -202 -178 -117 -142 -133 -250 -34 -230 -72 -160 -101 -91 -162 -8 -168 -15 -103 18
1171 18 -69 -11 92 -52 102 -30 141 -10 75 99 61 139 43 137 5 240 81 89 159 121 216 11 214 117 125 137
1197 137 165 109 64 251 1 113 35 147 28 -15 160 -39 42 -53 73 -81 -23 -7 -108 18 -130 -12 -172
1220 -172 -61 -103 -119 -119 -199 -60 -190 -59 -240 -119 -123 -187 -94 -240 -75 -183 -97 -166 -83 -131 -149 -17 -175 -18 -112
1245 -112 35 -108 -50 96 -63 32 40 151 -43 104 102 53 142 74 182 37 218 104 127 127 126 207 74 207 55
1270 55 228 98 78 170 78 153 37 149 4 111 51 28 70 -30 78 -99 75 -56 -37 0 -86 -46 -94 13
1294 13 -206 -50 -79 -100 -138 -159 -13 -216 -76 -156 -104 -158 -100 -76 -219 -59 -161 -37 -168 -68 -43 -139 -39 -110
1318 -110 4 -122 8 -68 -2 6 -47 62 -60 124 -11 62 72 77 97 43 159 30 191 81 133 97 118 212 40
1343 40 172 112 173 50 140 159 35 159 61 145 6 123 53 9 92 18 49 -55 81 -83 16 -15 -72 -4 -104
1368 -104 3 -166 -29 -102 -105 -106 -134 -83 -172 -50 -203 -91 -139 -139 -74 -182 -79 -172 -43 -170 -80 -60 -115 -85 -98 19
1394 19 -167 3 -25 -38 -14 -12 64 -46 116 1 70 28 76 106 31 151 31 170 91 111 99 139 128 51 219 60
1420 60 145 85 137 103 75 166 29 145 52 96 28 62 38 -15 100 -76 48 -25 24 -74 -42 24 -143 -32 -99 -17 -129
1447 -129 -57 -79 -157 -88 -155 -74 -199 -62 -139 -128 -101 -136 -49 -180 -58 -153 -54 -91 -108 -47 -101 4 -105 14 -66 -1
1473 -1 -19 -45 38 -44 77 -15 83 13 57 103 22 107 42 155 30 144 149 102 117 118 193 18 172 93 106 111 130 155 8
1502 8 138 38 84 31 65 38 3 83 -53 60 -27 14 -51 -22 -11 -108 11 -108 -39 -117 -30 -112 -130 -38 -153 -72 -153
1529 -153 -58 -134 -107 -125 -117 -48 -167 -26 -136 -66 -122 -84 -26 -144 -11 -60 -10 -84 24 -39 -49 38 -35 80 -29 91
1555 91 13 55 64 42 134 23 112 57 169 51 85 147 54 145 68 168 50 114 103 93 111 50 144 5 125 45 71
1582 71 90 -11 52 1 61 -57 42 -18 -42 -45 -61 7 -147 -7 -107 -104 -108 -85 -86 -177 -51 -133 -48 -162 -64 -80 -147 -65 -139
1611 -139 -44 -135 -55 -106 -68 -56 -81 -27 -123 18 -76 2 -17 -29 30 -23 54 -48 80 30 48 23 73 124 -16 150 63
1638 63 91 57 125 112 30 149 90 122 48 185 79 50 132 67 120 34 112 26 87 61 32 46 -24 67 -56 36 -33 -24 -9
1667 -9 -72 -23 -77 4 -123 -59 -97 -66 -71 -154 -38 -134 -77 -145 -65 -97 -142 -73 -119 -64 -145 -9 -125 -104 -28 -78 -42 -99 22
1696 22 -89 -17 -28 -1 11 -17 60 -36 83 16 64 48 26 70 44 129 5 115 71 86 70 84 147 25 121 68 134 57
1724 57 79 94 55 120 21 134 16 58 64 48 46 -27 97 -30 15 -20 32 -39 -69 28 -81 -11 -109 -24 -87 -95 -73 -112 -51
1753 -51 -143 -41 -142 -80 -125 -94 -77 -161 -47 -111 -45 -110 -47 -56 -96 -26 -100 8 -72 10 -28 -10 16 -29 45 -27 56 -18 88
1782 88 19 25 96 34 84 23 140 38 70 99 87 89 53 148 18 129 86 86 75 56 130 5 95 18 89 60 48 55 -7 77
1812 77 -62 44 -2 4 -19 -19 7 -86 6 -92 -29 -94 -57 -63 -110 -49 -133 -24 -133 -83 -93 -81 -100 -148 -29 -131 -49 -102 -37
1841 -37 -96 -83 0 -107 -14 -66 12 -85 -20 14 -30 44 -34 58 -14 48 20 44 80 14 101 28 114 43 104 74 58 127 39 117
1871 117 39 124 62 100 73 45 106 23 88 10 95 23 35 56 0 44 -26 57 -40 5 4 -17 -29 -61 17 -89 -2 -71 -43 -56
1901 -56 -93 -39 -116 -26 -111 -43 -95 -92 -77 -107 -57 -135 -26 -102 -67 -79 -57 -40 -101 -11 -83 -3 -54 -7 -19 -18 36 -41 71 -22
1931 -22 42 28 56 51 18 112 8 92 44 116 53 73 125 31 114 52 118 48 91 81 51 85 31 125 9 87 30 52 48 -19
1961 -19 46 -31 39 -43 29 -18 -4 -1 -58 17 -85 -14 -70 -41 -72 -72 -40 -118 -52 -109 -27 -121 -71 -46 -117 -62 -103 -33 -128 -38 -66
1992 -66 -82 -63 -66 -5 -104 -5 -67 -13 -13 -33 31 -33 36 -29 53 1 45 52 32 90 22 109 17 85 64 71 91 50 107 34 126 32
2024 32 95 79 43 85 27 106 15 85 38 43 31 39 68 -22 59 -34 26 -39 -19 17 -66 -3 -51 1 -85 -24 -66 -78 -36 -85 -13
2055 -13 -133 -32 -89 -71 -57 -85 -40 -109 -26 -117 -24 -73 -57 -48 -86 4 -89 -8 -49 -2 -49 -12 11 -35 51 -12 54 -23 50 59
2085 59 -2 66 34 91 25 117 65 73 77 69 111 28 128 41 97 89 85 89 27 94 18 110 25 48 38 13 53 -20 51 -32 20 -30 3
2118 3 -4 -43 13 -73 8 -82 -23 -60 -77 -49 -80 -34 -114 -26 -81 -66 -93 -61 -32 -120 -34 -100 -53 -94 -39 -45 -76 -12 -73 -3 -64 10
2150 10 -34 -20 10 -29 33 -41 39 -18 29 25 23 69 9 100 12 92 48 68 69 78 113 36 112 47 85 41 80 90 23 106 23 78
2182 78 22 74 35 0 48 -3 48 -31 48 -33 5 -1 -35 3 -60 -3 -77 -17 -71 -51 -41 -94 -27 -104 -20 -95 -59 -72 -74 -52 -91
2213 -91 -26 -104 -30 -79 -36 -33 -62 -21 -84 -1 -63 3 -36 -23 -5 -15 29 -51 56 1 24 16 37 53 0 82 11 70 29 78 63
2244 63 41 93 30 101 34 87 46 66 63 36 89 22 78 10 69 28 22 46 2 51 -23 45 -28 2 -19 -30 -6 -79 4 -63 -30
2275 -30 -76 -28 -57 -93 -36 -95 -38 -100 -41 -91 -76 -42 -85 -45 -93 -25 -85 -45 -56 -50 -15 -65 -8 -63 17 -34 -5 15 -19 21 -20
2306 -20 48 -21 53 28 33 47 12 82 5 79 21 93 55 34 74 52 83 15 103 44 52 57 51 79 12 92 19 53 25 48 41 0 71
2339 71 -15 27 -36 21 -12 -27 4 -47 -4 -62 -12 -65 -36 -45 -77 -35 -90 -31 -92 -27 -80 -72 -47 -91 -33 -87 -26 -75 -50 -52 -48 -24
2371 -24 -60 6 -53 -2 -42 -3 -6 -34 34 -26 30 -6 61 6 21 48 24 66 4 72 9 61 36 45 78 29 77 25 94 24 57
2402 57 58 21 74 22 72 6 67 31 34 21 9 51 -7 39 -25 36 -1 -26 -2 -27 10 -66 10 -60 -31 -38 -31 -40 -100 9 -83 -26
2434 -26 -71 -49 -52 -72 -36 -85 -29 -80 -30 -61 -49 -17 -69 -11 -60 1 -33 0 -24 -5 8 -26 32 -21 52 0 6 35 22 53 13
2465 13 80 28 49 31 59 50 33 94 2 66 44 64 38 28 72 26 56 8 74 11 30 40 -16 66 22 53 6 -3 -32 0 -19
2496 -19 -41 39 -47 -12 -45 -29 -11 -79 3 -54 -9 -82 12 -87 -136 -26 -72 -22 -94 -23 -82 -29 -64 -61 -17 -57 -27 -54 9 -64
2526 -64 -13 -22 -12 6 -20 46 -32 30 15 34 16 24 53 8 52 11 76 45 44 61 35 87 29 76 35 66 28 55 55 19 75 13
2558 13 57 9 33 32 9 17 -1 45 -20 16 -11 -1 -15 -25 17 -50 0 -36 -11 -39 -30 -24 -63 -14 -68 -18 -70 -42 -56 -58 -44 -80 -33
2591 -33 -70 -35 -71 -36 -43 -54 -9 -57 -7 -49 0 -15 -15 5 -12 19 -6 35 5 25 16 30 46 9 49 21 64 28 57 65 40 64
2623 64 40 95 22 63 43 41 46 32 68 13 62 17 47 10 5 38 -9 31 -16 41 -17 -17 -5 -25 8 -41 11 -53 -13 -38 -28 -38
2655 -38 -53 -12 -71 -10 -66 -30 -48 -60 -39 -64 -8 -78 -29 -52 -37 -48 -39 -21 -52 -5 -38 -9 -44 -4 -4 -35 9 -17 33 -27 42
2686 42 25 9 45 12 62 14 63 26 57 45 34 74 34 70 28 75 29 45 53 23 62 13 56 17 48 15 26 37 -5 31 -10
2717 -10 33 -31 0 3 -31 -12 -33 0 -60 -14 -44 -29 -44 -50 -20 -69 -15 -56 -30 -57 -47 -36 -65 -15 -69 -9 -60 -31 -38 -38 -30 -49 -4
2750 -4 -43 -15 -29 -5 -4 -26 12 -21 29 -17 30 7 11 32 20 52 -2 57 37 58 35 53 49 19 77 36 56 31 56 61 30 57 22
2783 22 65 13 59 23 31 24 5 41 -19 31 -17 12 -11 -11 -9 -51 -6 -57 -1 -46 -29 -38 -43 -23 -64 -15 -68 -43 -54 -44 -36 -63 -29 -66
2817 -66 -15 -66 -25 -34 -49 -18 -39 -1 -54 7 -12 -9 -2 -8 12 -23 30 -15 25 2 30 26 7 47 13 52 12 58 35 35 56 25 73
2850 73 14 54 31 54 40 29 59 24 55 22 54 4 18 23 2 24 -20 36 -12 -5 -6 -11 -10 -46 4 -35 -6 -55 -20 -40 -50 -19 -68
2883 -68 -30 -69 -25 -56 -43 -47 -55 -15 -79 -18 -57 -12 -44 -38 -17 -33 -5 -44 14 -42 13 -18 -9 20 -22 35 -9 26 -3 21 16 10 36
2916 36 8 53 10 54 24 24 46 22 59 15 57 24 49 43 47 44 12 60 11 48 9 31 26 9 24 -9 28 -20 21 -12 2 1 -26
2949 -26 16 -58 -7 -43 -22 -44 -43 -28 -57 -24 -68 -20 -63 -43 -47 -48 -33 -58 -20 -55 -20 -46 -27 -28 -28 -6 -42 10 -24 6 -8 2 14
2982 14 -10 29 -17 39 -2 27 20 14 41 8 56 11 42 21 37 45 25 54 13 72 8 49 25 41 49 22 53 32 49 5 50 14
3014 14 19 29 -4 35 -8 38 -7 -2 10 -22 -2 -41 8 -43 -8 -43 -26 -22 -50 -18 -61 -21 -59 -22 -52 -50 -35 -53 -16 -71 -15 -53
3046 -53 -32 -26 -39 -4 -31 10 -37 0 -25 -6 16 -1 24 -6 36 -11 20 30 30 37 12 63 10 49 17 49 40 21 53 16 52 27
3078 27 54 26 36 37 15 52 -4 55 3 32 23 10 16 -11 21 -17 21 -15 2 -15 -9 5 -32 14 -35 -8 -20 -15 -23 -46 -11 -48 -13
3111 -13 -56 -20 -47 -46 -19 -44 -26 -56 -15 -58 -29 -21 -36 -6 -40 13 -45 8 -17 -16 4 -18 19 -25 41 4 30 21 30 34 7 46 12
3144 12 49 18 39 40 36 46 13 49 4 60 16 25 33 22 38 10 44 -8 22 15 13 2 -19 31 -20 16 -9 0 -9 0 14 -13 4 -30 10
3179 10 -28 -20 -24 -30 -17 -51 -12 -43 -19 -41 -30 -41 -47 -17 -56 4 -47 -12 -24 -32 -24 -49 -1 -43 7 -20 1 -18 -12 27 -26 28 -2 38
3213 38 19 24 35 21 54 18 63 26 42 33 36 47 12 61 15 47 28 32 24 19 51 11 40 12 26 17 20 30 -3 28 -3 26 -15 6
3247 6 -17 -4 5 -26 1 -33 -4 -32 -11 -4 -32 -8 -42 -2 -33 -4 -29 -26 -30 -28 -5 -55 -13 -40 -16 -31 -25 -7 -26 -7 -30 0 -21 -11
3281 -11 -14 4 -4 -30 50 10 44 9 -6 -18 -26 -1 -33 39 14 47 22 29 35 26 58 13 52 20 47 23 43 47 11 31 10 39 8 29
3315 29 16 -7 -1 -10 21 -19 14 -4 -17 -1 -26 12 -40 -6 -25 -9 -21 -40 -16 -45 -11 -46 -5 -40 -15 -25 -30 -12 -39 -8 -39 -16
3347 -16 -25 -18 -17 -35 -5 -31 13 -49 3 -7 -20 24 -17 21 -20 22 1 16 10 -3 31 3 38 19 36 29 37 35 27 51 19 46 17 48
3381 48 25 33 38 21 38 14 35 11 36 19 1 36 -13 19 -20 15 -4 -5 -14 -26 0 -29 -6 -39 -5 -32 -31 -17 -44 -7 -43 -9 -42
3414 -42 -22 -20 -35 -26 -33 -10 -43 5 -23 -15 -10 -19 -4 -29 -3 -27 3 -18 -4 3 -10 20 -8 30 3 8 6 16 28 -2 38 6 35 28 41
3449 41 25 12 40 33 47 22 48 36 26 32 27 44 16 33 14 33 19 10 24 -5 17 -8 21 -11 2 -10 -13 -3 -26 7 -43 -13 -24
3482 -24 -28 -9 -34 -4 -52 -13 -40 -25 -32 -33 -5 -50 -7 -34 -10 -31 -19 -15 -16 -9 -29 9 -32 0 -16 8 13 -10 25 -6 23 1 22 17
3516 17 1 12 9 33 3 34 14 31 29 16 36 11 46 15 50 20 27 41 21 42 9 42 11 21 24 14 24 15 20 1 13 1 7 10
3550 10 -10 10 -23 -4 -25 -1 -21 -24 -21 -30 -39 -41 -14 -35 -21 -43 -38 -19 -42 -17 -41 -10 -39 -18 -18 -26 -3 -15 2 -21 7 -19 6 5 0
3585 0 12 -11 25 7 24 10 16 24 0 33 11 29 13 25 19 26 21 6 41 10 28 8 33 28 11 45 5 29 6 30 18 6 17 9
3619 9 16 -17 20 -1 7 -9 2 -2 -18 6 -27 -15 -28 -15 -20 -41 -15 -43 -20 -49 -22 -35 -19 -25 -32 -16 -37 -17 -51 -10 -26 -20 -8 -25
3653 -25 -3 -28 8 -10 2 2 8 10 -12 26 10 15 14 31 32 11 39 10 29 14 31 24 13 33 16 35 9 41 10 29 18 15 23 4 26
3688 26 3 25 -5 9 15 1 25 0 17 -10 4 -15 4 0 -20 4 -22 -5 -16 3 -24 -30 -9 -32 -16 -36 -7 -34 -23 -24 -37 -12
3720 -12 -37 -9 -29 -10 -20 -12 -9 -23 -7 -28 14 -20 1 5 -5 32 14 32 -4 32 12 26 23 21 30 15 34 22 35 21 18 34 21 43
3754 43 17 33 15 34 27 24 26 9 29 -3 20 -1 16 8 7 10 -14 20 -18 13 -11 1 6 -17 -1 -13 -4 -28 10 -17 -29 -17 -26 -8 -33
3789 -33 0 -29 -16 -23 -31 -22 -34 -10 -37 -18 -28 -23 -21 -23 -6 -27 -1 -17 1 -6 2 17 -6 20 -4 23 13 23 22 13 39 16 45 14 27
3824 27 31 33 35 11 44 23 36 32 28 38 18 -1 -1 18 -19 -14 6 12 4 -5 14 -8 0 -20 14 -4 6 8 -2 -6 -20 11 -12 -2 -16 -12 -3 -17
3862 -17 0 -28 -5 -26 -18 -20 -21 -17 -27 -1 -24 -1 -32 -12 -13 -21 -7 -29 -2 -16 -12 -9 -12 3 -14 13 -5 14 -1 19 20 12 26 5 27 9
3898 9 40 28 30 31 33 34 8 50 14 36 19 32 33 8 41 6 23 0 18 11 -2 12 -4 8 -13 13 -8 -12 -9 -15 0 -22 -10 -23 -17 -23
3934 -23 -19 -12 -27 -12 -33 -10 -24 -7 -17 -25 -17 -18 -14 -22 -4 -29 -13 -18 -10 -1 -21 -1 -24 -2 -8 -15 2 -1 17 -5 16 -11 16 6 5 28 -1
3971 -1 19 5 38 16 10 21 37 37 15 36 17 26 22 25 27 19 38 13 21 1 14 1 2 11 7 16 -26 -3 -11 0 -16 -17 -2 -26 -4 -30 -10 -19
4009 -19 -6 -20 -33 -10 -26 -6 -32 -11 -21 -9 -3 -20 -5 -24 -9 -4 -8 -15 -12 0 -15 -1 -14 10 -10 3 -1 -4 19 -11 15 6 8 6 13 24
4045 24 2 13 9 29 11 22 20 14 30 10 34 9 26 5 18 30 23 28 16 35 2 25 8 9 15 4 16 -1 10 -9 10 2 -7 -2 -24
4080 -24 3 -9 -2 -26 -15 -19 -19 -15 -26 -6 -27 -4 -23 -16 -3 -17 -9 -21 -1 -19 -4 -14 -8 4 -21 7 -13 4 -10 -2 -1 -11 15 -25 4
4115 4 -2 8 -5 12 8 6 17 6 20 4 15 -1 19 25 0 26 -2 36 16 16 29 25 32 19 34 4 20 12 8 14 3 11 4 14 -7 5 -12
4152 -12 -1 -13 -15 0 -23 -4 -13 -20 -9 -15 -19 -29 -18 -26 -6 -30 -18 -12 -16 -18 -31 -9 -21 5 -15 -18 -3 -15 8 -16 3 -11 6 4 -2 6 1
4189 1 20 1 18 13 15 11 2 16 13 24 4 13 1 21 12 5 32 7 23 9 21 14 18 33 10 18 9 15 11 18 20 5 17 0 14 5 9 2 -1 0 -5 14
4231 14 -13 0 -8 -10 -19 -19 -15 -24 0 -22 -20 -28 -8 -27 -17 -23 -36 -6 -25 -8 -11 -12 -8 -3 15 -7 11 -2 20 16 3 22 2 30 3 12 4 12 13
4270 13 13 18 12 26 6 43 14 12 18 8 18 8 22 16 28 7 23 21 5 16 11 25 14 9 18 3 16 0 10 -6 4 4 2 -1 0 11 -7
4307 -7 -14 -20 -2 -8 -13 -9 -27 -9 -34 -22 -22 -9 -21 -26 -12 -26 -5 -32 -23 -16 -3 -15 -13 -3 -14 15 -15 -2 2 6 6 4 11 5 18 8 30 17 15
4346 15 24 17 29 13 31 13 23 27 18 20 12 22 14 27 3 16 9 2 5 6 15 8 13 -2 5 14 -4 10 -2 8 1 -3 2 -13 6 -18 3 -9 3 -13
4386 -13 -23 -8 -14 -9 -12 -7 -19 -13 -18 -8 -12 -9 -4 -23 -8 -10 -11 -17 -15 7 -9 2 -16 8 -8 7 8 -11 23 9 36 8 20 20 24 30 11 35 20
4425 20 28 12 25 25 21 16 7 35 13 16 19 21 20 8 16 -1 15 0 9 0 -1 15 -2 9 -11 9 -10 3 -13 -4 1 -7 6 -18 10 -8 -7 -8 -5 -4
4465 -4 -16 1 -13 4 -15 -9 -4 -22 -10 -24 -6 -15 -9 0 0 -4 -22 1 -19 2 -3 8 15 -1 9 5 18 7 18 14 18 15 9 22 24 20 25 17 22 24 22
4506 22 14 27 16 34 13 21 12 8 7 7 18 5 12 -1 3 -1 -6 12 -14 -7 -12 -4 -1 -10 -9 -19 2 -22 1 -7 1 -2 -1 -4 -19 9 -17 -11 -20 -2 -5 -15
4548 -15 8 -14 -4 -4 7 -2 -2 12 -5 3 -15 8 -2 -1 2 -3 -5 0 6 -1 8 15 14 11 12 20 20 19 17 35 19 20 15 14 22 15 30 2 29 13 24 13 6
4591 6 23 9 16 4 14 11 -1 8 -6 14 3 -8 -5 -3 1 -13 -14 -17 -13 -13 2 -8 -14 -5 -8 -4 -10 -6 -2 -2 -13 -6 3 -10 2 -4 2 -3 10 1 -1 8 -8 3
4635 3 -4 -2 -1 6 8 -3 17 2 11 -5 2 17 5 18 11 24 8 16 11 13 21 10 10 22 16 17 23 2 18 18 13 17 3 21 15 15 -4 12 9 -9 1 -12
4677 -12 8 -6 3 -7 -14 -4 -10 -1 -23 -5 -25 -21 -8 -11 -4 -4 3 -13 -5 -5 4 -16 -14 6 -3 6 -3 7 -6 -4 11 -2 11 0 7 0 3 16 7 18 -2
4718 -2 10 8 8 1 5 8 6 24 12 25 10 11 21 15 32 7 26 7 20 28 18 29 14 12 9 28 7 21 9 9 2 8 3 -8 -2 -9 -4 -6 -2 1 -24
4759 -24 1 -16 -5 -7 -9 3 -21 -7 -21 0 -22 -5 -4 -15 -4 -9 -3 -13 -5 -8 1 5 5 5 5 4 2 17 15 7 4 5 7 0 26 5 14 4 5 17 11 18
4801 18 4 9 9 16 8 13 14 12 14 2 9 11 20 18 5 27 14 27 0 21 23 12 19 9 9 8 7 7 -1 3 4 -5 -8 0 -16 9 -13 -10 -5 -15 -10 -14 -12 -15 -3
4846 -3 -22 -17 -11 -13 1 -3 5 -14 -12 -6 5 -4 -1 13 -11 10 -8 7 8 8 13 8 15 2 7 4 11 19 12 22 2 24 8 11 11 17 14 13 9 4 28 11 17 9 7
4891 7 23 2 23 22 20 8 18 31 -10 46 18 15 -3 20 23 10 1 -9 0 -21 10 -10 4 3 -10 -1 -24 -11 -8 -4 -31 -8 -14 -16 -3 -18 -6
4928 -6 -13 -14 -11 -7 -12 -9 3 -14 5 -6 11 9 1 -2 0 19 10 24 14 20 12 15 19 2 27 8 15 6 5 13 2 15 7 13 -3 8 2 -6 10 -4 -1 -6 15
4971 15 -3 1 -3 1 9 2 13 -3 -1 0 -3 3 -10 5 -10 4 -7 -2 0 -6 -6 -14 -10 -2 -12 -11 -9 -10 -16 -13 -14 -8 -17 3 -5 -10 0 -5 -1 -4 17 -1 5 -3 9 6
5017 6 10 18 9 28 16 25 20 14 21 14 22 11 11 28 17 23 7 13 4 21 6 9 6 9 -3 -2 5 -7 4 5 9 -6 5 0 -2 -1 -8 1 -7 0 4 -1 5 -3 -3 -7 0 0
5065 0 -4 -4 -5 -6 -16 -8 -6 -9 -6 -6 -8 -11 -8 3 -4 -14 -9 3 -3 -2 -21 11 -10 -3 -4 -4 -4 1 8 8 14 1 14 11 13 16 21 16 16 20 10 14 18 10 15 12 19 25 16 5
5115 5 5 14 -2 15 -7 -4 -3 9 -6 -8 1 -4 -2 -12 10 -6 -9 -13 -13 -2 -24 -12 -12 -12 -4 -11 1 -3 0 -7 -5 -15 3 -6 -2 -3 -20 -3 -6 -12 -10 1 -4 -9
5159 -9 2 1 1 -5 4 -3 -5 4 9 3 -3 4 1 10 12 11 14 12 10 -1 9 12 11 7 9 17 16 24 9 14 14 11 6 9 8 -2 7 -2 10 -11 -5 -9 -21 -4 -11 2 -13 -5 -3 -13
5209 -13 -7 -16 1 -12 -3 -8 -14 -11 -11 9 -22 -2 -11 3 4 -11 -2 -5 16 -3 16 -3 1 -4 7 3 -8 10 -9 4 -3 -5 4 2 6 -7 -4 -1 2 4 -2 6 13
5252 13 17 9 17 11 20 12 2 7 0 18 3 8 13 17 16 12 10 11 12 -8 5 -5 -2 -3 0 7 -8 -2 -7 -15 -7 -12 -10 -10 -2 -25 -8 -16 -6 -7 -19 9 -9 4 -13
5297 -13 -1 0 2 0 4 -4 2 4 1 20 0 -5 4 2 8 2 12 -6 14 1 2 10 0 9 -9 10 3 3 7 -2 15 9 9 17 10 8 10 16 7 5 5 6 19 22 14 11 15 14
5345 14 15 2 11 16 6 -2 -3 9 4 1 -9 2 -7 -4 1 -8 -4 -10 -8 -10 -7 -10 -14 -7 -12 2 -19 -6 -11 -7 -13 -18 4 -5 5 -5 9 7 -8 -1 -3 12 2 10 -1
5390 -1 4 -1 4 5 2 5 -2 18 1 13 7 9 24 -15 16 -32 32 -42 -28 -32 51 14 -41 3 -13 2 -15 -1 13 -25 0 -1 30 38 -4 20 4
5427 4 12 -6 14 -2 9 0 1 0 -2 -3 -8 -15 -4 -14 -14 -23 -10 -14 -14 -12 -11 -20 -15 -7 -17 -3 -6 0 -18 10 2 1 -6 -2 -6 2 11 -1 15 5 12 3 -2 9 8 8
5473 8 -1 10 10 6 13 7 13 3 7 -4 8 9 8 6 13 11 2 11 5 19 10 4 17 -4 9 9 6 14 2 12 7 11 9 2 -6 5 2 -2 6 -8 -8 -9 -8 -10 2 -4 -2 -9
5521 -9 -10 -3 -17 -17 -10 -13 -9 -21 2 -3 -3 -10 -10 4 0 1 10 5 6 9 1 -4 16 13 27 16 12 13 13 16 15 19 13 12 18 14 15 18 7 3 5 11 4 -1 7 3 7 5 1 5 3 11 3
5574 3 16 1 -3 1 10 3 9 0 1 -5 1 -6 2 0 -2 -5 -11 -12 0 -8 -9 -1 -12 -9 -9 -8 -12 -18 -10 -25 -8 -30 -13 -24 -18 -17 -10 -6 -19 5 -5 1 0 4 10 15 14 11 17
5623 17 3 13 7 18 13 16 15 15 20 7 8 8 14 17 7 13 0 3 13 2 4 -2 3 0 -5 -8 3 -5 -3 6 -6 9 -3 13 0 -15 2 13 0 1 12
5664 12 -2 -1 0 2 -15 -5 3 -11 6 -14 -4 -1 -20 -6 -6 -1 -7 3 -3 0 -1 5 4 -6 -6 -4 0 -3 8 10 -2 7 6 13 4 17 -1 21 25 8 16 8 13
5707 13 20 21 23 14 15 14 13 7 16 3 1 17 10 -1 -1 0 -1 3 -4 0 -7 -5 -4 -9 -4 -19 -4 -13 -1 -13 -5 1 -7 0 -15 4 0 -3 -5 -1 -7 -4 -4 -3 -2 -3 -9 -2 -11 1
5757 1 -2 6 -17 -18 -7 0 1 -13 -8 1 -8 -2 -2 -4 0 1 -1 9 7 15 6 6 13 5 21 6 15 11 11 9 13 17 4 15 2 9 7 12 16 -6 2 5 0 4 -9 -11 -3 -20 -7
5806 -7 -3 -17 -22 -14 -8 -8 -15 -9 -3 -3 -13 -2 -5 -1 5 -10 5 -6 5 1 -1 -7 -2 3 -8 7 -3 -9 -1 -2 -6 -6 0 -13 0 -4 -3 -9 -2 -8 -4 -2 -6 5 -6 8
5852 8 -4 3 -10 -1 4 9 12 2 2 2 17 0 9 6 -5 1 11 10 9 14 -2 5 0 0 -4 -5 -7 -10 -12 -4 -4 -3 -1 -14 -13 -12 -8 -10 -10 -14 1 -13 -22 -11 -5 -6 -6 0 -8
5901 -8 -6 -8 -6 -18 -7 4 -5 -2 -3 10 1 -13 7 0 7 -4 0 3 5 1 -8 3 -10 -1 -1 -1 5 8 8 4 11 4 16 -8 -3 3 8 12 3 5 6 4 6 4 5 8 4 2 7 -6
5951 -6 -3 -7 1 -4 0 3 -1 4 1 -9 -7 -5 -16 -12 -11 -16 -9 -18 -7 1 -17 1 -7 -21 -4 -1 -10 0 -8 -8 0 6 5 0 0 6 -12 16 10 4 0 -9 -4 11 4 2 -2 -13 19
6000 19 9 2 -2 0 0 -7 8 0 2 5 0 -1 -2 7 5 8 -1 11 -3 -6 1 10 8 1 12 11 -1 3 -11 6 7 12 2 6 -3 -14 -4 -6 -6 -10 -1 -15 -8 -8 -7 -18 -10
6047 -10 -8 -17 -4 -10 4 -22 -7 -8 -5 -3 -5 1 1 12 4 5 12 1 11 6 14 15 5 18 12 9 21 2 3 3 7 2 13 -7 8 -8 7 -5 7 14 -2
6088 -2 -7 -3 8 3 5 -2 -4 -11 -6 12 12 6 12 -2 3 2 9 1 3 0 9 7 6 -1 -7 3 3 3 -11 -7 -11 -9 -12 -15 -2 -9 -13 -15 -21 -5 -13 -6 -14 -5 -17 -4 -4 -3 -1 4 2 -2
6140 -2 3 1 12 -8 -3 12 5 8 6 19 9 10 5 17 12 4 9 16 5 6 15 11 7 2 3 2 13 4 -1 6 -1 -8 -4 1 -3 -9 -6 4 -1 -6 5 4 -8 14 6 8 6 4 -7
6189 -7 -5 -3 -7 -2 -2 10 3 -7 -9 -3 -8 -11 -7 -14 -16 -22 -23 -7 -11 -10 -12 1 -7 -4 -7 -8 -3 -11 -1 9 -8 5 8 12 5 1 11 18 11 17 11 11 14 3 17 5 15 17
6237 17 11 4 -8 9 -1 14 -4 4 8 -7 0 0 -3 0 3 -6 -1 9 -4 11 -1 4 -11 6 -2 -8 4 -7 -11 -2 4 1 -2 5 6 11 -5 16 -8 -3 -2 -12
6279 -12 -7 -16 -15 -9 -5 -7 -18 -6 -13 -3 -8 0 -4 8 1 1 9 -4 12 10 6 -5 15 11 11 7 16 20 8 22 13 15 10 6 26 10 10 7 5 2 -3 8 4 0 0 10
6325 10 -16 -4 -10 -8 -5 -3 1 -19 -14 -12 -7 -17 4 8 -11 35 -13 5 -13 -1 -86 20 -48 -41 59 -34 20 -4 2 -9 2 -10 -3 -6 2 2 5
6362 5 7 -14 37 35 -6 -26 -10 -18 -27 22 8 10 -1 9 -3 8 9 19 -3 19 22 20 3 25 16 20 17 15 9 9 10 14 14 17 6 -1 3 -2 -4 8 -5 -4
6404 -4 -6 5 -5 0 -8 -15 -5 -10 -11 -15 -3 -5 -10 -6 -1 -1 -2 -7 -1 3 -2 9 -3 9 2 -2 2 1 -1 -1 4 2 1 1 -1 1 -2 -17 11 7 8 8 2 -2 1 15 -5 10 2
6453 2 10 10 7 10 9 17 4 14 12 15 8 11 20 11 29 9 16 21 22 12 13 11 3 16 12 7 -8 13 2 -7 -3 -2 -5 -5 -6 -15 -9 -4 -9 -14 1 -9 5 -9 -8 1 -5 -8
6501 -8 -6 5 16 8 9 11 4 8 12 13 7 12 13 12 1 2 0 4 7 9 8 12 4 10 7 1 8 9 7 0 9 11 9 5 12 11 14 16 14 10 6 17 15 13 11 -1 12 16 -1 7 8 4 10 6
6555 6 3 9 -7 -8 -4 0 -6 -7 -3 -10 1 -1 -9 -10 2 -9 -12 -10 -8 7 -14 -6 -5 7 -1 6 -1 1 8 -4 6 13 6 10 11 10 20 11 16 5 3 7 13 6 3 10 13 14 -2
6604 -2 10 0 -1 9 9 10 10 16 3 8 3 9 2 15 8 5 6 12 5 6 -2 14 17 6 7 11 24 4 2 5 5 2 0 10 -6 -7 -3 -8 3 -14 17 1 -5 -2 -9 -15
6650 -15 5 -14 -1 -1 -6 -2 0 0 2 -6 10 5 8 1 7 0 1 12 8 9 11 20 9 5 13 6 11 11 9 3 8 10 4 5 6 4 10 7 0 15 -8 7 4 -1 1 -3 6 5 7 6 13
6701 13 -1 3 11 5 4 5 5 1 9 11 8 -1 -2 2 6 3 -3 -19 -10 -8 -7 -6 -13 -1 -5 -7 -3 -10 -10 -8 -11 -14 -3 7 -3 6 -1 -7 1 7 7 0 8 3 9 3 15 15 17 10 16 11 17
6754 17 9 -2 7 2 11 9 -1 11 9 11 1 3 -1 0 -1 3 2 2 3 -1 3 1 8 14 20 8 7 12 11 7 6 8 1 9 8 8 8 8 -4 6 5 -5 -9 11 11 12 -17 26 -21
6803 -21 3 -47 -19 -13 25 -3 0 19 24 -7 -8 -4 12 -5 3 1 2 4 8 -1 5 2 4 16 11 8 12 15 12 10 15 7 18 10 3 4 3 1 1 12 7 1 -1 -12 7 4
6849 4 7 1 1 -7 -4 -3 -2 11 10 4 -1 8 9 10 13 3 4 2 1 5 4 3 4 9 3 -3 8 7 3 5 -16 -3 -1 -5 -8 5 0 -2 10 0 1 -2 -1 4 -1 0 5 5 1 7 2 10 20
6902 20 14 12 21 12 12 4 15 14 18 19 16 9 13 7 3 4 -3 -3 10 7 5 13 1 -5 13 9 5 11 1 -5 5 -5 1 6 4 0 0 11 2 0 8 0 -2 -12 -1 -2 3 4 10 -2
6952 -2 4 7 4 12 4 1 2 0 -12 -6 -2 -7 -1 -11 -8 -3 2 4 5 -2 2 -6 4 1 0 6 11 9 6 14 25 11 12 16 13 16 21 6 13 23 21 21 12 4 7 26 17 12 6 5 -1 7 -6
7005 -6 8 -17 -9 -7 -6 -4 -8 -3 -5 -3 -8 -5 4 -7 4 -3 2 6 -2 7 4 -2 -2 7 6 2 9 -1 -4 11 2 10 11 -6 -3 -1 16 8 2 5 -4 9 -5 1 5 6 1 2 1 13
7055 13 3 8 15 4 11 15 19 19 9 13 8 18 21 15 18 13 6 15 22 0 15 6 16 -2 1 15 1 1 6 4 1 -11 -17 7 -6 5 -7 -9 -4 -11 -5 19 6
7098 6 -11 1 -5 -4 -8 -4 13 4 2 13 4 3 4 8 5 0 8 7 4 13 10 17 8 9 8 4 -4 3 11 3 6 6 3 12 17 15 12 8 22 14 15 15 16 19 13 14 21 13 13 16 13 24 20 12 15
7153 15 6 13 20 12 9 5 -3 9 -3 -3 7 -1 1 -1 3 -6 -14 -1 -5 -5 -1 -3 -1 0 -11 8 4 -3 1 -2 12 12 7 7 11 7 7 8 7 19 9 14 14 7 10 13 5 10 12 2
7203 2 8 3 13 -2 8 4 10 -5 -2 7 -5 3 0 10 2 5 9 19 14 10 19 7 11 9 14 12 7 7 1 10 20 9 7 -2 6 2 0 -2 2 -12 -3 -4 -2 -10 1 1 -11 -2
7251 -2 -6 -8 -2 5 4 1 -1 2 -2 2 0 -1 5 11 16 8 11 19 10 10 13 8 22 11 5 20 7 12 12 7 3 4 12 3 7 -2 12 4 -2 5 16 2 8 10 6 12 -7 2 11 5 -2 -4 -6
7304 -6 3 11 6 11 7 6 4 8 7 10 -5 3 1 -1 0 1 -4 -3 7 11 0 -10 -5 -11 -6 -4 -3 -8 3 -10 -2 -1 -1 0 0 1 7 5 20 17 5 14 16 3 8 18 17 16 9 14 10
7355 10 14 10 19 11 14 9 11 7 6 -2 12 4 1 0 0 2 8 -4 -3 -5 -3 -1 4 10 -2 4 8 8 12 10 9 2 5 19 5 3 15 4 7 6 8 3 7 -1 0 3 7 -7 1 0 -12
7406 -12 2 -14 -1 1 -6 -4 -5 -13 1 -5 6 1 -5 -1 -1 3 5 7 4 5 9 9 7 7 15 5 15 14 14 5 -1 8 -3 -15 -7 9 -5 -4 0 -10 1 -4 4 -13 -11 -4
7452 -4 -10 -4 6 7 5 8 -1 -6 11 -2 35 28 4 11 4 9 -1 5 0 5 18 -3 8 20 42 -23 6 14 -14 4 -20 45 -71 -18 25 -6 -16 -20
7490 -20 -5 -14 2 -9 -4 -3 -7 -7 3 -5 -2 9 5 6 5 7 8 10 11 0 10 8 15 9 13 12 11 14 5 6 4 2 2 4 4 -5 1 0 1 -7 5 -2 -4 -10 10 3 4 2 6 5 1
7541 1 9 6 -1 4 2 12 4 0 6 11 5 6 6 8 8 6 12 -5 3 -3 2 4 5 2 -7 -7 0 -4 -6 -2 2 1 -1 1 -9 2 -4 13 -6 4 10 12 7 17 13 7 12 13 12 20 19 10 -9
7594 -9 5 -5 -7 39 20 15 13 11 17 10 9 12 2 -8 4 9 3 2 -5 3 2 -16 -4 -6 -3 0 -10 8 -5 2 7 2 12 10 4 4 -2 9 12 4 9 6 6 4 7 -9
7640 -9 0 -1 7 0 4 -4 -7 1 -1 4 -2 7 -2 1 7 9 2 9 8 13 8 17 5 13 8 7 18 14 13 12 17 11 10 18 12 11 11 11 11 8 7 -1 5 1 2 6 -9 4 -8 -6 -7 -6 3 -1 -8 -1
7696 -1 3 4 4 0 9 1 1 -3 -7 5 -5 5 -3 9 8 9 19 -2 10 -3 4 1 4 6 9 11 6 10 6 6 4 12 -4 2 5 3 6 0 5 1 9 5 1 15 13 18 20 13 19 17 15
7747 15 13 12 15 8 19 12 7 11 8 15 9 1 4 7 -4 7 -5 -11 2 -10 -13 -1 0 2 -9 -10 -5 2 -6 2 0 -9 -4 -6 -4 -8 4 5 11 11 -2 15 8 9 11 16 25 -2
7795 -2 16 15 11 10 7 3 0 5 0 -1 6 2 4 2 2 -2 8 -5 8 5 -2 1 9 12 4 4 13 4 5 17 16 14 8 11 2 13 2 6 -2 15 5 5 5 8 3 -3 0 -8 13 -3
7845 -3 -3 -12 -11 -13 0 -5 -12 -9 -10 -1 1 -5 -1 14 2 -4 17 6 -1 5 11 6 6 8 12 16 12 17 10 3 8 2 10 8 -2 16 3 9 8 3 6 -3 4 3 -2 -1 5 -3 5 1 -1 -2 1
7898 1 7 2 5 8 10 7 8 -3 5 7 12 4 9 7 6 6 -3 5 0 0 -10 2 -7 6 -2 0 -16 -3 -4 -1 -10 -13 -7 -8 -10 2 -12 -11 -7 -7 -3 10 6 8 10 8 8 10 9 9 13 8
7950 8 17 8 2 10 15 16 10 4 0 -4 8 12 12 5 -6 5 11 7 5 8 -5 -10 1 3 -5 2 0 -4 -4 -6 7 5 10 -7 8 -5 3 3 4 13 2 4 6 7 11 5 3 3 3 7 4
8001 4 -5 -3 2 -3 -4 -6 -2 -7 -2 -13 -7 -5 2 0 -8 4 -2 0 6 -4 15 7 2 9 14 7 8 4 15 18 16 5 2 15 13 6 13 21 15 9 5 6 -5 -2 5 6 7 1 3 8 -6 -12
8053 -12 1 -4 -2 11 6 2 -4 -4 -4 5 5 6 15 7 8 7 12 5 10 5 14 7 8 10 -3 7 1 10 1 11 -13 3 -3 7 -15 -7 -1 0 4 -4 4 0 7 -8 4 3 1 -8 5
8102 5 5 13 14 19 17 15 15 5 13 15 17 19 12 18 18 21 12 9 14 13 8 8 0 9 4 10 2 9 8 1 11 -3 -4 3 -12 5 2 -4 -10 9 4 3 8 16 15 12 11 20 13 4 8 13 15 9 16
8157 16 9 13 3 2 16 6 4 5 6 0 1 0 0 5 3 15 0 -8 0 -5 6 -1 10 7 11 10 7 8 15 19 12 18 12 14
8191A4
##END NTUPLES=NMR FID
##END=
