##TITLE=1H_EC-3237(33)
 CDCl3, 8 sc, 
 17.11.2020
##JCAMPDX= 6.0         $$ Bruker NMR JCAMP-DX V2.0
##DATA TYPE= NMR FID
##DATA CLASS= NTUPLES
##ORIGIN= UXNMR, Bruker Analytische Messtechnik GmbH
##OWNER= root
$$ XWIN-NMR		Version 3.5
$$ Tue Nov 17 12:30:30 2020 Russian Standard Time (UT+4h)  she@DPX200
##.OBSERVE FREQUENCY= 200.1315066352
##.OBSERVE NUCLEUS= ^1H
##.DELAY= (6, 6)
##.ACQUISITION MODE= SIMULTANEOUS
##.ACQUISITION SCHEME= undefined
##.AVERAGES= 8
##.DIGITISER RES= 18
##SPECTROMETER/DATA SYSTEM= spect
##.PULSE SEQUENCE= zg30
##.SOLVENT NAME= CDCl3
##.SHIFT REFERENCE= (INTERNAL, CDCl3, 0, 15.7039)
##AUDIT TRAIL= $$ (NUMBER, WHEN, WHO, WHERE, WHAT)
$$ ##TITLE= Audit trail, XWIN-NMR		Version 3.5
$$ ##JCAMPDX= 5.01
$$ ##ORIGIN= Bruker BioSpin GmbH
$$ ##OWNER= she
$$ F:/spectra/data/she/nmr/H-F/1/audita.txt
$$ ##AUDIT TRAIL=  $$ (NUMBER, WHEN, WHO, WHERE, WHAT)
(   1,<2020-11-17 12:28:33.51 +0400>,<she>,<DPX200>,
      <created by zg, POWCHK disabled, PULCHK disabled
       configuration hash MD5:
       00 E9 B6 7A A2 85 ED C7 34 08 36 98 17 FE 4E 26
       data hash MD5: 16K
       3E D0 E3 85 C8 38 FC 36 0D 49 00 D3 6E 05 DB D0>)
$$ ##END=
$$ 
$$ hash MD5
$$ 2A 86 3C 61 68 2A 4A 51 23 D8 08 55 6C 68 78 AD
##$RELAX= 
##$RELAX= 
##$RELAX= 
##$RELAX= 
##$RELAX= 
##$RELAX= 
$$ Bruker specific parameters
$$ --------------------------
##$DU= <F:/spectra>
##$EXPNO= 1
##$NAME= <H-F>
##$PROCNO= 1
##$TYPE= <nmr>
##$USER= <she>
##$AMP= (0..31)
100 100 100 100 100 100 100 100 100 100 100 100 100 100 100 100 100 100 
100 100 100 100 100 100 100 100 100 100 100 100 100 100 
##$AQSEQ= 0
##$AQ_mod= 1
##$AUNM= <au_zg>
##$AUTOPOS= <>
##$BF1= 200.13
##$BF2= 200.13
##$BF3= 200.13
##$BF4= 200.13
##$BF5= 200.13
##$BF6= 200.13
##$BF7= 200.13
##$BF8= 200.13
##$BYTORDA= 1
##$CFDGTYP= 0
##$CFRGTYP= 5
##$CHEMSTR= <none>
##$CNST= (0..31)
1 1 145 1 1 1 1 1 1 1 1 1 1 1 1 1 1 1 1 1 1 1 1 1 1 1 1 1 1 1 1 1 
##$CPDPRG= <>
##$CPDPRG1= <>
##$CPDPRG2= <>
##$CPDPRG3= <>
##$CPDPRG4= <mlev>
##$CPDPRG5= <mlev>
##$CPDPRG6= <mlev>
##$CPDPRG7= <mlev>
##$CPDPRG8= <mlev>
##$CPDPRGB= <>
##$CPDPRGT= <>
##$D= (0..31)
0 1.2 0 0 0 0 0 0 0 0.06 0 0.03 0 0 0 0 0.0002 0 0 0 0 0 0 0 0 0 0 0 0 
0 0 0 
##$DATE= 1605601712
##$DBL= (0..7)
120 120 120 120 120 120 120 120 
##$DBP= (0..7)
150 150 150 150 150 150 150 150 
##$DBP07= 0
##$DBPNAM0= <>
##$DBPNAM1= <>
##$DBPNAM2= <>
##$DBPNAM3= <>
##$DBPNAM4= <>
##$DBPNAM5= <>
##$DBPNAM6= <>
##$DBPNAM7= <>
##$DBPOAL= (0..7)
0.5 0.5 0.5 0.5 0.5 0.5 0.5 0.5 
##$DBPOFFS= (0..7)
0 0 0 0 0 0 0 0 
##$DE= 6
##$DECBNUC= <off>
##$DECIM= 32
##$DECNUC= <off>
##$DECSTAT= 4
##$DIGMOD= 1
##$DIGTYP= 9
##$DL= (0..7)
0 120 120 120 120 120 120 120 
##$DP= (0..7)
150 150 150 150 150 150 150 150 
##$DP07= 0
##$DPNAME0= <>
##$DPNAME1= <>
##$DPNAME2= <>
##$DPNAME3= <>
##$DPNAME4= <>
##$DPNAME5= <>
##$DPNAME6= <>
##$DPNAME7= <>
##$DPOAL= (0..7)
0.5 0.5 0.5 0.5 0.5 0.5 0.5 0.5 
##$DPOFFS= (0..7)
0 0 0 0 0 0 0 0 
##$DQDMODE= 0
##$DR= 18
##$DS= 0
##$DSLIST= <SSSSSSSSSSSSSSS>
$$ [...]
##$SUBNAM2= <"">
##$SUBNAM3= <"">
##$SUBNAM4= <"">
##$SUBNAM5= <"">
##$SUBNAM6= <"">
##$SUBNAM7= <"">
##$SUBNAM8= <"">
##$SUBNAM9= <"">
##$SW= 16.9725356469052
##$SWIBOX= (0..15)
0 0 2 0 0 0 0 0 0 0 0 0 0 0 0 0 
##$SW_h= 3396.73913043478
##$TD= 16384
##$TD0= 1
##$TE= 0
##$TE2= 300
##$TE3= 300
##$TEG= 300
##$TL= (0..7)
0 120 120 120 120 120 120 120 
##$TP= (0..7)
150 150 150 150 150 150 150 150 
##$TP07= 0
##$TPNAME0= <>
##$TPNAME1= <>
##$TPNAME2= <>
##$TPNAME3= <>
##$TPNAME4= <>
##$TPNAME5= <>
##$TPNAME6= <>
##$TPNAME7= <>
##$TPOAL= (0..7)
0.5 0.5 0.5 0.5 0.5 0.5 0.5 0.5 
##$TPOFFS= (0..7)
0 0 0 0 0 0 0 0 
##$TUNHIN= 0
##$TUNHOUT= 0
##$TUNXOUT= 0
##$USERA1= <user>
##$USERA2= <user>
##$USERA3= <user>
##$USERA4= <user>
##$USERA5= <user>
##$V9= 5
##$VALIST= <valist>
##$VCLIST= <CCCCCCCCCCCCCCC>
##$VD= 0
##$VDLIST= <DDDDDDDDDDDDDDD>
##$VPLIST= <PPPPPPPPPPPPPPP>
##$VTLIST= <TTTTTTTTTTTTTTT>
##$WBST= 1024
##$WBSW= 4
##$XGAIN= (0..3)
0 0 0 0 
##$XL= 0
##$YL= 0
##$YMAX_a= 11505
##$YMIN_a= -10321
##$ZGOPTNS= <>
##$ZL1= 120
##$ZL2= 120
##$ZL3= 120
##$ZL4= 120
##$ABSF1= 10
##$ABSF2= 0
##$ABSG= 5
##$ABSL= 3
##$ALPHA= 0
##$AQORDER= 0
##$ASSFAC= 0
##$ASSFACI= 0
##$ASSFACX= 0
##$ASSWID= 0
##$AUNMP= <proc_1d>
##$AZFE= 0.1
##$AZFW= 0.1
##$BCFW= 1
##$BC_mod= 2
##$BYTORDP= 1
##$COROFFS= 0
##$CY= 11.3945322036743
##$DATMOD= 1
##$DC= 2
##$DFILT= <>
##$DTYPP= 0
##$F1P= 15.9154993809931
##$F2P= -4.1035820241983
##$FCOR= 0.5
##$FTSIZE= 0
##$FT_mod= 4
##$GAMMA= 1
##$GB= 0.15
##$INTBC= 1
##$INTSCL= 1
##$ISEN= 128
##$LB= 0.24
##$LEV0= 0
##$LPBIN= 0
##$MAXI= 10000
##$MC2= 0
##$MEAN= 0
##$ME_mod= 0
##$MI= 1.114404
##$NCOEF= 0
##$NC_proc= 0
##$NLEV= 6
##$NOISF1= 3.799351
##$NOISF2= 2.8
##$NSP= 1
##$NTH_PI= 0
##$NZP= 0
##$OFFSET= 15.70392
##$PC= 1
##$PHC0= -11118.9
##$PHC1= -0.1991081
##$PH_mod= 1
##$PKNL= yes
##$PPARMOD= 0
##$PSCAL= 0
##$PSIGN= 0
##$REVERSE= no
##$SF= 200.130013532006
##$SI= 16384
##$SIGF1= 3
##$SIGF2= 2
##$SINO= 400
##$SIOLD= 16384
##$SREGLST= <1H.CDCl3>
##$SSB= 0
##$STSI= 0
##$STSR= 0
##$SW_p= 3612.71676300578
##$SYMM= 0
##$S_DEV= 0
##$TDeff= 0
##$TDoff= 0
##$TI= <>
##$TILT= no
##$TM1= 0
##$TM2= 0
##$TOPLEV= 0
##$USERP1= <user>
##$USERP2= <user>
##$USERP3= <user>
##$USERP4= <user>
##$USERP5= <user>
##$WDW= 1
##$XDIM= 8192
##$YMAX_p= 0
##$YMIN_p= 0
$$ End of Bruker specific parameters
$$ ---------------------------------
##NTUPLES= NMR FID
##VAR_NAME=  TIME,          FID/REAL,        FID/IMAG
##SYMBOL=    X,             R,               I
##VAR_TYPE=  INDEPENDENT,   DEPENDENT,       DEPENDENT
##VAR_FORM=  AFFN,          ASDF,            ASDF
##VAR_DIM=   8192,          8192,            8192
##UNITS=     SECONDS,       ARBITRARY UNITS, ARBITRARY UNITS
##FACTOR=    0.0002944,     1,               1
##FIRST=     0,             0,               0
##LAST=      2.4114304,     0,               0
##MIN=       0,             -10321,          0
##MAX=       2.4114304,     11505,           0
$$ Real data points
##PAGE= N=1
##DATA TABLE= (X++(R..R)), XYDATA
0@%%%%%%%%%%%%%%%%%%%%%%%%qJ6j6J6j6J6j6K2l0L2l2L5m3M8n1N9o4P2q0Q8r9
$$ 0 0 0 0 0 0 0 0 0 0 0 0 0 0 0 0 0 0 0 0 0 0 0 0 0 -8 8 -8 8 -8 8 -8 14 -16 16 -16 19 -24 24 -27 32 -32 40 -40 48 -51
45e1J07j20J34j45J58j74J93k14K35k59K88l20L55l98M48n06N79o71P89r49J180
$$ -51 56 -64 70 -75 83 -91 102 -112 123 -136 152 -168 187 -211 237 -269 310 -361 428 -521 659
66F59j536K162l578J1946J852k0810J5098m936p96K267k471M858n059j840Q784
$$ 659 -877 1285 -2293 9653 11505 -9305 5793 857 61 2328 -143 4715 -344 -2184 6600
81F600p837J468K696o738P051j187o017M643L39k630J970L089l709j301R7L671
$$ 6600 -1237 231 2927 -3811 3240 2053 -3964 679 1018 -1612 358 3447 -262 -1563 -1466 2205
97B205r83n525N554R74m669L167n13j156K857m819M461J378q525P116j558j830
$$ 2205 1222 -4303 1251 2225 -2444 723 210 -946 1911 -2908 1553 2931 -5594 1522 -36 -1866
113a866N067m194J891p67k797M923k220j683L036m355M240J912o592L742M05j996
$$ -1866 3201 -993 898 131 -2666 2257 37 -1646 1390 -2965 1275 3187 -3405 337 742 -1254
129a254R33J258m96k143R25J543M11j913J360r14j074L767k025k186L454j168
$$ -1254 -321 937 441 -1702 -777 766 1177 -736 624 -290 -1364 2403 378 -1808 1646 478
145D78j643L851l255k96K185j151J885l751J794K260m440K746J211k932J882p65
$$ 478 -1165 2686 -569 -865 1320 169 2054 -1697 97 2357 -2083 663 1874 -1058 824 59
161E9p54L154l533M10J822j397J296k055J109R44j989Q23J452j798o04J706q28
$$ 59 -695 2459 -1074 -664 1158 -239 1057 -998 111 1055 -934 -111 1341 -457 -1061 645 -183
178a83P89r99Q4J335k218J09K828j164k195K060n25N22p82m94K181k794J533J218
$$ -183 606 -393 -309 1026 -1192 -1083 1745 581 -1614 446 -79 443 -339 -833 1348 -1446 87 1305
196A305k444J278J92j434K098m86j976K084q31J96k37L86J261l119J398K208k639
$$ 1305 -1139 139 331 -1103 995 509 -1467 617 -214 -18 -255 131 1392 -1727 -329 1879 -760
213g60r54L009p26j355J138m06M57p56P02L08j142O30L96q65O07Q63j983J639
$$ -760 -1714 1295 569 -786 352 -54 403 -353 349 657 -485 145 541 -324 283 1146 -837 802
231H02k15j079J466j091L21l28Q2J349r20j330J894l54j460J505m94N10j274p7
$$ 802 587 -492 974 -117 204 -124 -42 1307 387 -943 951 597 -863 642 148 658 -616 -693
249f93J975j507l13J069m72o36J217j104P3N32q35J095l08K50o48k01J195p90
$$ -693 1282 -225 -538 531 59 -577 640 -464 -391 141 -694 401 93 343 -305 -506 689 -101
267a01j236K036N42k955J786P53j104j75L96J105j611l87J257Oq10J023m37k07
$$ -101 -1337 699 1241 -1714 72 825 -279 -454 -58 1047 -564 -951 306 312 -498 525 88 -119
285a19O43j481J618j8j266O15Q24m69r80O15P90l54j620K152K68k209P73L39M93
$$ -119 524 -957 661 643 -623 -8 816 347 -633 -18 772 418 -1202 950 1218 -991 -218 121 614
304F14o20k43J008L9j606P85J101j334M17k76P63m30r37J524k02j051J72P50n81
$$ 614 -6 -249 759 798 -808 -23 1078 -256 161 -115 648 218 -719 805 603 -448 -276 474 -107
323a07N7n47R52M74k067J239O70r21n59Q52M61p13k76P68J45j670J549J3r24J037
$$ -107 -50 -597 355 829 -1238 1 671 -250 -809 43 504 -209 -485 283 428 -1242 307 320 -604 433
343D33n32j20K54j12k95O70k81j19j07L69O58j893J224O39j415M08P28m30l08
$$ 433 -99 -219 35 -77 -372 298 17 -102 -209 160 818 -1075 149 788 -627 -219 509 79 -229
362b29M56l62M66n08L12n3m95J174q10j30O42k89o71P65R1l54L40m45Q24j084
$$ -229 227 -135 331 -177 135 82 -413 761 -49 -179 463 174 -497 268 359 5 345 -100 724 -360
382c60m1J307p61m49N42L86o27n4J55Q57j116l65J427r73K21Q2j55L25j73n14
$$ -360 -401 906 145 -304 238 624 -3 -57 98 955 -161 -526 901 -72 149 231 76 401 228 -286
402b86M18K37q56N49Q1M00j135j37J682j363n71J477J51j740N55Q62l06o01L6
$$ -286 132 369 -487 62 143 543 -592 -729 953 -410 -981 496 647 -1093 -538 324 18 -583 -547
421e47J396j147l20O88j25k5j21L8L07j4r16J295j49q24N13L4L31q36K45R00n03
$$ -547 849 -298 -618 70 -55 -80 -201 -163 144 130 -786 509 360 -464 49 83 414 -422 -177 723 220
442B20q18J078L11r54N7j31J045q02m78J281m93p24L58O43m94r5j61O32k56o31
$$ 220 -598 480 791 -163 -106 -237 808 6 -472 809 316 -408 -50 593 99 4 -157 475 219 -412
462d12R23m34L5k4J39L71m30p02P87N82j319N49J94k2l88k21R71o30k74M16p5
$$ -412 511 77 112 88 227 598 168 -534 253 835 -484 65 259 237 -151 -372 599 -31 -305 111 36
483C6n03M83k51J32N62j102O10N9l10m4K20M40p22j80P62K40j247P68M53o12J7
$$ 36 -467 16 -235 -103 459 -643 -33 26 -284 -328 -108 332 -390 -570 192 432 -815 -47 406 -206 -189
504a89q0O66l58m11K66N90l69k40K22k30N18p70O21L21q76J40N29J47n02j62L12
$$ -189 -269 397 39 -372 -106 484 115 -125 97 -133 385 -385 236 557 -319 -179 350 497 -5 -167 145
525A45N10j217N80R54j361J32M32N32p32m57R37Mp30J92N64o78L25j84K28J64
$$ 145 655 -562 18 972 -389 -257 175 707 -25 -482 455 459 -271 -79 485 -193 132 -52 176 340
545C40o62L17K50K0p12M76K68k46l64K97P64j318Q1R14j55n52j3M32N8m34l4Q96
$$ 340 -322 -5 245 265 -447 29 297 51 -313 -16 748 -570 -489 425 270 -282 -295 137 195 -239 -273 623
567F23j096R5O15j98K42q24M52J35k16K44O1m71J93K53n3M65j067J41O25R1k56
$$ 623 -473 -378 237 39 281 -543 -91 44 -172 72 133 -338 -145 108 55 520 -547 -406 219 310 54
588E4n72Q02j53k16Q7M07n38l78Q61p9q6m09R6L76N2m88J82J65l41M56k59M21
$$ 54 -518 284 131 -85 2 409 -129 -507 354 275 189 -220 -124 252 304 -184 -2 163 -178 278 19 440
610D40n43l83J159l63l20q2K49J06k76q6P18n74p30J030P4j43p60L22M91o05K19
$$ 440 -103 -486 673 310 -10 -92 157 263 -13 -99 619 45 -685 345 419 276 -484 -162 329 -276 -57
631e7K87o4p29N43M86k70n78j46Q75k10l90K09M21q50N9P51p0n64p30J447l0r14
$$ -57 230 166 -563 -20 466 196 -382 -528 347 137 -253 -44 377 -473 -414 337 267 -297 -1027 420 390 -524
653e24L24J42J14k17J99K20l79n57J070J68p34m7N7P90p11l8N46l86m44L92P75
$$ -524 -200 -58 56 -161 38 258 -121 -678 392 560 -174 -221 -164 626 -85 -123 423 37 -407 -15 760
674G60p46m55L11P54l79m81N09j24l39O1P36m38k22p0K97L17p16L75j61l6Q6q6
$$ 760 14 -441 -130 624 245 -236 273 149 -190 -129 607 169 -53 -123 174 491 -225 150 -11 -47 39 -47
696d7L30k42m78L76O60p49l8L2K82k8l88P06n41j86L49K27k69k50J62L2K79l59
$$ -47 283 41 -437 -61 599 -150 -188 -156 126 98 -290 416 -125 -311 38 265 -4 -254 -92 -60 219 -140
718a40P5j79J25K29r8L7l14N0K4O50m89m15L84R0K17n49L66J08n11J50N90k55
$$ -140 -65 -244 -119 110 12 49 -265 -215 -191 459 -30 -445 -61 29 246 -303 63 171 -340 -190 400 145
740A45m83L01N8L09n02K23J45l90L38j05K49k16j82Q2M17k76l54N56j45j59j97
$$ 145 -338 -37 21 330 -172 51 196 -194 144 39 288 72 -110 -28 389 113 -241 315 170 11 -186
761a86O30j74o45L71M37k18o23N97Mj46j16J07K89o55K34L83q0n36J74L23k1k40
$$ -186 444 270 -375 -4 433 215 -408 189 193 47 -69 38 327 -328 -94 289 209 -327 -153 170 149 -91
783i1j83N55n36P4K98kj70m47N16K70l01m51N43ol29J92Q4J11n98M01K79k77j80
$$ -91 -274 281 -255 -181 117 115 -55 -502 14 284 -17 -468 75 69 -260 -68 16 127 -471 -70 209 -68 -248
806b48J95J64l05J70j12L28l18j41M19o7r5k43M16l7j80j14M04m3m19M45j39J00
$$ -248 -53 111 -194 -24 -136 192 -126 -267 152 85 -10 -253 163 126 -54 -168 236 193 -226 219 80 180
828A80k44R2K73j85j15J2K87k44Q8j12K24j66l26N82j36k27k19M29M3l51k5L00
$$ 180 -64 28 301 116 1 13 300 56 144 32 256 90 -236 346 210 -17 -236 193 236 -115 -140 160
850A60L0o35N55J21k61k57K05L53m44L1J43J59m07J22J40m7jl97N59n9l54qN15
$$ 160 190 -445 110 231 -30 -287 -82 271 -173 -142 1 160 -247 -125 15 -32 -33 -430 129 70 -284 -292 223
873B23j42n81M20L39k14o28Q06J14p29K31L60jn57L01K37j05l20K67K77m54J10
$$ 223 81 -500 -80 259 45 -583 223 337 -392 -161 199 198 -359 -58 179 74 -246 21 298 -156 -46
894d6j3M01l11k54M03O4k43k01N79j76k62j17M90L6o64L85J91j55l88M24J72m04
$$ -46 -59 342 31 -223 180 244 1 -200 379 203 -59 -176 314 350 -314 71 262 107 -281 143 315 -89
916h9r4K88K10o16L65R9k24j8N9J93k25L9q3K06j46mqM3J74n11L85J05k17j11
$$ -89 -183 105 315 -301 64 163 -61 -79 -20 173 -52 -13 -96 110 -36 -40 -48 -5 169 -342 43 148 -69 -180
940a80K08P3k94J76mJ18l24J88O4j25J46k03J60q4L9j11K58n9k86K37j1J59l61
$$ -180 28 101 -193 -17 -21 97 -227 -39 25 -100 46 -157 3 -81 -42 -153 105 46 -240 -3 -14 145 -216
963b16J79J70j93n5J16K29l13KK2L60l40j59M42j92p4j04L80j34k26J06K31j00
$$ -216 -37 133 -60 -115 1 230 -83 -81 -59 301 -39 -198 244 52 -22 -126 254 120 -106 0 231 131
985A31l56M21no8l26K93K93n06L5K73J19o24L03L45k59k86P9M68m47j0J77O8k42
$$ 131 -225 196 191 123 -203 90 383 -123 -88 185 304 -320 -17 328 69 -217 -138 330 -117 -127 50 118 -124
1008a24m4K77Mj36l61N40m1l23P1K40N9n97L75L36l29l82M70J78m73J20J46J75
$$ -124 -168 109 113 -23 -384 156 115 -208 -137 103 162 -435 -60 276 -53 -435 35 213 -260 -140 6 181
1030A81m59J89K49k15o9QK83k36L0m9K34p1k59K58l4Rk57L22Q5k35j56L05K52
$$ 181 -278 -89 160 -55 -124 -116 167 -69 -39 -88 146 75 -184 74 40 49 -208 114 199 -36 -192 113 365
1053C65n43J98Q6L9k58J16L37l74l0J54J58l00J31k9n0J05j68K06j18Q7k31J00
$$ 365 -178 20 106 145 -113 3 340 -34 -64 90 248 -52 79 50 0 105 -63 143 25 112 -119 -19
1075a9K81k87j53J70K73n41J82L04j68k52R3L69l67k6N3J76j98k3J72r4R1k71
$$ -19 262 -25 -178 -8 265 -276 -94 210 42 -210 -117 252 -115 -141 -88 88 -110 -133 39 -55 36 -235
1097b35K98J4k40m9K56J20l84J07J55J05l95K17K62l94l3J45M02m27j69L13J26
$$ -235 63 77 -163 -212 44 164 -220 -113 42 147 -248 -31 231 -163 -196 -51 351 -76 -245 68 194
1118A94k46q3L84k96q5O4L38j76l23K69P5J8k89K64K3j41j17K07L04n49N9K61
$$ 194 -52 -135 249 -47 -132 -68 270 94 -229 40 115 133 -156 108 131 -10 -127 80 384 -165 -106 155
1140A55P1l57J04K44k42n6J05K79m28N8J48k2L6k28J83j8lj26K02n8k32J24J77
$$ 155 226 -131 -27 217 -25 -81 24 303 -125 -67 81 59 95 -133 50 32 29 -97 105 47 -185 -61 116
1163A16P3n22K39J72q6m1m7P4k00K18mO9k14q3K42L2M0k82J37K9N3k8L2pk23K06
$$ 116 189 -333 -94 78 -8 -49 -96 -22 -222 -4 -8 61 -153 -236 6 38 78 -204 -67 -38 15 -13 19 12 -211 -5
1189eK1J81l27r1L69n3j48o1L17k67n6K11J75l15j38M21j94O7j18O8J2l0J3lJ65
$$ -5 16 197 -130 -221 148 95 -53 -114 203 -64 -120 91 266 -49 -187 234 40 107 -11 57 69 39 52 49 214
1214B14l68R3K70N1m53J4N15l29j21K10J43n03J31M49j62k82j34M56j16j41K1
$$ 214 -154 -61 209 260 -193 -179 336 7 -114 96 239 -264 -133 316 154 -128 -262 194 78 -63 -42
1235d2N3m1j89L18M1k39l18M45J27k88LL2K03k86J30J35q4k44N8M49k37k31L6
$$ -42 11 -30 -219 99 140 -99 -417 28 155 -133 -130 -98 105 -181 -51 84 0 -244 -186 263 26 -205 -169
1258a69M23l11j74L77r1k41L6M30k99j31J14J09J3j58J71j19Q9j16P9J81j85j89
$$ -169 254 -57 -231 146 55 -186 -150 280 -19 -150 -36 73 86 -72 99 -20 69 -47 32 213 28 -161
1280a61J60L57m04J2Q8Rr6L6K56l20j5P8J72p3j17n1L5J98k23J24k9p1o5J37J69
$$ -161 -1 356 -48 -36 52 61 -35 1 257 -63 -78 0 172 99 -18 -69 -34 164 -59 65 36 -35 -100 37 206
1305B06l19J6O1J82j79k4N4m4Q6j53J90q8r1j8K21k5k71J23L3J35k52J24Q1j52
$$ 206 -113 -97 -36 146 -33 -57 -3 -47 39 -114 76 -12 -103 -121 100 75 -196 -73 -40 95 -157 -33 48 -104
1329a04NN1K12k71p9J53K33k84r9L38j72r5M9L22k66k21K67R8p9j80K06p9L3n8
$$ -104 -99 -48 164 -107 -186 -33 200 -84 -183 155 -17 -112 -63 259 -7 -228 39 137 58 -122 84 5 38 -20
1353b0Q9J27l04K0J61J83l66KK75m6k04N8L18l84l1K37Q4k54j03L31q1j00r9K53
$$ -20 69 196 -108 -88 73 256 -110 -108 167 121 -83 -25 293 -91 -122 115 199 -55 -158 173 92 -8 -107 146
1377A46j15j15J24J9J1k60K51O3j03j27Q7J29j76K5j7J66k36kK13k3j37j35L10
$$ 146 31 -84 40 59 70 -190 61 124 21 -106 -19 110 -66 -41 -58 108 -128 -130 83 60 -77 -212 98
1400I8j14r7K4J74j20j78K87o5l3j25J46Qo7L8l2J06j36N9rJ60j39j17K47m4p2
$$ 98 -16 -113 -89 85 -35 -213 74 9 -24 -149 -3 5 -62 -24 -56 50 -86 -27 -36 124 -15 -132 115 71 -1
1425ar3K53p8j22N8J26m5k27K28lk8j37J17J47k22KO1J60k77N4J42m3j21l3K85
$$ -1 -94 159 81 -41 17 143 98 -129 99 96 68 -69 48 195 -27 -25 36 196 -81 -27 115 72 -49 -82 203
1450B03j72j06J6J89j21j57K00M3q2k55L25L0k24kJ51P1l09J49J41n1k42J39K06
$$ 203 31 -75 -59 130 9 -148 52 95 13 -242 83 113 -111 -113 38 109 -200 -51 90 39 -203 -64 142
1473A42j91n0K8K28k68o5K38K4k02q5L56j42j60N5J90j25j64K54j0m3j32J80j2
$$ 142 -49 -99 -71 157 -111 -176 62 86 -116 -201 155 13 -147 -92 98 -27 -191 63 53 10 -122 58 46
1496D6o6m0N6J68k45O8R3N9k00rK46j50j03Q0K21k31m4J24J0n0j07K10r3k6l4
$$ 46 -20 -60 -4 164 -81 -13 80 139 -61 -70 176 26 -77 3 224 -7 -51 73 83 33 -74 136 43 17 -17
1521a7Q1J5j18M8k3J09j51O9K6k4k2p9J69q7k1o2J68o6j42J30J3j1j60K02J0j29
$$ -17 64 79 -39 9 -14 95 -56 13 39 15 -7 -86 83 -4 -25 -87 81 15 -127 3 16 5 -155 47 57 -72
1547g2jP3K8j63J04pJ02j34kJ21p3jj22K41r6j21R2J66j10k24K65Kj06j05K41
$$ -72 -73 0 28 -135 -31 -38 64 -70 -72 49 -24 -25 -147 94 -2 -123 -31 135 25 -199 66 68 -38 -143 98
1572I8Qk26Q8J13N3k92J61J35p9j34P1K23k64j0J35J11k31JK06q5j06o1K65j27
$$ 98 106 -120 -32 81 134 -158 3 138 59 -75 -4 219 -45 -55 80 191 -40 -39 167 82 -24 -85 180 53
1596E3j15O5J18j3k48J92P2j12j86K37R6k39J9J15P4k96J29J26j03j24N6J88j65
$$ 53 -62 3 121 108 -140 52 124 12 -174 63 159 -80 -61 54 128 -168 -39 87 -16 -140 -84 104 -61
1619f1j5NJ43j43o6J68k0p0j01K36m9r8QQ5L4j70J39l3L2j21N2J26q5m2qJ73j44
$$ -61 -76 -71 72 -71 -137 31 11 -59 -160 76 27 -71 -63 22 56 -114 25 -8 24 -97 -45 81 -4 -46 -54 119 -25
1646b5j6N0O2q0r8K16q4j4m6J37k6j05K9J3Q9j68J05J2Rq8LJ75j29l9j4J52j16
$$ -25 -41 9 71 -9 -107 109 25 11 -35 102 76 -29 0 13 102 -66 39 51 60 -28 -25 150 21 -18 -32 120 4
1673Dn3J17ol2j43K61o6j53l0J69K3k32J42M1k6j87K02R0k22k3O9J63k08J4O1
$$ 4 -49 68 62 30 -113 148 82 -71 -101 68 91 -141 1 42 16 -171 31 121 -101 -124 -55 108 -100 -86 -25
1698b5L8r8k2J94r9o7m2K36r0j93J21J15k8j92K15%j29m0J82M2k69J10J09L5j78
$$ -25 13 -85 -107 87 -12 -79 -121 115 25 -168 -47 68 40 -152 63 63 -66 -106 76 118 -151 -41 68 103 -75
1723g5Q9Q5j36j8O0J55k30j3J12O6q5r5J64o3k4nJ41r4j37R4R8O0k25J05L9Rp0
$$ -75 14 99 -37 -55 5 160 -70 -83 29 95 10 -85 79 16 -8 -13 128 34 -103 -9 89 149 -76 29 68 77 7
1750GJ5O9j55N0N5R7j66k5R8k0jj04J01p3M0J0L3m1j30J22J1O4j76L3R5l4j1k2
$$ 7 22 91 -64 -14 41 138 -28 -53 45 25 24 -80 21 -52 -12 -2 31 -10 -140 -18 -7 57 -119 -86 9 -25 -36 -58
1778e8J05j48K2O2J03j36j00J89k9rj14J56j2j14R0Q2m1k12J63P7j0j07N0R2j44
$$ -58 47 -101 -79 -17 86 -50 -150 39 10 1 -113 43 31 -83 7 89 48 -164 -1 76 66 -41 9 101 -43
1803d3N8K0Q0k06rJ94K2j32r6K45r4q3M7J21j37j11K49J1j29j48K35L2j52QP3
$$ -43 15 35 115 -91 -100 94 116 -16 -112 133 39 -44 3 124 -13 -124 125 136 7 -141 94 126 -26 -18 55
1828E5K5j94J55Q3r8j65J17J76j60n1RJ32j58J4J22n6p0m0K12q5j01n7J44mj31
$$ 55 80 -114 41 124 26 -139 -22 154 -6 -57 -48 84 -74 -60 62 6 -64 -104 108 23 -78 -135 9 5 -126
1853a26J42j0n1j22J86O2j48k9O0J07j56R7J0po2J3J39j27pk7J66q1m6J8JM3p4
$$ -126 16 6 -45 -167 19 81 -67 -96 -36 71 -85 12 22 15 -47 -34 105 -22 -29 -56 110 29 -17 1 2 45 -29
1880b9J26p7j2m9P5Q3j33j5OJ48j17j6N5k5k5j2J54j36l1KJ10j6j01M7j0O3j21
$$ -29 97 20 8 -41 34 117 -16 -31 -25 123 6 -10 45 20 -5 -17 137 1 -30 -28 82 66 -35 12 2 65 -56
1907e6J06J4r6l7P2J29j93J3M5P7j41LJ31j02m4qJ97j21j16J02Q8p4j33J84l1
$$ -56 50 64 -32 -69 3 132 -61 -48 -3 74 -67 -64 67 -35 -79 -87 110 -11 -127 -25 63 -11 -144 40 9
1932Ip6m4J66rj90J07O5L6j79Q3O9n0m7L1J50j92K5P6R4j47n5J61k6n9n4J86j14
$$ 9 -67 -111 55 46 -144 -37 28 64 -115 -32 37 -13 -60 -29 121 -71 -46 30 124 -23 -78 83 57 -2 -56 130 16
1959A6p1P3Q3m0j76J69K6n3q9J17L9j43N9L9M1j65P5O5m7l2k6J32j05J0oO5n8
$$ 16 -55 18 101 61 -115 54 80 27 -62 55 94 -49 10 49 90 -75 0 65 18 -14 -40 92 -13 -3 -9 56 -2
1986bo1Q2pPj13J40pm7rJ3M8j54R8nL7q9J6R8p5om6J13r3KL0L8k2r1J37l9Np9
$$ -2 -63 19 12 19 -94 46 39 -8 -17 -4 44 -110 -12 -17 20 -69 -53 45 -30 -36 -82 31 -62 -60 -30 8 -14 -105 32 -7 -2 -81
2018h1R0M0j08L3L0R5j73M3Q1Lq2qJ60j33l6M0J43j30n8J31km2j08J87o3p9J5
$$ -81 9 49 -59 -26 4 99 -74 -31 50 53 -29 -37 123 -10 -46 -6 137 7 -51 80 78 36 -72 115 52 -27 -12
2045a2R7J9j84J02L8j6j28R4P5j18j7L1J43j79%R3Mj09k3K00r7p0JJ46j12r2J49
$$ -12 85 104 -80 22 60 44 -84 10 85 -33 -50 -19 124 -55 -55 38 42 -67 -90 110 13 -57 -56 90 -22 -114 35
2072C5J1n9j08J69l9p9J3O3L3j46J10KK7j16L9R0p5nj5J09j08J0L9K6n9o4J61
$$ 35 46 -13 -121 48 9 -70 -57 6 39 -107 3 5 32 -84 -45 45 -30 -35 -50 59 -49 -39 0 26 -33 -97 64
2099F4n1j1n4R4j9o4O3J5K2j08J07Ll6k5K3P4j13M6k5Q0p9j6O2m3K5r8J30k3l0
$$ 64 13 2 -52 42 23 -41 22 37 59 -49 58 61 25 0 23 97 -16 30 5 85 6 -10 52 9 34 -64 66 43 13
2128A3m6N9L6j25N7J5M8j28M5P2n2m6pJ46j24j1L3N3o9n3J31n0j6o2J23lj00L6
$$ 13 -33 26 62 -63 -6 9 57 -71 -26 46 -6 -52 -59 87 -37 -48 -15 38 -31 -84 47 -3 -19 -81 42 39 -61 -25
2156b5L9K7j55R7M3k7q8N8J13j65K1N4Q6j65K7J28k8r9JJ78j39l8N0Q4o3j04J58
$$ -25 14 41 -114 -17 26 -1 -89 -31 82 -83 -62 -8 78 -87 -60 68 40 -59 -58 120 -19 -57 -7 77 14 -90 68
2183F8rm0p7J22Kr9K6O5K7j53J04M6l1p6M8R6j32lK6Q4j28qJ00j9m6n8J46q3m9
$$ 68 59 19 -58 64 66 -33 -7 58 85 -68 36 82 51 -25 23 119 -13 -16 10 94 -34 -42 58 39 -7 -65 81 -2 -51
2212e1RQ0l3j03J22j7j3o9Q3K3q3J9rQ2q9L5MJ9l9m2J04m2Jo5J01k2n1K9K4L2
$$ -51 -42 38 5 -98 24 7 -6 -75 8 31 -52 -33 -42 40 -49 -14 -10 9 -30 -72 32 -10 -9 -74 27 5 -46 -17 7 39
2242C9j22J01Lj2n5M8O1r3K1JP2j00K1N1rk3o9J47o0j1l4Q8kr9P6J9Rj18J08M1
$$ 39 -83 18 21 9 -46 2 63 -30 -9 -8 64 -36 -15 36 27 4 -65 82 22 11 -23 65 63 -36 40 59 68 -50 58 99
2272I9q9m4N6R4j45L3L8Jq6M3R3r8k8nJ30j04o3P4K4l2p5J35m5n9j9J09j4j07
$$ 99 10 -34 22 116 -29 4 42 43 -43 0 93 -5 -33 -38 92 -12 -75 -1 23 -9 -84 51 6 -53 -72 37 23 -84
2300h4N9J3L3j03P9L8p5l3N7J18j49j4O1N8q9k8J24p7k2J2J08q9n4N3L6%r7R2
$$ -84 -25 -12 21 -82 -3 35 -40 -73 -16 102 -47 -61 0 58 -31 -59 65 -12 -34 -22 86 -3 -57 -4 32 32 -65 27
2328B7j7Ll0M4J8r4M8K1O2j19K4K9lJ1m1R3q1J2LO9n0r0Q5K8Kq9P9j1n5K7K0J6
$$ 27 10 13 -17 27 45 -49 -1 20 82 -37 -13 16 13 24 -17 76 -5 7 10 79 29 -61 24 52 54 -35 44 33 -22 5 25 41
2360D1q7M3J3N0p4l4O5k0rl9Q0n9l1K9O7l2j15J00RNp5N9L4p9L3M5M3j51N0Q9
$$ 41 -46 -3 10 60 -14 -48 17 -3 -12 -51 29 -30 -61 -32 35 3 -112 -12 -3 2 -73 -14 20 -59 -26 19 62 -89 -39 50
2390E0j0r7KJ31j14J8K6O5j15j8J14km7r1J25nn3%O6qj28J27M4m2j24J01Q7j16
$$ 50 40 -57 -55 76 -38 -20 6 71 -44 -62 52 50 3 -88 37 32 -21 -21 45 37 -91 36 80 38 -86 15 102 -14
2418a4kL0N6j14L1Q4l0p2lJ33p3l6mQ1p0l6R9l5j8o7J15j4n9k3K5N6r2M6MJ2p6
$$ -14 -16 14 70 -44 -13 71 41 -31 -34 99 26 -10 -14 67 -3 -39 60 25 7 -60 55 41 -18 -41 -16 40 -52 -6 -2 10 -66
2449f6M1P7q1l4RJ04q0pJ8Lk2k1J05o1j4k7P2Ql9PJ0N0q4N5lj6j2%P1o0pj6Q6
$$ -66 -25 52 -29 -63 -54 50 -30 -37 -19 -16 -38 -59 46 -15 -29 -56 16 24 -15 -8 2 52 -32 23 20 4 -8 -8 63 3 -4 -20 66
2482F6l7n2L8jLo6J14l7m5pO0K6r6M3LL5q1N1M6p4qJ4Q7r6k1L7M8m1o3J08l1m6
$$ 66 29 -23 15 14 17 -49 65 28 -17 -24 36 62 -34 9 12 47 -34 17 63 -11 -19 -5 82 -14 -35 2 50 9 -54 54 23 -23
2514b3k3J18l3j05N2L8J8j11P4K6o9l1O1O0j38K7M8M3j08K0Q2m4l1KJ09j07pM9
$$ -23 -46 72 39 -66 -14 24 42 -69 5 31 -38 -69 -8 52 -86 -59 -11 32 -76 -56 26 -18 -49 -47 62 -45 -52 -3
2542cM3m7n9R5j6rm6P8Op0J9L7K7j00N7M9l0n0K4O7r6K5K1N0q3oO0k3k3l0P8n1
$$ -3 40 -7 -66 29 13 4 -42 36 42 -28 -9 28 55 -45 12 61 31 -19 5 72 -24 1 22 72 -11 -17 43 20 -3 -33 45 -6
2574fOrL7jp4P3j4J3n3L6K8m5K0k2P8p4j4J6M8n8l5R0m1k2k1P8l5m4K8J9Qp0M9
$$ -6 0 -9 28 27 -47 26 12 25 -28 8 36 -9 11 -11 67 -7 -21 -5 43 -15 -50 40 -1 -23 -44 34 -1 -45 -17 2 10 -60 -11
2607a1J0%m6K4O2p6LKP1p6j7P6j4k5n3J29n6l7J3Q0l0q3Q8J7j8p4R6J1p4KM7L4
$$ -11 -1 -1 -47 -23 39 -37 -34 -32 39 -37 -54 22 8 -17 -70 59 3 -34 -21 59 29 -54 34 51 33 -41 55 66 -8 -6 41 75
2639G5j14L8N1Jp5J3Q7p1qJP1p5l2O9J0l9n7J12m2l9mO7qr5O5K6j1o3O4K6o2r
$$ 75 -39 -1 50 51 -24 -11 76 5 -3 -2 69 -6 -38 31 41 2 -55 57 15 -24 -28 39 31 -64 1 27 16 -47 17 43 -19 -28
2671b8J3O6j04M5J6K2o0nO8m7ok3O8m9j5K7oJ3o5O6J2j2m4K9L5m6J6PN2q3L3L7
$$ -28 -15 51 -53 -8 8 30 -30 -35 33 -14 -20 -43 25 -24 -39 -12 -18 -5 -70 -4 8 -4 -48 -19 16 -30 -14 -7 45 -38 -5 32
2703C2j7j6l5Q0l6lnL9j0m3M5qL1q4N1J9k0k7KQ1r5J9MN0p5j0P5l4k8k7Q8l8m6
$$ 32 15 -1 -36 44 8 5 0 39 29 -14 31 23 54 -30 21 40 20 -7 -5 76 -19 0 4 54 -21 -31 44 10 -18 -45 43 5 -41
2736d1L9L4k5p7Q8Pk8n6P5K5q7K8J2N3r8L1M1j2m5kQ8p9j1K2M7n1l1Q2j8k2n5
$$ -41 -2 32 7 -70 18 25 -3 -59 16 41 -46 -18 -6 47 -51 -20 21 9 -36 -38 50 -29 -40 -18 29 -22 -53 29 11 -11 -66
2767f6J09m0l9J9M0pq2P6Pk6n0P6L3q6K8K6L7p7K9L3j3k4k2R0o1mJM7k6n1M4N
$$ -66 43 3 -36 -17 23 16 -66 10 17 -9 -59 17 50 -36 -8 18 55 -22 7 40 27 3 -19 71 10 6 7 54 28 -23 21 26
2799B6Np3P3km0J1K0J5o4L2K5j5n3L4L8m6Ql0O1m1qL0Jj0l5M7k1Qm0M3L1n1J6
$$ 26 31 -42 31 29 -11 0 20 35 -29 3 28 13 -40 -6 32 -14 -6 -36 25 -16 -24 6 7 -3 -38 9 -12 -4 -44 -1 30 -21 -5
2832enM0o3K4K8ml9j2Q6n5j2j1N9m7l4O4qqn7Q4Mm2j5N1J4o7M6J2Ro6L1O5n9j9
$$ -5 -10 30 -33 -9 19 15 -24 -36 50 -5 -17 -28 31 -16 -50 14 6 -2 -59 25 29 -13 -28 23 37 -30 16 28 37 -29 2 67 8 -11
2866a1J2P6p9j1N4kk2m2R4l7m1j2Q8l8n5M5J1lo8P7j0m0j8M2M3r4J4K3J9n4J9
$$ -11 1 77 -2 -13 41 39 17 -25 69 32 -9 -21 67 29 -26 19 30 27 -41 36 26 -14 -32 10 53 -41 -27 -4 15 -39 -20
2897b0M0m5j1QQ1q1j4L4J9k0m0O7k2j6j6N2qn9L6RL2n9K4JRnnM6p1K4jM4k6l5
$$ -20 20 -25 -36 -28 53 -28 -42 -8 11 -9 -49 18 -4 -20 -36 16 8 -51 -15 -6 26 -33 -9 -8 1 -4 -9 37 -34 -10 -11 33 7 -28
2931b8M3j2J7m9N8l6NoL5Pp0M6OL4o0K7J2k2RJM0o2MK5K6k3n2N1lln2N5Jn0J7
$$ -28 15 3 20 -29 29 -7 -2 -8 27 34 -36 10 16 50 -10 17 29 7 16 17 57 -5 -1 24 50 27 -25 26 23 20 -32 23 24 -26 -9
2966iK4K0r2M5K1Jn1J2N1n9PL3K1o9j5Q1j3k2k9Q0n5j7K0M6l5n0O6K0j9n6O7P
$$ -9 15 35 -57 -12 9 10 -41 -29 22 -37 -30 3 24 -45 -60 21 8 -14 -43 37 -18 -35 -15 31 -4 -54 12 32 13 -43 24 31
2998C1l6%J7K2p3L6L7j3o1K9N9m5j7QO0n9k2O3j1l5l6R7k7k2j2M1No6O5rMn6N3
$$ 31 -5 -5 12 34 -39 -3 34 21 -40 -11 48 3 -14 -6 54 -5 -27 36 25 -10 -46 51 24 2 -10 31 36 -30 35 26 30 -26 27
3031B7K6m8qKM3n8K3OJ6m1j2O0l2j9j4M0j4l4L1j7J5m2O7j9j8j6J8L8n1J5j9N0
$$ 27 53 5 -3 -1 42 -16 7 13 29 -12 -24 36 4 -15 -29 11 -3 -37 -6 -23 -8 -50 17 -2 -20 -36 -18 20 -31 -16 -35 15
3063A5l7J4ROll6O1k0j2k3M6Nm4J8OK5o6N2J9l6j1RN5o9J9%K4l4k2O8m7nj7P8
$$ 15 -22 -8 1 7 4 -32 29 9 -3 -26 20 25 -19 -1 5 30 -36 16 35 -1 -12 -3 52 -17 2 2 26 -8 -30 38 -9 -14 -31 47
3097D7m1l3K2K8Mo2O7nk3k5M1L2p0J5J8L5p8L1K8l4k8J5O2p4OK6K9n4k4O5k1k1
$$ 47 6 -27 -5 23 27 -35 32 27 4 -21 20 52 -18 -3 15 50 -28 3 31 -3 -31 -16 46 -28 -22 4 33 -21 -45 20 -1 -22
3129b2k4P3k3o5L8K5Ko6N8Krl2L6K8o4J0j7J16j33L8Q7l1Pq9J25n4q4R1kom3N1
$$ -22 -46 27 4 -61 -23 2 4 -62 -4 -2 -11 -43 -7 21 -43 -33 -50 66 -67 -29 58 27 34 -55 70 16 -68 23 21 15 -28 23
3161B3j5Rl5L1lmj5RL3n0K4mK3k9j1L7j0j5j8N1m1kJ2J4J0o6N9Jj0l5L0K9m7J2
$$ 23 8 17 -18 13 10 6 -9 0 33 -17 7 3 26 -3 -14 23 13 -2 -20 31 -10 -12 0 14 24 -42 17 18 8 -27 3 32 -15 -3
3195cJ2K7p4L2J7pj2qM9n6j1QM5l3m8N9mMn8Q2k0l6J8J4K7q1M9K4on5M1M8o8Q
$$ -3 9 36 -38 -6 11 4 -8 -16 33 -23 -34 -26 19 -14 -62 -3 -7 -3 -61 21 1 -35 -17 -3 24 -57 -8 16 10 -45 -4 44 -24 -16
3229a6K3L9n8mL9Lk6j6P4m3j3JL1j6n0N4Oqn3N3j0j3j3J9K7o6K5J3J9n2J3L9l5
$$ -16 7 46 -12 -16 23 26 0 -16 58 15 2 3 34 18 -32 22 28 20 -33 20 10 -3 -16 3 30 -36 -11 2 21 -31 -18 21 -14
3262a4K0k2M7l8nL2j4Kk7N1l0Rl5L1Rm8K4jJ6l7K0J0mpj8M3l9J0rK7rl0K9OPn9
$$ -14 6 -16 31 -7 -12 20 6 8 -19 32 2 11 -24 7 16 -32 -8 -9 7 -30 -10 0 -4 -11 -29 14 -25 -15 -24 3 -6 -36 -7 -1 6 -53
3298e3O2k1LmK0K8l2lPK5l9L7J6mk8rL5k2jj1N7o6j4N7o3R5o3J8Pm7J6K1%n5L8
$$ -53 9 -12 -9 -13 7 35 3 0 7 32 -7 30 46 42 14 5 40 18 17 6 63 -3 -17 40 -23 72 9 27 34 -13 3 24 24 -31 7
3333GJ8j0m0K8L5n9J1QK3m1j1N4k7ok2O8l2j7%M5j3o0N7Pk9k0L5Ql9MJ4K8p8N1
$$ 7 25 15 -25 3 38 -21 -10 -2 21 -20 -31 23 -4 -10 -32 36 4 -13 -13 32 19 -41 16 23 -6 -26 9 17 -22 -18 -4 24 -54 -3
3367cPnm1J6M3m2J1jK3k1rM2nj4k9O0k7qLK1ll5M1oQl6K7Qnj0MM0n4J3%K1j5k1
$$ -3 4 -1 -42 -26 17 -25 -14 -15 8 -13 -22 20 15 1 -28 32 5 -3 0 21 18 -17 24 18 26 -10 17 25 20 10 14 54 0 13 13 34 19 -2
3405bL7k7Lk5K2mj9J0KJ6m0K7Poj8%M6l7Pj3M1l3j1K3Lj4l4O1k0j5JK8Mm5L4k
$$ -2 35 8 11 -14 8 4 -15 -5 -3 13 -27 0 7 1 -17 -17 29 -8 -1 -14 27 -6 -17 6 9 -5 -39 22 2 -13 -12 16 20 -25 9 7
3441Gpn3N2K4m0MJ1K7n3J0K4Pl7nN5l1j6mO9m7k5L6K5k9l9O9ok5j3L7J9o2M0j
$$ 7 0 -53 -1 23 -17 -13 -2 25 -28 -18 6 13 -24 -29 26 -5 -21 -25 44 -3 -28 8 33 4 -35 34 28 3 -10 27 46 -16 24 23
3475B3Qm6L3K2l7j6J1N5o4kJ8J5j8j3K7k1oqM6l6k4K2MJ4l9L5%qj2J1K0m9K5%
$$ 23 31 -15 18 40 3 -13 -2 53 -11 -13 5 20 2 -11 16 -5 -11 -19 27 -9 -33 -11 -7 7 -32 3 3 -5 -17 -6 14 -35 -10 -10
3509a0K3k9NK2r%j3L4l7J3oL2j6l4K5pK4l7K3Oj3oJ9K3m7MLK6k1k0M4j4jj4M3
$$ -10 13 -16 -11 11 2 2 -11 23 -14 -1 -7 25 9 -25 0 -7 17 -20 3 9 -4 -10 9 32 -15 -11 -8 18 -3 -23 21 7 6 -8 35
3544C5k6k2L2%Rm5K6K2j6k4L3Ql8QQL6n8KK9lj6j8M4l8lJ7J1k4m0M8Ppl8M7km0
$$ 35 9 -13 19 19 28 -17 9 31 15 -9 24 32 -6 2 10 46 -12 -10 19 16 0 -18 26 -12 -15 2 13 -11 -51 -3 4 -3 -41 6 4 -36
3580c6J6K5Ln9N0J5pl9K1L5l2NpL9m5%L6j2j1k2N2j7k7JL2om1N1j3pl2N1ll5N
$$ -36 -20 5 8 -51 -1 14 7 -32 -11 24 -8 -3 -10 29 -16 -16 20 8 -3 -25 27 10 -17 -16 16 10 -31 20 7 0 -32 19 16 -19 -14
3615a4MJ6l1L2Llk4J3J8j2Oj7L9j6pNJ0%k6K6mj4j5K2Rj9Mj9K4k4J9ojqk3M9k8
$$ -14 -10 6 -25 7 10 7 -17 -4 14 2 8 -9 30 14 7 12 22 22 -4 22 18 4 -11 11 20 1 5 -14 10 -14 5 -1 -2 -10 -33 16 -12
3652a2Lj7K9ok5K1oJl6N9qj4oQL0l8QJ2Qm2K1K8j8j2JN6n9%J1J6j9j7M5k5j8J
$$ -12 -9 -26 3 -3 -28 -7 -13 -12 -48 11 3 -11 -17 -9 21 -17 -9 3 11 -31 -10 18 0 -12 -11 45 -14 -14 -3 13 -6 -23 22 -3 -21 -20
3688b0L6km0K4J3Kl1J8J0k0mJ2L3l8NJ1J6m3KM4k5rmM8l7l2L7J9j8k9M1oqk7L7
$$ -20 16 14 -26 -2 11 13 -18 0 10 -10 -14 -2 31 -7 -2 9 25 -18 -16 28 3 -6 -10 38 1 -31 6 25 7 -22 19 13 5 -22 15
3723A5ml7K2nJ7l8J7J2mj3lK3l0mK0Nj6JL5k2J6l5M0j3mLJJ5k6RJ1J0l3J7J3j3
$$ 15 11 -26 -4 -9 8 -30 -13 -1 -5 -18 -21 2 -28 -32 -12 -7 -23 -22 13 -9 7 -28 12 -1 -5 -2 -1 14 -12 -3 8 18 -15 2 15 2
3759BQqJ9j6nNJ1pj5J9j9K5m1L2pk0MQK8m4K0QQk9K0L2m4J1NK2l9j4M6j4j4j1
$$ 2 10 2 21 5 0 5 16 9 -6 13 -6 19 -22 10 3 -17 -13 -5 23 -21 -1 7 15 -14 6 38 -6 5 10 32 -7 -21 25 11 -3 -14
3795a4K8nj8JK5lm0K6NJ0m5K4J6m0lL4J8m8PK3pj4qL3j6j8J5L4k9j5L1Ooj9L2
$$ -14 14 9 -9 -8 17 14 -26 0 5 15 -30 -6 10 -30 -33 1 19 -29 -22 1 -6 -20 -28 5 -11 -29 -14 20 -9 -24 7 13 7 -12 20
3830B0Jk7MK4Km0K3J5%l2J8J3j3poL3m4OJ0J5l1qM3k4Oj3K6j2pJ9j3J1m9L3J5
$$ 20 21 -6 -2 22 24 -16 7 22 22 -10 8 21 8 1 -5 28 -16 -10 0 15 -16 -24 19 -5 1 -12 14 2 -5 14 1 12 -37 -4 11
3865A1ok1K1J1k0J1qJ5j1nORj4j1K7j0j1%Nj1k6L2j2Rk1K5J3k2oPK3l0J5lPkj3
$$ 11 5 -16 5 16 -4 7 -1 14 3 -2 4 13 -1 -12 15 5 -6 -6 -1 -12 -38 -6 -18 -9 -30 -5 8 -14 -20 -13 10 -20 -5 -8 -1 -3 -16
3902a6K6j7Oj7K4mj0J4RLm5M8Lj0l2L5J9m0PJ7Ql9K2J5j0k8jM7l5j6LK3qk8M6
$$ -16 10 -7 -1 -18 6 2 -8 6 15 18 -27 21 24 14 -18 17 36 -4 3 20 28 -11 11 26 16 -12 -13 34 -1 -17 -14 9 1 -27 19
3937A9j1j7j2L7j3k0J9RNk8J3J0Mj9KK8m8J4kK1l1J8J0j7jrL7j1j5JJ0j0j5L0
$$ 19 8 -9 -21 16 3 -17 2 11 16 -12 1 11 15 -4 -2 26 -22 -8 -10 11 -20 -2 8 -9 -10 -19 18 7 -8 -7 3 -7 -22 8
3971Hj2%k7L7Jom%K2l2QNJ3k4nL6j5Lj1K9pj0LOjk7K3%%j6POqLmJ7l1JK0Knk3
$$ 8 -4 -4 -31 6 7 1 -3 -3 19 -13 -5 0 13 -11 -16 20 5 8 -3 26 19 9 12 18 17 -10 13 13 13 -3 4 10 2 5 1 18 -13 -12 8 10 5 -18
4013a8L3k3Lj9M4j5k8L5Lk2k5L0J5k5jJ8J2l8K3PLk2J0L9m2omL7k9jJPj4j9M4
$$ -18 15 -8 -5 -24 20 5 -23 12 15 -7 -32 -2 13 -12 -13 5 17 -21 2 9 12 -10 0 39 -3 -9 -13 24 -5 -6 -5 2 -12 -31 13
4048A3k0nj1L1Jl4J8MPk4K8Qk8JJ1K7m4K0KJ1k7NL1k0jj5M8k7njJ7qk2L3j7kj2
$$ 13 -7 -12 -23 8 9 -25 -7 -3 4 -20 8 16 -12 -11 0 27 -17 3 5 16 -11 -6 25 5 4 -11 37 10 5 4 21 13 -9 24 7 5 -7
4085gK8%k0lj1K4l0J3J0j5jJ2K3m1J1pK8j2j1J7okrJ8rj0J0OOk9J7LJ1j8qJ6j1
$$ -7 21 21 1 -2 -13 11 -19 -6 4 -11 -12 0 23 -18 -7 -14 14 2 -9 8 2 0 -9 9 0 -10 0 6 12 -17 0 3 14 -4 -12 4 -7
4122gNoK6j6MkpJ2l0K0kJrK0%l7K3J6Ok0JRKJlJ5k5J3jK2k6nK2j2lqL2j9qjJ0
$$ -7 -2 -8 18 2 6 4 -3 9 -21 -1 -3 -2 -11 9 9 -28 -5 11 17 -3 -2 7 9 10 7 22 -3 10 9 31 5 0 22 10 7 -1 31 12 4 3 13
4163A3j0j7K5Jpj9J7Nj5lJ6jk6QJ3ok0jM2k5LkJ4j1j0K0llj1L5j2m%MQk4PRlk2
$$ 13 3 -14 11 12 5 -14 3 8 -7 -10 6 5 -21 -13 0 -6 -26 -27 15 -10 -7 -9 5 -6 -16 4 1 -2 -13 22 10 6 6 10 18 -6 1 10 7 -15
4203a5QJ7j6JqK8l0J4%Rj1j3J3Qj1JLKj1M1n3K4j1J5J2j5MoL0k2Pj2K0j2LJPr
$$ -15 -7 10 -6 -5 -13 15 -15 -1 -1 8 -3 -16 -3 5 -6 -5 -2 0 -11 30 -23 1 -10 5 17 2 6 0 30 8 15 3 23 11 14 15 22 13
4241A3k0J7j1JoQ%k5K7j9K3l9K3Qk2MkL0l1MJ5J5j8j7K9j3%qL4k1j6J7J2mk9M5
$$ 13 -7 10 -1 0 -6 2 2 -23 4 -15 8 -31 -8 0 -22 -18 -20 10 -21 -17 -2 13 -5 -22 7 -6 -6 -14 20 -1 -17 0 12 8 -21 24
4277B4oj1j0QJ5k6J6MJl0J8J4j4j0OJ6l1LK6oj3oJ7mKpK7j2j7J3Rmj4NQJ1k5J3
$$ 24 18 7 -3 5 20 -6 10 14 15 -15 3 17 3 -7 -1 15 -16 -13 13 7 -6 -12 5 1 3 -4 23 11 -6 7 16 12 -2 3 11 22 -3 10
4315A0J2k7J0LKj2LNj2nOJ6k4NnJ3qnNlPk8J6J0mkJJ1roQQ%j2K0j3J4j0J5Jj1
$$ 10 22 -5 5 8 10 -2 1 6 -6 -11 -5 11 -13 -8 -13 0 -8 -13 -8 -11 -4 -32 -16 -6 -10 -12 -11 0 -9 -15 -7 1 1 -11 9 -4 10 0 15 16 5
4356EjOMj2OJLj8JJ8k6QJ9pqpK2rj5PK5l0mKK0Kk5L0j3%j1K6j2j7J4jK0k8RJ3
$$ 5 4 10 14 2 8 9 12 -6 -5 13 -13 -5 14 7 -1 -8 14 5 -10 -3 22 -8 -12 -10 10 12 -13 17 4 4 -7 19 7 -10 4 3 23 -5 4 17
4396A7%k6PK9k8j1QK3l4oK2kLl1K4koj0J9jk0K1Okj9K2lqJQQj3NMJ3j6lJ8j4N
$$ 17 17 -9 -2 27 -1 -12 -4 19 -15 -21 1 -1 2 -29 -5 -7 -13 -23 -4 -5 -25 -4 2 0 -19 3 0 -8 -7 1 9 -4 1 5 18 2 -1 17 3 8
4436HoJ7mj9K4oRl2K4j3NpLQk4J2jOrOj0NJjJ7qmoL0j4j1J4qRj9mL5j2j9J3Mk8
$$ 8 2 19 15 -4 20 14 23 -9 15 2 7 0 3 11 -13 -1 -2 4 -5 1 -9 -4 -3 -4 13 5 1 -5 25 11 0 14 6 15 -4 -8 27 15 -4 9 13 -15
4478a5NJ3J3j7NJ2j0kk1K9k3LRlj2NK8j8j5JNJ0j6LJ7jj4J4J1rj4LL6l2JJ4Qk5
$$ -15 -10 3 16 -1 4 16 6 4 -17 12 -11 -8 1 -2 -14 -9 19 1 -14 -13 -8 2 -14 -11 6 5 -9 5 16 7 -7 -4 32 0 1 15 23 -2
4516bmK2ooKJ7j0j7LJ5j1l2L6qLqJ7nl3K2QKj3J3Nkj6RO%ppJ7qlROmj6K3Kj3L
$$ -2 -6 16 10 4 6 23 13 -4 -1 14 3 -29 7 -1 2 -6 11 6 -27 -5 3 5 -8 5 10 8 -8 1 7 7 0 -7 10 2 -1 8 14 10 -6 17 19 6 9
4559IrJ7k1MkNLj5J7j9JLJ3k0J1j0J5lj3J9Loj1J7pOKj0J2j3J9Nk0JoJ3kpLJ7
$$ 9 0 17 -4 0 -2 3 6 -9 8 -11 -10 -7 6 -14 -3 -13 2 -1 -14 5 8 2 -9 8 1 7 9 -1 11 -2 17 22 2 3 -3 10 8 1 4 21
4599B1qnJ2j2Kj9K1okqRLk8RMPj7J8Qoj5NK5l0NJ4Oj0rJ7Jlj3L0k7oK1kj6%J6
$$ 21 13 8 20 8 10 -9 12 6 4 -4 5 8 -20 -11 -7 0 -17 1 9 3 -12 -7 18 -12 -7 7 13 3 -6 11 12 9 -4 26 -1 -7 14 12 -4 -4 12
4640A2%j4j3L2j1k2J9mOj5J3Jj5JlK1j2l%KRj9K4j3kKK5j0nP%%j0J1j0KJOnj2
$$ 12 12 -2 -15 17 6 -16 3 -1 5 -10 3 4 -11 -10 -13 8 -4 -7 -7 -5 4 -15 9 -4 -6 -4 21 11 6 13 13 13 3 14 4 6 7 13 8 -4
4680dOPKj5QLj5Oj5K5k2NKRJk1K0pJ0j8J0j0LkLK9k6%nK0j3LJ7j3Qj4J6pj4QM
$$ -4 2 9 11 -4 4 7 -8 -2 -17 8 -14 -9 -7 2 3 -18 2 -5 5 -13 -3 -13 -10 -12 -9 20 -6 -6 -11 9 -4 -1 16 3 11 -3 13 6 -8 0 4
4721Dj2oJ6j0nnRJ2k0QQomLJ2j3mLJ7j4%QJ1j4k3L3nQj9K7jk8K1kOj1J0jJqJ1
$$ 4 -8 -14 2 -8 -13 -18 -9 3 -17 -9 -1 -7 -11 -8 4 -9 -13 -10 7 -7 -7 1 12 -2 -25 8 3 11 -8 19 18 -10 11 9 15 4 14 13 14 6 17
4762A7%k2J1mjj1RRprqJ9mj1KJ5rj3J9moj2K2Nj4JNQj7jJ7lkOnmkoK0ppJ3lrp
$$ 17 17 -5 6 2 1 -10 -1 8 1 -8 -16 3 -1 -12 -10 5 -4 -17 2 -2 -8 -20 2 7 -7 -6 -1 7 -10 -11 6 3 1 7 2 -2 -4 -10 10 3 -4 9 6 -3 -10
4807a0J4lqj1J0J2j6NOMj1MlK4j9NkoKK5Ql2J0oM9m0l3O1p3QK0j4L8j8NkrPML
$$ -10 4 1 -7 -18 -8 4 -12 -7 -1 3 -8 -4 -7 17 -2 3 1 -5 -3 22 30 -2 8 2 51 11 -22 39 -34 -26 -6 -20 18 0 5 3 -6 1 5 8
4847Hql6L7Kj8k4J3Oj5l9P6pnpJ4kj7J7NNj2MJ7rkLJ0k4J8nMj1oK1j0rJ2jj3%
$$ 8 0 -36 1 3 -15 -39 -26 -20 -35 -74 2 -5 -10 -17 -3 -5 -22 -5 0 5 -7 -3 14 5 3 6 16 -8 10 5 9 -2 -8 13 3 -6 6 5 -8 -8
4887hK6j3llNPj7mLJ8k3J0PJj2KMjKj0K5mn%MoMMLmj2J5lj8J2N%j7M%ProNnkl
$$ -8 18 5 2 -1 4 11 -6 -10 -7 11 -12 -2 5 6 -6 -4 0 -1 1 -9 16 12 7 7 11 5 9 13 16 12 0 15 12 -6 6 11 11 -6 -2 -2 5 -4 -10 -5 -10 -12 -15
4934a5J4j8RKlJ1qKLjqJ2KpmRMk0J9J0kj2MRLj5%J4j2oK0j0oj1K5oj2pJ0%j5K3
$$ -15 -1 -19 -10 -8 -11 0 -8 -6 -3 -4 -12 0 2 -5 -9 0 4 -16 3 13 11 -1 3 12 15 0 0 14 2 -4 16 6 0 -11 14 8 -4 -11 -1 -1 -16 7
4976GnnqJ1Oj3nJ6J7k6KJ4rnOJ8mj1rK1j1rQLj0nJ5j1mkOJj3PJ%qLPoj%J7k4J0
$$ 7 2 -3 -11 0 6 -7 -12 4 21 -5 -3 11 2 -3 3 21 17 6 -3 18 7 -2 6 9 -1 -6 9 -2 -6 -8 -2 -1 -14 -7 -6 -6 -14 -11 -4 -10 -11 -11 6 -18 -8
5021hLJ8j3j2K1j3KLO%oJ4mMj7K1%j1lpMj0OPJqj1J5l%kLkpJMJ1j4J4Qj6j6ML2
$$ -8 -5 13 0 -12 9 -4 -2 1 7 7 1 15 11 15 -2 19 19 8 5 -2 2 -8 -2 5 6 -2 -13 2 -1 -1 -3 0 -2 -9 -8 -4 7 -7 7 15 -1 -17 -13 19
5065A9j9nORj5OJ3Qk3LJ7mrOQk1oJ6krj1J7%j4NRLk7OJ7mk6J9J4njpK5j9oLJ1
$$ 19 0 -5 1 10 -5 1 14 22 -1 2 19 15 6 12 20 -1 -7 9 7 -2 -13 4 4 -10 -5 4 7 -20 -14 3 -1 -27 -8 6 1 0 -7 18 -1 -7 -4 7
5107GMj6J2rKkPMoJ0Oj1nJ3rko%KkJpJ9qj3Rmj3NR%qPOqlJ3Pp%J1oj2J7j4J4j2
$$ 7 11 -5 7 -2 0 -2 5 9 3 13 19 8 3 16 7 5 -1 -1 1 -1 0 -7 12 4 -9 0 -4 -17 -12 -3 -3 -11 -4 2 -6 -9 4 11 4 4 15 9 -3 14 0 14 2
5154BJMQj2j4L1j7k%RJj3RlKk4K4j3JoJ4j2j1RMJ7k2ROkmnJ7qRN%nlKNnoJ3nn
$$ 2 3 7 15 3 -11 20 3 1 1 10 11 -2 7 4 6 -18 6 -7 -6 -12 2 -10 -21 -12 -8 9 -13 -4 2 0 -4 -9 8 0 9 14 14 9 6 8 13 8 2 15 10 5
5200EjJ2rj0MPkj6J8JrkNJ0j7nJ8rj2J0Qj2Jj3K9kj0J6mj9MO%PnOOj6J9pj0Ok0
$$ 5 4 16 7 -3 1 8 6 -10 8 9 0 -2 3 13 -4 -9 9 0 -12 -2 6 -6 -5 -18 11 9 -1 15 11 -8 -4 2 2 9 4 10 16 0 19 12 2 8 -12
5243a2K0j3qmK0Qj6JkOj4K2j0mJQ%k5K7mNj3K1Qj2mKPqNjJmKR%JmNqmoOMk0J0
$$ -12 8 -5 -13 -17 3 11 -5 -4 -6 0 -14 8 -2 -6 -5 3 3 -22 5 1 6 -7 14 22 10 6 8 15 7 12 11 12 8 10 19 19 20 16 21 13 9 3 9 13 -7 3
5289C%KnLJ4j8npJ6j0j2J5J1rmJ0nRnPnj3J6kRk1J2LOj4kK1j9lOOj8MJ2j6J%O
$$ 3 3 5 0 3 17 -1 -6 -13 3 -7 -19 -4 7 -2 -6 4 -1 8 3 10 5 -8 8 6 15 -6 6 9 15 1 -1 20 1 -2 4 10 -8 -4 8 -8 -7 -7 -1
5332aj0KNMnj2K1k3K0lkRj1J0nJ4j9MK5qqNJ2rqPJj6mK1mj2j5K5rKJLj1oRkPj1
$$ -1 -11 -9 -4 0 -5 -17 4 -19 1 -2 -4 5 -6 4 -1 13 -6 -2 23 15 7 12 24 15 7 14 15 -1 -5 16 12 0 -15 10 1 3 4 7 -4 -10 -1 -3 4 -7
5376gR%j3NlJ2mj3J4oKQjlMlJ2pj2J4pMpJ6j7j%OPj6NjKLj4J6Pnj1J2oJlJ1rq
$$ -7 2 2 -11 -6 -9 3 -1 -14 0 -6 -4 4 3 0 4 1 13 6 -6 8 1 5 -2 14 -3 -4 -4 2 9 -7 -2 -3 -1 2 -12 4 11 6 -5 7 1 2 -1 10 1 -7
5422glJ3Mj2NJ6j6mJ2Rj7J1rJ6j1rPPj5jOkOljjj8K3jk6J5j0J9k6J2Rjj2KK1j5
$$ -7 -10 3 7 -5 0 16 0 -4 8 17 0 11 2 18 7 -2 5 12 -3 -4 2 0 6 3 2 1 -17 6 5 -21 -6 -16 3 -23 -11 -2 -3 -15 -13 8 -7
5463gnOLj1OKmJ0qJ1mNj1J8kj4J5r%j0J9Jj2mR%j9J3kNj5LJ0j8J3mJ2qQKnLlO
$$ -7 -12 -6 -3 -14 -8 -6 -10 0 -8 3 -1 4 -7 11 9 -5 10 1 1 -9 10 11 -1 -5 4 4 -15 -2 -4 1 -14 -11 -1 -19 -6 -10 2 -6 2 4 -1 2 -1 5
5507EK%qJ7Jrj2PJ6k4J9pLJKmj7NjJ0j4JlLKj2QjkqJ3MqLKQj8lJ3kJJ5Lj5J4l
$$ 5 7 7 -1 16 17 8 -4 3 19 -5 14 7 10 11 13 9 -8 -3 -4 6 -8 -7 -10 -7 -5 -17 -9 -10 -12 -20 -7 -3 -11 -8 -6 2 -16 -19 -6 -8 -7 8 11 -4 10 7
5553GJ4j9qK0r%j5J2Ll%LJj6J0qnQJOj1LpJ6j8J5%MqkPmKmK2j3j4J1LnJ0Kqlm
$$ 7 21 2 -6 14 5 5 -10 2 5 2 2 5 6 -10 0 -8 -13 -5 -4 2 -9 -6 -13 3 -15 0 0 4 -4 -6 1 -3 -1 -5 17 4 -10 1 4 -1 9 11 3 0 -4
5598dMJ3k2J3mqkmJ8okLnjJoKKrJ4nMj3J1LpJMJ0j3OJ3mj3QJMoJ1J5j7j5J7lk
$$ -4 0 13 -9 4 0 -8 -10 -14 4 -2 -4 -1 -6 -7 -6 -12 -10 -8 -17 -3 -8 -4 -17 -6 -3 -10 -9 -5 5 -8 -2 11 7 -6 2 3 7 1 12 27 10 -5 12 9 7
5643GoJ%%%OlkokojKQnLlJ8j0j2J5NknPmkmJ9j3j3J2Qjj2J0oLj6J7mk0NOJ4j2
$$ 7 1 2 2 2 2 8 5 3 -3 -5 -11 -12 -10 -2 -7 -4 -7 11 1 -11 4 9 7 2 9 5 3 -1 18 5 -8 4 12 11 -1 9 3 6 -10 7 3 -17 -12 -6 8 -4
5689dlJlmQrj%JLKlJ4kpKP%rjJ3NlKJPj5J3Mj6Q%Jj3J1lj0NjRjmj0Mlj0J5kMj3
$$ -4 -7 -6 -9 -13 -5 -14 -15 -15 -14 -11 -9 -12 2 0 -7 -5 2 2 -7 -8 5 10 7 9 10 17 2 15 19 3 11 11 12 -1 10 7 -3 2 1 10 9 5 -5 -1 -4 -14 1 -1 3 -10
5739a0ML%pMQj2PJ0Kj0%J1oOpO%qPqOj0J6Nk6%J2l5J4l6O7J9m4j7JO4k8L1k7p2
$$ -10 -6 -3 -3 -10 -6 2 -10 -3 7 9 -1 -1 10 4 10 3 9 9 1 8 0 6 -4 12 17 -9 -9 3 -32 -18 -54 13 32 -12 -29 -28 36 8 39 12 -60
5780f0N8M2o2oJ7J2qNoQPpjLK0k1mK8j7NrJ6j1j1oJ5jj8J8mj3%Qlq%P%j5J3jJ2
$$ -60 -2 40 -22 -28 -11 1 -7 -2 -8 0 7 0 -1 2 22 1 -3 25 8 13 4 20 9 -2 -8 7 6 -12 6 2 -11 -11 -3 -6 -14 -14 -7 -7 -22 -9 -10 2
5822BrR%oM%J4j3MmnM%J1pmKNkKp%J5k4J3Jj2NJp%lPj0NLkJpJJ3qjJ0LnOMJkj6
$$ 2 -7 2 2 -4 0 0 14 1 5 1 -4 0 0 11 4 0 2 7 5 7 0 0 15 -9 4 5 -7 -2 -1 -8 -8 -11 -4 -14 -9 -6 -8 -7 -14 -13 0 -8 -9 1 4 -1 5 9 10 8 -8
5873hJ7%j6ORj%oKJ1k0PPj3J1Klj7NJ0j%j3MJ0omMnnKjLqJ7Qj1pJ6nl%ORj9Rn
$$ -8 9 9 -7 -1 8 7 7 1 3 14 -6 1 8 -5 6 8 5 -12 -7 3 2 2 -11 -7 3 -3 -7 -3 -8 -13 -11 -12 -9 -17 0 8 -3 -10 6 1 -2 -2 4 13 -6 3 -2
5920bmPnLjj4PNlqQKlk%J2orQRj4MlJ0j4J1N%JkLJqK3j6Pj4J4JqJNLj9lJ2nj3
$$ -2 -6 1 -4 -1 -2 -16 -9 -4 -7 -15 -7 -5 -8 -10 -10 2 -4 -13 -5 4 -10 -6 -9 1 -13 -2 3 3 4 2 5 6 -2 21 5 12 -2 12 13 5 6 11 14 -5 -8 4 -1 -14
5968a4J8%qkj5L0j2rNj0jJ2Pj3PRqMJJ0j3OqnJ1KkMJ0j6%JJ4lj9RlKqNMj5RoK2
$$ -14 4 4 -4 -6 -21 9 -3 -12 -7 -17 -18 -6 1 -12 -5 4 -4 0 1 11 -2 4 -4 -9 2 4 2 6 16 0 0 1 15 12 -7 2 -1 1 -7 -2 2 -13 -4 -10 12
6013A2k6NJ3j3mJ3Ppj3J3OrMLKJlJ3j3JOPoj0QLJj9J5lMj4PrLPqOj1kK2k8J3l
$$ 12 -14 -9 4 -9 -13 0 7 0 -13 0 6 -3 1 4 6 7 4 17 4 5 11 18 12 2 10 13 14 -5 10 7 11 -3 4 -5 -2 5 -3 3 -8 -10 12 -16 -3 -6
6057fkmjQLPj2J3Jj0QpJ3%Qj0Nj3QRj5%oJ0pkMrlMNkPj7J7j2MmRJj1QJnjJ2kj5
$$ -6 -8 -12 -13 -5 -2 5 -7 6 7 -3 5 -2 11 11 19 9 14 1 9 18 3 3 -3 7 0 -2 2 -7 -10 -6 -1 -3 4 -13 4 -8 -4 -8 1 2 -9 -1 0 -5 -6 6 4 -11
6105a1J0pJ2l%NJpJOknKJ0j0JkJ4nj6Qo%rJ1nolMJ7j3JJ0j3j2PJ3pKRmKj0K2n
$$ -11 -1 -8 4 1 1 6 7 0 1 7 5 0 2 12 2 3 1 15 10 -6 2 -4 -4 -13 -2 -7 -13 -16 -12 5 -8 -7 3 -10 -22 -15 -2 -9 -7 2 -2 0 -10 12 7
6150Grj1J8lkJlJ0j0RqlmJ1J1noj0OJj0J8j5%nJ2j3PrJ5Rj7QPMj8J3NqkKPmnk
$$ 7 -2 -13 5 2 0 1 -2 8 -2 7 -1 -4 -8 3 14 9 3 -7 -1 0 -10 8 -7 -7 -12 0 -13 -6 -15 0 9 -8 0 7 11 -7 6 11 3 1 3 10 6 1 -1
6195aOJjPj2J0qJ0j1KOLlrNkj5R%Jn%qJ2j9J0Rj4J5j3J6nNRoKnJ8j1joJ3k%%l
$$ -1 5 6 5 12 0 10 2 12 1 3 9 12 9 0 5 3 -12 -3 -3 -2 -7 -7 -15 -3 -22 -12 -3 -17 -2 -15 1 -4 1 10 4 6 1 19 8 7 1 14 12 12 12 9
6241IKqkPk0PRmoKQKprJ3jlj4J5JkoJ6pkkJJ5j3NRj2Nj3L0j5J%j0PpL2n2NQJJ4
$$ 9 11 3 1 8 -12 -5 4 0 -6 -4 4 6 -1 -10 3 2 -1 -15 0 1 -1 -7 9 2 0 -2 -1 14 1 6 15 3 8 -5 25 10 11 11 1 8 1 33 -19 -14 -6 -5 9
6288Ij2%Kj0rJ9j0J2pKPj8J5NLrJ4j2KnLPj5J0QRok1J2jJ2j4Rjj4%K1%j6jNqJ
$$ 9 -3 -3 -1 -11 -20 -1 -11 1 -6 -4 3 -15 0 5 8 -1 13 1 3 -2 1 8 -7 3 11 20 14 -7 5 4 16 2 11 10 -4 -4 17 17 1 0 5 -3 -2
6331bllkJ4ljj0KMOKkJ4j1kj2J7Mj4J1Lnj6J4J5k3J0j1JKJ2j7K0j4oL%Mj2J6o
$$ -2 -5 -8 -10 4 1 0 -10 -8 -4 2 4 2 16 5 3 -9 8 12 -2 9 12 7 -9 5 20 -3 7 -4 -3 -1 11 -6 14 0 -6 -3 -3 1 -11 5 -1
6372aNppNj2J1j%%lJ8j5J5pnJ4kNjj6QRr%nJ4jj5OQmj0J1lj4LjK0j4JNjk5J5J1
$$ -1 4 -3 -10 -5 -17 -6 -7 -7 -7 -10 8 -7 8 1 -4 10 8 13 12 -4 4 13 4 4 -1 13 12 -3 3 11 7 -3 8 5 -9 -6 -7 13 -1 0 5 4 -21 -6 5
6417Ej1jjPqMKJ0j6LQj2LJ8%kj1J6qjnP%Nk0RKKq%Jjj0QknoMQQj0J7knoKNmJQ
$$ 5 -6 -7 -8 -1 -9 -5 -3 7 -9 -6 2 -10 -7 11 11 9 -2 14 6 5 0 7 7 12 -8 1 3 5 -3 -3 -2 -3 -13 -5 -7 -12 -18 -14 -6 2 -8 9 7 2 -4 -2 3 -1 0 8
6467HnoOKqORpJ2j2J5j0J0kmJ3l4J4lmjkNj3LMLj7J6j4PpNJ4j1JoJ5llLJ5j3q
$$ 8 3 -3 3 5 -3 3 12 5 17 5 20 10 20 18 14 27 -7 7 4 0 -1 -3 2 -11 -8 -4 -1 -18 -2 -16 -9 -16 -11 3 -8 -7 -13 2 -1 -4 -1 14 1 -7
6511gJ6j7J2qJ3LqRJjj2%kJ4k3NJ8j9lNJ2j8J0kpJNKqJJ0%jj0J0O%nKJ3rj2J4
$$ -7 9 -8 4 -4 9 12 4 13 14 13 1 1 -1 13 -10 -5 13 -6 -9 -4 8 -10 0 -2 -9 -8 -3 -1 -9 -8 2 2 1 -9 1 7 7 2 4 17 8 -4 10
6554A0JkKjnKOjrlkQJj1LnJ2j6PKnmlJ2qPmOnpPMMj3QJKKmJ0kMPlk2NJ1%rmQN
$$ 10 11 9 11 10 5 7 13 12 3 0 -2 6 7 -4 -1 -6 6 -10 -3 -1 -6 -10 -13 -1 -9 -2 -6 0 -5 -12 -5 -1 3 -10 -2 -1 1 3 -1 9 7 11 18 15 -7 -2 9 9 0 -4 4 9
6606Ik0PMkJJlLK%rkJ1kj0LJ7j2JOojO%j%nPJ0j1RPknk5M3rl2RNmKj1nJ8rOnk
$$ 9 -11 -4 0 -2 -1 0 -3 0 2 2 -7 -9 2 0 -10 -7 10 -2 -1 5 -1 -2 4 4 3 3 -2 5 15 4 13 20 18 13 -12 31 22 -10 -1 4 0 2 -9 -14 4 -5 1 -4 -6
6655fj2J2lKJ%J1qLjJ2j0nJ8j8KjJ7j4Qj2K6rmnrK2j6KOj4LNKJj8J1llOJMokO
$$ -6 -18 -6 -9 -7 -6 -6 5 -3 0 -1 11 1 -4 14 -4 -2 -3 14 0 8 -4 22 13 9 4 -5 17 1 3 9 -5 -2 3 5 6 -12 -1 -4 -7 -1 0 4 -2 -4 2
6700Bj1nJ6LJpJ8j1JLJ%mLmMj4LJ5mj2MJ9k0%J0lj3jQkj0mQNNj6N%mjMJ3j0KR
$$ 2 -9 -14 2 5 6 -1 17 6 7 10 11 11 7 10 6 10 -4 -1 14 10 -2 2 21 1 1 11 8 -5 -6 2 0 -10 -14 -6 -1 4 -12 -7 -7 -11 -12 -8 5 -5 -3 6
6746Fj3R%J1npJ0j%j2K0nJj7J4Nj8NoLoPJ1j8KMjlLQlq%J1npOJ0j2RLj2MJJ3n
$$ 6 -7 2 2 13 8 1 11 10 10 -2 18 13 14 -3 11 16 -2 3 -3 0 -6 1 12 -6 -4 0 -1 -4 -1 7 4 -4 -4 7 2 -5 1 11 -1 8 11 -1 3 4 17 12
6792A2j3JNMJ3roJ1j1RolqKoonJ1Jj5qK5Qj0j6J4mKkPJ0k3J4%JnmRLlRlJj2J0
$$ 12 -1 0 5 9 22 13 7 18 7 16 10 7 -1 1 -5 -11 -16 -5 -4 -19 -27 -2 6 -4 -20 -6 -10 -8 -10 -3 7 -16 -2 -2 -1 -6 -10 -1 2 -1 8 5 6 -6 4
6837D%KpPNnoQj%j1jJj4J1Rj2JoKlQJPj0qK8j4l%K3j8LJ1jnj5J3pQoRJj7J4%%
$$ 4 4 6 -1 6 11 6 0 8 7 7 -4 -5 -4 -18 -7 2 -10 -9 -15 -13 -16 -8 -7 0 -10 -18 10 -4 -7 -7 16 -2 1 12 11 6 -9 4 -3 5 -1 8 9 -8 6 6 6
6884FpJLlj1KRpj0%Q%nKoPK%jmMjQmRqOPoJkJ7j6LmkMpJ7j0JJ7j9rQLrj0QOnN
$$ 6 -1 0 3 0 -11 -9 0 -7 -17 -17 -9 -9 -14 -12 -18 -11 -9 -9 -10 -14 -10 -11 -3 -7 2 -6 0 7 1 2 0 17 1 4 0 -2 2 -5 12 2 3 20 1 -8 0 3 -6 -16 -8 -2 -7 -2
6936bmQMpjoKkQnkJ0pjPjpJ5PJ0j2o%j0NLj0KklJ2Kj7kPMr%J3j8J2kOonJ6mnj2
$$ -2 -6 2 6 -1 -2 -8 -6 -8 0 -5 -7 3 -4 -5 2 1 -6 9 16 26 14 8 8 -2 3 6 -4 -2 -4 -7 5 7 -10 -12 -5 -1 -10 -10 3 -15 -3 -5 1 -5 -10 6 2 -3 -15
6985a5K3j0mlJ4JrJ5LknOj3QkqQ%MMoj7Qj5J3J0J9j2m2NlK7lm2K4L2k8RLL%Qj2
$$ -15 8 -2 -6 -9 5 6 -3 12 15 13 8 14 1 9 7 -1 7 7 11 15 9 -8 0 -15 -2 8 27 15 -27 -22 -25 2 -1 -43 -19 13 -15 -6 -3 0 0 8 -4
7028dMKjRqj2J9kmJ2j5lJ3j3KJ4kj8MRj7oJ3Rj5KlKkJMNj0qK1j0J2jOK4k2rLj
$$ -4 0 2 1 10 2 -10 9 7 3 15 0 -3 10 -3 -1 13 11 -7 -3 6 -11 -17 -4 5 -10 -8 -11 -9 -11 -10 -6 -1 -11 -19 2 -8 4 3 9 33 11 2 5 4
7072DM%Qj1nLJ4k5J6jnoMJ1j2lLjklrJ4rmJ1PkllLnKNMoPPk4K0nRpNkJ1j4mLO
$$ 4 8 8 16 5 0 3 17 -8 8 7 2 -4 0 11 -1 -4 -1 -2 -4 -7 -16 -2 -11 -15 -4 3 1 -2 -5 -2 -7 -5 0 4 -2 5 12 -12 8 3 12 5 10 8 19 5 1 4 10
7121A0j2kjpKOpMkJ3j2oOJ0kj4J2oOrJ3J4k0LlJnOnJ1NnLlJ1kRlkj1kMKj2Rqm
$$ 10 -2 -4 -5 -12 -10 -4 -11 -7 -9 4 -8 -14 -8 2 0 -14 -2 -8 -2 -11 2 16 -4 -1 -4 -3 -8 -2 -7 4 9 4 7 4 15 13 22 19 17 6 4 8 10 -2 7 -1 -5
7168erK3j9Pj4J4pKmMRj2LjmRm0K9K5j6J6pnkK1j6Oj5J4j2MNK2k3rJ4pLJ0rQj6
$$ -5 -14 9 -10 -3 -17 -3 -10 -8 -12 -8 1 -11 -8 -9 -13 -4 -44 -15 10 -6 10 3 -2 -4 17 1 7 -8 6 -6 -2 3 25 2 -7 7 0 3 13 4 12 -4
7210dRj1OmLRj5Lj9K4j1P%mRLOplJ3Nj2nJ0k%kJLlqRMj3%jJPnKmOp%j6J7jnqR
$$ -4 5 -6 0 -4 -1 8 -7 -4 -23 1 -10 -3 -3 -7 2 5 11 4 1 14 19 7 2 12 10 10 8 9 12 9 1 10 14 1 1 0 1 8 3 5 1 7 0 0 -16 1 0 -5 -13 -4
7260dj0PnKJ4rJ2j1J8pKlj6J7lKJ4j3oRpOj0PJj6OjLlljJ1pRnlJqLlQlJ1pk%J5
$$ -4 -14 -7 -12 -10 4 -5 7 -4 14 7 9 6 -10 7 4 6 20 7 1 10 3 9 -1 6 7 -9 -3 -4 -1 -4 -7 -8 3 -4 5 0 -3 -2 -10 -7 -10 -2 -5 6 -1 -3 -3 12
7308A2j5loJ6ljJ6j6JJ5qlJJ2j2pQnkkrRj2MoJ3jj1MmNQJ%Olj1J7nqNNNj0Pno
$$ 12 -3 -6 -12 4 1 0 16 0 1 16 8 5 6 18 6 -1 7 2 0 -2 -11 -2 -14 -10 -16 -3 -4 -15 -11 -15 -10 -2 -1 -1 5 2 -9 8 3 -5 0 5 10 0 7 2 -4
7355dJ1Jn%KkqPMnlj3J2j1J1jj2KOL%pJOJkoJ6LjrOJmKKJMmoJ1mlOjlKqRPj6j
$$ -4 7 8 3 3 5 3 -5 2 6 1 -2 -15 -3 -14 -3 -4 -16 -14 -8 -5 -5 -12 -11 -5 -4 -6 -12 4 7 6 -3 3 4 0 2 4 5 9 5 -1 10 6 3 9 8 5 7 -1 8 15 -1 -2
7407bKjkPj2oJ4NrrN%PlnMrOQlN%jMj1J5Pk1JNMMJj8QMj7J3qMQomqJ1lkQLqqJ
$$ -2 0 -1 -3 4 -8 -14 0 5 -4 -13 -8 -8 -1 -4 -9 -5 -14 -8 0 -3 2 2 1 5 -6 9 16 -5 -4 1 5 9 10 -8 0 4 -13 0 -8 -4 4 -2 -6 -14 -3 -6 -8 0 3 -5 -13 -12
7459a2Ql%JjLj2J7Km%LRmNmPj6LMJ1qpOlJjj1KLJrlmNNmjj5K3mJMmjj%LJ3j7P
$$ -12 -4 -7 -7 -6 -7 -4 -16 1 3 -1 -1 2 11 7 12 8 15 -1 2 6 17 9 2 8 5 6 5 -6 -4 -1 0 -9 -12 -16 -11 -6 -10 -11 -26 -3 -7 -6 -2 -6 -7 -8 -8 -5 8 -9 -2
7510bNKoQj2MJKQrmK0k1JJ1kj2Nkk1J0jOOoL3k6j2jJ3%rOQ%pJ3J0k0J1OrJpKQ
$$ -2 3 5 -1 7 -5 -1 0 2 10 1 -3 17 -4 -3 8 6 -6 -1 -3 -24 -14 -15 -9 -3 -9 24 -2 -14 -15 -2 -2 -11 -5 3 3 -4 9 19 -1 10 16 7 8 1 3 11
7556A1j7NMRKoOmj0%Pj2Qljj1LpJ5jNjj5oQjNkQjjMJRqMLKnkRllmJPJk1J8%k0
$$ 11 -6 -1 3 12 14 8 14 10 0 0 7 -5 3 0 -1 -12 -9 -16 -1 -2 3 2 -13 -19 -11 -12 -7 -9 -1 -2 -3 1 2 11 3 7 10 12 7 5 14 11 8 4 5 12 13 -8 10 10 -10
7607a0OJPKpKqL%Pj1QqRk1J5%NqnJ4MnQlNqJ0krRmQomj0J9j3pJLqkMKNj2J4jr
$$ -10 -4 -3 4 6 -1 1 -7 -4 -4 3 -8 0 -8 1 -20 -5 -5 0 -8 -13 1 5 0 8 5 10 2 12 10 1 10 6 14 8 4 -6 13 0 -7 -6 -3 -11 -13 -9 -7 -2 -14 0 -1 -10
7657a0MPPk6J9Nj8J1QonLJ1j5RmJ5j3jQJ7j1j2jJ7lrJ1rj5J6qpKK%j1PnJ1rNl
$$ -10 -6 1 8 -18 1 6 -12 -1 7 1 -4 -1 10 -5 4 0 15 2 1 9 26 15 3 2 19 16 7 18 9 -6 10 2 -5 -3 -1 -1 -12 -5 -10 1 -8 -3 -6
7700fLkJnJ0Mj3RMqlJ5j1J2onNpPOljmLj2QqRonJMjjLj2LkJ5JlNkqPLkOKJN%K
$$ -6 -3 -5 -4 -9 1 5 -8 1 5 -3 -6 9 -2 10 4 -1 4 -3 4 10 7 6 2 5 -7 1 -7 2 -4 -9 -8 -4 -5 -6 -3 -15 -12 -14 1 2 -1 4 2 -6 1 4 2 8 10 11 16 16 18
7753A8j4j4N7o5N8rk2jrJ6j2MKpMqKjOpNopjOlljJ3oJ2rLrnQOMqJ2ojQQprMMr
$$ 18 4 -10 47 -18 40 31 9 8 -1 15 3 7 9 2 6 -2 0 -1 5 -2 3 -3 -10 -11 -5 -8 -11 -12 1 -5 7 -2 1 -8 -13 -5 1 5 -3 9 3 2 10 18 11 2 6 10 1
7802ArJ0Orj0J0kpMoRoProkJ5oLPkLokNkmJ8j1Rj1PLrNJ5j0nJjJ%Oj4JjKJMj3
$$ 1 -8 2 8 -1 -11 -1 -3 -10 -6 -12 -3 -9 -2 -11 -17 -19 -4 -10 -7 0 -2 1 -5 -7 -2 -4 -8 10 -1 8 -3 4 7 -2 3 18 8 3 4 3 4 4 10 -4 -3 -4 -2 -1 3 -10
7852a0L%JmnJ0rK%kPnNlJ2lKnoRNlmJ4oMpJ0j2OrNKnoRjoNpjMj1J0j1J5j6KPP
$$ -10 -7 -7 -6 -10 -15 -5 -14 -12 -12 -14 -7 -12 -7 -10 2 -1 1 -4 -10 -1 4 1 -3 11 5 9 2 12 0 6 -3 2 4 -1 -7 2 1 -5 0 -7 -8 -4 -15 -5 -16 -1 -17 -15 -8 -1
7902alN%nJ9j4%jJK0j7jQpklQk3J6Kmj0MJ0LnojKnkJ1qqJ8j0j3KKLN%J5rkJqO
$$ -1 -4 1 1 -4 15 1 1 0 1 21 4 3 11 4 2 -1 7 -16 0 2 -2 -12 -8 2 5 0 -6 -7 -5 -10 -12 -1 -9 -17 1 -9 -22 -20 -18 -15 -10 -10 5 -4 -6 -5 -13 -7
7950gJ1j1PJJ3rQrqMMKj8QNj7QlPj0J3j0J2j4J%LOj3QrLJ0j3K4j3OkkmJ2J0j6
$$ -7 4 -7 0 1 14 5 13 4 -4 0 4 6 -12 -4 1 -16 -8 -11 -4 -14 -1 -11 1 -13 -12 -12 -9 -3 -16 -8 -17 -14 -4 -17 7 -6 0 -2 -4 -8 4 14 -2
7993bLPqlJ8j3Rj1JjLnj2J5klj6NRmKMpJjlJLjRnOOnoLJ5k1J9nRj6L%Mj%N%mn
$$ -2 1 8 0 -3 15 2 11 0 1 0 3 -2 -14 1 -1 -4 -20 -15 -6 -10 -8 -4 -11 -10 -11 -14 -13 -10 -11 -2 -7 -1 5 0 -6 -3 12 -9 10 5 14 -2 1 1 5 4 4 9 9 5 0
8044@J0q%pRj7ONpnjJ1Lj3j1J4jJ5j0J3j3PlnJ5qQlKpJ2Ok6J2KNnj7j7M2j9pR
$$ 0 10 2 2 -5 4 -13 -7 -2 -9 -14 -15 -4 -1 -14 -25 -11 -12 3 -7 6 -7 0 -3 -8 7 -1 7 4 6 -1 11 17 -9 3 5 10 5 -12 -29 13 -6 -13 -4
8087dknLKpPpPqjjmjRRj0K%jJ7j3KkMlRPj6J3qJ2kJ%j2KkMj4JON%Rl9M6l1Oj5
$$ -4 -6 -11 -8 -6 -13 -6 -13 -6 -14 -15 -16 -20 -21 -12 -3 -13 -11 -11 -12 5 -8 -6 -8 -4 -7 2 9 -7 6 -2 10 8 9 9 -3 -1 -3 1 -13 -12 -6 -1 -1 8 -31 15 -16 -10 -25
8136b5KJ2MpJ0j3PJ%LjJ3qNj1kNLJ1Kj3jJ5j0jJ2j6LpR%qpmNoKQPj7J0mqoOKO
$$ -25 -23 -11 -7 -14 -4 -17 -10 -9 -9 -6 -7 6 -2 3 -8 -10 -5 -2 9 11 -2 -3 12 2 1 13 -3 0 -7 2 2 -6 -13 -17 -12 -18 -16 -8 -1 -18 -8 -12 -20 -26 -20 -18 -12
8183a2NMj2J1kRnL
$$ -12 -7 -3 -15 -4 -6 3 -2 1
8191A
$$ Imaginary data points
##PAGE= N=2
##DATA TABLE= (X++(I..I)), XYDATA
0@%%%%%%%%%%%%%%%%%%%%%%%%%Qj6J6j6J6j6J6k1K9l2L2l2M0m8M9n7O4p2Q0q8
$$ 0 0 0 0 0 0 0 0 0 0 0 0 0 0 0 0 0 0 0 0 0 0 0 0 0 0 8 -8 8 -8 8 -8 8 -13 16 -16 16 -16 24 -24 25 -32 32 -40 40 -48
45d8R8j06J20j36J50j63J80j99K16k37K61k88L20l57L99m47N06n76O63p75R25
$$ -48 50 -56 64 -72 78 -85 95 -104 112 -125 136 -152 168 -189 210 -237 269 -307 356 -419 506
66E06j138J471k091N385j4454Q549P902j0566P525m175K910j530m557P976l398
$$ 506 -632 839 -1252 4133 -10321 -1772 6130 -4436 3089 -1086 1824 294 -4263 3713 315
81C15n150P594o453L246L227p827M143K959l494R95K841l209k294K334J712O48
$$ 315 -4835 2759 -3694 -448 2779 -5048 -905 2054 -1440 -445 2396 -813 -3107 -773 939 1587
97A587n454L676L730n855J620K339l109K688k097j71M892q364L809M357o161N406
$$ 1587 -3867 -191 3539 -2316 -696 1643 -1466 1222 -875 -1046 3846 -4518 -709 3648 -2513 2893
113B893k623j715K517l557L671M35m180L769j722J16M476o942J614L665l493J169
$$ 2893 270 -1445 1072 -2485 1186 1621 -2559 1210 -512 -396 4080 -2862 -1248 2417 -1076 93
129I3J020l24j932J016J755j10j794J61J007j873K849n34l348L008O70l156L008
$$ 93 1113 789 -1143 -127 1628 1518 -276 -115 892 -981 1868 1334 -2014 994 1664 -1492 1516
146A516q88k758L869j575M80j314q65M150m024N68L160l513O48J370k043K622
$$ 1516 628 -2130 1739 164 644 -670 -1535 2615 -1409 -841 2319 -1194 -546 824 -1219 1403
162A403j582j864L637j874L79m87m71K077k023J93J628j241j270K170l99l96J76
$$ 1403 -179 -2043 1594 -280 99 -388 -859 1218 -805 -612 1016 -225 -1495 675 276 -120 56
179E6q96J647j351n04K578n38k866J905P86j064N58j326K191j420n32K641k657
$$ 56 -840 807 -544 -1048 1530 992 -1874 31 817 -247 311 -1015 1176 -244 -776 1865 -792
196g92L23J408j565J016P54k575J759M80j165Q93o47J327k078k4L003k281j487
$$ -792 -469 939 -626 390 1144 -1431 328 808 -357 536 -111 1216 -862 -886 2117 -164 -1651
213a651K906K48k547J388Q3j89n7j83Q96j276L73P03o64p8J134j554K82J295k027
$$ -1651 1255 1503 -1044 344 427 238 181 -2 894 -382 -9 694 30 -48 1086 -468 -186 1109 -918
232i18J442m04n40O56m28J055o10j436J322P43k118J376K37o12k8q20K151r84
$$ -918 524 120 -420 236 -192 863 253 -1183 139 882 -1236 140 377 -235 -263 -1083 1068 84
250H4j117J356j15r25R26j70q41J340q58O15K01n98N8n55J161l46j145J277J198
$$ 84 -1033 323 208 -717 209 39 -802 538 -320 295 496 -102 -44 -599 562 216 -929 348 1546
269A546k826P33K084j881L0L74Q10j027q35J622J84r96M52L63j037R98r67N34
$$ 1546 -1280 -547 1537 -344 -314 60 870 -157 -992 630 814 -182 270 633 -404 594 -373 161
287A61R74j825O33Q11m10j035O71P51l42j237J071J283k698O45J148j45k77n74
$$ 161 1135 -690 -57 754 344 -691 -20 731 389 -848 223 1506 -1192 -547 601 456 179 -395
305c95Q94M7j237J52J675j397j56N16q7L37j268J249K11j314J78R48m16l30K15
$$ -395 499 546 -691 -539 1136 -261 -417 99 12 349 -919 330 541 -773 -595 353 -63 -393 -178
324a78J14R40j861N31J445j270l85P35O90r20k35N40M20j351O73J167j669R18
$$ -178 -64 876 -985 -454 991 -279 -664 71 761 -159 -394 146 566 -785 -112 1055 -614 304
342C04k8n83M43j0k30L83J23n71L66r5O81j306J92J566j661J62R54l75o24N89
$$ 304 276 -307 136 126 -104 279 402 -169 197 102 783 -523 -331 1235 -426 -264 690 315 -309 280
362B80j55K4M4l21N70p50Q85k44p58Q65k17n70M47N55q08L97k90K56j69p25J534
$$ 280 125 149 193 -128 442 -308 577 333 -425 440 223 -347 100 655 -153 244 -46 210 41 -684 850
383H50o03p54O06M18o40j72L65L64m17r95J642n42n84O83m60K81j55l50J63N55
$$ 850 247 -507 99 517 -123 -295 70 434 17 -978 664 122 -462 221 -239 42 -113 -463 -300 255
403B55q16L02M40j97l45o15J730p12j117J476L38j623K04J484o53m08p9J167o10
$$ 255 -561 -259 181 -16 -361 -976 754 42 -1075 401 739 -884 -680 804 151 -257 -336 831 221
422B21j007J169j38j64o2J07J13J26p11O48N83j375O82J52J6l75j66R98m50q04
$$ 221 -786 383 245 81 19 126 239 365 -346 302 885 -490 192 344 360 -15 -181 817 367 -437
442d37O48P04j245Q1K32M87j29j052J291k11r36L79P35m72l64K32J85K19r13Q49
$$ -437 211 915 -330 -249 -17 470 341 -711 580 369 -567 -188 547 75 -289 -57 128 347 -566 283
462B83nn32L77k01L33l83m84M50Q71j242L1Q59n51L0l64Q17k72o26N80O9m52K77
$$ 283 278 -254 123 -78 255 -128 -612 -162 709 -533 -502 357 -194 -164 -528 289 17 -609 -29 40 -412 -135
484a35K56l57O85q73J35O45o38K05O9M34n66k30P25K64j045K06J061r54N0J10
$$ -135 121 -236 449 -424 -289 356 -282 -77 -8 426 -140 -370 355 619 -426 -220 841 -113 -63 47
504D7L54q1o10M15M67k96n40M52k17L36l12j6O53r64J17O09J2m76j73L44L55p10
$$ 47 401 320 -290 125 592 296 -244 208 -9 327 15 -1 652 -312 -195 414 426 -50 -223 121 476 -234
526b34j42J351j240l32Q90Q4l62p23J011J73q55J1P49n19j03L60k40L76p14K87
$$ -234 -376 975 -265 -597 293 377 15 -708 303 476 -379 -368 381 -138 -241 119 -121 255 -459 -172
546a72L55j15m17J23O24n16q5L1P30q99l57J268l26n50l3N60j5l01j86P51n43
$$ -172 183 68 -349 -226 398 -118 -203 -172 558 -341 -698 570 244 -306 -339 221 206 -95 -281 470 -73
567g3n72J168m23J5m69O2O74m65K03P6l41j4M88k46K38n29k71J002j91j94n25
$$ -73 -645 523 100 115 -354 -292 382 -83 120 196 -145 -159 329 83 321 -208 -479 523 332 138 -387
588c87O06J97n08J72J55j35n27Q10j7m07q2j08N10l5l09j22M51m48M40k6k08J19
$$ -387 219 416 -92 80 235 100 -427 383 366 -41 -123 -231 279 244 -65 -187 264 -184 256 230 22 141
610A41p24J113j59p46J99J94J43k80r4M28j31r19J011L03o40l15M3Q66o31J4L74
$$ 141 -583 530 371 -375 -176 18 161 -119 -213 215 84 -835 176 479 -161 -476 -433 433 -198 -184 190
631A90j18m92K59P05n64m03o3Q54m9o28K13L58m62k77R84k76m69m39J046N11j413
$$ 190 72 -420 -161 544 -20 -423 -486 368 319 -309 -96 262 -200 -477 507 231 -238 -677 369 880 -533
652e33M11L78l8j50J5J99k61l76O91N03j121P6K19N03l26n87Q03l59l58L10O75
$$ -533 -122 256 218 68 83 282 21 -355 336 839 -282 -206 13 516 190 -397 406 47 -311 -1 674
673F74o28o03N71N36k17p91N35O7l28P6N40k50n80L32N8L89o92R1L09l51L16j72
$$ 674 46 -557 14 550 333 -458 77 144 -184 -108 432 182 -398 -66 -8 381 -311 -220 89 -262 54 -118
695a18K01j33l66K68O56o35l74M96K4J88n34M91j04n15N76P5j96l42L23N5J52
$$ -118 83 -50 -416 -148 508 -127 -501 -5 19 207 -327 164 60 -455 121 196 0 -342 -19 36 188
716A88k61j20J88p6L50k42Pk05Q5J74K70j62p06O46Q2N2l54J0M17n33J10M98j40
$$ 188 -73 -193 -5 -81 269 27 34 -171 -86 88 358 196 -510 136 218 270 -84 -74 343 -190 -80 418 278
739B78o49L92J87N2k41j88N18n11K69P4p7rk83K02K37p9n26N46J1l30pL12J12
$$ 278 -371 21 208 260 19 -169 349 -162 107 181 104 95 -188 14 251 172 -354 192 203 -127 -134 178 290
762B90p84L95M33k09o13M28L51m83J01o3L48m79J6N41k20m15P6N31k29j39k14
$$ 290 -494 -99 334 125 -488 -60 291 -192 -91 -154 194 -285 -269 272 52 -363 -287 244 15 -124 -338
783c38M74j54l22N65k18p5l28M02L55l92l57L62L51n63K63P9N1l79J25N41m61
$$ -338 136 -18 -340 225 7 -68 -396 6 361 -31 -388 -26 325 -238 25 104 155 -224 -99 442 -19
804a9j09J29K83l37P8P6K4K3l94N42p6j94j23K59J35l49J6K02J76n57L56Q6k01
$$ -19 -128 1 284 -53 25 101 125 148 -246 296 220 26 -97 162 297 -52 -36 166 342 -215 141 227 26
827B6K8j37L72k57j02J5K36j53j18R5n0J08m36M99K3m00k5K69K21m71M7K18J31
$$ 26 54 -83 289 32 -70 -55 181 28 -90 5 -45 63 -373 126 149 -251 -276 -7 214 -257 -210 8 139
850A39n48L03M18n21n9J12M13m06j22K79M8k13p8L93k32Q0k77L47K03n15J24L24
$$ 139 -409 -106 312 -209 -268 -156 257 -149 -271 8 56 -157 -235 158 -74 6 -271 76 279 -236 -112 212
872B12N0o36L81M04k73m90M60M95r40K23M44q4m75J53M35k89j50O5M25m91MJ89
$$ 212 262 -374 7 411 138 -352 108 603 -337 -114 330 246 -229 -76 359 70 -80 -15 410 -81 -77 112
894A12J11m3m67M66N7k38k12M40qm56J03K64K00p29K62L88k58k55K29L46n26j9
$$ 112 223 180 -287 179 236 -2 -214 226 218 -238 -135 129 329 -400 -138 250 -8 -263 -34 312 -214 -233
916b33K48K47n12P6M38m29P9L5J87k16m1O6O9K2j87J93j27K11l56J19L73m04L
$$ -233 15 262 -250 -174 264 -165 -86 -51 136 -80 -121 -55 14 36 -151 42 -85 126 -230 -111 262 -142 -139
939a39J14J79l31J24J04k7j23l5L07k69J60j34O3O5p6L6M9J28l83K66N4J0j42
$$ -139 -25 154 -177 -53 51 24 -99 -134 173 -96 64 -70 -7 58 -18 18 67 195 -188 78 132 142 0
962@p3L65k87k4P1K15k61j05J85J27q5m10N38j37j99L3J88N6m00K16J31j5l63
$$ 0 -73 292 5 -19 52 267 6 -99 86 213 128 -282 256 119 -80 -47 141 197 -203 13 144 129 -234
985b34L18J39k86p6O0M36n35o2L54O1m48K0N78l81k11N8M66k94k54L75m3j25j44
$$ -234 84 223 -63 -139 -79 357 -178 -240 114 175 -273 -253 325 -56 -267 -209 257 -37 -291 84 41 -84 -228
1008b28L54o0j38k24L12K44n43J88J70P2m65J66M94l86k98L33M03n86P9K48M3
$$ -228 126 66 -72 -296 16 260 -283 -95 75 147 -318 -152 342 -44 -342 -9 394 -192 -113 135 178
1029A78k65n0M59l29l5M3K19j50j25J43J3Q8l51K53M4p9j00J10K32l48l9J60L04
$$ 178 -87 -137 322 -7 -42 1 220 70 -55 88 101 189 -162 91 135 56 -44 66 298 -50 -89 71 375
1052C75n16lL41j61n8o6L75l37j46K57Q1k26o3K23k08J82j57J12J3j06K8j00L47
$$ 375 -141 -144 197 36 -22 -88 287 -50 -196 61 142 -84 -147 76 -132 50 -107 5 18 -88 -60 -160 187
1075A87k90j34J84K34l47q6N04k82j82K7L89k63j91K58M2m8j75K93j33J9r7P0
$$ 187 -103 -237 -53 181 -166 -252 252 -30 -212 -185 204 -59 -250 8 50 2 -173 120 -13 6 -91 -21
1097b1K23l64O6J73J65l70J9K64pk28l5M41m10m8K22K21k48l38M33Q1j89j97L77
$$ -21 202 -162 -96 77 242 -128 -109 155 148 -80 -115 326 -84 -132 90 311 63 -275 158 239 50 -147 230
1120B30j59k21K18J50l3m42L29J06q8j92Q1K09k73J9P1L01m50j06M30m4k52q4
$$ 230 71 -150 68 218 185 -257 72 178 90 -102 -21 188 -85 -66 5 306 -144 -250 180 136 -116 -200
1142b00L93k52r2J26J89k52j69L80j67O2j97J12J15q8m1K5J22k92J69J36J7l66
$$ -200 193 -59 -151 -25 164 -88 -257 123 -44 18 -179 -67 48 -40 -81 -56 66 -226 -57 79 96 -270
1164b70O1M40k58pp8J30j14J02J18j30k3j72L23km9j87N2J97r2M9r1R2k13J86
$$ -270 -209 231 -27 -34 -112 18 -96 6 124 -6 -29 -201 122 120 71 -116 -64 133 41 90 -1 91 -122 64
1188F4J03l1j15k39M57n3k05l9K50j05k10K94M8j80k55M47r1j68N7o6J41j32O2
$$ 64 167 136 21 -218 239 186 -19 -58 192 87 -123 171 219 39 -216 231 140 -28 29 -37 104 -28 34
1211C4p1J14j78o4L55r8k91j13N83k39k76K50J00l03p6N74k37k90o1L99M0l49
$$ 34 -37 77 -101 -165 190 92 -199 -312 271 32 -244 6 106 -197 -273 301 64 -226 -287 112 152 -197
1233a97J41J1M5j69K39P4k78j64L15L16m66L6Q0J68j61p9K62j58j03j1M14j88
$$ -197 -56 -45 0 -169 70 144 -134 -298 17 333 -133 -97 -17 151 -10 -89 173 15 -88 -99 315 127
1255A27l12J20L03j17l75M31l6k53L0L58j66l21K90K9L6k11J32pn0N1p3K26k26
$$ 127 -185 -65 238 121 -254 177 141 -112 -82 276 110 -211 79 108 144 -67 65 58 8 59 -14 212 -14
1278a4j15J23L25l26k09L12r1qp4K59k52j10K27L9j1k32O3LK15j70m9J30j53N4
$$ -14 -129 -6 319 -7 -216 96 5 -3 -77 182 -70 -180 47 86 75 -157 -94 -91 124 -46 -95 35 -118 -64
1302f4L3J92l08l7J86P7r6j51J81r5J09r9Q0L9j76Q6R8P9l16J38J19J8j14m9K32
$$ -64 -31 161 -147 -184 2 79 -17 -168 13 -82 27 -72 8 47 -129 -43 55 134 -182 -44 75 93 -21 -70 162
1327A62k29M8M0J46j77j53K58Q8j39k52L87r7j78J05K04j17l45L37J04j19j78
$$ 162 -67 -19 21 167 -10 -163 95 183 44 -208 179 82 -96 9 213 96 -249 88 192 73 -105
1348a05J54N5j08O7n1J58k63oK01Q3k39j41L93j05j68l0L24k51k08L75rj80j63
$$ -105 49 104 -4 63 12 170 -93 -99 102 185 -54 -195 198 93 -75 -105 219 -32 -240 135 126 -54 -217
1371b17L42l0k01j5J53J1k45K12j1kj65J20J75k07n1L5J92j82%N9O5q6j07K82
$$ -217 125 95 -106 -121 32 43 -202 10 -1 -3 -168 -48 127 -80 -131 -96 96 -86 -86 -27 38 -48 -155 127
1395A27p9j07j08K55Rk13J03R4j7k43K92Lj30l8M7J38j66Q4m0R3q5mO5j3J6k17
$$ 127 48 -59 -167 88 97 -116 -13 81 64 -179 113 116 -14 -52 -5 133 -33 51 11 104 19 15 80 67 83 -134
1421a34K71k1j13k8J27L8k47J26O2Rk25J52J09j52j2QK04k16m7J04P9j60p6K54
$$ -134 137 116 3 -25 102 140 -107 19 81 90 -135 17 126 -26 -38 -30 174 -42 -89 15 94 -66 -142 112
1445A12j13o7m9K40j06k05J36R0j0k35K15N0j06j53J92J90l48O9J13P9k55O2K45
$$ 112 -1 -68 -117 123 17 -188 -52 38 28 -207 8 58 -48 -201 -9 181 -167 -98 15 94 -161 -99 146
1468A46j35j45M0K96k41o5Q6J36j32j72L19j7j53r6L07l6k76J36J34m1k43K67
$$ 146 11 -134 -94 202 -39 -104 -18 118 -14 -186 133 116 -37 -133 174 138 -138 -2 132 91 -152 115
1490A15L0j35o7J04R8k03O5J1J44j88l4J86n2q9j02K92j33j33R8J69j42j96K45
$$ 115 145 10 -57 47 145 -58 7 18 162 -26 -60 126 74 -15 -117 175 42 -91 7 176 34 -162 83
1513H3m2l7j05J71j3j50Q1pP1j53O9J6L4m7n0J24j08M2q8J47l3j00L2O6M6k26
$$ 83 41 4 -101 70 57 -93 -12 -19 52 -101 -32 -16 18 -29 -79 45 -63 -21 -109 38 5 -95 -63 3 49 -177
1539a77J68L5l9r9J00J30k15M7L8Q8j63Q4N8l2Oj11J82q9j8m5J29L6k06J41J00
$$ -177 -9 26 -13 -112 -12 118 -97 -50 -12 76 -87 -3 55 23 29 -82 100 11 -7 -52 77 113 -93 48 148
1564A48n8k51K30Q7j80l8J30J31k83R1J22j0k08M5K29j64o2%K21k07r9K05K6j36
$$ 148 90 -161 69 156 -24 -62 68 199 -84 7 129 119 -89 -44 185 21 -41 -41 180 -27 -126 79 105 -31
1588c1j17K77j02j02l0K02k7k18J47M8K4k32J25J44j48j18J29J82k89L1J29M9
$$ -31 -148 129 27 -75 -105 97 70 -148 -1 47 71 -161 -36 108 -40 -158 -29 153 -136 -105 24 73
1610G3k08LK39j63o1L6J98j38j00R9M7pj53K14l2r1o0J59O3k04Q6K6P5j65R1N0
$$ 73 -135 -132 107 -56 -117 -81 117 -21 -121 -22 25 18 -135 79 47 -44 -104 55 118 -86 0 26 101 -64 27 77
1636G7o9J1l9J79j15m1LJ23o5j24J41j7k2j22J85j8j18L4L5O0j83P6K5N7r8pJ07
$$ 77 8 19 -20 159 44 3 6 129 64 -60 81 64 42 -80 105 87 -31 3 38 98 -85 -9 16 73 -25 -32 75
1663G5p7mo2J75j15r2O1Q7j4j51J51k3m1p8J37O2k31L0J32Q6k39P6J16o8r8P4
$$ 75 -2 -6 -68 107 -8 -100 -39 48 34 -117 34 11 -30 -108 29 91 -140 -110 22 108 -131 -55 61 -7 -105 -31
1689c1J73k64RJ13J00j33q8J73l8j8q9J91o7j25L7J38K4k63J72J14m6j74J24J12
$$ -31 142 -122 -113 0 100 -33 -121 52 14 -4 -93 98 31 -94 -57 81 105 -158 14 128 82 -92 32 144
1713A44k12K7J14Q9k66O5J80o4j04j0J72j54nO1J15j65r6K02j2l6j34J49Qq4J4
$$ 144 -68 -41 73 162 -104 -39 141 77 -27 -37 135 -19 -24 37 152 -13 -109 93 81 45 -89 60 68 -16 -2
1738bO1mk04J52P5J6j73J1J53r1pn0J08j13J0J05Mq3j11J87o5po3O6J9m6Q2n7
$$ -2 59 55 -149 3 78 94 -79 -68 85 -6 -13 -63 45 -68 -58 47 51 -32 -143 44 -21 -28 -91 -25 -6 -52 30 -27
1766b7L3j29J17M8k3p4m2J85q4ol4Q6p1m1J41j4m7j55J93K7p8m6P9P3j80J17O2
$$ -27 6 -123 -6 42 19 -55 -97 88 4 -2 -36 50 -21 -62 79 65 18 -137 56 83 5 -41 38 111 -69 48 110
1793A10m3j83J32J48j08n1k9J51j28rN7K6j02p4K28l0j19j12K14Qj79R7M7l2j60
$$ 110 67 -116 16 164 56 5 -24 127 -1 -10 47 73 -29 -103 125 95 -24 -136 78 86 -93 4 51 19 -141
1818a41K27K8j85p8J62J34k47L9L9O7j48M6J68j56j00P1K28j92q2O8Q9o3o4J70
$$ -141 86 114 -71 -149 13 147 -100 -61 -22 45 -103 -57 111 -45 -145 -74 154 -38 -120 -52 37 -26 -90 80
1842H0q9m4k5J70k7j80L8Q4R3j85J01M9r8m6Q9J37k09RP4R0j12mR4q1Lk9J51j16
$$ 80 -9 -53 -78 92 65 -115 -77 7 100 -85 16 65 -33 -79 10 147 -62 -53 21 111 -1 -5 89 8 11 -18 133 17
1870A7m8N3P3j4j36R2k3O3q3N0Kp9N2qJ05j40j6M4R3p2j01J28q0J8l9J17p1j06
$$ 17 -31 22 95 81 -55 37 14 77 -6 44 46 -33 19 11 116 -24 -40 4 97 25 -76 52 -28 -10 -49 68 -3 -109
1898a09R8L0K1j39O5PK7m3PQ7j31J5L3J30j45m8J18Qn5q9J94r4o6L0J29m2j74
$$ -109 -11 19 40 -99 -34 -27 0 -43 -36 51 -80 -65 -32 98 -47 -95 23 31 -24 -113 81 -13 -79 -49 80 38 -136
1925a36J43N8l4j45J38N8j38L3P8O5k25Q8J02j0j20PJ61j12jj7J36j32o3J50J5
$$ -136 7 65 31 -114 24 82 -56 -23 55 120 -105 -17 85 75 -45 -38 123 11 10 -7 129 -3 -66 84 99
1950I9o7j43K05mr7j6J09lj81J54J7k1j65J21J02j34k2M5J05j86M1Q3j2r9j5J57
$$ 99 32 -111 94 90 -7 -23 86 83 -98 56 73 52 -113 8 110 -24 -46 -1 104 -82 -41 42 30 -69 -84 73
1976G3j07jk8J02m8p1N5J7K2j24J21lk6n3O2P5j38M6PO9j22M3P2l7j0o1J47p4
$$ 73 -34 -35 -63 39 -9 -80 -25 -8 14 -110 11 8 -18 -71 -9 66 -72 -26 -19 50 -72 -29 43 6 -4 -65 82 8
2004Hk1qO0Nq9R6j5J1j14J17K0q0LqJ28j42K7L6N5j03m0J64o9l6m3J44q7q1R6
$$ 8 -13 -21 39 44 -45 51 36 47 -67 50 70 -10 -7 -15 113 -29 -2 34 89 -14 -54 110 41 5 -38 106 19 -62 34
2033C4N8m9j40J73j6o5o6J00M6j62Q1L9K9j58N3R9n6o8J8J37j52%M7Q5j16p6J64
$$ 34 92 43 -97 76 60 -5 -71 29 75 -87 -6 33 62 -96 -43 56 0 -68 -50 87 -65 -65 -18 67 -49 -125 39
2060C9l5n7o4J92n5j23N1R4k3j54J84J2p0q6J18N6j58O4L9N1j36M9Q7o1m1k4J55
$$ 39 4 -53 -117 75 20 -103 -52 42 19 -135 49 61 -9 -95 23 79 -79 -15 24 75 -61 -12 75 14 -27 -51 104
2087A04j01k2J2P8l3q4J15m7mp4J28j0p1J0J9M7j18Q3K0j1o6K4Q6j02J6k1R5q5
$$ 104 3 -19 -7 71 38 -46 69 22 18 -56 72 62 -9 1 20 67 -51 32 52 41 -25 -1 85 -17 -1 -22 73 -12
2115a2j5N5j0Lr3J04n1K6n7N1M6r3J7oP9j15L3L4J7p1j7J37j03j0%J03n7r1J09
$$ -12 -27 28 18 21 -72 32 -19 7 -50 1 47 -46 -29 -35 44 -71 -38 -4 13 -58 -75 62 -41 -51 -51 52 -5 -96 13
2144A3Oj2j00J30qo6j0O4N4j50Q0K0K7j10N3J12j01k6NJ46j42l2J02K2r7n7K00
$$ 13 19 7 -93 37 29 -37 -47 17 71 -79 1 21 48 -62 -9 103 2 -24 -19 127 -15 -47 55 77 -20 -77 123
2171A23p6p6j3J44o6j23J17M4k4j42J56J2q7k9P4N8j65O1M8K0j04K3J08q9k6j5
$$ 123 47 -29 -42 102 36 -87 30 74 50 -92 64 76 -11 -40 34 92 -73 -12 36 56 -48 -25 83 -6 -32 -47
2197d7J25j16k5O3M0m5q7J51m6m6m7J07j0j10O6L4L1j33R9J3o4oK9Q7j32M7MO1
$$ -47 78 -38 -63 0 40 -5 -92 59 13 -33 -80 27 17 -93 -27 7 38 -95 4 17 -47 -53 -24 63 -69 -22 -18 43
2225D3n5l0Q0n5K1p4J17l2j7j1L0M6j00O6nL6r7M0O8o7jrJ07j05lL7J2k8m6J06
$$ 43 -12 -42 38 -17 4 -70 47 15 -2 -13 17 63 -37 29 24 60 -37 3 71 4 3 -6 101 -4 -7 30 42 14 -32 74
2255G4n4j3n1J08j8q2L2J7N4j34P0K9j6o1M5R4j44nN5Q5j31j0Q5l3l2k1J35r7
$$ 74 20 7 -44 64 46 -36 -4 13 67 -67 3 32 16 -45 0 94 -50 -55 0 85 -46 -56 29 -4 -36 -57 78 -19
2283a9n5M0Q3m1j13J26nj2p8R7Rj09L7O7L8j57O3N4Jo2NJ02j01lL2R8j01o7J16
$$ -19 -74 -34 49 8 -105 21 16 4 -74 23 32 -77 -40 27 65 -92 -29 25 26 -36 -31 71 -30 -33 -1 97 -4 -71 45
2312D5Pm1o4J42o6m3M0M7k4j11J26j6Pq6N1L9n3K5j6N0j00M2L9J0o9l6J09m0J7
$$ 45 52 11 -53 89 23 -20 20 67 43 -68 58 42 49 -37 14 53 0 25 9 59 -41 1 40 50 -19 -55 54 14 31
2341C1m8M4l2k9M8QKj17J01J5j5n4J8N4p7M5jL3r1M0N2%k2r7J12k9Ll7M2K4j00
$$ 31 -17 27 -5 -34 14 22 24 -93 8 23 8 -46 -28 26 -51 -6 -7 26 -65 -25 27 27 5 -92 20 -9 -6 -43 -1 23 -77
2372g7Q3L0k0j03Q1M8m6k2%Q3r4L3N2lq2j5J62n5o9j6J16o7m2P8j3l4p2J48j3
$$ -77 6 36 16 -87 -6 42 -4 -26 -26 57 -37 -4 48 45 -37 -52 110 55 -14 -30 86 19 -23 55 42 8 -64 84 71
2401G1o6n9Q2N3j04K6L4K1j14O2R3q6p7N1J27j35j2L8M1q9qJ26q9l4j0J29n3r2
$$ 71 5 -54 28 81 -23 3 37 58 -56 6 99 13 -64 -13 114 -21 -33 5 46 -43 -51 75 -14 -48 -58 71 18 -74
2429g4N2M0rq0J13k6m9j6O4M0j25M0J4N9p9OM5k5qk0J17q8m3M0P0l7o7P1l0J9
$$ -74 -22 18 9 -71 42 16 -33 -49 15 55 -70 -30 -16 43 -36 -30 15 -10 -18 -38 79 -9 -52 -12 58 21 -46 25 -5 14
2459A4l1P6l7m6K0L0L8p9J6jM7j8j6M0n8K8k0P1n4l2L3J4K6r1O1pj0k9M9J9r6
$$ 14 -17 59 22 -24 -4 26 64 -15 1 0 47 29 13 53 -5 23 3 74 20 -12 21 35 61 -30 31 24 14 -15 34 53 -43
2490d3L6K7L9j08K7M4j4l4nQ9r1RJ4O1o1p8R2J6k0p8J06j3o5RN6K0j27O3N7Lr0
$$ -43 -7 20 59 -49 -22 22 8 -26 -31 58 -33 -24 -10 51 -10 -88 4 20 0 -78 28 15 -50 -41 15 35 -92 -29 28 31 -59
2521e9M0Q7r6kL6P6j26kQ5Mo9l2J23o1k1kP5m4p4R1J4j7p3J00Qo8J1K0M5r5M4
$$ -59 -19 68 -28 -30 6 82 -44 -46 39 43 -26 -58 65 4 -17 -19 56 12 -62 29 43 26 -47 53 61 -7 4 24 69 -26 18
2552A8K6Rq3K4R5p1k4j1R7q2k0N9Lm3m2R6l8k1j9N2j0m6L5%K1q7N0K3k4kl4Q0
$$ 18 44 53 -30 -6 89 18 -6 -17 80 -2 -22 37 40 -3 -45 51 13 -8 -27 25 15 -31 4 4 25 -62 -12 11 -13 -15 -49 31
2584C1o6K5j9M8l4m8N3PLp7J05j3l1lN1Kq0N2J2Pn9K7N1m0lj3Q2p6qL8K5l0n4
$$ 31 -35 -10 -29 19 -15 -63 -10 -3 0 -77 28 15 -16 -19 32 34 -46 6 18 25 -34 -7 44 4 1 -12 70 -6 -14 24 49 19 -35
2617c5R9k5k7n6J02rq0N1L0kr8P3M2m5n2N4N8j10K4L0M2q7j1J00o3j8k1R6n5m5
$$ -35 64 39 12 -44 58 49 -31 20 50 48 -50 23 65 20 -32 22 80 -30 -6 24 66 -21 -32 68 5 -13 -34 62 7 -38
2647c8L5L6k5p9R2J0l4o3R1Kp8K9L8J5j01O2M9m9l7K4P7j02J4K7M2o6mP1k8k1
$$ -38 -3 33 8 -71 21 31 -3 -66 25 27 -51 -22 16 31 -70 -8 41 -8 -45 -21 56 -46 -32 -5 37 -29 -33 38 10 -11
2677a1k5R2m2k5J7L5mo4N7qQm9M0L5n5KmN0o1J3K1J7l3k3P2m9J2m3N7km2L0j2
$$ -11 -36 56 14 -11 6 41 37 -27 30 22 30 -19 21 56 1 3 -1 49 -12 1 22 39 6 -17 55 6 18 -25 32 30 -12 18 6
2710FK9o3N3Kml1jO6o5Jj4P0o9j9N0lj1m8R6m1k9j4O3oq5O4K1qq2Q5K3o8pK9N9
$$ 6 35 -28 25 27 23 -8 -9 57 -8 -7 -21 49 -20 -39 11 8 -3 -51 45 4 -25 -39 24 18 -67 -3 18 10 -72 13 36 -32 -39 -10 49
2745D9r1J8M2Ln8qJ00n7k5KQ8n1n7O2K1j3q4R9j1l7j7P1Qq8M7K6j1p5O0M7p0j0
$$ 49 -42 -24 18 21 -37 -45 55 -2 -27 -25 63 12 -45 17 38 25 -59 40 29 -8 -25 46 54 -34 13 39 28 -47 13 60 -10 -20
2777b0K9O1j02J1M0J7n2j4Q9n1k1pN5j0n6K7J7Mo8P9k2j6k6L7M1p5K6nL0n1QM2
$$ -20 9 70 -32 -21 19 36 -16 -30 59 8 -13 -20 35 25 -31 -4 13 17 -51 28 6 -10 -36 1 42 -33 -7 -12 18 -33 -25 17
2809A7m1%j8P5n7lMJ2J5m9N9k8J2l9L1K1l1QmM5o2K3J0K4m0nO6m5Kl0Q2m1k9K7
$$ 17 -24 -24 -42 33 -24 -27 -23 -11 4 -45 14 -14 -2 -41 -10 11 -20 -12 -16 29 -33 -10 0 24 -16 -21 45 0 2 -28 54 13 -16 11
2843A1NK2p8P0Lk9k7M4L4q0K6J5L1o7J5M4l3j2j1Q3p0j9J7M4m6l9O0Pk6l2O8j1
$$ 11 16 38 -40 30 33 4 -23 21 55 -25 1 16 47 -20 -5 39 6 -6 -17 66 -4 -23 -6 38 -8 -47 13 20 -6 -38 30 19
2875A9n9J6L5K2j08O3K5j4l8K8N0p7J2J9L9p0lM7Jk0m6P9n1qRN7k3o6N3K6%n7
$$ 19 -40 -24 11 33 -75 -12 13 -1 -39 -11 39 -38 -26 -7 32 -38 -41 6 7 -13 -59 20 -31 -39 -30 27 4 -62 -9 17 17 -40
2907d0N3Ql3QK4J4p2M5J0J4m7NN5l8J3k3L9m2LL6okn4N3jnk6J1K1l4K3j3K9o9
$$ -40 13 21 -12 -4 20 34 -38 7 17 31 -16 -11 44 6 19 -4 35 -7 -4 32 26 24 -30 23 22 17 -9 2 23 -11 12 -1 28 -41
2941d1K5M0pk9l1Q0m8%PL1l5k5M6lj0n8P3jk4qNL4o8L9J9Pp6J5O9k5j9j1O9n2
$$ -41 -16 24 17 -12 -43 37 -11 -11 -4 27 -8 -33 13 10 0 -58 15 14 -10 -18 -13 21 -47 -8 11 18 -58 -43 26 1 -18 -29 40 -12
2975a2k7O3Ll4m1P8Jm5k2O7j0o6N5J6rp4P3K9l5k9K7M8n8J7J1J8n2MO6l9l3rQ8
$$ -12 -39 24 27 -7 -48 30 31 -14 -36 31 21 -45 10 26 17 -57 16 45 10 -19 8 56 -2 15 26 44 -8 -4 62 23 -10 -19 69
3008F9n6l9L1K7k9m4P9k2k9k6O6K0p2K1LL2p6M6K9l6k1J5M9o4N%L5l0pK3j7Mj7
$$ 69 13 -26 5 32 3 -41 38 16 -13 -39 27 47 -25 -4 -1 31 -45 1 30 -6 -27 -12 37 -27 -22 -22 13 -17 -24 -1 -18 -14 -31
3041c1O0k5l5QK3K3o0M5j8J4l3J6L7n6J7j1O0n2MOJ3jl0N3k5Mj5M5Jm9K6KM0p8
$$ -31 29 4 -31 -23 0 23 -37 8 -10 4 -29 -13 24 -32 -15 -26 34 -18 -14 -8 5 4 -26 27 2 6 -9 36 37 -12 14 16 56 -22
3075b2L0K6j0k5KO8p4PNN6o2j9N2j0k2k5P6l8l4J7K4ko9O0P%n8M4J8n0KK3L8q0
$$ -22 8 34 24 -1 1 69 -5 2 7 63 1 -18 34 24 2 -23 53 15 -19 -2 22 20 -49 11 18 18 -40 4 22 -28 -26 -3 35 -45
3109d5K2L7On4ON8m4j1kO6n3m9P1Pj5n9Q2j4l0rM0J2p0M8J5J1n5M1L3n3J4j7N3
$$ -45 -23 14 20 -34 -28 30 -14 -25 -27 39 -14 -63 8 15 0 -59 23 9 -21 -30 10 22 -48 0 15 26 -29 12 45 -8 6 -11 42
3142D2o8RL8Ll1k7M7L5l5j7K6Lo5N2n9N7j9L1Kj9omN0o8L4KJ3l9lL5k0Ll4N9k6
$$ 42 -26 -17 21 24 -7 -34 13 48 13 -4 22 25 -40 12 -47 10 -9 22 24 5 -1 -5 45 -23 11 13 26 -13 -16 19 -1 2 -32 27 1
3177Ak0qL9qm0K6jJ1m5K8K4k8pMN4o6J2K8J9m3j0O0m3Qk2O4m5l3M7NRn6O0mj5
$$ 1 -19 -27 12 4 -36 -10 -11 0 -45 -17 7 -21 -28 -24 30 -36 -24 4 23 -20 -30 30 -13 -5 -27 37 -8 -41 6 11 20 -36 24 20 5
3212El0L0L7n2K9lK7q6L3M9k8pj1O1o6LL6J6l2l6O7k2j3l1N9rm0K4J0J3p6O6M
$$ 5 -25 5 42 -10 19 16 43 -43 -10 39 11 4 -7 54 -12 -9 27 43 11 -25 42 20 7 -24 35 26 -14 10 20 33 -43 23 27
3245B7j5m2L2M2o7J6kL2n9J8L9j9l2j6O6m6qJ7K1j3l3N7k0mk5M9pk6J0LK0m2L8
$$ 27 12 -30 2 44 -23 -7 -9 23 -36 -18 21 2 -30 -46 20 -26 -34 -17 4 -9 -42 15 -5 -9 -34 15 8 -18 -8 -5 15 -27 11
3278A1kJ0l8OM6k2j0oM2l1l1L0KK1m0K6jlj4J1L4n0QmN7o1pM9j8j2j8N0j6l2J1
$$ 11 9 19 -19 -13 33 11 1 -5 37 6 -25 5 7 28 -12 14 13 10 -4 7 41 -9 -1 -5 52 -9 -16 33 15 3 -15 35 19 -13 -2
3313bL4j8m2L8jJ9q2O1N9p9L4k6Rl7J8K0Jl8PN0m5nKM3n0ML1Kk4k4O4k9j2qL4
$$ -2 32 14 -28 10 9 28 -54 7 66 -13 21 -5 4 -33 -15 5 6 -32 -25 25 -20 -25 -23 20 -30 -26 5 7 -17 -41 23 -6 -18 -26 8
3348HQo4N5N%m8L9J5k1nJ3L2o0J5K4J7n4J0M4l0nkM4l8j7K5J4k4l3O3k6Mj6J7
$$ 8 16 -48 7 12 12 -36 3 18 -3 -8 5 37 -23 -8 16 33 -21 -11 33 3 -2 -4 40 2 -15 10 24 0 -33 30 4 8 -8 9
3382IJ9m9K4QJ8n2K5J5j5loL8l6pJ0J7ll0M8j0j4l4M5j0k3lK8K1o2L2mkk2J4K1
$$ 9 28 -21 3 11 29 -23 2 17 2 -1 -7 31 -5 -12 -2 15 12 -18 30 20 6 -28 17 7 -16 -19 9 30 -32 0 -4 -6 -28 -14 7
3417Gj6j3j4M2j0j9J6J0pk7M0oj1k0M0J2m0J8QJ5m5K9K0j7k7RM7m9%J4L0m2jM3
$$ 7 -9 -22 -36 6 -4 -23 -7 3 -4 -31 9 3 -8 -28 12 24 -16 2 10 25 -20 9 29 12 -15 -6 41 -8 -8 6 36 -6 -7 36
3451C6k1k2j4M5j6k2J3L0jn2L6Lj1l2M3J8n4NK7L4o8K1K6k4j2KM4m4JLL9l7k0
$$ 36 15 -7 -21 24 8 -14 -1 29 28 -24 12 15 4 -28 15 33 -21 -16 11 45 -23 -2 24 0 -12 -10 34 -10 -9 -6 33 -4 -24
3484b4L8j0mk6L9j3k3RL0j3l3J9K0Jk9NK7k4KmL3l9%J4J9j7k9N0j5mpK6lj7J2
$$ -24 14 4 0 -26 13 0 -23 -14 16 3 -30 -11 9 10 -19 -14 13 -11 -9 -13 20 -19 -19 -5 14 -3 -32 18 3 -1 -8 18 15 -2 10
3519A0JK3m4K0J0nNj1K7m4J8kJ8k4qJ7qOl9M7rj6kJ6Rm4L3J9om1J6J2rkj7L8l2
$$ 10 11 34 -10 10 20 15 20 9 36 -8 10 8 26 2 -6 11 3 9 -30 17 8 -8 -10 6 15 -29 4 23 17 -24 -8 4 -5 -7 -24 14 -18
3556a8J0MJ7l1k0O8k2j6j9M7ol3K0Pj2l8N7mk5j9K1K7n2K3J1J0m7L8L1m2jOM7
$$ -18 -8 -4 13 -18 -38 30 8 -8 -27 20 14 -19 1 8 -4 -42 15 11 -14 -33 -12 15 -37 -14 -3 7 -40 -2 29 -13 -14 -8 39
3589C9m3lK1Jj1l3N0mk0j6M8j2k7J1K0Jn0M0Nj6j4K6K1m1RKJ5k0kJ7k7Nj2L7j7
$$ 39 -4 -7 14 15 4 -29 21 17 -3 -19 29 17 -10 1 21 22 -28 12 17 1 -13 13 34 -7 2 4 19 -1 -3 14 -13 -8 -20 17 0
3624@olJ6Rm0L2qJ4k8L0Jk5%LJ9k8PMJ2rj9K6k0Pk1M5j9k0J2J4J5m0K9mmj8J1
$$ 0 -6 -9 7 16 -24 8 0 14 -14 16 17 -8 -8 -5 14 -14 -7 -3 9 0 -19 7 -13 -6 -27 18 -1 -21 -9 5 20 -20 9 5 1 -17 -6
3661fK2m1NRM0l4NPLrj0M0k6j7OL4km3M0mOk9K9Km6K3J5J1n7K6J9nl5J4L4l6k
$$ -6 16 -25 -20 -11 29 -5 0 7 10 1 -9 31 5 -12 -6 28 26 -17 23 19 25 -4 25 27 -19 4 19 30 -27 -1 18 13 -22 -8 26 -10 -12
3698a2PL4m2lK4jok3M5j9k1NJ8j2k8L9qKj9K8J1l9J8LJ9m5K6%Kj7%L2k4nkK7k4
$$ -12 -5 29 -13 -16 8 7 1 -22 23 4 -17 -12 6 -6 -34 5 -3 -1 -20 8 19 -20 -2 1 20 -25 1 1 3 -14 -14 18 -6 -11 -13 14 -10
3735a0j4K1KNk3L4rmj2J1J0k9K5KK2m2K4J0rj3qM0l3J4j0J9rk4L1j1K3l6K5pj2
$$ -10 -24 -3 -1 4 -19 15 6 2 -10 1 11 -18 7 9 31 -11 13 23 14 1 -7 33 0 14 4 23 14 -10 21 10 33 -3 22 15 3
3770CmLK9m9J4jK2l0j0L1k2Nj9M4l2mJ5L0k5k7M6qj9j5K5kk2J5J2Kl4K0J8j0j7
$$ 3 -1 2 31 -18 -4 -5 17 -13 -23 8 -14 -9 -28 16 -16 -20 -5 25 0 -27 19 11 -8 -23 2 0 -22 -7 5 7 -27 -7 11 1 -16
3805a6PL9n0J1J2K8m0j5M5k6noL2qk7K1J6j1l0M2omk3K5Kk3K3KJ3m5J4L4pj8n
$$ -16 -9 30 -20 -9 3 31 -9 -24 21 -5 -10 -16 16 8 -19 2 18 7 -23 19 13 9 -14 11 13 -10 13 15 28 -17 -3 31 24 6 1
3840AL5l2l%J9k0j1K9j3Kl0L5j3j5OPJ0m1K9J3mk3KK9k8J6rPj5JOOmpK5j7lrJ8
$$ 1 36 4 1 1 20 0 -11 18 5 7 -23 12 -1 -16 -10 -3 7 -34 -5 8 4 -19 -17 12 -16 0 -9 -2 -17 -16 -10 -4 -8 -15 10 -7 -10 -19 -1
3879aQk2J6JJ0l4K6J6j7j5PL7l9J3qK4j5j8K4j1Nk1L7mrj1J9Nm0K4RMl7J6L5m0
$$ -1 7 -15 1 2 12 -22 4 20 3 -12 -5 32 -7 6 -2 22 7 -11 13 2 7 -14 23 19 10 -1 18 23 -17 7 16 20 -17 -1 34 -6
3915fOJ5J9l5OQJ4k7j9N0j6j2k0M1k0k6J5J4j1k5L6j0k0qK1Nj3J6qJ0k2J7K0k3
$$ -6 0 15 34 -1 5 13 27 0 -19 31 15 3 -17 24 4 -22 -7 7 -4 -29 7 -3 -23 -31 -10 -5 -18 -2 -10 0 -22 -5 15 -8
3949hkPK2l1QROpl1M4j9MnJ4Ql0J1J0Mj7J7Pmk2J7Mk6J8j3K0k5KJ9j2Mk7M2j6
$$ -8 -10 -3 19 -12 -4 5 11 4 -27 17 -2 2 -3 11 19 -11 0 10 14 -3 14 21 17 -5 12 16 -10 8 -5 15 -10 -8 11 -1 3 -24 18 2
3987BqQLJ3l5J6QNk3J9J0k0JjK2l5K2j4J3qj3J8j0jj6K7j1qJ4kQl2K3J0j1j0J5
$$ 2 -6 2 5 18 -17 -1 7 12 -11 8 18 -2 -1 -2 20 -15 7 -7 6 -2 -15 3 -7 -8 -24 3 -8 -16 -2 -4 4 -28 -5 5 -6 -16 -1
4024aJ1k8J0MJ9l3J7J2j2jJL5l0K%K2j6k1K7j1Rl1M2pk9KK1ok7K6Jkk5K2K7l1
$$ -1 10 -18 -8 -4 15 -18 -1 11 -1 -2 -1 34 4 6 6 28 12 -9 18 7 16 -15 27 20 -9 -7 14 8 -19 7 8 6 -19 3 30 -1
4060aNjK5l6oK5npoK5j8pMJ6Jl4L2loj0J8j6kMKK4l6OO%Oj8J0j0J2qJ0j2j0K0
$$ -1 4 3 28 -8 -14 11 6 -1 -7 18 0 -7 -3 13 14 -20 12 9 3 -7 11 -5 -7 -3 -1 23 -13 -7 -1 -1 5 -13 -3 -13 -1 -9 1 -11 -21 -1
4100aMok1K2rJ2j3J5pKLnJ5j8J3kRoj6J8mrJ7Lpk4L2jlk6K5JqoKRk7J5OLk0pK7
$$ -1 3 -3 -24 -2 -11 1 -12 3 -4 -2 1 -4 11 -7 6 4 13 7 -9 9 5 -4 13 16 9 -15 17 16 13 -13 12 13 5 -1 1 10 -17 -2 4 7 -13 -20 7
4143Gj6pKK0j3mK6pj0j8K8%j4mJ2J0k3J0J3pk6J3J4qpJK6l1OJ3lk0lL5j2j3pL4
$$ 7 -9 -16 -14 6 -7 -11 15 8 -2 -20 8 8 -6 -10 2 12 -11 -1 12 5 -21 -8 6 -2 -9 -8 18 -13 -7 6 3 -17 -20 15 3 -10 -17 17
4181A7k3j0J3Okk7L6Lk6jJ5J3k5RJ3J0k9J3J6j5pmK9k2MpJ7j6j1K8j5%j1K1j5
$$ 17 -6 -16 -3 3 1 -26 10 13 -13 -14 1 14 -11 -2 11 21 -8 5 21 6 -1 -5 24 2 6 -1 16 0 -11 17 2 2 -9 12 -3
4216conJ3K1m3M1pj8J5pkmNj4K4k1LJKJ8k6J1kRj9L0j0qj3J6J6k5J4r%j5J5J7
$$ -3 -9 -14 -1 20 -23 18 11 -7 8 1 -1 -5 0 -14 10 -11 -8 -7 -5 13 -13 -2 -4 5 -14 16 6 -2 -15 1 17 -8 6 -3 -3 -18 -3 14
4254A4k5qJ2J9j2j9L3j0nj4L4j0j9PJ8kk8J5MQrJ6J2l8J2nK8m0J6J6Jk6OK6k2
$$ 14 -11 -19 -7 12 0 -19 14 4 -1 -15 19 9 -10 -3 15 13 -15 0 4 12 3 19 31 -7 5 0 28 -12 4 20 21 -5 1 27 5
4289EolK4k4nK5lpk3L5j3qj0J4Rm2K9QOk4NK3k0lQRj2mPJj1rK4lk1QJ8kj9RmJ5
$$ 5 -1 -4 20 -4 -9 16 13 6 -17 18 5 -3 -13 1 10 -32 -3 5 11 -13 -8 15 -5 -8 0 9 -3 -7 0 1 -10 -19 5 2 -19 -11 7 5 -14 -5 -9 6
4331Fj9J2j1J2j4LJ7j7J4j7K6l2QOMJj8L3j5pPJ0Mj1MkPj6J2Plkj1J9j5LNMj3
$$ 6 -13 -1 -12 0 -14 -11 6 -11 3 -14 12 -20 -12 -6 -2 -1 -19 14 -1 -8 -1 9 13 2 6 4 11 -5 7 14 11 9 -2 17 2 5 10 14 1
4370ApK6j6j6%K6j9nJ5Kkk5K6nnj5RK4l4J7PNl1J0K9k0%lK1j2j1OK8k3j7K7jj6
$$ 1 -6 20 4 -12 -12 14 -5 -10 5 7 5 -20 6 1 -4 -19 -10 14 -20 -3 4 9 -22 -12 17 -3 -3 -6 15 3 -8 -2 26 3 -14 13 12 -4
4408dj1K4mj8lJ9Ol0J6Nj2JLJ7k2J6qJ7j7J3OrrnK3j5qJ2Qpj5J9%J2k2J1Rk4J2
$$ -4 -15 9 5 -13 -16 3 9 -21 -5 0 -12 -11 -8 9 -13 3 -5 12 -5 8 14 5 -4 -9 14 -1 -9 3 11 4 -11 8 8 20 -2 9 18 -6 6
4447FmJ3k6KNKlkJ7k0Lj5K1oj1N%jj5J8J4qj7K1Mj4Rj6K1j6JJ5Mj5%J6mk1PJ8
$$ 6 2 15 -11 -9 -4 -2 -5 -7 10 -10 -7 -22 -1 -7 -18 -13 -13 -14 -29 -11 3 -5 -22 -1 3 -11 -2 -18 3 -13 -12 3 7 -8 -8 8 4 -17 -10 8
4487Hj3j7K4Nk1lRJ6j8PoJ4j3kK7k1MnJ5j9%K2Jj8qJ8J1j5j2L0rqqJ8Ll2L0j2
$$ 8 -5 -22 2 7 -14 -17 -8 8 -10 -3 -9 5 -8 -10 17 -4 0 -5 10 -9 -9 13 14 -4 -12 6 17 2 -10 20 11 3 -5 13 16 -16 14 2
4525BRk4J9%j3kKJ4k8%K2%j0nK5j8jlK1qj7K1KpqMnJMJ2oj0J3pQj3J8Qj8knJ9
$$ 2 11 -13 6 6 -7 -9 -7 7 -21 -21 1 1 -9 -14 11 -7 -8 -11 10 2 -15 6 8 1 -7 -3 -8 -7 -3 9 3 -7 6 -1 7 -6 12 20 2 0 -5 14
4567A4j4PrQopJ8j3mnJ6Lj3OJ3mj6J6l%j0KJ7j7J0j9K6j4NpJlmK5j9KpJ1Kj2M
$$ 14 0 7 -2 6 0 -7 11 -2 -6 -11 5 8 -5 1 14 10 -6 10 7 7 -3 -1 16 -1 9 -10 16 2 7 0 1 -2 -6 19 0 2 -5 6 8 -4 0
4608@MRj3mJ1j0j3kK5k3KKJ0j4kJ7oj2jK9rqLPKj5K2lJpJ1mk5K3LOj9nJ6oqjK2
$$ 0 4 13 0 -4 7 -3 -16 -18 7 -16 -14 -12 -2 -16 -18 -1 -7 -19 -20 9 0 -8 -5 2 4 -11 11 8 9 2 13 9 -16 7 10 16 -3 -8 8 2 -6 -7 15
4651A5k2NQJ0j3jJ5j0nj3J7j5LPO%j8J5kPj0NJ4j8mJ1J6k2QMj8%rK2rjpJ0lj8
$$ 15 -7 -2 6 16 3 2 17 7 2 -11 6 -9 -6 1 7 7 -11 4 2 9 -1 4 18 0 -4 7 23 1 9 13 -5 -5 -14 8 -1 -2 -9 1 -2 -20
4691b0J1PQk1J1lkPnK%%NJ0j7pJ9j8QmMP%jJ4Lk4J8pQpJJ2j6P%J2j8oJ7j6jrK3
$$ -20 -9 -2 6 -15 -4 -7 -9 -2 -7 -5 -5 -5 0 10 -7 -14 5 -13 -5 -9 -5 2 2 1 15 18 -6 12 5 13 6 7 19 3 10 10 22 4 -2 15 -1 -2 -11 12
4735A2mj1QJ2j6jKJ3rqK3j8kj4J4Pj8J2Njk1NL2j8mNJ2k6NRNlqPkrLJ6j4j5J3
$$ 12 8 -3 5 17 1 0 2 15 6 -2 21 3 1 -13 1 8 -10 2 7 6 -15 -10 22 4 0 5 17 -9 -4 5 10 7 -1 6 4 -5 -2 14 0 -15 -2
4776bmjlJ8kqj3K0PpopK3k6J5PnOj9K1lpKJ2qlJ4j3Rk0RJ1j9K1j5Qj3KOkqlJ3
$$ -2 -6 -7 -10 8 6 -2 -15 5 12 5 -1 -8 15 -11 4 11 6 12 -7 14 11 4 6 18 10 7 21 8 17 -3 6 17 -2 19 4 12 -1 1 7 5 -3 -6 7
4819Gkk4J8mJ6k4M%J4jk3M7k4NJ2j0m3QP3j3n9L6j6J5j8OJ0Ql1J1Qk6jJ4M2m4
$$ 7 5 -19 -1 -5 11 -13 -9 -9 5 4 -19 28 4 9 21 11 -32 -24 49 36 -23 13 -3 12 -6 0 10 18 -13 -2 6 -20 -21 -7 35 -9
4855iJ0j4J4%jjMk6K5J1j4JlJ2j7PQNj2pK5Lmj8J4%qQqonK1Jj5kNm%LJJk8J8J
$$ -9 1 -13 1 1 0 -1 3 -23 2 13 -1 0 -3 9 -8 -1 7 12 0 -7 18 21 17 -1 13 13 5 13 5 -1 -6 15 16 1 -1 4 0 0 3 4 5 -23 -5 -4
4899dMrQJ0j6J1j0J2j1mjRoj0J9ljj7J9J1j6JJ3onJ0Kk0Q%OqkNPok5J6QjkOjm
$$ -4 0 -9 -1 9 -7 4 -6 6 -5 -9 -10 -1 -7 -17 2 -1 -2 -19 0 11 -5 -4 9 3 -2 8 10 -10 -2 -2 4 -4 -6 -1 6 0 -25 -9 -1 -2 -4 2 1 -3
4943cpJ5Jj1PkJ8j6jJ6j7Qj3K4j5ljJ1j4%J1OmpJ7j0j0NlQk7J4J3j4j5J7Qk0P
$$ -3 -10 5 6 -5 2 0 18 2 1 17 0 8 -5 19 4 1 0 11 -3 -3 8 14 10 3 20 10 0 5 2 10 -17 -3 10 -4 -19 -2 6 -14 -7
4982gKJ1j3KMPj0j1K2rj3J8LKj9OkjNQLk3J3J1pkj1K3j3lmRmqQJpjJ4k2J5j5K6
$$ -7 -5 6 -7 -5 -1 6 -4 -15 7 -2 -15 3 6 8 -11 -5 -7 -8 -3 5 8 -15 -2 9 2 0 -11 12 -1 -4 -8 1 -3 -11 -3 -2 -9 -10 4 -18 -3 -18 8
5025Hj4PlQMplRmoJ1Nj2J%J1j7J9j1Nrj3K1j0j4J6MomJ0Lkj7J4Mj4%jJ1mmkJ1
$$ 8 -6 1 -2 6 10 3 0 9 5 -1 10 15 3 4 4 15 -2 17 6 11 2 -11 10 0 -14 2 6 0 -4 6 9 7 -10 4 8 -6 -6 -7 4 0 -4 -6 5
5068EokMmJpK0Lk3J0J9lj9J6j0Rq%NnKJMk5RJ2rlj2K3nrJK6k3Lj5J5J1j5J7ko
$$ 5 -1 -3 1 -3 -2 -9 11 14 -9 1 20 17 -2 14 4 13 5 5 10 5 7 8 12 -13 -4 8 -1 -4 -16 7 2 -7 -6 20 -3 0 -15 0 11 -4 13 11 5
5111Ej0Rjj2J6OqMjRj1qMJ1rjJ2pk3J6Rj7J2j8J4Lk5J1KJ8l2K0MqOOmPnOlj4N
$$ 5 -5 4 3 -9 7 13 5 9 8 17 6 -2 2 13 4 3 15 8 -15 1 10 -7 5 -13 1 4 -21 -10 -8 10 -22 -2 2 -6 0 6 2 9 4 10 7 -7 -2
5154bJ1Mr%J0oj4QRqklMRj8RJ2j3%jJ0qM%LooM%koJ6mj4RlNj1J8rOj4J5Mj9J0
$$ -2 9 13 4 4 14 8 -6 2 11 3 1 -2 2 11 -7 2 14 1 1 0 10 2 6 6 9 3 -3 1 1 -1 -7 9 5 -9 0 -3 2 -9 9 0 6 -8 7 11 -8 2
5200BJ2Nj5Knm%jJ3k3J0j1J8jj1J3m%qJ3jj6KJ2Mk0JJ3j2jMK1k0LNRj9J1MMj7
$$ 2 14 19 4 6 1 -3 -3 -4 9 -14 -4 -15 3 2 -9 4 0 0 -8 5 4 -12 -10 2 6 -14 -13 0 -12 -13 -9 12 -8 -5 0 9 -10 1 5 9 -8
5241hJ3J8j6qQkRk0J2KmmJMj3NjJ2mkmJ7j7j4L1Nj1k4K9j4j2J8oOj4J5j0J3j2
$$ -8 5 23 7 -1 7 5 14 -6 6 8 4 0 1 5 -8 -3 -4 8 4 2 -2 15 -2 -16 15 20 9 -15 14 0 -12 6 0 6 -8 7 -3 10 -2
5280bnJ6jljnmJ0rlOj6K3j0mNj6NmJ4nJj0QNMrJ2Mj6J0J0kqMJ3oj5NJ8k0JJ2K
$$ -2 -7 9 8 5 4 -1 -5 5 -4 -7 -1 -17 6 -4 -8 -3 -19 -14 -18 -4 -9 -8 -18 -10 -5 -1 -10 2 6 -10 0 10 8 0 4 17 11 -4 1 19 -1 0 12 14
5324A4j0j5K3j3KnNMlJ1Kj4oJ2Lk1NOnkkRmPqJ6j5lOJ7j0pRpkpJ2KpkPNk0R%p
$$ 14 4 -11 12 -1 1 -4 1 5 2 13 15 1 -5 7 10 -11 -6 0 -5 -7 -9 0 -4 3 -5 11 -4 -7 -1 16 6 -1 8 1 -1 -8 4 6 -1 -3 4 9 -11 -2 -2 -9
5370imJ4kj6J3rRpJ2pkLj8K9j0mjJ4Koj3J2J4j8J3pRljPmj0J6oJpjJ1j2rK2j2
$$ -9 -13 1 -1 -17 -4 -13 -4 -11 1 -6 -8 -5 -23 6 -4 -8 -9 5 7 1 -12 0 14 -4 9 2 11 8 7 14 10 0 16 10 11 4 3 14 2 -7 15 3
5412CJrRPkrKJj3JJ5kj3J2Mj5%QOj9MJ6j2MP%l%%Rlj2J2j0kpJ8mj7J2qOj2J0J6
$$ 3 4 -5 4 11 9 0 2 3 -10 -9 6 4 -9 3 7 -8 -8 0 6 -13 -9 7 -5 -1 6 6 3 3 3 12 9 -3 9 -1 -3 -10 8 4 -13 -1 -9 -3 -15 -5 11
5457A1lj6kJ2j7J1KJ1k0OJ3Jrj1J4OnlLJpQOKj4J3Oj4MkJ1j9MQj6LlQoJ1j5Pp
$$ 11 8 -8 -10 2 -15 -4 -2 9 -11 -5 8 9 0 -11 3 9 4 1 4 5 -2 6 12 14 0 13 19 5 9 7 18 -1 3 11 -5 -2 -5 3 -3 8 -7 0 -7
5500gj2J5oJ2k1J4Lo%J5%j4%LJ0ojKlPj5J0j3J1j1J7MpOj1OrJ2on%MMj0PnJK%
$$ -7 -19 -4 -10 2 -19 -5 -2 -8 -8 7 7 -7 -7 -4 6 0 -1 1 -2 5 -10 0 -13 -2 -13 4 8 1 7 -4 2 -7 5 -1 -6 -6 -2 2 -8 -1 -6 -5 -3 -3
5544cJ1j1JlJ1j1LJjlj0L6j2nJQrqJ0P%k0JJ0Lj7J3Oj3%KJ0j9kJ8pj8ROJ2j7J4
$$ -3 8 -3 -2 -5 6 -5 -2 -1 -2 -5 -15 21 9 4 5 13 4 -4 6 13 13 -7 -6 4 7 -10 3 9 -4 -4 -2 8 -11 -13 5 -2 -20 -11 -5 7 -10 4
5586DMl2J4RLrNMJ4j9MjMlpJ1Oj0JNlmkPnlRj0pJ2mkJmNJrRjjMpJ1nJmLNj2J7
$$ 4 8 -24 -10 -1 2 -7 -2 2 16 -3 1 0 4 1 -6 5 11 1 2 7 4 0 -2 5 0 -3 6 -4 -11 1 -3 -5 -4 -8 -3 -2 -11 -2 -3 -4 0 -7 4 -1 0 -4 -1 4 -8 9
5636I%j1jPRj1jRqnNMomkJ5j4mNOj2LJjRj6LQKrJ3Mj3LPLj9J5MpJlQj1LnP%pj
$$ 9 9 -2 -3 4 13 2 1 10 2 -3 2 6 0 -4 -6 9 -5 -9 -4 2 -10 -7 -6 -7 2 -14 -11 -3 -1 -10 3 7 -6 -3 4 7 -12 3 7 0 1 -2 6 -5 -2 -7 0 0 -7 -8
5686hKL%J5qnlPlqNjKnOLmNmQk2PJ8j3%KJ4j5KnK4j3j0J7rJnOjKoNmkQj4J2j6
$$ -8 -6 -3 -3 12 4 -1 -4 3 0 -8 -3 -4 -2 -7 -1 2 -2 3 -1 7 -15 -8 10 -3 -3 -1 13 -2 0 -5 19 6 -4 13 4 5 0 6 5 7 1 6 2 0 8 -6 6 -10
5734a0J7qQpkLnKKQnj1J1KMk1QNj4NJ0kj1J9%j0kOJJ4k2oJ6q%M0m9LL3j5j6Q7
$$ -10 7 -1 7 0 -2 1 -4 -2 0 8 3 -8 3 5 9 -12 -4 1 -13 -8 2 0 -11 8 8 -2 -4 2 3 17 -5 -11 5 -3 -3 37 -12 -9 24 9 -7 80
5776H0p7N6K4j26J0P9n0p%J5mpPJ5rmJ0pKoL%JlJ0pmPMj0%QMpj6J4J0m5K3Qj3
$$ 80 3 59 83 -43 -33 46 -4 -11 -11 4 0 -7 0 15 6 2 12 5 7 1 4 4 5 2 12 5 1 8 12 2 2 10 14 7 -9 5 15 -30 -7 1 -12
5817a2jOjKj5J5Qj3J1j1J8j4kJ5j7MLQLj0PPqKOnOjqK%kLPq%Lj1Qj9K1pjo%Np
$$ -12 -13 -7 -8 -6 -21 -6 2 -11 0 -11 7 -7 -9 6 -11 -7 -4 4 7 -3 4 11 3 5 11 6 12 11 3 5 5 3 6 13 5 5 8 -3 5 -14 7 0 -1 -7 -7 -2 -9
5864ikNLQljJnNK%KkMpLnJ3j1%NqJQPk2nJ2Jlj2J3J9k2Nj%qoJ2mlMOpNrJ5jj0
$$ -9 -11 -6 -3 5 2 1 2 -3 2 4 4 6 4 8 1 4 -1 12 1 1 6 -2 -1 7 14 -8 -13 -1 0 -3 -15 -2 17 -5 0 -1 -1 -9 -15 -3 -7 -10 -6 0 -7 -2 -11 4 3 -7
5914gPPkkPRj2loJ1k1K3kKknMkJrJ0ppJ2jJoJnLRmklL%Mj1J8r%pMJ1j8J4rJ1j5
$$ -7 0 7 5 3 10 19 7 4 -2 9 -12 11 9 11 9 4 8 6 7 -2 8 1 -6 6 5 6 0 1 -4 -1 8 4 2 -1 2 2 6 -5 13 4 4 -3 1 12 -6 8 -1 10 -5
5963eJ3mnJ0j6QPlkpKomP%nOOj0KQnrK0kjJqJ7oJokQj2Q%jnQjjnRLmpN%j6J7k
$$ -5 8 4 -1 9 -7 1 8 5 3 -4 -2 -8 -12 -5 -5 -10 -4 2 -8 -6 2 -3 -12 8 6 5 6 -2 15 9 10 4 2 10 -2 6 6 5 0 8 7 6 1 10 13 9 2 7 7 -9 8 6
6015F%rkQj0%KPj4kJ2nNnJ5knPjOj5J1jjj7J2J0j3Pj1K8L0n3J1oLj3JjLjkMnQ
$$ 6 6 -3 -5 3 -7 -7 -5 2 -12 -14 -2 -7 -2 -7 8 6 1 8 7 13 -2 9 8 7 -10 2 12 -1 6 -5 23 53 0 11 5 8 -5 -4 -5 -2 -3 -5 -1 -6 2
6060B%l%J1j3rJ4pPKkjmKPQmJ3qJNj6J3Llj2%jOp%PrlMMj2MPpJqJ2pn%J7rnLJ0
$$ 2 2 -1 -1 10 -3 -12 2 -5 2 4 2 1 -3 -1 6 14 10 23 15 16 21 5 18 21 18 6 6 5 11 4 4 11 2 -1 3 7 -5 -1 6 -1 0 -8 4 -3 -8 -8 9 0 -5 -2 8
6111HmqLjOj7J0J0j4PkRrmJ1olJJ6j2j4J7jj0KKj4kJ0LQj4J7Mmj6J5MpkOPnko
$$ 8 4 -4 -1 -2 4 -13 -3 7 -7 0 -2 7 -2 -6 5 -1 -4 -3 13 1 -13 4 3 -7 -5 -3 -17 -19 -9 -6 2 -12 5 9 5 -11 4 8 1 -1 5 12 7 5 -1
6156aJ0pjPjkmPj0KKQrqJ5qj2J5jj0jLMjj2J1jrKRllJ1KlMj6K2j4J5oLjrOjmL
$$ -1 9 2 1 8 7 5 1 8 -2 0 2 10 1 -7 8 0 -12 3 2 -8 -9 -6 -2 -3 -15 -4 -5 -14 -12 -3 -6 -9 2 4 1 5 -11 11 -3 12 6 9 8 -1 5 4 0 3
6204CkmLMlKNJ%LqmJ3oOk0RJnj1QJqNJ2Mj0%RNj6JQ%J3pkrLJ7j6JnNJ2rj8Pjl
$$ 3 1 -3 0 4 1 3 8 9 9 12 4 0 13 7 13 -7 2 3 -2 -13 -5 -4 -12 -7 5 9 -1 -1 8 13 -3 -2 6 6 19 12 10 1 4 21 5 6 1 6 18 9 -9 -2 -3 -6
6254fJ2qRk3J5oqJ1J4j7%OM%Kj0RLpOkkpJ8j1qJ6qJ0l7M7N1j10L1L0k4Oj7NJ0
$$ -6 6 -2 7 -16 -1 -7 -15 -4 10 -7 -7 -1 3 3 5 -5 4 7 0 6 4 2 -5 13 2 -6 10 2 12 -25 22 73 -37 -6 24 0 6 -11 -6 4
6294DrRkLk5J0QkNpOLlpJ8j4%OnMMpJ7pj8J1J1mm%%lKKj%jJmPprJ6j8jJJ0rQJ3
$$ 4 -5 4 2 5 -20 -10 -2 -4 1 -6 0 3 0 -7 11 -3 -3 3 -2 2 6 -1 16 9 -9 2 13 9 5 5 5 2 4 6 5 5 4 5 1 8 1 -8 8 -10 -11 -10 0 -9 -1 12
6344A2j4%OKpJ9k2J2j0lJ5%j4LJ0j2NlMMmoRJj4J1KolNKrPJkqPNj1kOMkkJ1Mk5
$$ 12 -2 -2 4 6 -1 18 -4 8 -2 -5 10 10 -4 -1 9 -3 2 -1 3 7 3 -3 6 7 -7 4 6 0 -3 2 4 -5 2 3 1 -7 0 5 -6 -8 -2 2 0 -2 9 13 -12
6391a2J5O%lMRj0onJ3jpMOj4nJJ6qj2J2kLoJ0oMpJ0lj1MKkkNLj3OjMoMQj5QR%
$$ -12 3 9 9 6 10 19 9 3 -2 11 10 3 7 13 -1 -6 -5 11 3 -9 3 1 4 -2 8 2 6 -1 9 6 -5 -1 1 -1 -3 2 5 -8 -2 -3 1 -5 -1 7 -8 0 9 9
6439Ij1QoQmOj0kLMOj2kKnJ5j2nkJ0kNmoNkJ0Nj0lMJ1j5PMMk1J2JkjKK3j3nNo
$$ 9 -2 6 0 8 4 10 0 -2 1 5 11 -1 -3 -1 -6 9 -3 -8 -10 0 -2 3 -1 -7 -2 -4 6 11 1 -2 2 13 -2 5 9 13 -8 4 5 3 2 4 27 14 9 14 8
6486HpJ3j2jkJMnlPrJmJ6k1%J0l%oJ8LnoRnJ0klKrJjO%j1J7opPJ0j0qJ1Pj3qJ8
$$ 8 1 14 2 1 -1 0 4 -1 -4 3 -6 -5 -9 7 -14 -14 -4 -7 -7 -13 5 8 3 -3 6 1 11 9 6 8 -1 0 -1 5 5 -6 11 5 -2 5 15 5 -3 8 15 2 -6 12
6534A2qrkJ8rj0J0%NnnMjjjJ1Kmj1QqJ4Oj0KrPlkOpQj4KNNj0pPLKpK1j3j7K6j0
$$ 12 4 -5 -7 11 2 -8 2 2 7 2 -3 1 0 -1 -2 9 11 7 -4 4 -4 10 16 6 8 -1 6 3 1 7 0 8 -6 -4 1 6 -4 -11 -4 -1 1 -6 15 2 -15 11 1
6581AoQmj2NpRRj1J2j2J2oLJ3j2KPJ4rm%Nj3j0J8nJmjNj6J1Olj3J0qJ5oJklK0
$$ 1 -5 3 -1 -13 -8 -15 -6 3 -8 4 -8 4 -2 1 14 2 4 11 25 16 12 12 17 4 -6 12 7 8 4 3 8 -8 3 9 6 -7 3 -5 10 4 5 3 0 20
6625B0j2lj1MlRnLJ9j8ooK5k8J6j1PL1n1K3J2j2JpJ2j8QLj2KJ2opRqOj1J5okM
$$ 20 8 5 -6 -2 -5 4 -1 2 21 3 -3 -9 16 -12 4 -7 0 31 -20 3 15 3 4 -3 9 -9 -1 2 -10 -8 4 -2 -9 0 -8 -2 -13 2 -4 -6 -2
6666bJ2rRnkQNj3KNrNm%jjJ1jqPlJ0qm%oMKrJpJ5qRk1J5lokMJ0j5J2J0%rJ2lp
$$ -2 10 1 10 5 3 11 16 3 5 10 1 6 2 2 1 0 11 10 2 9 6 16 8 4 4 -2 2 4 -5 -4 -11 4 -4 5 -16 -1 -4 -10 -12 -8 2 -13 -1 9 9 0 12 9 2
6715BlLPqKlJ2k1J2J%prJ2jrNQLj5J1jPj4KOpjrJ6pJ%kLMmJ0loK4j4JlJ4qpMQ
$$ 2 -1 2 9 1 3 0 12 -9 3 4 4 -3 -12 0 -1 -10 -5 3 6 -9 2 1 8 -6 -4 2 -5 -6 -15 1 -6 -5 -5 -7 -4 0 -4 6 3 -3 21 7 8 5 19 11 4 8 16
6764A6j8NmLnQkKMj6J1JkkJ2j8kLOMnRj2%KJ5j7jNNolOmPkJjlQj0jJ2j0NPj0q
$$ 16 -2 3 -1 2 -3 5 3 5 9 -7 4 5 3 1 13 -5 -7 -4 2 6 1 10 -2 -2 0 15 -2 -3 2 7 1 -2 4 0 7 5 6 5 2 10 0 -1 11 1 6 13 3 -5
6812eKlRj1oJ6jnJ3j0LJ6krj2J0kM%knjkJ1MpMJjj5J2jJ2j2OMjoJkj8LnK0j8J
$$ -5 -3 -6 3 -8 -14 2 1 -4 9 -1 2 18 16 7 -5 5 3 7 7 5 0 -1 -3 8 12 5 9 10 9 -6 6 5 17 5 11 15 14 8 9 7 -11 -8 -13 7 -11 -10
6858a0J3%lnJ%mnJ7j3OJ1mlpJ5lKlj2J7j0MnJ6j7KP%pmJ7pnJJJ1j4Nkj4J0Rpj0
$$ -10 3 3 0 -5 -4 -4 -8 -13 4 -9 -3 8 4 1 -6 9 6 8 5 -7 10 0 4 -1 15 -2 0 7 7 0 -4 13 6 1 2 3 14 0 5 3 -11 -1 8 1 -9
6903iMjkRpJNjMKJ0lqQ%j2Rn%nPJ2j8qNJjj1J9j3M%%klPnPlQkJj1OkOj0NRj0J1
$$ -9 -5 -6 -8 1 -6 -5 0 -1 3 5 15 12 4 12 12 0 9 4 4 -1 6 18 0 -8 -3 -2 -3 -14 5 -8 -4 -4 -4 -6 -9 -2 -7 0 -3 5 3 4 -7 -1 -3 3 -7 -2 7 -3 8
6954Hkj3MNJ2n%lJ1j3J0knpRMj2%pJ0j2mJ9j0KjJ4kj6LlPqQpPljJ0oO%Qk3kJ7
$$ 8 6 -7 -3 2 14 9 9 6 17 4 14 12 7 0 9 13 1 1 -6 4 -8 -12 7 -3 -1 -2 12 10 -6 -3 -6 1 -7 1 -6 1 -2 -3 7 1 7 7 15 -8 -10 7
7000G%j0LJ4kmPj1Qj7K0l7K9RQj3%Ll6J9m8M9lQj2J1%J1j4qK6j9mPMLonLJ2rl
$$ 7 7 -3 0 14 12 8 15 4 12 -5 15 -22 7 16 24 11 11 14 -22 -3 -51 -2 -5 3 -9 2 2 13 -1 -9 17 -2 -6 1 5 8 2 -3 0 12 3 0
7042@J0%mLJ3k0MnJpRK%p%J5Jk3kPKj2J2nJ0l8M9j6kMJNj3J0%J1lrJ0JmnJ3j5
$$ 0 10 10 6 9 22 2 6 1 2 -5 4 6 6 -1 -1 14 15 -8 -10 -3 -1 -13 -1 -6 4 -34 15 -1 -3 1 2 7 -6 4 4 15 12 3 13 14 10 5 18 3
7086C%J3rpnJ7k%k3J9Lj5LQnrKONmmQpjLlNpJ1%j2J2%Nj1J5pOj4J1nrLnK0rrQ
$$ 3 3 16 7 0 -5 12 10 10 -13 6 9 -6 -3 5 0 -9 -7 -1 4 0 -4 4 -3 -4 -1 -4 1 -6 5 5 -7 5 5 10 -1 14 7 13 -1 10 5 -4 -1 -6 14 5 -4 4
7134DoLlL%mMKlJpJ3lj0NOj0mJ8mj0JQRknMOj2%OjoOMj1lQkLj9J3qmPkRk9PJ0
$$ 4 -2 1 -2 1 1 -3 1 3 0 1 -6 7 4 -6 -1 5 -5 -9 9 5 -5 -4 4 13 11 6 10 16 4 4 10 9 3 9 13 2 -1 7 5 8 -11 2 -6 -10 -3 -5 4 -25 -18 -8
7184hJ5J3j1qj1J8qMqJ4qOKj4%OJ0j0LRmmMKj3J5%j8J0nJ3j0mLojJQlj1JQojO
$$ -8 7 20 9 1 -10 8 0 4 -4 10 2 8 10 -4 -4 2 12 2 5 14 10 6 10 12 -1 14 14 -4 6 1 14 4 0 3 -3 -4 -3 5 2 -9 -8 0 -6 -7 -1
7229aLJkJ3pMnlPQj4NlpJ0lJkj0K3j0jjlj8J1Pj0J1j1OkmnOoklJ3Kj0K0mjpMM
$$ -1 2 3 1 14 7 11 6 3 10 18 4 9 6 -1 9 6 7 5 -5 18 8 7 6 3 -15 -4 3 -7 4 -7 -1 -3 -7 -12 -6 -12 -14 -17 -4 -2 -12 8 4 3 -4 0 4
7276DPKj1J8ojRpj2RJlpJ0Kj2j1J1konJ0NmJ0j6kOLlqJ1j2J9j4JlJ3lj1POJrN
$$ 4 11 13 2 20 14 13 22 15 3 12 13 10 3 13 15 3 -8 3 1 -5 -10 0 5 1 11 -5 -7 -1 2 -1 -9 2 -10 9 -5 -4 -7 6 3 -8 -1 5 6 -3 2
7321BRmKj4J9j3qMMrlJNJnLJj0NJJRkoJ3kmLj1RlJ0%mLljJQnnKkMMPqrNJ2k2M
$$ 2 11 7 9 -5 14 1 -7 -3 1 -8 -11 -10 -5 -4 -9 -6 -5 -15 -10 -9 -8 1 -1 -7 6 4 0 3 -8 1 -2 8 8 4 7 4 3 4 12 7 2 4 2 6 10 17 9 0 5 17 -5 -1
7373aOn%oKkJoMqJ2MpQjnNoJ1qQnj%Ro%J1j4J2mK%Kj9K0lj2J0JRj4l%Kj3lJ0j
$$ -1 5 0 0 -6 -4 -6 -5 -11 -7 -15 -3 1 -6 2 1 -4 1 -5 6 -2 6 1 0 0 9 3 3 14 0 12 8 10 10 12 -7 13 10 -2 8 9 18 4 1 1 3 -10 -13 -3 -4
7422dLnJ0%j1J6qNj0J2JkN%oOkJ0qn%J5j1jOj3j1J1Jlj3LPJjOLKj5KJ3j3P%rm
$$ -4 -1 -6 4 4 -7 9 1 6 -4 8 9 7 12 12 6 12 10 20 12 7 7 22 11 10 16 3 -8 3 4 1 -12 -9 -2 -1 -2 4 7 9 -6 -4 9 -4 3 3 -6 -10
7468a0lLN%mJ7j6J0jLKMKj2J8rLmLmpJ7oj3LOjjlmOjJ2nj0mjnNRklJlJ0kLkj1
$$ -10 -13 -10 -5 -5 -9 8 -8 2 1 4 6 10 12 0 18 9 12 8 11 7 0 17 11 -2 1 7 6 5 2 -2 4 3 15 10 0 -4 -5 -10 -5 4 2 -1 0 -3 7 5 8 6 -5
7517eOMJL%KrLRj2J7j2%j0K0j4ooJ1Nj6LkJrJ1MKqLpKJ1JLKj6J0LoJ1ojkPrnM
$$ -5 1 5 6 9 9 11 2 5 14 2 19 7 7 -3 17 3 -3 -9 2 7 -9 -6 -8 -7 -16 -5 -1 1 -7 -4 -11 -9 2 3 6 8 -8 2 5 -1 10 4 3 1 8 -1 -6 -2
7565bJ4pj0J0LJ3j9J7j1JknjrJ8rJqlJ3j0QoJ3oJPkjRpmOmQj3MMoj0MJ3j5PNj2
$$ -2 12 5 -5 5 8 21 2 19 8 9 7 2 1 -8 10 1 2 -6 -9 4 -6 2 -4 9 3 4 11 9 8 17 10 6 12 8 16 3 7 11 5 -5 -1 12 -3 4 9 -3
7611cKkJ1j7J8j0kN%Qj5J%KoJ5mlqJ2Oj5J7j0ONjpNKlL%p%NJj7J0L%joOq%Mkj0
$$ -3 -1 -3 8 -9 9 -1 -3 2 2 10 -5 -4 -4 -2 -8 7 3 0 -8 4 10 -5 12 2 8 13 12 5 10 12 9 12 12 5 5 10 11 -6 4 7 7 6 0 6 -2 -2 2 0 -10
7660a0J2kOlp%jmMJ0j0lJ4j3RJRqj2PQKmN%oqJ5jj0LjLnqJ8j1Pj2lJ0kK%J2lo
$$ -10 2 0 6 3 -4 -4 -5 -9 -5 5 -5 -8 6 -7 2 3 12 4 -8 -1 7 9 5 10 10 4 -4 11 10 0 3 2 5 0 -8 10 -1 6 -6 -9 1 -1 1 1 13 10 4
7707DkPj0PmJJ1j0Qj0Qj2RMj1J1mlKQLj4OMMj4J%jJj3QLMlj0QOkjjlOj3K3j4K
$$ 4 2 9 -1 6 2 3 14 4 12 2 10 -2 7 11 0 11 7 4 6 14 17 3 9 13 17 3 4 4 3 4 -9 -1 2 6 3 -7 1 7 5 4 3 0 6 -7 16 2 4
7754DJ1pL5k3m7l1P2Kj2qJ2Nj0kQkj4jONoRj1JRJqjJKlqQlLmJ3JjrLQ%jL%j0J1
$$ 4 15 8 43 20 -27 -58 14 16 4 -4 8 13 3 1 9 7 -7 -8 -2 3 -3 6 -5 -4 5 6 -2 -3 -2 0 -3 -11 -3 -6 -3 -7 6 7 6 -3 0 8 8 7 10 10 0 11
7802A1J%knKrjRlnlKlNpPMmmJ1n%NMj0jMKKLpMn%RnLpJ8j4J4j1kL%j2J0Mj6KL
$$ 11 12 12 10 5 7 -2 -3 6 3 -2 -5 -3 -6 -1 -8 -1 3 -1 -5 6 1 1 6 10 0 -1 3 5 7 10 3 7 2 2 11 6 9 2 20 6 20 9 7 10 10 -2 8 12 -4 -2 1
7853APj7LJ0j8kJ6p%kJ3pLKKNMqOrRLmlNrn%JlQKj1J0Qnj1J9j0jj%oOKoNj8J7
$$ 1 8 -9 -6 4 -14 -16 0 -7 -7 -9 4 -3 0 2 4 9 13 5 11 2 11 14 10 7 12 3 -2 -2 -1 -4 4 6 -5 5 13 8 -3 16 6 5 4 4 -2 4 6 0 5 -13 4
7902DlmkJ5rlJ6q%rQKOqJRKj0pJ5lnLqK%MmKQj3loK3j5J0j0Okj7J5LnlJ2oN%q
$$ 4 1 -3 -5 10 1 -2 14 6 6 -3 5 7 13 5 6 15 17 7 0 15 12 7 10 2 4 4 8 4 6 14 1 -2 -8 15 0 10 0 6 4 -13 2 5 0 -3 9 3 8 8 0
7951@QNK%npQJ6j4nOnJ5Jj5M%j4J0NqnqK3j5JKRp%mJoOMOj4JJ5j8pK0pNnnJ0J
$$ 0 8 13 15 15 10 3 11 27 13 8 14 9 24 25 10 14 14 0 10 15 7 2 -6 17 2 3 5 14 7 7 3 4 -2 4 8 14 0 1 16 -2 -9 11 4 9 4 -1 9 10
7999A0j8J7K%KJ%j2KKJlqKKpO%N%j0QLlklOjJ2qrPKJKqJ4mJ2k3%LkJ0KpJQj0O
$$ 10 -8 9 11 11 13 14 14 2 4 6 7 4 -4 -2 0 -7 -1 -1 4 4 -6 2 5 2 0 -3 3 2 14 6 -3 4 6 7 9 1 15 11 23 0 0 3 1 11 13 6 7 15 5 11
8049A1j1K2j4knQopJJ4j4kmMmkJ6rJJ1krJ7j1mPqJ4rPj1Nqj6K8j4J8qj2KLKJJ8
$$ 11 0 22 8 6 1 9 3 -4 -3 11 -3 -5 -9 -5 -9 -11 5 -4 -3 8 6 -3 14 3 -1 6 -2 12 3 10 -1 4 -4 -20 8 -6 12 4 -8 -6 -3 -1 0 18
8093A8j6p%LLJj2Rj2NJ5j1KJNmNpmK0kLnNMo%nnMJj0J0J1k9J6qRj2L3k6lK0k4
$$ 18 2 -5 -5 -2 1 2 -10 -1 -13 -8 7 -4 -2 -1 4 0 5 -2 -6 14 12 15 10 15 19 13 13 8 3 7 8 -2 8 19 -10 6 -2 7 -5 28 2 -1 19 -5
8137eJ8qj5J3oQMj8QOqNLj3RqJ1LoQLlLOk0QjJOjqmNNj2ORj2KJJMj2PjMnJ1ol
$$ -5 13 5 -10 3 -3 5 9 -9 -1 5 -3 2 5 -8 1 -7 4 7 1 9 12 9 12 18 -2 6 5 6 12 11 3 -1 4 9 -3 3 12 0 2 3 4 8 -4 3 2 6 1 12 6 3
8187CnmMQ
$$ 3 -2 -6 -2 6
8191F
##END NTUPLES=NMR FID
##END=
