##TITLE=1H_EC-3237(32)
 CDCl3, 8 sc, 
 17.11.2020
##JCAMPDX= 6.0         $$ Bruker NMR JCAMP-DX V2.0
##DATA TYPE= NMR FID
##DATA CLASS= NTUPLES
##ORIGIN= UXNMR, Bruker Analytische Messtechnik GmbH
##OWNER= root
$$ XWIN-NMR		Version 3.5
$$ Tue Nov 17 12:23:37 2020 Russian Standard Time (UT+4h)  she@DPX200
##.OBSERVE FREQUENCY= 200.1315066352
##.OBSERVE NUCLEUS= ^1H
##.DELAY= (6, 6)
##.ACQUISITION MODE= SIMULTANEOUS
##.ACQUISITION SCHEME= undefined
##.AVERAGES= 8
##.DIGITISER RES= 18
##SPECTROMETER/DATA SYSTEM= spect
##.PULSE SEQUENCE= zg30
##.SOLVENT NAME= CDCl3
##.SHIFT REFERENCE= (INTERNAL, CDCl3, 0, 15.7039)
##AUDIT TRAIL= $$ (NUMBER, WHEN, WHO, WHERE, WHAT)
$$ ##TITLE= Audit trail, XWIN-NMR		Version 3.5
$$ ##JCAMPDX= 5.01
$$ ##ORIGIN= Bruker BioSpin GmbH
$$ ##OWNER= she
$$ F:/spectra/data/she/nmr/H-F/1/audita.txt
$$ ##AUDIT TRAIL=  $$ (NUMBER, WHEN, WHO, WHERE, WHAT)
(   1,<2020-11-17 12:22:09.46 +0400>,<she>,<DPX200>,
      <created by zg, POWCHK disabled, PULCHK disabled
       configuration hash MD5:
       00 E9 B6 7A A2 85 ED C7 34 08 36 98 17 FE 4E 26
       data hash MD5: 16K
       5C E3 53 2F C0 B9 12 AE 7B 46 70 EE 2D 92 B7 1A>)
$$ ##END=
$$ 
$$ hash MD5
$$ C1 AB 48 61 3F 28 01 F6 D5 E7 C5 07 84 11 30 8E
##$RELAX= 
##$RELAX= 
##$RELAX= 
##$RELAX= 
##$RELAX= 
##$RELAX= 
$$ Bruker specific parameters
$$ --------------------------
##$DU= <F:/spectra>
##$EXPNO= 1
##$NAME= <H-F>
##$PROCNO= 1
##$TYPE= <nmr>
##$USER= <she>
##$AMP= (0..31)
100 100 100 100 100 100 100 100 100 100 100 100 100 100 100 100 100 100 
100 100 100 100 100 100 100 100 100 100 100 100 100 100 
##$AQSEQ= 0
##$AQ_mod= 1
##$AUNM= <au_zg>
##$AUTOPOS= <>
##$BF1= 200.13
##$BF2= 200.13
##$BF3= 200.13
##$BF4= 200.13
##$BF5= 200.13
##$BF6= 200.13
##$BF7= 200.13
##$BF8= 200.13
##$BYTORDA= 1
##$CFDGTYP= 0
##$CFRGTYP= 5
##$CHEMSTR= <none>
##$CNST= (0..31)
1 1 145 1 1 1 1 1 1 1 1 1 1 1 1 1 1 1 1 1 1 1 1 1 1 1 1 1 1 1 1 1 
##$CPDPRG= <>
##$CPDPRG1= <>
##$CPDPRG2= <>
##$CPDPRG3= <>
##$CPDPRG4= <mlev>
##$CPDPRG5= <mlev>
##$CPDPRG6= <mlev>
##$CPDPRG7= <mlev>
##$CPDPRG8= <mlev>
##$CPDPRGB= <>
##$CPDPRGT= <>
##$D= (0..31)
0 1.2 0 0 0 0 0 0 0 0.06 0 0.03 0 0 0 0 0.0002 0 0 0 0 0 0 0 0 0 0 0 0 
0 0 0 
##$DATE= 1605601329
##$DBL= (0..7)
120 120 120 120 120 120 120 120 
##$DBP= (0..7)
150 150 150 150 150 150 150 150 
##$DBP07= 0
##$DBPNAM0= <>
##$DBPNAM1= <>
##$DBPNAM2= <>
##$DBPNAM3= <>
##$DBPNAM4= <>
##$DBPNAM5= <>
##$DBPNAM6= <>
##$DBPNAM7= <>
##$DBPOAL= (0..7)
0.5 0.5 0.5 0.5 0.5 0.5 0.5 0.5 
##$DBPOFFS= (0..7)
0 0 0 0 0 0 0 0 
##$DE= 6
##$DECBNUC= <off>
##$DECIM= 32
##$DECNUC= <off>
##$DECSTAT= 4
##$DIGMOD= 1
##$DIGTYP= 9
##$DL= (0..7)
0 120 120 120 120 120 120 120 
##$DP= (0..7)
150 150 150 150 150 150 150 150 
##$DP07= 0
##$DPNAME0= <>
##$DPNAME1= <>
##$DPNAME2= <>
##$DPNAME3= <>
##$DPNAME4= <>
##$DPNAME5= <>
##$DPNAME6= <>
##$DPNAME7= <>
##$DPOAL= (0..7)
0.5 0.5 0.5 0.5 0.5 0.5 0.5 0.5 
##$DPOFFS= (0..7)
0 0 0 0 0 0 0 0 
##$DQDMODE= 0
##$DR= 18
##$DS= 0
##$DSLIST= <SSSSSSSSSSSSSSS>
$$ [...]
##$SUBNAM2= <"">
##$SUBNAM3= <"">
##$SUBNAM4= <"">
##$SUBNAM5= <"">
##$SUBNAM6= <"">
##$SUBNAM7= <"">
##$SUBNAM8= <"">
##$SUBNAM9= <"">
##$SW= 16.9725356469052
##$SWIBOX= (0..15)
0 0 2 0 0 0 0 0 0 0 0 0 0 0 0 0 
##$SW_h= 3396.73913043478
##$TD= 16384
##$TD0= 1
##$TE= 0
##$TE2= 300
##$TE3= 300
##$TEG= 300
##$TL= (0..7)
0 120 120 120 120 120 120 120 
##$TP= (0..7)
150 150 150 150 150 150 150 150 
##$TP07= 0
##$TPNAME0= <>
##$TPNAME1= <>
##$TPNAME2= <>
##$TPNAME3= <>
##$TPNAME4= <>
##$TPNAME5= <>
##$TPNAME6= <>
##$TPNAME7= <>
##$TPOAL= (0..7)
0.5 0.5 0.5 0.5 0.5 0.5 0.5 0.5 
##$TPOFFS= (0..7)
0 0 0 0 0 0 0 0 
##$TUNHIN= 0
##$TUNHOUT= 0
##$TUNXOUT= 0
##$USERA1= <user>
##$USERA2= <user>
##$USERA3= <user>
##$USERA4= <user>
##$USERA5= <user>
##$V9= 5
##$VALIST= <valist>
##$VCLIST= <CCCCCCCCCCCCCCC>
##$VD= 0
##$VDLIST= <DDDDDDDDDDDDDDD>
##$VPLIST= <PPPPPPPPPPPPPPP>
##$VTLIST= <TTTTTTTTTTTTTTT>
##$WBST= 1024
##$WBSW= 4
##$XGAIN= (0..3)
0 0 0 0 
##$XL= 0
##$YL= 0
##$YMAX_a= 6085
##$YMIN_a= -5623
##$ZGOPTNS= <>
##$ZL1= 120
##$ZL2= 120
##$ZL3= 120
##$ZL4= 120
##$ABSF1= 10
##$ABSF2= 0
##$ABSG= 5
##$ABSL= 3
##$ALPHA= 0
##$AQORDER= 0
##$ASSFAC= 0
##$ASSFACI= 0
##$ASSFACX= 0
##$ASSWID= 0
##$AUNMP= <proc_1d>
##$AZFE= 0.1
##$AZFW= 0.1
##$BCFW= 1
##$BC_mod= 2
##$BYTORDP= 1
##$COROFFS= 0
##$CY= 11.3945322036743
##$DATMOD= 1
##$DC= 2
##$DFILT= <>
##$DTYPP= 0
##$F1P= 15.9154993809931
##$F2P= -4.1035820241983
##$FCOR= 0.5
##$FTSIZE= 0
##$FT_mod= 4
##$GAMMA= 1
##$GB= 0.15
##$INTBC= 1
##$INTSCL= 1
##$ISEN= 128
##$LB= 0.24
##$LEV0= 0
##$LPBIN= 0
##$MAXI= 10000
##$MC2= 0
##$MEAN= 0
##$ME_mod= 0
##$MI= 1.114404
##$NCOEF= 0
##$NC_proc= 0
##$NLEV= 6
##$NOISF1= 3.799351
##$NOISF2= 2.8
##$NSP= 1
##$NTH_PI= 0
##$NZP= 0
##$OFFSET= 15.70392
##$PC= 1
##$PHC0= -11139.47
##$PHC1= 27.60089
##$PH_mod= 1
##$PKNL= yes
##$PPARMOD= 0
##$PSCAL= 0
##$PSIGN= 0
##$REVERSE= no
##$SF= 200.130013532006
##$SI= 16384
##$SIGF1= 3
##$SIGF2= 2
##$SINO= 400
##$SIOLD= 16384
##$SREGLST= <1H.CDCl3>
##$SSB= 0
##$STSI= 0
##$STSR= 0
##$SW_p= 3612.71676300578
##$SYMM= 0
##$S_DEV= 0
##$TDeff= 0
##$TDoff= 0
##$TI= <>
##$TILT= no
##$TM1= 0
##$TM2= 0
##$TOPLEV= 0
##$USERP1= <user>
##$USERP2= <user>
##$USERP3= <user>
##$USERP4= <user>
##$USERP5= <user>
##$WDW= 1
##$XDIM= 8192
##$YMAX_p= 0
##$YMIN_p= 0
$$ End of Bruker specific parameters
$$ ---------------------------------
##NTUPLES= NMR FID
##VAR_NAME=  TIME,          FID/REAL,        FID/IMAG
##SYMBOL=    X,             R,               I
##VAR_TYPE=  INDEPENDENT,   DEPENDENT,       DEPENDENT
##VAR_FORM=  AFFN,          ASDF,            ASDF
##VAR_DIM=   8192,          8192,            8192
##UNITS=     SECONDS,       ARBITRARY UNITS, ARBITRARY UNITS
##FACTOR=    0.0002944,     1,               1
##FIRST=     0,             0,               0
##LAST=      2.4114304,     0,               0
##MIN=       0,             -5623,           0
##MAX=       2.4114304,     6085,            0
$$ Real data points
##PAGE= N=1
##DATA TABLE= (X++(R..R)), XYDATA
0@%%%%%%%%%%%%%%%%%%%%%%%%%%%%qJ6j6J6j6J6j6J6j9K7l2L2l2L6m4M8n0N8o4
47c2O8p6Q4r2J04j16J24j36J52j69J89k11K35k65L05l54M17n03O24q13J143j886
69a208O297R96j1216P037j108j23m72M23K884m011k317O007k305p58J235l183
85a822L351q46k342J908K4q12O1J985j458r26p58L012j9m096L123J174l073O47
103h67K389o36j316j653M252Q0o533M735R14j607Q38j537J697j333j261L222k2
120A362k556K98j179K728J133l434K034p41r86R69J317l98j921N57Q55O32j384
137g14J195k74j472J591J61m75l23l56M89J799k610L18J917j820P59p45J419l47
155E12k119K471M16k117P00P68p11J372j601K3P33l57J238j685N56L24j106N15
$$ plain form
0 0 0 0 0 0 0 0 0 0 0 0 0 0 0 0 0 0 0 0 0 0 0 0 0 0 0 0 0 0 -8 8 -8 8 -8 8 -8 8 -11 16 -16 16 -16 20 -24 24 -26 32 -32
47 -32 36 -40 44 -48 56 -60 64 -72 80 -89 100 -111 124 -141 164 -190 227 -276 348 -465 678 -1208
69 -1208 5089 6085 -5131 1906 798 675 203 626 3510 -501 -2818 3189 884 126 1361 -1822
85 -1822 1529 683 -1659 249 273 -539 -478 1507 49 -877 -1635 1377 1358 -2738 385 1559 -1514 -867
103 -867 1522 886 -430 -2083 2169 2249 -4284 451 1365 -242 596 -941 756 -577 -1838 1384 1362
120 1362 -1194 -896 -2075 653 1786 -1648 386 -355 -1341 -372 945 547 -1374 -817 38 670 -714
137 -714 481 207 -1265 326 487 12 -311 -667 -178 1621 -989 -671 1246 -574 185 -560 859 512
155 512 -1607 864 1280 -837 -137 631 -80 1292 -309 -286 447 90 1328 -357 199 523 -583 -68
173f8J594r18j888J062L46P08q90J10M0j357J105J163q71r88J272j309N92J080
191G83q34J53j012J329l68m64J277q94r71J938q7k347J929M52r41r26J347J141
209A505k975Q48J997j195j690J676N47j070jk50R52o88K70K01l09J9n38L60J106
228G65J43k406J271Q90j080M71M92L02k154N55K210q37j819J596O39k049P27Q47
246E63M73j930K6K050r42r44L86J003p59l65j1J248m03j801J501N30m99r04R30
265A52P26j373n52J541P80k084O76N35k96n40J76J665j195j176O93J239j022k86
283c41Q33P2q82r73K441k35j818M56J221n10j225J140N94p36j290J747M53j590
301f43L86K51M63o38J6M60J51r05j19J166j44k40j035J299J9j553J149J111j086
$$ plain form
173 -68 1526 608 -1280 -218 128 836 -54 56 96 -1261 -156 1007 136 -852 420 -889 -297 783
191 783 -51 102 -910 419 51 -413 864 -30 -1001 937 850 -1497 432 884 -57 -983 364 1505
209 1505 -1470 -622 1375 180 -1510 166 713 -357 -358 -608 344 -344 -74 127 -182 -163 -701 -341 765
228 765 908 -1498 -227 663 -417 54 546 848 -1306 -751 1459 622 -1197 399 1038 -1011 -284 563
246 563 1036 -894 -868 1182 240 -704 -318 685 -74 -439 -450 798 395 -1406 95 625 126 -778 152
265 152 878 -495 -1047 494 1274 -810 -134 401 105 -435 -259 1406 211 -965 -272 967 -55 -341
283 -341 492 564 -318 -1291 1150 915 -903 -447 774 264 -961 179 773 37 -1253 494 947 -643
301 -643 -257 -6 457 -181 -165 295 446 -459 -578 588 444 204 -831 468 487 -1066 83 1194 108
320A08j449J538L92r71k40J468l79k139J631P27q74l57P22k06o11N01J82K11p21
339d67M82l90K17P52j121K81O16k97q18J133J62r84j18Q85M69j704J047N62j192
358d85K0J015K4r79M22K2Q9l17P17j37q57Q11m43N7N20J08r77K08O32m26M4M1
380A09O32j259N4J104m50k50O4J83n35L67j9L88l55m22M96l33N92l94o3K89k32
401c4k85M52M30q69J83K1N12n04l16Q76n18l40J01P54m66n13k2P41j1j108J050
422A34O6o42m53Q74O43j066k30P56J98j207R98O07o70l91K3R08n71K7L70mn77
443b07M2M68K28M0j179Q44K74p37L4P47J19j515M84J296m56j657J220R81j650
462f24Q9J042J94j556M21J296m93q66L77O34p99L37j3L45k3p43L25L55J36q15
$$ plain form
320 108 -1341 197 589 -382 -622 846 467 -1672 -41 686 -188 -545 177 -29 -640 -139 43 254 -467
339 -467 15 -375 -158 594 -527 -246 370 73 -745 388 550 -434 -552 333 802 -902 145 707 -485
358 -485 -465 550 574 -405 17 39 128 -189 528 391 -466 345 -98 -41 479 587 -390 -182 450 24 68 109
380 109 741 -518 -464 640 190 -60 4 187 -348 19 0 388 33 -389 107 -226 366 -28 -91 198 -34
401 -34 -319 133 563 -306 -123 -102 410 -94 -410 466 -52 -392 -291 463 -3 -516 -538 203 192 -916 134
422 134 200 -442 -895 -21 622 -444 -674 82 280 -927 71 678 8 -383 -360 548 -23 4 374 370 -207
443 -207 -165 303 531 571 -608 236 510 -227 -193 554 673 -842 -358 938 482 -1175 45 1026 -624
462 -624 -535 507 701 -855 -434 862 369 -497 -120 514 -285 52 39 384 361 -382 -57 298 434 -381
482c81L85N36n36r18J054R75j749K56Q78l90j113Q63J265j386p87J020P19j298
500f07L80P00n53m80Q2J065m38n48j12O61J22m08k6O4L86r93N97Q15p08o70M41
521b30Q98p01k87M65L78j127L88J025q35j63J25O49n62l38N95J28l82k20M88k64
541C0L4k66N91Q3j006K14N54K75q19J54J51j28J3J49M39q38nJ60N02J41o31j82
563c85M28K74n54N97j90m22q4N14N49j033K33K16k31J06L62k44m20K70j2K54m63
584b35K29j32m1L91m29L7P3L55n34J42L67m01j34L70O81j110k83R71K57q42K05
605f3N05q34K37M44L68q22k35N50k20N69k55o27R3O15m21R0N20p13m22N24J036
626I39j178l95R53l08m36M31P10j067k11P32K95o08l67P60j18k65j36N34j86k73
$$ plain form
482 -381 4 540 4 -914 140 1115 -634 -378 500 110 -1003 -140 1125 -261 -1048 -28 691 -607
500 -607 -227 473 -80 -560 -478 587 149 -399 -511 150 272 -136 -162 -98 288 -705 -108 707 -1 -671 -230
521 -230 668 -33 -320 145 523 -604 -216 809 -26 -189 -64 585 23 -315 280 408 26 -194 294 30
541 30 64 -202 389 472 -534 -320 234 509 -310 -156 -5 -133 -120 29 468 -370 -375 -215 287 428 -203 -385
563 -385 43 317 -237 360 170 -252 -336 178 727 -306 -73 143 -88 18 380 136 -284 -14 -26 228 -235
584 -235 -6 -138 -179 212 -217 -180 -107 248 -286 -144 223 -178 -312 58 739 -371 -654 317 574 -268 -63
605 -63 442 -392 -155 289 657 -165 -400 150 -70 499 244 -383 -290 325 -96 -6 514 -199 -621 -97 939
626 939 -239 -634 319 11 -425 6 716 -351 -562 170 465 -143 -510 250 132 -133 -269 265 79 -194
646a94J61K36J13r80N02M76K4n08l51Q28o3m49J92N99j002k50R83M18q43o92J245
667D45k25m29M08K08o22m62R29K73l09p32M20M50k74j32K07K12r24K68P91M0j032
688d90J49R90o47j48P5L66l26l09M13J88k79m58O48K58l70p86P33N90j036K27
708b12M60j61p47P10O72q61n14N32N84p11J49K09k11k53K91N99m70l53j76O50
728A87Rj84p4j26L62m40L15L59k76o86L55P87n29m38L63O02j006J90Q40n63m12
749c65L10O03p31l5L91qk21Q1J45m30M62j18o3P9m5k34J05O63n82k78J81M62m14
772d2q4O17n81k81L39N78m92l39K18R8l2j06M00m97qP9R2J98k68p9j31M32j37
795b6j14J6K00j60l60O83j50k70l7M36j23l91L43J42m0m55M17K5j86L6P8K44n03
$$ plain form
646 -194 -33 203 316 -664 -162 314 338 -170 -521 307 244 -205 -13 586 -416 -666 317 735 -108 -800 445
667 445 220 -209 199 407 -215 -677 252 525 216 -516 -96 354 80 -52 155 367 -557 -289 502 542 -490
688 -490 -341 649 2 -146 -71 295 -31 -340 73 261 -18 -476 172 430 60 -726 7 597 -439 -212
708 -212 248 87 -660 50 722 -139 -653 -121 463 -248 -99 110 -101 -354 -63 536 66 -287 -463 187
728 187 196 12 -62 -188 174 -266 49 408 132 -554 -199 588 59 -379 -16 586 -420 -230 610 47 -365
749 -365 -55 548 -183 -218 173 165 -56 25 170 -260 202 84 21 100 55 -179 -74 589 7 -271 -90 372 -42
772 -42 -126 491 -90 -371 -32 546 54 -285 -67 31 -1 -107 293 -204 -212 -133 -41 157 -111 -190 -321 111 -26
795 -26 -140 -124 76 -84 -444 239 89 -181 -218 218 95 -296 47 189 149 -306 111 136 -50 -14 64 308 -195
818a95L9K53K66m73q4L37j57j3q6M83m16k81K88K60k4m31J93O2J10l34L30K45
840C72n54q0L11N15p17r2N12k1n78K33P51p16k76L40M38n40k04O40k32l03l8N30
862B91k49j48j4Q2J74m10K25J03J43n38mO49j39n17Q0P63p43k25P05J86p36k39
884e61J019l16m99K84N24o13k60O63pj96l28M53n7j43N8K5K13l47n8J64M60n42
906f4k35N70p4l73o1Q15m98n64M35M96m71l92P33k03l74QN93j43n53K98J46Jk91
929b01K94Pj00j63M4M75l67q8kL22k19k25M08K9l14k65O57j72k51J8K23k8m40
952c58M01J31j04m11K56K52k57j2L5K96n12R8L36Kk61r2L65k06M5l6K50k30j42
975a54K25l2K20l45N9Q9N8j86O0L42l48j54R8M81m60j68M39j23k69J0N66l99k09
$$ plain form
818 -195 -156 97 363 -110 -194 143 -14 -27 -113 370 -46 -327 -39 221 197 -234 -41 21 131 -203 127 372
840 372 -182 -262 49 564 -153 -245 267 246 -332 -99 652 -64 -340 0 438 -102 -306 334 102 -201 -239 291
862 291 42 -106 -120 -38 136 -274 -49 54 197 -341 -345 304 165 -352 -272 491 -252 -477 228 414 -322 -561
884 -561 458 142 -357 -73 451 -162 -422 241 234 38 -290 163 106 -37 21 46 259 -88 -146 18 478 -64
906 -64 -299 271 197 -176 -237 578 80 -484 -49 447 -24 -416 317 114 -260 -252 341 198 -355 -57 89 90 -201
929 -201 93 100 0 -163 -119 356 -11 -99 -101 221 2 -223 185 214 -100 -365 292 120 -131 -113 110 82 -358
952 -358 43 174 70 -341 -85 167 -90 -102 -67 229 -283 -185 151 153 -108 -200 165 -41 4 -32 218 -12 -154
975 -154 71 39 259 -86 -27 62 120 -66 -6 336 -12 -166 -68 413 -47 -215 224 101 -168 -158 408 9 -200
998b00J63J71j42j52L66k92L5m9J04O2Jj45k03M74j99j18ML41k97l87P37m4m06
1021a76j26O05k76l85M00K26k96l71O07j39j68N6J06j5k54J99k0K46k55j14J14
1042c6J67o0l35M84j39l46O3O06j84o04M10K04j84l82O17j3o08J76M16N0n36K50
1064A6J26o3k34J74K51l59Nj7M01k34k46K30J38j84l55N16nk62j44M40j7n12L18
1087a7K42r4n48L07L13j91j86J31L39n48N6L72J08n29j67O08q8k02m0M01l98j24
1109b55L93O8j88l99L94R0k6j72R0J36k32M6J02K71n50j2M31K7l32r2N75l28k35
1132a98J91L34m03k25N79p9l16j27N36j14l00J43N1o3j65L81j68m5j46RL25o1
1154A39j58k93M23n3j80J70J88m02l06P77n3m07j36M16j01k59M18r0k29j57M12
$$ plain form
998 -200 -37 134 -8 -160 206 -86 -51 -100 4 66 67 -78 -281 193 -6 -124 -120 221 -76 -463 274 230 -176
1021 -176 -302 303 27 -358 42 268 -28 -399 208 69 -99 -43 63 48 -206 -7 -27 219 -36 -150 -36
1042 -36 131 71 -264 220 81 -265 -202 404 220 -384 26 230 46 -336 281 268 -340 -164 252 302 -234 16
1064 16 142 79 -155 19 270 -89 -84 -101 300 66 -180 50 188 4 -351 165 160 -102 -246 194 177 -335 -17
1087 -17 225 131 -417 -110 203 12 -174 -43 296 -252 -196 176 284 -245 -412 196 108 -94 -134 267 -131 -255
1109 -255 138 206 18 -381 13 103 77 -95 -5 131 -101 -55 47 318 -232 -244 187 214 -118 -210 365 37 -198
1132 -198 -7 327 -76 -301 278 199 -117 -244 292 178 -122 21 72 9 -156 225 57 12 -134 -125 200 139
1154 139 -19 -312 111 58 -122 48 236 -166 -472 305 252 -155 -291 125 24 -235 183 93 -136 -293 119
1175A19Jj54k0q8K39j11M9j17J47q5j02K10j7p2k64M48Mk88p3K11J75l84J96Q0
1199A04j07k45M05J81m64m1R5K80k41Q9l1j31Q5J5K44j60j30k18L90J56l14k8
1221f6O7R5k51L37M5k70j87K09L35l47m6k1K42j82j01K84r1k35l9N14k75k89J41
1244a31L03j35l10L61j37m3MJ93o2k24N9R5K99l25j27J01K21j27j33L46k50k10
1266b32J21N46l25m20K78K23n3l00L68q4l68O4M78o2n09K68O3J6j10O6O5j80R4
1289Gp9K54j86j11K0L11r3l96L19J55j88k83M84m7m97K80L64j89n28M45J71k35
1311b2j01J80K9l39K68J27Ml22kK32M9m8k63K45r5k8M1J95p8m18K57K54m4l92
1335b71K35J62k62K3K23J27n25J94K87q3k61P7K91k58RL1J83k08n2J97j9m7k19
$$ plain form
1175 119 120 -34 -54 -142 97 -14 35 -82 65 -20 -122 88 71 -1 -265 183 187 -101 -174 37 212 -172 24 104
1199 104 -3 -248 157 338 -126 -167 -72 208 -33 56 25 -106 -21 -6 238 78 -52 -270 120 276 -38 -66
1221 -66 1 96 -155 182 227 -43 -230 -21 314 -33 -79 -100 142 -40 -141 143 52 -183 -222 292 17 -272 -131
1244 -131 172 37 -273 88 -49 -92 -88 105 43 -181 -122 -27 272 -53 -180 -79 142 15 -118 228 -22 -232
1266 -232 -111 435 110 -310 -32 191 138 -162 206 122 -246 -182 296 234 -275 -7 56 72 -38 28 93 -87 7
1289 7 -72 182 -4 -115 -95 216 123 -273 46 201 13 -270 214 167 -330 -50 314 125 -403 42 213 -22
1311 -22 -123 57 86 -253 15 142 146 -176 -178 54 103 55 -208 37 -58 -86 -45 150 72 -346 -89 165 121 -271
1335 -271 -36 126 -136 -113 110 237 -288 -94 193 110 -151 -74 217 -41 -32 -1 182 -26 -78 119 100 53 -166
1358a66K93K9j25j49J39J46k30R3J0O5k91J06K89j30j93o8L29j50n6N9J15j99
1380h4j54M10l9j82j54K97k2j78J35M2n5k13K78pl6j19LJ50j10K9r9K28j18j51
1404a49Q9J68p5k99L69mk28p1L38J0l74J94J15n7k34L12K9k39L3R1J45k05M8k8
1428b2P7k0o8J26l4k1k25L33N7k41p6K05P5l69K40J93j56l32K75K39l57K5J57
1451H1P2l54J40K10j06j04l2K14j66J4m5J51m0k08J41J05K0l12J96J57j61j36
1473a63J84K03m29O6K46O0l23L1L02k02j21R9K91k95j42J96J04j13j51K96q7j44
1495i2m2K32L6k44O9O7Q5k56J39J65j14j66L7L03k12q7O5K13k28j28L12j0k00
1518e6j67M15m7k63O8K04r3k84L05O4j44j99K10J20k40Q8K5Q7k25M9J07M3p6j58
$$ plain form
1358 -166 127 156 31 -118 21 167 -63 30 40 105 -186 -80 209 79 -114 -182 147 -3 -59 0 115 -84
1380 -84 -238 172 133 -49 -203 94 72 -106 29 71 16 -197 81 74 38 -81 -78 72 -38 -9 -108 120 2 -149
1404 -149 -60 108 33 -266 103 99 -129 -200 138 148 -226 -32 83 26 -208 104 133 -106 -73 18 163 -42 6 -22
1428 -22 55 35 -33 93 59 38 -187 146 203 -38 -114 91 166 -203 37 230 74 -258 17 256 -101 -76 81
1451 81 153 -201 -61 149 43 -61 -93 121 -45 -31 -76 75 35 -173 -32 73 93 -219 -23 134 -27 -163
1473 -163 21 224 -205 -139 107 167 -156 -125 177 -25 -146 -47 244 -51 -193 3 107 -6 -157 139 52 -92
1495 -92 -134 98 134 -110 -41 26 111 -145 -6 159 45 -121 -84 219 7 -80 -15 198 -30 -158 154 144 -56
1518 -56 -223 192 145 -118 -50 154 61 -223 82 146 2 -197 13 133 -107 -19 6 93 -132 -83 24 67 -9 -167
1542a67K25m7o4r2K78n3l03J59J94n0l16L10N6k47l2K50R6m00J47J40l8j73J39
1565A2J21k04J7KJ74j23m4j9Q2O2k01J44N4k6k25K07J61k42n3J56J34l48J39K16
1589A96j44j92J22K28k56M3N0O8j78oK08q2l7j27J51j4k0m9N4P7k33Q3R3R6k63
1614a32J3K36j14j16L7K66k66p9J45J31j64j24K94r6r5m4K14n1j63R7M8M1j85
1637a07J51K1p4r2P6J81j77l8j2J84j30k4J34k8j21j42L56k1k05m5K29j2k73K25
1661E6R5j15k45K71J24k46j7J06J36k45P6O3mj05pJ73j08k0p8J95k9j62N7J09
1685H0J4k73J94O6j04j30K28J43m03K9K03R5l11J10J85k22q1J86K34l41l7R2Q9
1708D6m6r9J26m1K6j20J76O2j86o6J63J76l25K5J62%j89J37J94k81n4J15K13k77
$$ plain form
1542 -167 58 11 -53 -145 133 80 -223 -64 130 80 -236 74 130 -117 -149 101 197 -203 -56 84 46 -127 12
1565 12 133 -71 -54 -52 122 -1 -45 -64 18 80 -121 23 77 51 -174 33 194 -48 -101 55 189 -159 -20 196
1589 196 52 -140 -18 210 -46 -3 47 115 -63 -69 139 57 20 -107 44 30 10 -39 15 92 -141 -58 35 131 -132
1614 -132 -119 117 3 -113 -76 190 -76 -155 -10 121 -43 -167 127 31 -64 -108 106 55 -108 -11 37 78 -107
1637 -107 44 65 -9 -101 -25 156 -21 -59 -71 113 -17 -41 93 65 -56 -198 158 137 -68 -113 116 104 -169 56
1661 56 151 36 -209 62 186 -60 -77 29 165 -80 -4 59 55 -50 -57 116 8 -12 -90 105 76 -86 -29 80
1685 80 94 -179 15 81 -23 -153 75 218 -185 -156 47 142 -169 -59 126 -96 -177 9 243 -98 -135 -43 46
1708 46 0 -99 27 -14 12 -108 68 130 -56 -122 41 217 -108 -83 79 79 -110 27 221 -60 -114 1 214 -63
1732f3m1K08l9j20m0K48j59o1O5J46j39j89K20M2M5k09N2O6k6mlJ79k71n4J88
1757D1J90k44j66K66l5q1l2K19j92j29J77J07q0k20J68K1kq0P8K6k02J38Q4L6
1781H8k47P5J23k1l2p5J56j09L2l0J07l7j98J82J26p7k82K62J26j78n3J15K5k52
1805a74K09J29q6k07N9J87o0jj10Q7r8L9J03Ro1j65J94J7Lj58O8R1j20M0L1R4
1831A20k64J03K03p5k37M4K74k22j2J18O5k32J0K35j09o2o7J80m2o5n3N6J41j55
1855d6M1J4Mj74J07K55j64j48k6K37j16k7J36ok03l5L21r8j34m2K37o8j59J51
1879E7kn4j16K48j9j33o3O6J73j53rk0J21j49k7J84j8j29r2K96j14j79P6K02p3
1904G3k35K13nj02n6J91N9k76N6P9J31k22Q4M1n6n2M6J68k10j3L0J66q2j24Q3
$$ plain form
1732 -63 -104 104 65 -55 -95 153 -6 -67 -2 144 5 -184 36 78 123 -86 -34 32 6 2 -1 178 -93 -147 41
1757 41 231 -13 -179 87 52 -29 -61 158 -34 -163 14 121 41 -179 -11 10 8 -72 6 32 -170 -32 52 88
1781 88 -159 -84 39 18 -14 -89 67 -42 -10 -40 67 30 -168 14 140 63 -219 43 169 -9 -62 53 78 -174
1805 -174 35 164 78 -129 -70 117 57 56 -54 33 -65 -26 77 86 25 -140 54 71 74 -84 -16 75 -45 -5 26 120
1831 120 -144 -41 162 87 -150 -106 168 -54 -66 52 117 -115 -105 130 21 -41 -108 72 30 -35 -88 -32 109 -46
1855 -46 -5 9 13 -161 -54 201 37 -111 -137 100 -16 -43 93 87 -116 -151 170 72 -62 -104 133 65 -94 57
1879 57 55 1 -115 133 114 -19 -82 -16 157 4 -5 -25 96 -53 -80 104 86 -43 -135 161 47 -132 -56 146 73
1904 73 -162 51 46 -56 -112 79 138 -138 -82 -3 128 -94 -10 31 -25 -77 -31 137 -73 -86 -56 110 28 -96 -13
1929a3JL7j80K46k6j77m8K34K2k50N0J88q6j65J69J28j63p5J04J41k21J3J28J3
1953G0r3m6J71j09K5l8J08m3j07O9M4P2k15O9R2nj31O4J58k25oJ26J24k60l7K05
1979H2m7r2nJ93j75p0J05R6p8j32J54k8J2r0R0L0q0MKJ34j55j5P4P2j21p0K16
2006A06q5q8m1K27j09j30J22O4o3j16J96o2n7m5R4M1j44J03K0L3j57P2R0l9l7
2031en2J69j08l3J8J05n6j44J61K8l7j72J96L2j64J1J25M0k50J25Q7k8j29Q4J09
2056A12j84K6M0J26j45n1P6QNj20J53pq0o9J31N7j78O0O8L3j69O2J38r4j26J17
2082a1J60k38j3J49N6j78j9K24j32o4jJ81j13o8P6L2j2j43J48L2kj49L9J24j19
2107d1QN7J33k40j2J75Qj22m1K18j56n7O6J60j31j32J79j4o2q9J94m8j16M5N6
$$ plain form
1929 -13 -12 25 -155 91 65 -112 -160 74 96 -154 -104 84 -2 -167 2 130 -33 -108 -4 137 -84 -71 57 70
1953 70 -23 -69 102 -7 18 -20 88 45 -62 7 51 123 -92 -23 69 64 -67 -3 155 -70 -76 50 174 -86 -123 82
1979 82 35 -57 -62 131 -44 -114 -9 87 9 -123 31 3 15 -75 15 45 -35 -31 -29 105 -50 -65 9 81 -40 -110 106
2006 106 21 -67 -108 119 10 -120 2 66 3 -113 83 21 -36 -81 13 54 -90 13 33 66 -91 -19 71 32 -5
2031 -5 -57 112 4 -29 -11 94 38 -106 55 83 46 -126 70 102 -62 -51 74 114 -136 -11 76 48 -81 3 112
2056 112 -72 -46 -6 120 -25 -76 0 8 13 -107 46 39 -41 -110 21 78 -100 -40 28 61 -108 -46 92 -2 -128 -11
2082 -11 149 -89 -102 47 103 -75 -94 130 -2 -66 -67 114 1 -67 9 41 29 -114 34 66 64 -85 -46 78 -41
2107 -41 -33 24 157 -83 -95 80 88 -34 -75 143 -13 -70 -4 156 25 -107 72 58 -4 -93 101 53 -63 -18 38
2132C8K4j56R7K0K2j05pJ27o7m7k4K06j36j10Q0J21q9j46K43l6j17o2J87K0j79
2157i6R6M0j2j64J61P0r7m9K5J04j42O1J6L3r8j9J24l2qj02J55k9q2J1J00J6k11
2184a29J35P2l8j56J39R8j76RQ5Q8k02M0J04k9n5m2J43j17K3k3J04l8j03N8J1
2209AN6j35Q2Rj1o9N0J23j61oN2N5j25OJ53p6q0MJ79j26o4J01M0q9j07J85j5k8
2237Dq5R0K3p7L3QQ9j61L2P9M0j01p5J99q6m5k2J49r6j11J56N0p1j44J96l9p1
2264c6K2Q0k2j66J36M6j5j13P2P9r2j9k4J34r0OJ4N9q6q4J89k5o7j30J85K0j48
2291g5L5P6J1j98J70P2r2j29J08J26j68L9QL4j08N8J01o9n1l7J70m5n2k7O2Pj10
2318h4J22K4m2j46J62Q8j48n3Q5J24k05M3J01j9j34L6J98j42q3L7J47j11m5Q7
$$ plain form
2132 38 62 -94 3 23 45 -60 -67 60 -7 -54 -78 128 -8 -118 -38 83 -6 -152 91 55 -62 -124 63 83 -96
2157 -96 0 40 28 -136 25 95 -2 -51 -26 78 -64 -3 13 46 -52 -71 53 21 13 -89 66 37 -45 -34 66 82 -129
2184 -129 6 78 40 -116 23 121 -55 -46 39 127 -75 -35 69 40 -15 -57 86 -31 -8 -31 73 35 -68 -10 1
2209 1 57 -78 4 13 2 -67 -17 106 -55 -61 -9 46 -79 -73 80 4 -76 -72 107 -19 -83 18 58 -31 -138 47 32 4
2237 4 -81 9 32 -45 -12 -4 85 -76 -44 35 75 -26 -101 98 12 -33 -55 94 -2 -113 43 93 22 -122 74 35 -36
2264 -36 -14 66 44 -122 14 60 45 -68 4 83 -9 -28 -52 82 -8 -2 12 71 -15 -99 90 65 -2 -132 53 73 -75
2291 -75 -40 36 47 -151 19 91 -1 -130 -22 104 -64 -25 -17 17 -91 -33 68 -1 -52 -89 81 36 -16 -43 19 26 -84
2318 -84 38 62 20 -126 36 124 -24 -77 8 132 -73 -30 71 52 -82 -46 152 10 -73 -36 111 0 -45 42
2342D2j4j2n9J10n1l7m1P8Q8j29j6K4J00j24M6Q1r2p6M9J91j64o5N8R2q3p8J59
2369G7q2m9k5J68m4j38L9Q1L2j37R1k3Jl4M0O9r9j6j2J46p8q2O6N5l1r8J61o0
2397A8q2K3J49n5j66J20N9j0j04Q9lq7L2N7N5j73K6O3O9p8m2R0o7K0l2J10p1q4
2425g4L8J00K7j91P8N7Pj15Q7P4j66L3Q5O3j86M9J05o0n2lR9j00K3K1N4o4q3J02
2453HL0%j39R1L6l6k2L3O2j57M7Q2N5j77lJ66n0n5lJ37j47l5J27M2j06q2J65l8
2481C1k2l3O6kq1O5J3L1j37N8P7nr6j7J54j07m1L3J03j25n3J64k1q8q1K05m4j00
2509e3K8Q3l6j39J61K5o1j04J14O7j04pLP5j11L2O7op0m7J52m4n3m1J27l0j24
2536i6Q5O9m9j37J56M2r6m4R2O1j75O8O1J2j24N3J04q4k3J9J13j07k3L5L6j8o9
$$ plain form
2342 42 28 16 -43 67 16 -21 -62 16 104 -25 -41 -17 83 -41 5 86 -6 -82 -33 158 -6 -71 -13 79 -4 -82 77
2369 77 -5 -54 -79 89 45 -93 -54 27 59 -78 13 -10 -9 -43 -3 66 -33 -49 -61 85 7 -75 -9 46 15 -83 78 18
2397 18 -64 -41 108 53 -113 7 66 56 -48 41 38 -49 -17 40 95 -78 -52 11 80 2 -40 50 -17 3 -29 81 10 -74
2425 -74 -36 64 91 -100 -22 35 42 -73 14 88 -78 -45 40 103 -83 -34 71 11 -41 -44 55 -45 -22 -1 53 -11 -94 8
2453 8 38 38 -101 -10 26 -10 -32 1 63 -94 -47 35 90 -87 -90 76 26 -29 -32 105 -42 -77 50 92 -14 -96 69 31
2481 31 9 -24 42 40 -41 24 37 68 -69 -11 66 61 -35 -52 102 -5 -46 -13 90 -35 -88 76 55 -33 -114 91 47 -53
2509 -53 -25 58 22 -117 44 69 8 -96 18 85 -19 -26 -23 52 -59 -27 40 34 -36 -83 69 25 -28 -69 58 28 -96
2536 -96 -11 58 9 -128 28 70 -26 -70 22 83 -92 -24 37 49 -75 -22 82 -2 -25 -6 107 0 -23 12 48 30 -39
2563c9R1j3j5q0J02M9j20MN0O5j65O8P5n2q6N2J24j46nM6P0j09j6J01m5k6l5J18
2591F3n3l6mL8L9r9N0J9L0j13M2Q4n5m5MJ19j22j6O8N2j04m8J57o0m9j5J17o3
2619@o9P2L0rj00R8J0l2l3K5Q2j01NJ5Q6r5mO1Ll9n9J48n7o0lR4j3j27J01J9m0
2650Hq7J19L0j03J2K3N0j09N1L4j2m9kR9n1k5l4R9m3n6M0L3rj17J29K6o1p5R8
2679A8N7j43L4O6K9j38M9J01o7n9K0J22j38J0N0N0p5l8Q5l3j0l9R6j6p5NO0O7
2707H8j46M8M6Lr2M9J12j15l4L5J27j37l4J00jo2m4J52q1n1J2Q9l8q1Q0j0lp9
2735f7Q5Ol1l8J9R6j07j6M3P2j10l4J44m8l9l1J28q6o8Q6M7m5j06J30mk8m7P7
2763B8J8j16N4K9L8j04L5M5om5j3R8p1j2j9R9m5q2Q0K1j6j04J27K3r8kP5K6j24
$$ plain form
2563 -39 52 39 24 -56 46 95 -25 -21 29 94 -71 -3 72 20 -66 -14 110 -36 -41 5 75 -34 -50 51 6 -20 -55 63
2591 63 10 -26 -30 8 47 -52 -2 17 47 -66 -24 60 5 -40 -36 83 -39 -55 13 65 -39 -87 70 10 -39 -54 63 0
2619 0 -69 3 33 24 -76 22 32 0 -33 -8 74 -27 -22 -7 79 -16 -20 41 44 5 -54 94 37 -23 -26 68 55 -72 29 48 8
2650 8 -79 40 70 -33 -21 2 52 -57 -6 28 16 -33 -35 64 13 -12 -46 53 10 -46 -6 27 18 -99 30 56 -5 -80 18
2679 18 75 -68 -34 32 61 -77 -28 73 6 -53 -33 89 -49 -39 11 61 -14 -52 33 0 -10 -49 47 31 -44 -39 21 88
2707 88 -58 -10 36 39 -53 -4 108 -7 -41 -6 121 -16 -50 50 49 -13 -57 95 14 -37 -25 64 26 -55 25 15 12 -67
2735 -67 18 24 -7 -45 -26 70 -37 -53 -10 62 -48 -82 62 14 -25 -56 72 -14 -82 4 51 6 -100 30 26 -2 -49 28
2763 28 46 -70 -16 13 51 -53 -18 27 21 -24 -37 61 -10 -22 -41 58 13 -69 11 32 16 -88 39 62 -36 -38 37 63 -61
2792f1P8L0k3p3N4P3r4JJ2P7q6kM3%l8m3J01k4k9n0P0L2j06M7J2L8j32P5M8l8
2822hn2M2J04j30K6K3O6r9m5J33p1l6J9R1n1m6K3L0K0q5N5jL5o8K5M2p7PK1R8
2852I1j24j2O5M2o0m2J20q5l8J0J04o4p8Q7K3j5q8J06j4n4OK9M2q6K4L6N1r5j7
2881c6P3ol7m7J35q3n0M5P6n0j21J22J0m2o5J15j0r7M7M8Qj34Q1M5oo0mQ8q1K4
2911a2LP0r1l8Q2L5l4q9J05jm2j6P3K3j42O7O7mj34P0R2p6k4J3O7j19M6M6Qq4
2941c9k2J10l3k2l5P1j5m2L2K0Lj08J05M2n4p0M1P9q1PK1M7j23M1J00l6q5j7J28
2970F5o3l4K9L7n7m3J11k0m1n8Q9Om6JKN4p6K2L3J2p4%J23o0n5j9J39q0l8N5J6
3001C0l3n6J19k0p9J7N6K1q6M5mMo3J09Op8l1J8P7l6j7m7O2p5o9K19j07L7j55
$$ plain form
2792 -61 17 47 24 -49 5 78 -16 -15 -3 74 -12 -14 29 29 -9 -52 49 25 -4 -54 16 48 -58 -11 1 39 -93 -18 30 -8
2822 -8 -60 -18 86 -44 -18 5 71 -28 -73 60 -11 -47 -28 63 12 -34 -11 19 39 -46 9 8 43 -25 0 42 -35 -28 -7 91
2852 91 -33 -45 20 62 2 -40 80 -5 -43 -33 71 7 -71 16 39 24 -64 42 28 -26 -20 9 51 -35 -11 25 76 -19 -36
2881 -36 37 31 -6 -53 82 -1 -51 -6 70 20 -101 21 31 -11 -76 39 29 -68 -21 27 35 -99 -18 27 21 -39 -43 45 -36 -12
2911 -12 -9 61 -30 -68 14 49 15 -74 31 30 -12 -28 45 68 -74 -7 60 56 -78 -8 84 8 -16 -3 64 -55 -9 37 45 -39
2941 -39 -61 49 16 -6 -41 30 15 -27 5 25 28 -80 25 67 13 -57 -16 63 -18 -11 10 57 -66 -25 75 39 -46 -63 65
2970 65 2 -32 -3 34 -23 -66 45 25 -16 -74 15 21 -25 -24 -22 32 -44 -22 11 23 -51 -51 72 12 -43 -62 77 -3 -41 14 30
3001 30 -3 -59 60 40 -39 -22 34 55 -31 14 10 14 -49 60 66 -12 -43 -25 52 16 -1 -48 14 -61 -130 89 -18 19 -136
3030a36J93L2j30L4J4P7j45J00rl3m9P8L1q6J2J4P1r5nM0opm0Q3m9j5k0Q0Or6
3060e6L2K8K9r8P2K4o7j1M3Q8j20kM3M4p3j4R4n7l8K4Q6p3k9L5M1qp9P5j3jn0
3091c1M6M3r4J8J3Q3j19J1O9K0j07K6J23j05Rj7J09j06o2J62j11roP7j2o4k8O4
3119BM5j12O8KK4p5L2L9m7jj6J05q7l5N0M4n6o3J16j9n9j5J00l4q2P0K6kq9Q4
3149A5K1l8k7L4N7q9L4OM1n3k9P1j1k7m1R6l7m7J9N5jj11P9L1k6q9Q6M4r5kM9
3180A5L0j06L5N6j8m0JQ5q1oJ3O7m9n0N7Q%o4O8mk7k0M0M9j03J7K8M9r3QQ0m0
3212El6KQ7p9k5M8K6l5m9Q4l2pk8O9qn8K1K6L6r4M7K3Pm9MP6o8nJ0P1o4n0P3J3
3246D1m4m7J08j9n7QN4j1q6P7Mj9o4N8L4m4%oM0n6QJ9L0l8n6Q9j3k1m3R3k9o1
$$ plain form
3030 -136 57 89 -41 -7 7 84 -61 39 30 -3 -52 26 57 -29 -17 -3 68 -27 -32 8 2 -5 -45 38 -11 -26 -46 34 40 -56
3060 -56 -24 4 33 -65 7 31 -36 -47 -4 84 -36 -38 5 49 -24 -38 56 -1 -39 -15 71 -2 -31 4 45 37 -42 33 20 19 -31
3091 -31 15 58 -36 -18 -5 78 -41 -30 39 59 -48 -22 101 -4 5 -12 97 -9 -71 91 -20 -29 -35 42 30 -34 -62 2
3119 2 47 -65 3 5 29 -46 -14 25 -22 -23 -39 66 -21 -56 -6 38 -18 -81 35 16 -43 -58 42 8 -74 -4 22 20 -69 15
3149 15 36 -2 -29 5 62 -27 7 13 54 1 -28 43 32 5 -36 60 23 -24 -5 50 49 -62 17 48 22 -67 19 63 -32 -34 15
3180 15 45 -61 -26 30 12 -28 -27 58 -23 -29 -16 51 2 -48 9 17 17 -47 21 17 -10 -30 10 59 -44 -27 1 50 -43 -35 45 5
3212 5 -31 -29 58 -21 -46 2 28 -7 -56 28 -4 -11 -39 30 22 -36 -15 11 47 -47 0 23 30 -19 -15 61 -7 -12 -2 69 5 -45 28 41
3246 41 -3 -50 58 39 -18 -10 44 33 -53 24 28 9 -55 3 37 -7 -7 -13 27 -29 -21 -2 28 -10 -66 23 10 -11 -54 39 10 -51
3278e1L7M5Mj05Q7K5m6n2N6M8q5K4K2L0r3L1N6l1j9k5Q0p1K4j2N1j3p2O7Okq2
3309f6Q6L0o1j3L6N4j08M7L5no4J7R1o9j8JP5p4k5N5Mj3n5Q5l0j8l5N5J4p3L4
3340hJ5K6q8L7N0k4n2K0Q7q8k4M6N5o8m0R1j6l4l2R4k6n7K9K0J6q2P3rPn7K6N7
3372D4o2j%N7o6jL2L1n0m0J00l5l3LQ0m3m4N0K0k0q0Q4J8n3lL8K6r1M5K2J1n9
3404b0%O2l4rk3P9n6k7J8K6np6P8K1l0o8P4L2q3J6K8K8j01N1N4m7k7J5P5p6Pj
3436a9M8l7j5M5%oo2P2%l6j9K6M4p5L9J4J4p2L0N7n5k1JQ8p9rM8J2m2k1Q1l4l4
3469a7pN8%o1M0MJ7n4M6Jj7k9NQ0p3j5J1O7n6m2P3l1l1k3J05m2n0J4N0j2p2O3
3501Boj0m0N4K4p1J7K2N0p9J4K8Ok4j2M8j7k7kQ3k3q6L9O3n0o6J03j1l3n4P8K4
$$ plain form
3278 -51 -14 31 35 -70 17 42 -4 -56 0 48 -37 -13 9 39 -54 -23 33 2 -17 -42 38 -33 -9 -21 30 17 -55 12 18 16 -66
3309 -66 20 50 -11 -24 12 66 -42 5 40 35 -29 -12 79 10 -8 -7 68 -6 -31 24 28 15 -40 45 15 -3 -38 17 31 -42 -8
3340 -8 7 33 -55 -18 32 8 -44 -24 63 -25 -49 -3 52 -16 -56 35 19 -15 -47 47 21 -36 -7 13 29 -53 20 11 18 -39 -13 44
3372 44 -18 -19 -19 38 -28 -29 3 34 -16 -56 44 9 -24 -21 59 16 -28 22 42 22 -58 26 44 -9 -12 26 52 -39 6 28 39 -20
3404 -20 -20 42 8 -1 -24 55 -1 -28 -10 16 11 -65 13 34 4 -64 10 42 -41 -25 3 31 -70 -19 35 -12 -39 -24 51 -25 -18 -19
3436 -19 29 -8 -23 22 22 16 -46 26 26 -10 -29 -3 41 -34 5 19 33 -39 -9 48 -7 -28 -27 61 -18 -27 21 33 -9 -30 51 17 -17
3469 -17 -24 34 34 -27 13 17 34 -20 26 27 10 -19 -14 66 -7 -22 -11 56 0 -42 31 0 -31 -54 51 9 -41 -27 23 11 -61 2
3501 2 -4 -14 -54 0 24 -47 -30 -8 42 -37 -23 5 11 -13 -25 23 6 -21 -23 60 37 -49 -10 53 3 -63 40 29 -4 -58 20 44
3533D4r2M0K3J5o5J2N1l9lON5o7j0K8M4l4n1O5qLn4O5km7J7K8K2j00L3N3qm9K6
3566AM6p5kM3L6q4j3N9jk9k1O2l4k1K3J7jo1L8K3K4q3M0L7l2qJN1o6RK9L9p4j4
3600d1Q3k3k9rP0n1l0N0J2k5n0P4rkl5J5K2m0J1J3K5n0%M8j4k6l3Q4l6j9QL8l0
3633Am5O5J2k4m9P6j1m6MK6K1o8M2Rj0l6J5O1n3pk3O0k5j7K5J7l3n5Q6Kl9k8N7
3666A0J5p2L8L1J6q3M0L5k2m1J4P8p7jK6K3m5j3O4j9j0k4M9k0l7J4L2Nn7K8K2
3697A9Ln9K9M7n0k4K7N5p0oN2Jl7j7P6l2l7RM9k1m1L8mNm1M4Pl1kJM9n4OJ2K1
3732B4m3k9P6k4l4nP3n4k6L9K8k4n9P9ml5j5M5J2n9K8K0Pm9L2L1j1l5oO0l7j3
3764hjN3l7m6N7J4l0n1Q4lo0LM6J7q5N2J9k2m5M0M0m4j0LN3n6KK9Qk9k3O8l1k8
$$ plain form
3533 44 -48 -8 15 30 -35 -23 28 -11 -14 -8 47 -20 -30 -2 42 8 -43 22 14 17 -37 28 26 -21 -4 24 46 -54 -21 32 24 -25 1
3566 1 47 -28 -30 13 49 -35 -48 11 10 -19 -40 22 -12 -33 -10 7 6 -55 -17 6 30 -53 -13 24 -8 -16 -15 36 -30 -21 8 47 -27 -41
3600 -41 42 19 -10 -19 51 0 -30 20 32 7 -43 31 22 20 -15 0 22 -18 -7 6 31 -19 -19 29 15 -11 -44 40 4 -15 -7 31 1
3633 1 -44 21 33 9 -40 36 25 -21 -17 9 30 -38 4 13 3 -33 -18 43 -10 -17 -40 20 -5 -22 3 20 -13 -68 18 20 -19 -47 10
3666 10 25 -47 -9 22 38 -45 -5 30 8 -33 -19 59 -18 -19 7 30 -15 -28 36 17 7 -17 32 12 -25 -11 21 26 -31 -3 19
3697 19 22 -37 -8 39 -11 -35 -8 47 -23 -29 23 24 -13 -30 46 14 -23 -14 35 14 -27 11 7 12 -29 15 22 -9 -11 -10 39 -15 -9 3 24
3732 24 -19 -48 28 4 -30 -35 38 -16 -42 -3 25 1 -58 21 17 -18 -33 12 24 -35 -7 13 20 -29 3 34 23 -12 -18 42 5 -8
3764 -8 -9 44 7 -39 18 32 2 -49 35 32 -28 -25 21 38 -47 5 24 2 -43 -3 37 -7 -17 -14 39 -17 -15 14 22 -7 -30 38 7 -21
3798b1j0M8Ln3J4J9L2q1M0L9l5m1K6O3o6qK3M0o1mM8k8qj4O1l4k6J2L8j7m1M1
3830aM%k6K0M0m0j3J2M7n1j1M4Qm8j5P3l8j7LN2l7m8N0Lpm6N9ol9J5K4J9p6L6
3864a0JK7n3J5M7k5k5mO3m9nQM2k3n4P1%l2l7O6lo1K9K6J5p8M6L4k0l4J2L4o0
3897c7L1nL6m3k9M8J7j5n1N7j0k2kM4J5o7L1L0ln5L7L2n6OPN7p0NM1ll8j3N1k2
3931Dj5k1N0k2j6QJ2Rn4M4J1k0l2L4K5m2qK7L3p8K9M7j6k9k2Q1m6k5K3M1l2m1
3963d1P0j5j1k9N1%l7PML3o1K9J5ml0LM4l2j4pO9m6k5L7J3k1l4P3k6k9J5M3j2
3996C2o3M2J4Lm8L2K2k3j9OM8n6MPK7k6l6N6j2j1l6N1rl1J2L4Rq6M9J9qm4K6K4
4030Im2QJ3M2n9J1L1qnj2L4l1Nj2L8j8m0L9J9kn6M1Rk3k2K7M2o8J8K5J2o0LO2
$$ plain form
3798 -21 -31 17 20 -33 -19 0 32 -49 -9 30 -5 -46 -20 43 -23 -31 -8 32 -29 -33 15 -13 -21 -35 26 -8 -34 -22 16 -1 -42 -1
3830 -1 3 3 -23 -3 37 -3 -16 -4 43 -8 -19 25 33 -15 -30 43 5 -12 -9 43 6 -42 8 11 4 -42 17 11 -28 -13 11 30 -46 -10
3864 -10 -9 18 -35 -20 27 2 -23 -27 36 -13 -18 -10 32 9 -45 26 26 -6 -43 23 20 -41 -12 14 29 -49 -3 31 11 -23 -11 23 -37
3897 -37 -6 -11 25 -18 -47 1 18 3 -48 9 -1 -23 -25 19 34 -33 -2 28 25 -30 7 39 -17 -11 -4 53 -17 -12 29 26 -12 -25 26 4
3931 4 -11 -32 18 -4 -20 -12 0 9 -45 -1 10 -10 -42 -8 17 -25 -33 -6 27 -51 -22 25 9 -20 -42 39 -7 -32 -9 32 0 -41
3963 -41 29 14 3 -26 25 25 -12 -5 -1 32 -29 0 15 11 -19 -16 28 -4 -18 -25 44 -2 -27 10 23 2 -32 41 15 -14 1 44 32
3996 32 -31 11 25 28 -20 12 34 11 -8 -2 46 -10 -6 1 28 2 -34 22 10 -1 -37 14 5 -26 -14 20 29 -57 -8 11 3 -41 -15 9
4030 9 -33 -25 -12 30 -29 -18 13 5 0 -12 22 -9 -4 -16 22 4 -36 3 22 20 -36 5 14 -9 -31 -4 38 -30 -12 13 25 -35 -32 30
4064C0l0j4j3O5m9rL2Lk3j5M5jj3rJ7K9m5J0kL2o4K3K7j2j8k3O1l7j2LK8k9k3
4097c6N2j0qm2O6j0k5nL5lp5Q8Jj3n7L9J6qk3kN6m4mQK7k4l2O9k2j9k7O2j0m5
4131b5L2J6j4n1N0J2k4k3J3M2m8RNL0l9OL0k5qj6N4pl3lK7J8n4L6J3rl9M1K9o7
4165b2J0K0K7n1PK9j5k2kN4m0j8JL3j3l2L1j5K1l8M0Lk0j4K7L2o1J7kM1m3mM4
4198B5j4k0KN2n3j0K9K1k5l5N3k8lj5M4pm0J3J4J8n8K7J4Ll1J2L5m0jPM3l6k3
4231b7M1kk0k3O0k3j6JL6j0n1M0J4%m2L0Pk2jML5n0LK1J0j2k6L1j5%j8M4j3l7
4265c1K2K3J2p0L7J8qk7K6M0o6K3J0J8n2K4L3k1j2j0M5k6qkK6kn0M3nml8M0J5
4298B3l5%J0K3n4K3K2km4K3M1l8mLL2k9k0L0J4k0j7M7j9j0rK7J1m9J8J5J1m6L1
$$ plain form
4064 30 0 -14 -27 38 -11 -20 12 15 -8 -23 22 21 8 -1 16 45 0 10 8 40 -24 -1 26 14 -4 -27 34 -3 -15 -12 16 -13 -36
4097 -36 16 6 -2 -44 22 12 -13 -18 17 14 -61 27 28 15 -42 -3 13 5 -18 -20 36 -8 -12 -4 23 -1 -33 36 14 -5 -32 30 20 -25
4131 -25 7 23 9 -42 8 20 -4 -27 -14 28 -20 -11 -6 24 -15 -9 21 -4 -12 -28 26 19 -14 -17 10 28 -26 10 23 14 -25 16 45 -22
4165 -22 -12 8 35 -16 -9 20 5 -17 -19 35 -5 -23 -22 11 -2 -34 -3 -18 3 -35 5 8 -12 -26 1 33 -28 -11 -13 28 -15 -19 25
4198 25 11 -9 -7 45 -8 -18 11 32 7 -28 25 -3 -6 -21 23 16 -24 -11 3 21 -37 -10 4 7 -24 -12 23 -17 -18 -11 32 -4 -27
4231 -27 14 12 -8 -31 29 6 -10 -9 27 17 -34 6 20 20 -22 8 15 -7 -8 -4 31 -19 -16 5 15 3 -23 8 -7 -7 -25 19 6 -31
4265 -31 -9 14 26 -44 -7 11 3 -24 2 42 -24 -1 9 27 -25 -1 32 11 -1 -11 34 8 0 -2 24 22 -28 15 10 6 -32 8 23
4298 23 -12 -12 -2 21 -33 -10 12 10 -34 -11 30 -8 -12 -9 23 -6 -26 4 18 -2 -19 28 9 -1 -10 17 28 -21 -3 12 23 -23 8
4331HJ2j8k1qN0k6j5LM5m6j4M9j5j2j7M3j4l0L0J6J0n6L0J0Ml3K2K9m1%OM3m3
4364Aj5L0Oj9j9M3k3poL5j7l6K9K1j1m1K9Kj9jJ6K1m7J8K1Nl4QK7j5pj2M8k5j2
4399fRL2k2m2M8kll5K7J8m1J5J2Lm9K1M4j4l8nM8k5j7K0K4l6j3L5Lkl5M0Lj7N
4434EOJ4l7K2J0Kl8J7M4l4k4J6M2m7pL3j1j4k6N9k2kj8M1k0l7J8JJ4l9L5J6j9
4467@k5LM0k4mMK8l9lL7ok1j5O0l3k1K2J9qm9N5kj4k8L4Ok7%NK9m8OK6jk1rM5
4504B1l0j0mM6j2l2L5Nj2l7N4Lk9j4K2L2n6K0PJ2k7J6L7l0j7oM1l7lNK0k0k8M5
4538A7lrl6M8Mm6K2QJ5m5J5L0j8j9J5K5l0qJ9K8l0j1J9oj2rN0l4lpK3Lk4J5%O
4574A2m7K2L8m0kJL6k9j1J3J7k8NL5k4qrL9qk6K6Pkl2L6%j2pK2J2l7RKQj9nK5
$$ plain form
4331 8 20 2 -19 -27 23 -3 -18 -15 30 -16 -30 19 4 -8 -25 18 4 -26 4 20 30 -26 4 14 18 -15 7 36 -5 -5 1 44 1
4364 1 -14 16 22 3 -16 27 4 -3 -9 26 9 -27 2 23 12 -29 0 2 -17 -18 -2 19 -28 -10 11 16 -18 -10 17 2 -5 -17 31 6 -6
4399 -6 3 35 13 -29 19 17 14 -21 6 24 -17 -2 10 13 -36 -15 29 15 -23 -28 20 -5 -22 -2 22 -14 -27 8 11 9 -26 14 17 0 5
4434 5 11 25 -12 10 20 22 -16 1 45 11 -13 3 45 -2 -9 24 13 -1 -27 32 10 8 -10 31 11 -26 -8 -7 7 -32 3 19 0
4467 0 -25 -22 18 -6 -10 -6 22 -17 -20 17 11 -10 -25 35 2 -19 3 22 14 -35 20 18 4 -24 10 16 -11 -11 -6 23 -25 -19 7 6 -15 -24 21
4504 21 -9 -19 -23 23 11 -21 14 19 7 -30 24 27 -2 -16 6 38 -18 2 9 21 -6 10 47 17 0 -6 35 -2 -5 0 20 0 -28 17
4538 17 14 5 -31 17 21 -25 -3 5 20 -25 -10 20 2 -17 -2 23 -7 -15 4 32 2 -9 10 4 -8 -17 33 -1 -4 -11 12 15 -9 6 6 12
4574 12 -35 -13 25 -15 -17 -16 20 -9 -20 -7 10 -18 -13 22 -2 -10 -19 20 12 -14 12 19 17 -15 21 21 9 2 24 36 -1 8 10 18 -1 -6 19
4611A9rk1kM2k7k5QL6rl0J6jqj7L7pk4MK0J5n0L2Q%k1OL6l6joM4m4kK0LQl2K7
4649ImJk4L1j1k9J8J1Rl9J4K6j5j2J0K6l9JJ5K8l0pK8j4Kk0M5j2l0J6J7Om3K0
4683DRjk4K0K1l7JOL7m7JK0Jk7qM8l9J6Kj7lmK2Oj0k8K4jQj4J2K1k9QPK0k9j4
4721a8L8oj6j2M4l0j7K4Lkk4K8Mj7j1K7j4k4J9OJ4l7J1L9j2k1rL2k9QKJ1j4j6
4755a9L8jml3L4Mk1jNJ2m2K6J7mk6PK1k5%LK5l0qK4lj7pK9j0j2j6L9lj6J4pJ4
4792Gk3K2J0qk4J5K2l2jK5Om0J3M0k1j4rK7pj5QNnk3K4Mj9l1M4Rj7oJ1K1l2OJ5
4829Gqoj0M5k5j0%K7j0l1L7j1Mk8K8lj9OJ2J7l2J5oOj6%K3k8KkK8j8j2PJ5j1k8
4866c5L6Jk3pL8%k6J6Qjl4L2OQl6J5L1l5%J2K6l2oK4Jj8k1L6j7mj0J8Ml2J7J7
$$ plain form
4611 19 10 -11 -13 29 2 -23 -15 21 12 -18 -2 -3 -11 -28 9 2 -22 -18 2 17 -33 -1 7 7 -14 -8 28 -8 -9 -15 29 -15 -17 3 6 14 -18 9
4649 9 5 6 -18 13 2 -27 -9 2 11 -28 -14 12 -3 -15 -5 21 -18 -17 -2 26 -4 -11 17 3 5 -15 30 18 -12 4 21 27 -16 4
4683 4 13 12 -12 8 29 -8 -7 -1 36 -11 -10 10 11 -16 -24 24 -15 1 3 -14 -17 -21 1 7 -3 -31 -7 -8 0 -14 -2 19 -10 -2 5 25 -4 -18
4721 -18 20 14 -2 -14 30 0 -17 7 10 8 -16 12 16 -1 -12 15 1 -23 -4 2 16 -21 -10 29 17 -4 -13 19 -10 -2 0 11 -3 -19
4755 -19 19 18 14 -19 15 19 -2 -3 2 14 -28 -2 15 11 -15 -8 13 -12 -12 -9 16 -14 -22 2 -1 -18 -25 4 -6 -18 -34 5 2 -14 0 -7 7
4792 7 -16 6 16 8 -16 -1 21 -11 -12 13 19 -21 -8 32 11 -3 -12 15 8 -7 1 6 1 -22 2 6 -13 -44 0 9 -8 -14 -3 18 -14 -8 7
4829 7 -1 -7 -17 28 3 -7 -7 20 10 -21 16 5 9 -19 9 6 -13 -7 5 22 -10 5 -1 5 -11 -11 12 -16 -14 -16 12 -6 -18 -11 4 -7 -35
4866 -35 1 2 -21 -28 10 10 -16 0 8 7 -27 5 11 19 -17 -2 29 -6 -6 6 32 0 -6 18 19 1 -20 16 -1 -5 -15 3 7 -25 -8 9
4902ILl6K6J0k5MMK1k3kK1jj5MK0k0lnL1rk0KJ3qqJ5Kj2k0K8Qk4Lj1K8k8jK4o
4941aj4oM7l0j4PK3k0j6M2k1Kj6L1lj1lQJ5k3QJ2kk6J9J0k3rPK6k0j9J6Qj0j9
4977b5M5j9j8%K6ol7L0Rpj3NJ5Lk0MJ6l1RJ3J8k1j3L0j1mj3K8j3j7NK5mk4PQm
5014dk2K7Nk8KJ3J2l3J4J2n%j3J7mQrJ7oj8K3Pj1k3K7Mj4RORm0J3LJ8k8J4J3p
5052Hj5RJ5k8lOJ8j9k0L6j0j3kJ8Lk5J8LJ8l3PJ0J6k9kL9l1KRJ6qk2L0j2j2k5
5088b8N1j0k3NJ0jk0K1pLk0K0%qj5LK2j5rJ6Nj7oL6j2Mk2L2kl1K2J2ok1K8mj3
5125@%J2%k3NJ2J3l4J2JJ0%j4K9k5qkK2pl9L3jOk3L4%j9qJ2J8k8MK3qk8J6J8L
5163A6j8pL1j9j2L2k9Pl4L6LMk0J4%k4j6M3rkqK9j1l7L5K8n5k1M0K5o3K3K0K4
$$ plain form
4902 9 12 -24 2 12 -13 -9 -5 16 -7 -9 12 11 -4 0 20 0 -3 -8 23 14 -6 -4 9 1 -7 8 10 -2 -22 6 14 -10 -7 -18 10 -18 -19 5 -1
4941 -1 -15 -21 26 -4 -18 -11 12 -8 -24 18 -3 -1 -17 14 11 0 -3 5 20 -3 5 17 15 -11 8 18 -5 -14 -7 19 -1 -20 -4 4 -6 -25
4977 -25 20 1 -17 -17 9 3 -34 -4 5 -2 -15 -10 5 8 -12 -8 8 -23 -14 -1 17 -4 -17 13 2 -2 -15 13 0 -17 -12 13 9 -15 -8 0 -4
5014 -4 -26 1 6 -22 -20 -7 5 -28 -14 -2 -7 -7 -20 -3 -7 1 -8 9 3 -15 8 15 4 -19 8 12 -2 7 13 22 -18 -5 -2 16 -12 2 15 8
5052 8 -7 2 17 -11 -14 -8 10 -9 -29 7 -3 -16 -18 0 3 -22 -4 -1 17 -16 -9 1 17 -12 -14 25 -6 -4 5 21 13 -9 21 9 -3 -28
5088 -28 23 13 -10 -5 5 4 -16 5 -2 1 -19 1 1 -7 -22 -19 3 -12 -21 -5 0 -17 -23 13 1 5 -17 15 13 -18 4 16 10 -11 17 13 0
5125 0 0 12 12 -11 -6 6 19 -15 -3 -2 8 8 -6 23 -2 -10 -12 10 3 -36 -3 -4 2 -21 13 13 -6 -14 -2 16 -12 -8 15 7 -21 -5 13 16
5163 16 -2 -9 22 3 -9 23 -6 1 -33 3 6 10 -10 4 4 -20 -36 7 -2 -4 -12 17 6 -31 4 32 -23 -44 -4 21 -42 -19 1 25
5197B5Rq5J18kl8mr%k4J6Nlj6J4J2k4J1pJ2l3J4PPj3j0L0j2JpOlk6M9KJm5K2J9
5235A9k3mJ1J9l9J3NNmj7L2j6Jj6K5j5oJ0K%l1K9Mj2j8K7jk2J8lJ4m5M2Oj2om
5272a2L4j4Jj4K0j6mJ1J2lk1K3Jj7lLJ2j5J1%Jj7RJ5k4NlJ8j7j5J6Kmj1K6k6R
5309gjK1jk4KJ3J2k6J8Oj3j1RJ5j0j0RK2k0j2K8j8krK2ol3K3J1mk3K8pKk0RJ0
5346Cj1nJ0K0k4OPJ8k1j5L6k0rkK5j2j9J8J5k4JK0rk0J6LKj6LOrj5J4J0k1%ML1
5384A6l9J2jJ3j5pK3Oj1lJ6mj6J3PNk5LK7j2j4kK6k7KJ0K2k3lJ3j0jj0K5j3j4
5420a1KJ1J4k5MJ0Ll3K9Rj6qJ6J3l0J6MOqj0L1j8j1%K4k0j1J2Mlj8K3lq%LJ5l5
5458a9K0mNk0QOJ2j2qJ9k2KMJ3nj4K1Qrj2K6kk4K0NJ8k9mJ1jolJ5j5rjK1j2rJ8
$$ plain form
5197 25 34 -51 67 65 27 23 14 14 -10 6 11 8 -8 6 18 -6 5 -2 10 -23 -9 -2 5 -8 -18 12 0 1 -6 0 -3 -29 20 22 23 -22 0 19
5235 19 -4 -8 3 22 -17 -4 1 6 2 -15 17 1 2 -14 11 -4 -10 0 2 2 -29 0 4 -8 -26 1 0 -22 -4 -7 7 -38 4 10 -2 -8 -12
5272 -12 22 8 9 -5 15 -1 -5 6 18 15 -6 17 18 1 -2 1 13 -2 9 9 10 -7 2 17 -7 -2 -5 13 -4 -19 -3 -1 -5 -16 10 -16 -7
5309 -7 -8 13 12 -12 -10 3 15 -11 7 13 0 -11 -2 13 3 -7 2 24 4 -8 20 2 0 -9 13 7 -26 -3 8 4 -19 9 2 4 -16 -7 3
5346 3 -8 -13 -3 17 -7 -1 6 24 3 -12 24 4 -5 -7 18 6 -13 5 20 -4 -3 17 8 -12 4 7 9 -7 -4 2 -7 -22 -8 2 -19 -19 -15 16
5384 16 -23 -11 -12 1 -14 -21 2 8 -3 -6 10 6 -10 3 10 15 -10 -7 20 8 -6 -8 18 -9 -7 3 25 2 -1 12 2 1 -9 16 3 -11
5420 -11 -9 2 16 -9 -5 5 8 -25 4 13 -3 -11 5 18 -12 4 8 14 6 -4 27 9 -2 -2 22 2 -9 3 7 4 -14 9 6 -2 -2 1 16 -19
5458 -19 1 -3 2 -18 -10 -4 8 -4 -12 7 -15 -13 -9 4 -1 -15 6 14 5 -7 19 17 -7 13 18 36 7 3 14 13 7 4 19 4 -5 -6 15 3 -6 12
5498A2lpj2J4Nj4oK0Lk1J7lkk5J7J8rmJ0J2k0qJ9Jj4j1K3nJj4J4nrNlJ3k5J4M
5537BpmlK6k2oJ1J9j9mJ7j2Lj8K6JqqJ5Pj9K2nJ6l2K3nj9QNK0k0oOJ2j7lK1k4
5576aqlK9j9j2J7Llk5L0rLj0RMj7MJ3OorM0Ln4K7Oj8j3K0J1rpKnNj4K7kk1qJ4
5617@Rk0J6J0qk7J3J4qj0JK3k6J0J2Oj0rJ0MnoK5nk1RJ0Ll1J6J8j5qJ6Nk4oJ3
5655DLj7%J7qmqK0lpmJ7j2j3J2Nnj0J3J0j8pJ2J2j9OK4qk0NJ5rjLJ1j0j5J0Nq
5695bk0K8mj0rPOk1J9MOj4RMm%j1K5k0lJ0J1pj5K3lOj6K1Nk9J1mRk7K5nMk8K2
5735CJ7k8NmJ0j6MRQj4j3K0Mj6LONj5J8J0j4j4J5J8k1jJ6pk0K1jmkrJ1mjpJ6r
5775aj1J0j9K1lM3j4k2k7M0rl6O9l5pK5J3j8o6K0M3kk8K0l0N3k3qJ8knj8J0%J
$$ plain form
5498 12 9 2 -10 4 9 -5 -11 9 12 -9 8 5 3 -22 -5 13 4 0 10 22 2 -6 13 14 0 -11 12 7 8 -6 8 3 -6 -1 -4 9 -16 -2 2
5537 2 -5 -9 -12 14 -8 -14 -3 16 -3 -7 10 -2 1 -17 9 10 2 -6 9 16 -3 19 14 30 -2 21 16 -3 5 10 30 10 4 10 22 5 2 23 -1
5576 -1 -9 -12 17 -2 -14 3 6 3 -22 8 -1 2 -8 1 5 -12 -8 5 11 5 -4 36 39 -15 12 18 0 -13 7 18 9 2 4 -1 4 -10 17 15 -6 -14 0
5617 0 9 -11 5 15 7 -20 -7 7 -1 -11 -10 13 -13 -3 9 15 5 -4 6 10 5 -1 24 19 -2 7 17 20 -11 5 23 8 0 16 21 -3 -9 4
5655 4 7 -10 -10 7 -1 -5 -13 7 4 -3 -7 10 -2 -15 -3 2 -3 -13 0 10 -8 -15 -3 9 -10 -4 20 12 -8 -3 12 3 2 5 16 6 -9 1 6 -2
5695 -2 -22 6 2 -8 -17 -10 -4 -25 -6 -2 4 -10 -1 3 -1 -1 -12 13 -7 -10 0 11 4 -11 12 9 15 -1 20 25 -4 7 3 12 -15 10 5 9 -19 3
5735 3 20 -8 -3 -7 3 -13 -9 0 8 -6 -19 1 5 -11 -8 -2 3 -12 6 16 2 -12 3 21 0 -1 15 8 -12 9 8 4 2 -7 4 0 -1 -8 8 -1
5775 -1 -12 -2 -21 0 -3 40 26 4 -23 17 8 -28 41 6 -1 24 37 19 -47 -27 16 14 -14 6 -24 29 6 -2 16 14 9 -9 1 1 2
5810BjJJ5k1rK6j5jj0K5l4jJ6Nl3lM5j1J0k4K5j1mjJ9Qk0J2nNk1J4J6rj4OJ1l4
5848b1K2J3j4%j0K2j3Pk1J8jj6LJ0Kl0K0J6lj2J7Jj8R%JooJ3LjMProJ0J6oj7Q
5888A2%lj5J6J2k6LMJ1rj4RJ3k7NK3j7rqJ2O%kJl%J6%jj0OJ2j4PJ4j8nLJ5j2q
5929aKJ5k4PMLoJ0Mj6pJ0MMk2jJ4Lk1K2mLpMK5k5NqK2j7J5nmKj0J1J1j7j1M1k1
5970A4r%Oj0j4K1%j0qRJ4j9p%J6k4J0J7pmj4K6nj0OJ9j3j6J2J4pk0K8mj8QQJ0
6008A9k1J4j3j7KK4k%loJ7j8oLOKqJK0k2nK4Pj8OpJ5j4mK7j9J4j7J8j4kQJ3k4
6047@oJ6Mj0j3J5j0KKL%k3J9J7j8nJPrj1MJ2qJ0oPJ%J1npnJ4Oj2QKkj2QJ0j2k
6090CJJ1k1NJ0n%pJ8k5LLJ2rnJ0j1jjJ8j1llJ0J1j9QPRj1pQj0KjK3j1j1J1jpj3
$$ plain form
5810 2 1 2 17 -4 -13 13 -2 -3 -13 12 -22 -23 -7 -2 -35 -38 7 -4 6 -18 7 -4 -8 -9 10 18 -2 10 5 10 -11 3 19 10 -4 2 13 -21
5848 -21 1 14 0 0 -10 12 -1 6 -15 3 2 -14 -11 -1 1 -29 -9 7 4 -8 9 10 -8 1 1 2 -4 -10 3 6 5 9 16 7 1 11 27 21 4 12
5888 12 12 9 -6 10 22 -4 -1 3 14 5 -9 0 13 -14 -9 14 -3 -12 -20 -8 -2 -2 -4 -3 -6 -6 10 10 9 -1 5 17 3 10 24 6 1 4 19 7 -1
5929 -1 1 16 -8 -1 3 6 0 10 14 -2 -9 1 5 9 -13 -14 0 3 -18 4 0 3 -4 0 25 0 5 -3 19 2 17 12 8 10 0 11 22 5 -6 35 14
5970 14 5 5 11 1 -13 8 8 -2 -10 -1 13 -6 -13 -13 3 -21 -11 6 -1 -5 -19 7 2 -8 -2 17 4 -12 0 14 7 -13 15 11 -7 1 9 19
6008 19 -2 12 -1 -18 -16 8 6 6 3 -3 14 -4 -10 -7 -1 1 -7 -6 14 -8 -13 11 18 0 6 -1 14 0 -4 23 4 18 1 19 5 3 11 24 0
6047 0 -6 10 14 4 -9 6 -4 -2 0 3 3 -20 -1 16 -2 -7 -6 1 -8 -19 -15 -3 -11 -1 -7 0 1 1 12 7 0 -5 9 15 3 11 13 11 -1 7 17 5 3
6090 3 4 15 -6 -1 9 4 4 -3 15 -10 -7 -4 8 -1 -6 4 -7 -8 -9 9 -2 -5 -8 2 13 -6 2 9 18 7 0 8 -2 0 -1 22 11 0 11 10 3 -10
6132a0J7jj3LLmPqOj2oMJ7np%J3j4JLJ5j9KJ3KpnK3j3Lj0K1Lk7J0J6Kk3J2j4J2
6173A0j7KK6l2mJ4Qj0oMKlpJ4Nmn%MqJ4oJ3j8ROonjJ2j4PJ8kk0JmJ1j2MLpj6Q
6217a2J5nk6K2Oj4LJ3nqmK0Jk0PPRj9J4J0j2ojJ6j2KLRj2qK0Lj3%Nkk4QJ5qnK
6259fPj2%LjMj0K5omj7J5LoLQJ1j8pQOkRmj1%RMj7J0Pj0Mj1J1j7%OJPj3PJ2rj3
6304a4J3mqOnK1j4KlJ3j2kJ6p%kJ1pmQmNj3MLjQnnj9J8KJ0l0jJ4Qj3MlJ2rLLj1
6349a2jK7j4jnM%%K%QqMJonRKplKJ1j3J2pMj6KPqJ2orRrJKJ3j0jJ0omj1L4k3P
6396bNLj1NJ4j0j9K0KjNJmMj5NpJ8k4J0lnomK3k1K0mqoOJ7pjj7J9lnKlK2j9J1
6439GLmj2K1Lk4J3kJ2k0NO%oJJ0j4qMJ1j0njJKqJ6Nj5KNNKj1MNnjJ6mjjPoMJJ
$$ plain form
6132 -10 7 6 -7 -4 -1 -5 2 -6 0 -12 -18 -14 3 -2 -9 -9 4 -10 -9 -6 9 -10 -8 5 7 0 -5 18 5 8 -2 19 22 -5 5 21 23 0 12 -2 10
6173 10 -7 -5 21 -11 -15 -1 7 -3 -9 -5 -3 -6 -13 1 6 2 -3 -3 1 -7 7 1 14 -4 5 11 5 0 -1 11 -3 4 22 20 0 1 -3 8 -4 0 3 -4 -20 -12
6217 -12 3 -2 -28 -6 0 -14 -11 2 -3 -11 -15 5 6 -14 -7 0 9 -10 4 14 2 -4 -5 11 -1 1 4 13 1 -7 13 16 3 3 8 6 -18 -10 5 -3 -8 -6
6259 -6 1 -11 -11 -8 -9 -5 -15 10 4 0 -17 -2 1 -5 -2 6 17 -1 -8 0 6 4 13 9 -2 -2 7 11 -6 4 11 1 5 -6 5 -12 -12 -6 -5 2 -11 -4 8 -1 -14
6304 -14 -1 -5 -13 -7 -12 9 -5 -3 -6 7 -5 -7 9 2 2 0 11 4 0 8 4 9 -4 0 3 2 10 5 0 -19 -1 1 11 -19 -20 -6 2 -11 -7 -10 2 -7 -4 -1 -12
6349 -12 -13 14 0 -1 -6 -2 -2 -2 0 0 8 0 4 5 -1 -6 3 5 -2 -5 -3 8 -5 7 0 4 -12 -10 -3 -11 1 -5 -14 -5 -14 -13 -11 2 -8 -9 1 -5 -9 -20 14 -9 -2
6396 -2 3 6 -5 0 14 4 -15 5 7 6 11 12 8 12 -3 2 -5 13 -11 -1 -4 -9 -15 -19 4 -17 3 -1 -9 -15 -9 8 1 0 -17 2 -1 -6 -4 -7 15 -4 7
6439 7 10 6 -6 15 18 -6 7 5 17 -3 2 8 8 2 3 13 -1 -9 -5 6 -4 -9 -10 -9 -7 -15 1 6 -9 -7 -2 3 5 -6 -2 3 -2 -3 13 9 8 7 14 8 12 13 14
6486A4qjPj4NmMnlJ6qKk1J1nNoJ2lk0J8Q%mj0PQJnJ0mj0QJ0Lj9JPlkkJ0j1j2J7
6531D%rL%Oj3kJ2jnlJJoJ5j1Oj4J4RlMj2J7j9RkPqOJ1j5KJ3Ok9NJ3kj0JOqQj7
6576a0J4jk%JK1l8J0PlrMJ8j6KMNj0LLNnnJ8lj3QJ0qnJ3nRj5nPMj4J4noknRqm
6622hOomlPJ7k0J0jPmJPj4JPJ2Nj1kRmKNj3m%J7j8%J0j1lqRPjj2MmlKoJ1j5J0
6668iJJ4j3pRQj0J4JopPJ6k3RJMLMrMj0KMkj2jRJj0lPmmKMNlJ5j1Qj7j4K3j3J9
6714FjKk0K5mjJK%jjNKj0kNOjl0K8j7KMNmlLPk3pJ5RroPQj4RNkj1J0KLKnQJnj
6764DlJ3pOljj3RloJ2opLlkJ3lj6J6mpjJ8rj5J6%Rk1J5Jj2J1jJ3j6Qk0J8JlOq
6808BjnJ5jqNprrJ7Lj5j1J9Mj6J6rklPNkMkMoKMNj4QJ2Mj8QQj1JPMmrPJj2nOj0
$$ plain form
6486 14 6 5 12 -2 3 -1 3 -2 -5 11 3 5 -16 -5 -10 -5 -11 1 -2 -22 -4 4 4 0 -10 -3 5 6 1 11 7 -3 5 15 18 -1 0 7 4 2 0 10 -1 -13 4
6531 4 4 -5 -2 -2 4 -9 -11 1 0 -5 -8 -7 -6 -12 3 -8 -2 -16 -2 7 4 8 -4 13 -6 3 1 8 0 6 17 2 4 17 23 -6 -1 12 10 0 1 7 -1 7 -10
6576 -10 4 3 1 1 2 23 -15 -5 2 -1 -10 -6 12 -4 -2 2 7 -3 0 3 8 3 -2 16 13 0 8 18 10 5 18 13 22 7 2 9 13 -1 13 8 2 0 -5 4 -4 -8
6622 -8 -2 -8 -12 -15 -8 9 -11 -1 -2 5 1 2 9 -5 -4 3 15 20 9 7 16 12 14 19 6 2 2 19 1 1 11 0 -3 -11 -2 5 4 -8 -4 -8 -11 -9 -15 -4 -19 -9
6668 -9 -8 6 -7 -14 -5 3 -7 7 8 2 -5 2 18 -5 4 5 9 12 16 7 11 1 3 7 5 -7 -8 1 2 -8 -11 -4 -8 -12 -10 -6 -1 -4 11 0 8 -9 -23 0 -13 6
6714 6 5 7 -13 12 8 7 8 10 10 9 8 13 15 5 3 8 14 13 -17 11 -6 -4 0 5 1 -2 1 8 -15 -22 -7 2 -7 -13 -6 2 -12 -3 2 0 -11 -1 1 4 6 1 9 10 5 4
6764 4 1 14 7 13 10 9 -4 5 2 -4 8 2 -5 -2 -5 -7 6 3 -13 3 -1 -8 -9 9 0 -15 1 1 10 -11 4 5 -7 4 3 16 0 8 -12 6 7 4 10 2
6808 2 1 -4 11 10 2 7 0 -9 -18 -1 2 -13 -24 -5 -1 -17 -1 -10 -12 -15 -8 -3 -5 -1 -3 1 -5 -3 1 6 -8 0 12 16 -2 6 14 3 4 11 15 11 2 9 10 -2 -7 -1 -11
6857a1nJ5oRqjQJj3mJ9j0mJJ6mj4J3%loQOloQPj4QJ2j0lNkkj7PJ2k4J0Okk1K0
6901bk0J3RJ7j3n4N2J3j4K3k6mJ9poJ1lqNnQj7J2kLoPJQrqNJnPnolNKmj1MJ0l
6946fMknkqK0mJ0j1J0qmJ3R%j8ORj4O%mJJOlj3POomoRjp%J1j3%MjlQp%%nRLJK
6997@OPk3RJ5j4MKj2JPONj0ojM%qnLpMJ7rj2PLRk6J4Om1M5M1m8Qn7M7K4j2k2L3
7040A4jj9J0RKj0kJ1k1NOKj7J6pKj0KJ3pj4KMmQnJ4lrJ0j3RljQjNmKmJ0j7J0m
7084b%J7pkj4K0nkm%o%J0j3q%QPj5%QmOjPomJRKljJ0Oj4PoNnQlMoNlmkL%mJQj6
7137hRqNj0OjnJ1j5J5LnrJ7rJOOnj0QJNj0NQj3J0%onpJ7okJ3rJjj0QjnKoRj5N
7185a0PPmo%qOKOLrJ7Ok3J1jPlPKmj6jO%ONqKj0Qj1jLMqkOllmJ9%lqJ%J0j7J3
$$ plain form
6857 -11 -16 -1 -7 2 -6 -7 1 2 -11 -15 4 -6 -10 -9 7 3 -11 2 2 -1 -7 1 7 4 -2 6 13 -1 7 19 9 6 11 9 7 -10 -3 9 -15 -5 1 -1 -22 -2
6901 -2 -22 -9 0 17 4 -50 2 15 1 24 -2 -6 13 6 0 11 8 0 5 0 8 -9 3 1 4 -2 5 6 14 5 -3 2 3 -2 5 0 -6 -9 -4 -2 -6 -17 -13 -3 -6
6946 -6 -2 -4 -9 -11 -19 1 -3 7 -4 6 -2 -6 7 16 16 -2 4 13 -1 5 5 1 2 3 9 6 -7 0 6 0 -4 -10 -1 -2 -9 -9 2 -11 -11 -7 -8 -11 -3 -10 -10 -10 -15 -6 -3 -2 0
6997 0 6 13 -10 -1 14 0 4 6 -6 -5 2 8 13 3 -3 -4 0 0 -8 -13 -10 -17 -13 4 -5 -17 -10 -7 2 -24 -10 -4 -45 0 41 -7 1 -56 -9 15 3 -19 14
7040 14 13 -6 4 13 15 5 3 14 -7 -2 4 6 -11 5 -2 0 -10 -8 5 -2 -16 -14 -10 -14 -6 -11 3 0 -9 1 -12 -3 -6 -7 1 0 5 1 3 -1 9 -8 2 -2
7084 -2 -2 15 8 6 -8 12 7 5 1 1 -5 -5 5 -8 -16 -16 -8 -1 -16 -16 -8 -12 -6 -7 0 -6 -10 -9 0 2 -1 -2 8 14 0 7 1 6 1 9 6 10 4 9 6 2 0 3 3 -1 0 8 -8
7137 -8 1 -7 -2 -12 -6 -7 -12 -1 -16 -1 2 -3 -12 5 -4 -3 3 9 4 -6 2 3 8 -2 3 11 -2 8 8 2 -3 -10 7 1 -1 12 3 4 3 -7 1 0 -5 -3 -9 0 -15 -10
7185 -10 -3 4 0 -6 -6 -14 -8 -6 0 3 -6 11 17 -6 5 4 11 8 15 17 13 -3 -4 2 2 8 13 5 7 -3 5 -6 -7 -4 0 -8 -10 -4 -7 -10 -14 5 5 2 -6 -5 -5 5 -12 1
7235ApR%lk%J8jpoMKjrJ0%j0mQk%j7J8Mj7OLjJMoo%RoMKpJ3j2MRLr%J2moNNrQ
7287A0rKKjMOplkpkjQ%pmQkqjPj0POQj0lJ1Pj8rK2kLkJ1nonRjnlJ1kOj7J6j2o
7337fOorLQ%jkJmKRoPj5J0jLqPkJRnJ5pj1J5oOj4K1j9pJ7pj1j1RPJ1kj2KkoJR
7385akoPmmJ5jKj2QO%j4J0MjjOJKrjPooNOj3JJ0j4LnNLj3J4j1PnjQj1%J5ojMK
7434CkjmN%nOPkrJ2Oj2NomJ3j0Lmkj0RkmMj0j%MJ1pmKMnOJ4j5jNLnJ6j2J1j3%
7482alJ7nnKjQj5QkpQOj1Kj4RpJ1pmJOqMnRpJ3j0pJ8Pj4J0KrnJ3Qj1%JJ1qNrM
7530Hjj1R%j0MJj%oJ2nonJP%qjJ3mJKjmK%JlJ5nmJNJ0mj1kKKOkj7NOKJj2Mjj2
7581a6J9rPj4KR%nlJ5rmJ9q%nJ0Mmj1J9oJomJK6k9K1m3nK4L4l9L6l4j2QK7m7J5
$$ plain form
7235 1 -6 3 3 0 -2 -2 16 15 8 2 6 8 7 -2 8 8 -2 -6 2 0 0 -17 1 5 -12 -6 -3 -4 -3 1 -5 -11 -11 -2 -8 -4 -2 -9 4 -8 -4 5 8 -1 -1 11 7 1 6 11 2 10
7287 10 1 3 5 4 8 14 7 4 2 -5 -7 -8 0 0 -7 -11 -3 -5 -13 -14 -7 -17 -10 -4 4 -6 -9 2 9 -9 -18 4 2 5 3 14 9 3 -2 7 6 1 -2 9 7 13 -4 12 0 -6
7337 -6 0 -6 -15 -12 -4 -4 -5 -7 -6 -10 -8 1 -5 2 -13 -3 -4 -1 -9 -2 -4 -3 6 1 16 9 -2 13 7 13 -1 20 1 -6 11 4 -7 -18 -9 -2 9 7 -5 -3 -5 -11 -10 -1
7385 -1 -3 -9 -2 -6 -10 5 4 6 -6 2 8 8 -6 4 8 7 6 12 13 15 6 5 12 6 0 5 11 -2 -1 9 -5 -2 -7 -2 1 -12 2 -9 -2 -7 -8 0 -11 -11 4 -2 -3 1 3
7434 3 1 0 -4 1 1 -4 2 9 7 -2 10 16 4 9 3 -1 12 2 5 1 -1 -11 -2 -4 -8 -4 -14 -15 -15 -11 0 -7 -11 -9 -5 -10 -4 10 -5 -6 -1 2 -3 13 1 12 -1 -1
7482 -1 -4 13 8 3 5 4 12 -3 5 3 -4 4 10 -1 1 -13 -4 -11 0 -7 -11 -10 -4 -12 -8 -13 -4 -11 2 -8 -15 3 10 -4 6 8 -1 -6 7 15 4 4 5 16 8 13 4 8
7530 8 7 -4 5 5 -5 -1 0 -1 -1 -7 5 0 -6 -11 -10 -3 -3 -11 -12 1 -3 -2 0 -1 -5 -3 -3 -2 -5 10 5 1 2 7 17 13 2 0 2 4 10 8 -9 -4 2 4 5 -7 -3 -4 -16
7581 -16 3 -6 1 -13 -11 -2 -2 -7 -10 5 -4 -8 11 3 3 -2 8 12 8 -3 16 10 11 5 1 2 28 -1 20 -23 -28 -4 30 -9 27 -7 -19 -11 16 -31 -16
7622a6K1k6j2MK9M0o1j4O1l5j2kN0m5L5k6J9oNr%QLp%MQk%j5J6j0mNj4J2K1k7
7660bk2K4rjlLmNOj0J5oMRj0OkqRpRMqmJ1olQj1J5Jj6MJ3j8nJ%Pj0NoKnJ3n%o
7708a3KNrPKj%J3LqjM%%jJ0kpjJlJqJ2njk%Pmk4RJ0J1j6J2k5K9lLj6K2n3O1j6
7753Ej1J1Qok6M7l8k1RK1j7L0%m6R0m1j6oJK0j9J9k3J1plk%nJkJ0%Pj9J1MqjJ4
7793BLj0QjJJLJmqjJ0KmPj1ONrlJj0J5%j0knqJ2LljJnJ2oNoOkj1J1L%LLOokNr
7844bNoOKrJ3j9K1lj7K3j5nj%NmOoklP%qQnNj4J2kJ8k2NnK1nnJ1n%LlkjOkmRq
7893CLlmOkj3OMkj1OMlpJ6qoJ5j0RrLoJ2K%nmPNjOj6MOjmPj3J0Lj5NmlRqllO%
7944gpORqlK0j6P%LKnLjQoQlRj0mQkmlNJpkkKPmpNmrMj1LJ2qLNJ0j8P%MklLJ5
$$ plain form
7622 -16 5 -21 -33 -29 0 40 -21 -35 26 -9 -21 -23 27 -18 17 -9 10 4 9 0 0 8 11 4 4 8 16 14 14 -1 15 5 1 6 -8 4 25 -2
7660 -2 -24 0 -9 -10 -13 -10 -14 -9 -3 -13 2 -4 0 9 -1 5 3 -5 4 -3 6 10 2 -2 9 3 0 8 -3 12 13 -3 1 14 -4 -9 -8 -8 -1 -11 -6 -12 -10 -15 -2 -7 -7 -13
7708 -13 -11 -6 -15 -8 -6 -7 -7 6 9 1 0 4 4 4 3 13 11 4 3 4 1 2 -6 6 1 0 -2 -2 5 1 -23 -14 -4 7 -9 3 -22 7 4 7 -9 13 -40 21 5
7753 5 -6 5 13 7 -19 28 -10 -31 -22 -1 -18 12 12 -34 56 15 -1 -7 -6 14 -5 14 -9 2 -5 -8 -10 -10 -15 -14 -16 -6 -6 1 -18 -7 -3 -11 -12 2
7793 2 5 -5 3 2 3 4 7 8 4 -4 -5 5 7 3 10 -1 5 10 1 -2 -1 -11 4 4 -6 -8 -13 -21 -9 -6 -9 -10 -9 -14 -2 -8 -3 -9 -3 -5 -16 -5 -2 -2 1 4 10 4 2 7 -2
7844 -2 3 -3 3 5 -4 9 -10 11 8 -9 14 -1 -6 -7 -7 -2 -6 0 -6 -8 -11 -4 -4 -12 -4 -9 -4 -18 -6 -8 10 -12 -7 -12 9 4 -1 10 5 5 8 5 3 2 8 6 2 11 3
7893 3 6 3 -1 5 3 -10 -4 0 -2 -13 -7 -3 -6 -13 3 -5 -11 4 -6 3 -6 -3 -9 3 5 5 0 -4 3 8 7 13 -3 1 7 6 2 9 -4 6 9 -6 -1 -5 -8 1 -7 -10 -13 -7 -7
7944 -7 -14 -8 1 -7 -10 10 -6 1 1 4 6 1 4 3 11 5 13 10 19 9 5 13 11 7 4 9 10 3 1 -1 1 8 4 -3 2 -2 -11 -7 -18 -15 -3 -11 -8 -3 7 -11 -4 -4 0 -2 -5 -2 13
7997A3rKKmNlJ1kknLqKLlQj1oRr%jkjLMj1RKoQj1%OQj0%NjOKjRj1LJ2pknRj2k
8049aJ0oj1J2OpjlNN3n3k4K7j2rNJ0j0Pj%ojL%OJ0PqKokmJ0%kpQMjj2J0mJlqr
8096a5J6rjJlKlnOMMpjRo%JkPlmQJ0Lj8J2J1j3%OPj3jQj4PmjRmn%jrPqJ0qKNq
8147a1MjmQJjJ0j3J4qjJ1oJ5j7LL6k7J4m8O0Kk8l3J4NNlMmrJ5j5Kj0J0kKJpMJ2
8189Dj1O
$$ plain form
7997 13 4 6 8 4 9 6 17 15 13 8 11 3 5 8 5 13 2 -4 5 -4 -4 -5 -7 -8 -5 -1 -12 -3 -1 -7 1 -10 -10 -4 4 -6 -6 -1 -2 4 6 5 14 3 6 18 11 9 4 13 1 -1
8049 -1 9 3 -8 4 10 3 2 -1 4 57 4 -20 7 -5 -14 -9 1 -9 -2 -3 -3 -9 -10 -7 -7 -1 9 16 8 10 4 2 -2 8 8 6 -1 7 11 10 -2 8 4 5 2 -6 -15
8096 -15 1 -8 -9 -8 -11 -9 -12 -17 -11 -7 -3 -10 -11 -2 -8 -8 -7 -9 -2 -5 -9 -1 9 12 -6 6 17 4 4 10 17 4 3 11 -3 4 0 -1 8 4 -1 -1 -2 -11 -4 -12 -2 -10 -8 -3 -11
8147 -11 -7 -8 -12 -4 -3 -4 6 -7 7 -1 -2 9 3 18 1 4 40 13 27 -21 39 41 13 -20 -6 -1 4 1 5 1 -8 7 -8 -6 -16 -6 -8 -6 -5 -12 -8 4
8189 4 -7 -1
8191a
$$ Imaginary data points
##PAGE= N=2
##DATA TABLE= (X++(I..I)), XYDATA
0@%%%%%%%%%%%%%%%%%%%%%%%%%%%%%Qj6J6j6J6j6J6j6J6k4L2l2L2l8M6m8N0n8
47c2O4p1P9q7R5j04J15j23J36j52J68j87K10k38K70l05L49m08M86n99P77j103
69f60K904p867M001M956m578K046j344K453k577k933N338K13m423L008k464J491
85d36J475l543K148Q12j013q6J491q91j523P10J433J223m285J924K764l329l0
102a156K811r52j735l95K108J816o360K801M200m183J054q73O07L98j811K600
118I30N93l300M94Q12Q93K082l963P88J383j846J508P13l27j995P62J253K30j095
136h5MR35j834J367O18j034k31J37K60J215j416j272L000j747j77N77r3Q18k343
155a301J760J233k436J68J636j034M93m26j117J796p95O83r07n62J323j139L63
$$ plain form
0 0 0 0 0 0 0 0 0 0 0 0 0 0 0 0 0 0 0 0 0 0 0 0 0 0 0 0 0 0 0 8 -8 8 -8 8 -8 8 -8 8 -16 16 -16 16 -22 24 -24 26 -32
47 -32 32 -39 40 -47 48 -56 59 -64 72 -80 88 -99 111 -127 143 -162 187 -221 265 -334 443 -660
69 -660 2244 -5623 -1622 3334 -1244 802 -542 1911 -666 -3599 1739 1952 -2471 537 -1927 -436
85 -436 1039 -2504 -356 456 -557 -643 848 -43 -1566 -856 577 1800 -2485 -561 2203 -1126 -1156
102 -1156 1655 703 -1032 -1427 681 2497 -3863 -1062 3138 -1045 9 -864 -257 141 -1670 930
118 930 1523 -1777 -1283 -471 422 2504 -1459 -671 712 -1134 374 1087 760 -1235 -473 780 1010 -85
136 -85 -81 854 -980 387 1005 -29 -260 -123 137 1352 -64 -1336 1664 -83 -260 317 224 1042 -1301
155 -1301 459 1692 -744 -576 1060 26 519 93 -1024 772 -23 660 -247 -809 514 -625 -262
172b62J118n62k102J292J021j60m31p47Q43j013Q23J223r11j252J155m0n97J770
190A168j277p8l22N74O64j277J135l91j109J323O71k492J209J432j698l16O65
207a19J456k442j06K619j209j720J347J345j711Q4J68O14j13n19P09o28J85k22
225b62L70O71J0j842L98K075j589K10M45j1j305k7K442q45j955R98J483k157L46
244e45J366k69j155n89K384p60j356O13R75n68p00N30N40J57j884J213J129j077
262Dn24M57J039j338m51J303Q82k009o4J466p94j29o4J283q26j475J010J177p37
281B10r33J123j90n65o83J733N15k430O24J270k83j378R71Q27r23q76J075J176
299A263k052L01P43O6l48l57O77j30m86l46J291k19n89m94N75Q57j717Q17J177
$$ plain form
172 -262 856 294 -1808 -516 505 345 -86 -833 10 -1003 -180 1043 132 -1120 35 -5 -602 1168
190 1168 -109 -187 -509 65 729 -548 587 196 -913 410 1081 -1411 -202 1230 -468 -784 -119
207 -119 1337 -1105 -1211 1408 199 -1521 -174 1171 -540 -456 -288 326 213 -306 403 -225 -40 -262
225 -262 108 779 789 -1053 -655 1420 -169 41 486 475 -830 -857 1585 740 -1215 -217 1266 -891 -545
244 -545 821 552 -603 -1192 1192 432 -924 -311 664 96 -604 -74 466 623 -1261 -48 1081 4
262 4 -520 -63 976 -362 -813 490 1372 -637 -701 765 -29 -158 -222 1061 235 -1240 -230 947 210
281 210 -723 400 210 -355 -1038 695 1210 -1220 -596 674 391 -987 -16 811 -112 -988 87 1263
299 1263 -789 -488 255 321 -27 -384 293 163 -323 -669 622 403 -186 -680 -105 752 -965 -148 1029
318A029j076j391J351J026j360j22R45J95k093J211J511j404l50O03K33q34O11
335H5K40k8m96O7L73m21R07r00j38Q71l12o83O59O21j287J12P00N18j408K08J335
356A023j399j6R53J40j175L00M51j79m3J21L27j113P00J46m16N71j01o82j37J042
376E13n06j18O4K91n76m89J483m96n14J42K47l26J24L42j39M0o92O89j12J41L0
397A38n17N29k41j49J97N26q31m8M42M0l6o85R23k92n29L17N03k05p56L90M48
418A64K60j105O52N83r28n8O08P71j131l21Q38L29r86L82J076j114k66J44P89
437F87k97n00N48j90l65r4O81j15j03q24L30Q68r66P6N47J76j247K20J434n19
457C47j410O86J569j664k65J286K6j212KJ606o18r66K82Q84o95p3M76k17K16p91
$$ plain form
318 1029 -47 -1438 -87 939 -421 -543 402 597 -1496 -285 1226 -178 -528 75 308 -526 85
335 85 325 297 -199 -132 241 -180 727 -173 -311 560 248 -435 224 845 -442 -330 370 888 -520 -312 1023
356 1023 -376 -392 561 701 -474 -174 277 98 55 176 503 -610 90 236 -180 391 290 -392 -529 513
376 513 7 -111 -47 244 -332 -821 662 166 -348 -206 41 -285 -161 181 42 82 -610 79 -33 108 138
397 138 -379 150 -91 -240 -43 483 -348 -396 46 86 50 -635 288 -4 -533 -216 287 82 -674 -284 164
418 164 424 -681 -29 554 -374 -432 176 947 -184 -505 333 662 -324 58 1134 20 -246 -102 687
437 687 390 -110 438 248 -117 -211 470 355 252 -572 -242 626 -340 -264 283 459 -788 -568 866 347
457 347 -1063 -377 1192 -472 -737 549 575 -637 -635 971 353 -613 -331 553 -142 -215 261 44 260 -531
477e31L26M52n1n87L9P43n61n70O23J177j597l18J371m76p95M81J359j280r45
496a140J187Q08j130k57J161p04l84K15Q72k79q62K65M92K83o93P7O7L09n02L1
516a84J073q60n78M57R18o24n80N55K85o89j52J318q54m61M23L34k29o49P31P7
536C11l98k93N01o6k20P6R1L54j000K21P26O0o80j47O00k56J33j5L37n78k20O10
558A47J21J56o87j10M58L84n78J91J78o81K66L00M78r45r2O65l69pK80o0m73K76
580a02J06R5k39r2L48l35M65l46p4K29J68k40k34O30m31p6K67M82p63n52J152
601D58K12q34j92Q03o62j6O51m6n29n12R21j49Q5j7p00K19O05j68l91O11n72l51
623e74N72P54p93q89J270j17n58L21O14p91n14J040J03n12m78P92P4m73K1L31
$$ plain form
477 -531 -205 247 196 -391 -352 391 -170 -740 -117 1060 -537 -855 516 40 -755 -274 1085 -195 -1140
496 -1140 47 855 -275 -532 629 -75 -459 -244 628 349 -513 -248 244 527 -166 -89 -22 287 -215 -184
516 -184 889 29 -549 -92 826 202 -378 177 462 -227 -379 939 85 -376 47 381 152 -497 234 311
536 311 -87 -380 121 55 -165 -89 2 356 -644 -423 303 363 -317 -464 136 -120 13 -2 335 -243 -463 147
558 147 268 424 -263 -373 85 469 -109 82 260 -421 -155 145 623 -322 -414 251 -118 -125 155 95 -378 -102
580 -102 4 99 -140 -232 116 -219 246 -100 -174 55 223 -17 -251 379 -52 -128 139 621 -142 -694 458
601 458 670 -164 -356 447 -215 -231 420 374 -155 -667 254 105 190 173 -527 -308 297 129 -262 349 -223 -574
623 -574 -2 752 -41 -930 340 223 -335 -14 600 -191 -705 335 438 -74 -552 240 314 -159 -138 193
643A93P5n32L20Q1J06o91K08Q33l86l34l56P82R9o16R8M85n53m84J147J88p69
664a06p14J132K61r28M39J38l95m25Q99L29o27m86K70P25m74j57R0K26o01L8R46
685E80k06q07j16J187n55n16L92J47o0m52M76J44k47l70M78L37n57m21L91Q97
705G22j063o0P07k07n06L31Q43r54m72O14O45o43k43N29k91p3J36N40m98m55J73
726b25M80J99n56J14j52L41j92k4M43m14m24K10Q74n40n37L59N50o41l26J085
746F24n49n04L64N54n39l52O66j09k14n7K98l82K34J93l57J93j00k3n0N48m35
767Cm87M44K84j64m24O24l80l90M76L83l51n75M69J12K2k24K80k22k82M25o3K15
789A75l01m8L2K79N0l35J79K2N8l83N35P2n14J39K53Q3n43L62J57j50l14J83L32
$$ plain form
643 193 268 -264 56 137 243 -448 -240 593 207 -127 -483 299 398 -218 -120 365 -188 -672 475 663 -106
664 -106 -820 312 573 -355 84 222 -173 -598 301 630 3 -483 -213 512 38 -119 -29 197 -404 -366 580
685 580 374 -433 -549 638 83 -433 -41 106 46 -406 70 214 -33 -403 75 412 -145 -566 -175 722
705 722 -341 -401 306 99 -407 -76 767 -187 -659 -45 600 -43 -286 243 -48 -121 15 555 57 -398 -225
726 -225 255 454 -102 12 -140 201 9 -15 428 14 -410 -200 674 134 -403 -44 506 -135 -461 624
746 624 75 -429 -65 489 -50 -402 264 155 -59 -116 182 -200 34 227 -130 63 -37 -60 -110 438 3
767 3 -484 -40 244 80 -344 280 -100 -490 -14 369 18 -557 -88 24 46 -178 102 -120 -402 23 -40 175
789 175 -126 -174 -142 137 187 -148 31 53 111 -272 263 335 -179 -40 213 296 -247 115 272 122 -192 -9 323
812C23m27J49j6J87l41r6M09M4k92l15N51j56n0k2K34j12n00N07J59o0m26J55
834i5K17k9j25j4M37n90n6L47L47n06l85P16p4m29PP58n63n01N47K84l25m50P12
857B30j27m20R6M13p6m14K14j6K50l45Q8K35o6k29j85P28j71m84J4P02l88n53
879e04Q46Q6o11l32R87o3p75L44M49l65n06P83Ol64j99K88K13l94J90m9J42k69
901i7q5K64K12k80m87O84m0l79m5N94j88p72N81M18l22n67O88O2n68J74L88M6
923B81o80L06K98j17j98J18J82l03N8n8M33k94k56J91J36J6m10M28L6l20j88M97
945A56Q5m83J59J18Q7m28K85K75k86k06J09M37l58j1N3J96k63j35N28j51k02j42
967a77L87r8j28R4K7J0l30L63o6O6j77j31K74q0l1j26L67k98j94K04K89k11m39
$$ plain form
812 323 -104 45 29 216 -125 -221 188 232 -60 -375 176 20 -30 -52 182 70 -430 77 236 176 -250 -95
834 -95 122 93 -32 -46 391 -199 -255 92 439 -67 -452 264 190 -239 -232 526 -37 -538 9 293 -32 -482 230
857 230 103 -317 -221 192 116 -298 -84 -100 150 -195 -107 128 62 -167 -352 376 205 -279 -265 437 49 -504
879 -504 342 428 -183 -515 472 409 -366 -22 427 62 -444 339 345 -19 -218 70 283 -111 79 30 172 -97
901 -97 -182 82 294 14 -473 211 171 -208 -253 341 153 -619 -38 380 58 -509 179 241 -327 -153 235 281
923 281 -399 -93 205 88 -110 8 190 -113 -55 -113 320 26 -230 -39 97 113 -297 131 167 -153 -341 156
945 156 241 -242 -83 35 122 -306 -21 254 -32 -238 -129 308 -50 -61 -8 188 -75 -210 318 167 -35 -177
967 -177 210 112 -16 78 105 115 -215 148 82 148 -29 -160 114 34 3 -123 244 -54 -248 -44 245 34 -405
990d05N70r8k52OM59k09m50L68R1k9k68L36j37j52J93l9J41j64J2k05L82k4k70
1013a44J16J69l2n35O46R4n34m2M76j0n77M61J92k73l68M75J54m61J87K6Q4k87
1035a83K03R5%p2k61K84M8K5l46L26Q8m55J75M03k2p41M00L37k73k74L49K55p31
1058c70K12M41k1n21J05L38k14q8J5L32l61n0J64J69m9m37L33R8j10l16M00J70
1080B40m20pK64J79n81K30L29j87l72J46N33l44j46N9K91l45j12M93o0l72k20
1101d02O73k6l51jK94j56l30N05j3k22k95L35K75k54m9n2K36k40L2J24J32l17
1123a02k06O00p8k81j51N12j53m20K92K11j93m02N99Jm18l1L89O7n12K22P2k9
1145a1j45K42Lk57R3p0L41j27j88j56K82J81l53J68R2j76l38O78J08o34J3L39
$$ plain form
990 -405 165 67 -185 -179 280 71 -379 -11 80 51 -217 119 -18 -170 23 -16 125 -39 -27 -232 150 126 -144
1013 -144 -28 141 109 -426 220 314 -220 -262 214 204 -373 88 280 7 -361 114 268 -193 -6 20 104 -183
1035 -183 20 115 115 43 -218 66 114 139 -207 119 207 -248 -73 330 308 -433 -33 304 31 -243 106 361 -370
1058 -370 -158 283 262 -259 -154 184 -30 -118 -103 229 -132 -182 -18 151 102 -335 -2 96 -14 -330 70 240
1080 240 -180 -187 77 256 -325 -95 234 47 -325 -179 354 10 -136 -77 214 -131 -243 250 190 -182 -402
1101 -402 271 245 -106 -107 187 31 -299 206 193 -29 -324 11 286 32 -17 -69 167 -73 -41 83 215 -102
1123 -102 -308 292 214 -67 -218 294 141 -279 13 224 31 -371 228 229 -189 -220 169 236 -276 -54 18 -11
1145 -11 -156 86 89 -168 -75 -145 196 69 -119 -275 7 188 -165 3 95 -81 -419 259 367 -267 -254 85
1167H5J32m40L50L3l20j0L05J20l80Q7o7K15l1j04J9j4J10k29K44l7p1j48K42
1190I1J91m67O6J62J92l59M8K19j68j01K01K96n62j9K41J85j59j57J84k04J57
1211C7oJ48j37j99KK11K77m50l0J12J22j63P3J93l89k8J65L45l35j70J63R5Pk63
1235b20L20p1j87k2M00j04m34K93K03m7m00L33O2k15J24M5L8k82J51R8J64k25
1257B4k61K73J19k9k80L14j14k62K02L55j60o10L95K47r5k91K04J27m35K21L01
1278B45rn85K16K84l7j67rK45l59J91O7n9Lk10J86J29K4m40K65K42k50k08K96
1301F0J88n82K40L78j88m86L25L80l93o4J06J42l01J36K48j53j86o4L62l7r8j97
1323a84J67Q9j42J31J8K7l93K45L11j44l06R4L55l35K1J78R7l95J8M42j97j94
$$ plain form
1167 85 217 -223 127 160 -160 -170 135 255 -125 -38 -105 110 79 -25 -6 -20 90 -139 105 68 -3 -151 91
1190 91 282 -185 -119 43 235 -124 -76 143 -25 -126 75 371 -191 -210 31 216 57 -100 84 -120 37
1211 37 31 179 42 -157 -155 56 333 -117 -147 -35 87 -76 -3 190 -199 -227 -62 283 -52 -222 -59 36 43 -220
1235 -220 100 29 -158 -180 220 116 -318 -25 178 131 -269 64 126 -89 35 80 118 -164 -13 85 249 24
1257 24 -237 36 155 126 -154 160 46 -216 -14 341 181 -429 -34 213 118 -173 31 158 -277 -56 245
1278 245 236 -349 -133 151 114 -53 -62 183 -176 15 82 23 26 -184 2 131 155 -285 -20 222 -28 -236 60
1301 60 248 -334 -94 284 96 -390 -65 315 -78 -142 -36 106 -195 -59 189 36 -150 -214 148 111 13 -184
1323 -184 -17 72 -70 61 79 106 -287 -42 269 125 -181 -87 268 -67 -46 132 229 -166 -148 294 97 -97
1345i7J1L31k15j15J37N8o6j83K61o4o3j30J78J30k52k9N4K21k57K9R6l4j12j3
1369a24L48k10j64k5L18m9k21J45J2m5k19L94J3l02m7K10J33l12J54M0l9j75J91
1392B6J35k20J9p0J98r8k9MQ2K7k41J87P8j8k77K53J57l30J2K35J02m25J47K18
1416A72j21j63J52J89l57Q5J10R1j75m5J02l8Q7j41J25n5k7j09J53K06l41k7J56
1439B9J50l34Q8K90k24k27J67L50m02m2K33J6k36oL39j84j02j5K00r2j02J07j0
1462gQ6k52J51J13l4k02O3K71k30q0J23K20l49n3L65l6k32q5L70j68j67J37K09
1485B13j87k74L33N0r1j72K33J7k39O9J36J08l15P4J03L2j50JK52j91j06PK87
1508A90j38k02J54J17q5k39L32Ok23r5K90R2l89J11J69j3k93K13K00k64r8J31
$$ plain form
1345 -97 -86 245 30 -85 52 110 44 -139 122 58 -5 -135 43 173 -79 -108 -54 167 -90 -61 35 1 -111 -124
1369 -124 224 14 -150 -175 143 94 -127 18 30 -15 -234 160 173 -129 -176 34 167 -145 9 49 10 -165 26
1392 26 161 -59 -40 -110 88 -10 -39 -35 47 74 -167 20 98 80 -197 56 213 -117 -105 130 232 -193 -46 172
1416 172 51 -112 40 229 -128 -43 67 158 -17 -62 40 2 89 -52 73 18 -9 -118 35 241 -100 -127 29
1439 29 179 -155 -67 223 -1 -228 -61 289 -113 -155 78 94 -142 -148 191 7 -95 -110 90 -2 -104 3 -7
1462 -7 79 -173 -22 91 57 -145 -82 189 -41 -121 2 222 -127 -180 185 149 -83 -168 202 34 -133 4 213
1485 213 26 -248 85 135 44 -128 105 122 -117 -48 88 196 -119 -45 58 90 -60 -59 193 2 -104 -97 190
1508 190 52 -150 4 121 36 -203 129 135 -88 -183 107 199 -190 -79 90 77 -216 -3 197 -67 -165 -34
1530c4K18k93M7R8lj05m9K13p0j5j70K00L8j47QJ32Q5l62J49K27o9k79J72K33
1554B24l37J3J87J31l78M3K83j05j23L0K10k33lP7R1o8j38J16qJ05j90O5J16r5
1578A3j03O5K64k90n5J45J17k47k7L22j90j55O5K82k31r3J80l3p0q8K56j10p7
1601f0m8R8P6j00K2m0J42k18M9J47Rj60r4L30j35j11L2K08j51j81K44M8r8j75
1625a66K82j8j84L2J22N1k51J27O7K4j52N6J23j59J4K7J71j76p2P6J04k4j62J83
1649I5n8q4q6K69O5l29L1J68Q6l14J63J49j81j56J73K34l23JJ25R8j89m3J90j02
1673a8j2p4K05o6j04J4R1O5k32Q2R3K4k26R6J97j76m7R8K08l87l1L10L3k49k9
1698a35K99k16p3J79J73k83j59K59K3j1j49J46j7k1j0K8J42k48pJ49J50k86o3
$$ plain form
1530 -34 184 -109 -62 36 33 -72 -121 92 22 7 -163 37 75 -72 -64 68 153 -209 -60 167 98 -181 -9 224
1554 224 -113 -100 87 218 -160 -117 166 61 -62 -32 178 -55 -58 19 110 42 -96 20 12 117 -73 -8 108 13
1578 13 -90 -25 239 -51 -106 39 156 -91 -118 204 14 -141 -76 206 -25 -118 62 29 -41 -129 127 17 -60
1601 -60 -108 -10 66 -34 -12 -52 90 -128 -79 68 77 -83 -177 153 18 -93 -61 147 -4 -185 59 107 9 -166
1625 -166 116 98 -86 -54 68 119 -132 -5 62 86 -66 -10 113 -46 -32 -5 166 -10 -82 -6 98 74 -88 95
1649 95 37 -47 -133 136 201 -128 -97 71 157 -157 6 155 -26 -182 -9 225 -98 -97 28 126 -63 -106 84 -18
1673 -18 -30 -104 101 35 -69 -55 36 101 -131 -49 44 68 -158 -62 135 -41 -88 10 218 -169 -200 110 143 -106 -135
1698 -135 164 -52 -125 54 227 -56 -215 44 67 56 -93 53 36 15 5 33 175 -73 -80 69 219 -67 -130
1721a30K59l5j22JK14k43q5J79J42j90j73L04n3j17n5K17p9j78J52Q5q1k06K40
1744D6Q0j05j00m1J89p6K1m3J05j45j08K43R6j63k49L15J2j32mJ20m9k07K45M7
1768I7p3j98J33J33j08j7rJ12j90R0J24m4j42j0K25q7k6o6J16k7o3M5K0M9k20
1793a36J72J14r1k21J44K47k56m3P7R1k12J21J83j71j28J1K58j06n7o3M1K5n0
1816e0J50n6m3j46J59P1j04n2j5J86j49K7L0M1j57lK93j68j71J7L07j48j36J81
1840F4Oj27q4K93j06j27J9J14L9j63N8j1J50j40m0P0Jq8L2K55j90j83O5K03l8
1865G2j37J56o4j19p0L15jk81R1J34K9k47J66K7p2p0J41P8k43K7P4J36j49p6O7
1890a6M3k8j20K26n1j32o6K40ok65J31J21l1k35J55J04j18k1J00J04l02P4J35
$$ plain form
1721 -130 129 94 -28 -27 187 -56 -141 38 180 -10 -183 121 68 -49 -104 113 34 -144 8 93 12 -194 46
1744 46 126 21 -79 -120 69 -7 14 -29 76 -69 -177 66 162 -1 -250 65 77 -55 -59 61 12 -195 50 97
1768 97 24 -174 -41 92 -16 -33 -42 70 -120 -30 94 50 -92 -102 123 36 10 -56 60 33 -30 15 35 84 -136
1793 -136 36 150 59 -162 -18 229 -27 -70 7 98 -114 7 190 19 -109 -98 160 54 -3 -66 -25 0 -50
1816 -50 100 44 1 -145 14 85 -19 -71 -86 100 -49 -22 8 49 -108 -111 182 14 -157 -140 167 19 -117 64
1840 64 70 -57 -141 152 46 -81 -62 52 91 -72 -14 -25 125 -15 -55 15 16 -72 -40 215 25 -158 -93 110 72
1865 72 -65 91 27 -92 -162 153 152 -129 -38 96 125 -122 44 71 -1 -71 70 148 -95 -68 6 142 -7 -83 -16
1890 -16 27 -1 -121 105 54 -78 -144 96 90 -175 -44 77 46 -189 -34 70 -48 -69 31 135 -167 -93 42
1913D2Q4j50r7J79q6k2Q1J10k09r1J66M1Rj60J07M8n2r1J80N0k43L1J36J41l47
1938a43P9J03M2j02j0K06k20n6J28J23j73r8K47p5m5q2J73n6o2K5K1L4j42J04
1962B1K6K3j38j0J80q9o4k0K02j91n0J65M0j55j38K94n9r8k1J49o8j45J72L4l8
1987B2j55J51K2o3pJ5R8j48M0J2J03j05p8J38Pm3j24K19l2j58K0J59j6k23J77
2012C1M5o9j30J87P4k14L8N5Q7j64P0N5l1o3k4J62r4j6n7J33l4j15R2K1J5j73
2038a19J29R2r3r3Q3J48k34L9J04L5k12L7K04j14p1LJ58j65j5Q8O3p0j32J50k4
2063iJ7r0J15Lj34L0O9J17k00L6J00j7j10J8K10j99m9R7J18j49r1K21jj10j05
2088a13K49j04j10O3J15l6j78J41J1Oj26R6Q6j00n8oJ84j37k3O1O4j34r7K49k4
$$ plain form
1913 42 126 -24 -121 58 -28 -50 31 141 -68 -159 7 48 57 -103 4 52 0 -91 89 139 -104 -73 63 204 -143
1938 -143 -64 39 81 -21 -31 175 -45 -101 27 150 -23 -121 126 51 6 -76 97 41 -21 4 25 59 -83 21
1962 21 47 70 -68 -78 102 13 -51 -71 131 -60 -110 55 95 -60 -198 96 37 -61 -82 67 -1 -146 26 60 22
1987 22 -133 18 40 -23 -30 -15 83 -65 -25 -13 90 -15 -93 45 52 9 -115 104 72 -86 -66 93 77 -146 31
2012 31 76 7 -123 64 138 -76 -38 17 104 -60 10 65 34 -29 -53 109 15 -1 -58 75 41 -74 18 39 54 -119
2038 -119 10 102 9 -84 -1 147 -87 -48 56 91 -121 -84 120 6 -65 -62 96 -69 -84 4 67 -3 -135 15 -9
2063 -9 8 -82 33 36 -98 -68 1 118 -82 -46 54 37 -73 -55 155 -44 -93 4 122 -27 -118 103 102 -8 -113
2088 -113 136 32 -78 -15 100 64 -114 27 38 44 -82 14 100 0 -58 -64 120 -17 -40 21 85 -49 -146 103 79
2113G9j05q1J99o4j42J32P7m8k10K09L4j24m1J17N5j93Q1N2Qj30M8J06o7l1o0
2138i9J79q9m1MJ19m8j78J63N0l1j56J85M8j92LJ30Q7k38R0O7l4r7P6J57j79r
2164c3J9J06j15j0R8m2j5p8J53n8k8m8Q3N4j51N9M9M3j94P1J39q6r9M3J88k08
2190f0nJ02M6j35m8J87p2l8m7J25m2o5N4K1L1j54R7J8J4p2NQ8q6J0jJ27j48m8
2218i6J27J7p3q6K10q1j07O3J22o7j27J52rl6j14J71K5r9j3RR1j14N0QM5q1n2
2245f5J42k1m6r2J71k1j21L0Q5rj67J89K7r8j13J38O7j71O8K8K1j48J07P7p1o3
2271e6RJ33j19kJ4Q2o0p2J07Pj5j51K05j0j02p4J07J23k05L5O8K9j48O8J45j54
2297c6m6L1J82j61l6R2l0k5k7J60j20l3j1J21K4j29L0J4O6j28R2M8p9q1Q2J50
$$ plain form
2113 79 -26 -107 92 28 -114 18 95 47 -163 46 80 -44 -85 32 87 -106 -25 27 35 -95 -47 59 -8 -39 -99
2138 -99 80 -9 -50 -46 73 25 -153 10 60 29 -127 58 106 -86 -83 47 134 -104 -14 53 19 -78 -2 155 -24 -33
2164 -33 -14 92 -23 -33 65 23 8 -70 83 25 -3 -51 32 86 -65 -6 43 86 -108 -37 102 16 -83 -40 148 -60
2190 -60 -65 37 83 -52 -100 87 15 -23 -70 55 13 -52 2 23 54 -100 -3 15 29 -43 -38 50 -36 -26 -27 100 -48 -96
2218 -96 31 48 -25 -111 99 18 -89 -26 96 29 -98 54 45 9 -105 66 91 -8 -21 -12 79 -35 15 23 68 -13 -65
2245 -65 77 56 10 -82 89 68 -53 -23 62 53 -114 75 102 4 -109 29 96 -75 -7 21 42 -106 1 78 7 -56
2271 -56 -47 86 -33 -35 -21 61 1 -71 36 43 28 -123 82 72 -30 -104 3 126 -79 -44 24 53 -95 -27 118 -36
2297 -36 -82 -51 131 -30 -66 26 -4 -29 -56 104 -16 -49 -60 61 85 -44 -14 0 66 -62 30 78 -1 -82 0 150
2323A50j88k8P1J18j55l5J59n5r2j7K21j37j19R5R6m5j40J36l3Km5O2jq8N0RJ06
2350I7j56k4O8P0o5n3J35j15m9N7J60j16j39J39L6k0j27J64l8q6K2J10Ok01R9
2375b6O1K1j09K5O9o5J7j6Q8r3j5L9O5j1j53J22L3j6j02J13Rj26Q0O8Qk01J20
2402ER1m7p7J6Q3j31P2K3M8j43lJ24ol4r5R6k5oKK9J1j25Q1N5L1j74L5J10m6n1
2432e1J0J27j57J0J12K3j43l2J87q9k8j3J02p0k4Q0k0j1r9J12J6k6q9M3J05r0
2458a5J8jO3j25J6J36k6j11o3K14m6r3J7Q8p1j03J73Lp0j01J59K1j13K7K4L7j10
2485e2O9J4Oq6MJ33p1m9k8J34o7q0P2N0o3j01J89j8j03l1J33K1j67N7N7J2j23
2512h8J00O5j04m2N7J22j50nK7M8m0l7J16o5j1n8J27Lj17LP9M0j56R9N0n0j03
$$ plain form
2323 150 -38 -66 5 123 -32 -67 92 37 -55 -72 149 12 -107 -12 84 39 -101 35 2 4 -41 21 20 -68 -18 -9 97
2350 97 -59 -83 -15 55 -10 -63 72 -43 -92 -35 125 9 -130 9 45 25 -102 62 24 -62 -40 70 76 -125 -26
2375 -26 35 56 -53 -28 41 -24 -7 -23 65 -28 -43 -4 61 50 -103 19 52 36 -66 47 56 -70 10 78 86 -115 5
2402 5 96 49 -28 -12 71 -60 12 35 83 -60 -63 61 55 21 -74 22 -3 -9 -7 22 33 -92 -11 44 75 -99 -64 46 0 -51
2432 -51 -41 86 -71 -61 51 74 -69 -101 86 -3 -31 -44 58 -12 -36 44 24 13 -86 26 42 16 -73 -30 75 -15
2458 -15 3 2 65 -60 -44 92 66 -45 -108 106 60 -33 -16 72 1 -102 71 74 4 -97 62 83 -30 -3 21 58 -52
2485 -52 17 31 37 -49 -45 88 17 -32 -60 74 7 -73 -1 49 -14 -115 74 56 -47 -78 55 76 -91 -34 23 35 -88
2512 -88 12 77 -27 -69 -12 110 -40 -45 -18 30 -10 -47 69 4 -7 -65 62 65 -52 -49 30 70 -86 13 63 13 -90
2539i0J05J06j59oO8P6j62K9J09m3n5k5J52j12l0L8O5m6p5R0j0K0j05Q0K2n4k2
2566c4M0Q9j46ON9N5j11j9J35p9n2J4J44j13q1J09L0n5q2J50n3m6nP5oq3N2jO1
2595E3r6L7L8j8l8k7J38q6m4J0J08p1o9J20lo0o7J51k6q4J9N8Nj16R6K0k4p8N3
2624aP0q2QqQ8q8j1M4J9k5p3J09j7l9m2R5J1j22M3M6L3j43R9M1p3m3O1Q8j55K4
2654d3M4M6r0jQ3n5j0k8J09m8n6J3N3K2j18P9J9Mj05P7P1j01j2L1J10j35%Q4J0
2683E3q5j4J40r3m0K4J16r9o2J08rk2q5J19k2m4LK9M0j06L7L1N0j01rQ7k4n5J0
2712b3J28j16n5Q0P4q4j05J45nn4n4J36k8j09O2L5J0j12P8J3k0l2K2O4q5MjQ9
2740E7p2n6R2nk6q5J61k9q4MR5j5j29J10M7m0r8J03M2q9JM0M9j18M0N2kn9j2Q6
$$ plain form
2539 -90 15 121 -38 -44 24 100 -62 -33 76 33 -22 -47 105 -7 -37 1 66 20 -55 35 25 45 -60 20 42 -12 -34
2566 -34 6 95 -51 -45 14 69 -42 -61 74 -5 -57 -43 101 -12 -93 16 46 -9 -91 59 6 -40 -45 30 24 -59 -7 -8 53
2595 53 -43 -6 32 14 -24 -51 87 1 -43 -33 75 4 -65 55 52 -8 -75 76 50 -34 -15 43 48 -68 28 48 24 -54 -1
2624 -1 69 -13 -5 -13 75 -13 -24 20 39 14 -59 50 33 -6 -48 47 58 -64 -21 25 58 -85 14 55 -18 -61 0 88 -67 -43
2654 -43 1 47 -43 -44 39 -16 -26 -54 55 7 -49 -36 17 39 -79 0 19 23 -82 -5 66 -35 -47 -16 94 -41 -41 43 53
2683 53 -32 -46 94 1 -39 -15 101 2 -60 48 39 17 -68 51 29 -15 -12 17 57 -49 -12 19 69 -32 -41 46 22 -33 -23
2712 -23 105 -11 -66 14 88 4 -101 44 39 -15 -69 67 39 -70 -8 27 37 -75 3 16 -4 -36 -14 50 -35 -31 -32 57
2740 57 -15 -71 21 16 -10 -95 66 37 -47 -43 52 37 -92 18 65 25 -73 30 72 -17 -16 24 73 -45 -5 47 45 -14 -26 60
2770F0m7ql0P7l0o1M6K5J0j16Q7L8n3m4N9O7j45M5M4M7j28K7Q8o2k7OR7r3k2L4
2800iN7m2o2P4l1Jm5Q4Mo5mK6O7j10L3L1K2q1MJ21q6l6L4R1j04k9O9K0n5n0R2
2831B1J6m4k9P7k9o1O2OK4p6K9O2m0j5j8Q4r4kL4O7q2n7J02J3m1o2J17m5q1M8
2861a4O3oj34J04K7l2n0M4M7q1K0kN3q2J4N7Lk9q0J21l3l6j5Q3j9j05Q8M3k5j37
2891a13J19M7p5k5M5O5j30N5N1j6r3K2J12o7k2k1Q2m1k0L9J7l1p9J21J3l3p0O6
2919A8O1r4J9J7M2j34N9R0m3q8J9J31j09k2L1O2q5k1J15m7m4n5J28k9n7J2K6L6
2947C8r5O7rJ2q0N4Q7q8k8KJ16j01lM2Nn2l8J51o1o9j3J24k6j06P0K1j7o6J08
2976D5j1o1j2M5O6r9PPN0n1j3O4k9k1l1J26n8o7K2P4j5r2R0qk6l9R5Oj16L3M7
$$ plain form
2770 60 13 5 -25 52 22 -39 7 32 42 -74 13 51 -2 -46 13 80 -65 -20 24 71 -57 -30 58 -4 -31 -25 72 -21 -43 -9
2800 -9 48 6 -56 18 -13 -12 -57 27 31 -34 -38 -12 55 -55 -22 9 31 -50 -46 75 -11 -47 -13 78 -26 -55 14 34 -21 -71 21
2831 21 37 -7 -36 41 12 -49 13 19 43 -33 -4 58 18 3 -15 69 -25 -27 7 74 -8 -65 37 50 9 -53 64 19 -62 -14
2861 -14 49 43 -91 13 40 8 -42 2 49 -32 -12 -14 39 -43 -29 28 31 2 -78 43 10 -26 -41 42 23 -82 6 49 24 -113
2891 -113 6 53 -22 -47 -2 63 -67 -12 39 23 -70 -48 64 -3 -25 -46 36 -5 -25 14 31 0 -79 42 55 22 -48 18
2919 18 79 -15 4 21 63 -71 -12 78 35 -53 -34 97 -12 -34 -3 59 -26 -47 68 21 -23 -78 50 21 -36 -24 2 38
2947 38 -57 10 1 13 -67 -13 74 -14 -42 -40 76 -25 -28 14 19 -33 -71 80 19 -50 -63 61 35 -71 -1 20 3 -63 45
2976 45 34 -27 -39 6 72 -27 -20 -13 37 -14 -27 37 8 -13 -44 82 24 -43 -21 53 38 -54 36 28 2 -37 58 64 -52 -19 28
3007B8K4r5J3O6o4OJ7O7j15lM4L9m1m0M9J5K1j20J36n3j1n8J29k8q0M9J4Jq8L2
3037d6P7n0j3K1P8r8mM8K7m7m9Q5l0J2m7O9k5n4L8L2L2j29M9M5J5o2oQ7q4nL2
3068bQ2j07l7J06%m1n9J13m4l5K2N9m0q3R5%oo7N1K6l6Mj2O5r5K3L6K7o7l3Q5
3099C0pl9l4Q5k1q2N9L4m8m9O8L2n9QJ7N8j21M8L0pn8L4O0k7pm3R3n4j4jN9l7
3131Go6P8J6l1o4J01J4r9K5N2J6j16P9K7j9p7M4P8q6mK3O1q4jO1rj5m3N5mk1j8
3163b0N3J5r0M1L0Qr2N2N4n7n2M1P8j04KM1L8p3j8J06o3k0rP6l8l9L3L0j1p5Q3
3194B0qpm7L5N4o3NkO0p7KN6Lm3l2J05n5k7mP4m7o4Q6mk0n6Q6nn3J2L2K6r1N2
3228CLK0n4lP2l6rk4Q8n9k1K8K1k0q9J10Qm6m0P6K7j00M7K2Qr9P5L1m4l9J7O1
$$ plain form
3007 28 52 -43 -30 36 -28 -22 -5 62 -53 -56 -12 27 -14 -54 -5 10 31 -89 47 -6 -17 -75 54 26 -54 -5 9 10 -78 -46
3037 -46 31 -19 -32 -11 67 -31 -35 13 40 -7 -56 29 -1 11 -36 33 8 -46 -8 24 56 -73 -24 21 36 -26 -32 55 -29 -34 -2
3068 -2 80 -27 -64 42 42 1 -58 55 11 -24 -2 57 17 -66 29 29 23 -44 7 33 -3 1 -11 54 -41 -18 18 45 -22 -55 30
3099 30 23 -16 -50 35 14 -68 -9 25 -23 -72 -4 28 -31 -23 -6 52 -69 -21 9 2 -56 -22 38 11 4 -39 54 0 -14 -15 44 7
3131 7 -59 19 35 4 -60 41 55 -44 -19 33 49 -67 12 39 20 -57 -13 65 -21 -25 -2 59 -25 -26 35 26 11 -32 23 19 -2 -20
3163 -20 33 48 -42 -1 29 37 -55 -3 51 -6 -58 -17 61 -43 -41 0 38 -35 -53 53 -10 -30 -39 37 -1 -40 -7 23 12 -63 20
3194 20 12 5 -42 -7 47 -16 -11 -13 47 -30 -28 28 31 -12 -44 61 6 -21 -25 49 2 -62 24 20 0 -56 30 25 -28 -16 16 42 -49 3
3228 3 6 26 -28 -31 41 5 -4 -28 60 1 -20 8 29 9 -80 30 38 -8 -48 28 55 -45 2 24 32 -67 8 39 -5 -44 -27 34
3260C4o6K0j1L3l5j9N7rj0o8J00jm4j7M5K6r2O3L1Lq5L6P6p4k3J4Q4r5KO2km7
3292a2k0J00o7j4j4O9k1k1k7K1L0p3O2J9k7m8L7P3r5%K4N7q2j8R4l2m8j2J14p0
3322an0L5M3j7o4Q6j2l3m7P3No6K7J3M3q3K4L2Jm0qQ2m1l6OO7l4p2P4J3k1o3Q5
3355B1No0RN6Or7P0J4Jp0M4L9m1njO6o2mJ9L0k7n5O8nk0m3P5Nq5M1L2K2p4K8J9
3390B1l5k9L7P5r6QK2L6p6PO1k9j2k9P5l6k5kM9j5n4M8LPo4N4L6n8j7K0N8r2J7
3423c5L9J0m9jJ06p6l4J8O3n3k2M1J1Lm2N6j4k0k8M0M1p0jK1L7o6J9M5j6m3%Q1
3455F1o9j8J2O0l1o4O5jk0l5P6j4p0J9M8J7q2L7J6%l4K0L6m7lqO9m4m6L4L7j9
3487Bo4P9j4m4QO6%r5M4M7j0p8N2K9l4j4K8M2r0J6L6L1n8j7N9k1J3l6M6j0o5N1
$$ plain form
3260 34 -32 -12 -23 10 -25 -44 13 4 -6 -74 26 25 -19 -36 9 35 -57 6 37 40 -45 -9 67 -7 -30 -16 68 -27 -25 37 35 -12
3292 -12 -32 68 1 -13 -27 42 21 0 -27 -6 24 -49 13 32 5 -43 -6 67 -28 -28 -4 53 -29 -47 47 15 -33 -45 69 -1
3322 -1 -51 -16 27 10 -54 32 20 -13 -60 13 18 -48 -21 -8 35 -48 -24 8 9 -31 -39 43 2 -34 -28 39 5 -67 7 20 -1 -64 21
3355 21 26 -34 -25 31 37 -60 10 24 25 -45 -1 38 -3 -8 -9 57 -5 -9 10 40 13 -42 26 21 1 -42 33 38 -47 -6 26 48 -26 2 21
3390 21 -14 -43 -6 69 -27 -19 3 39 -37 -30 31 2 -10 -39 36 0 -25 -27 22 7 -47 1 4 11 -53 1 37 -21 -38 -18 40 -52 -35
3423 -35 4 14 -35 -36 70 -6 -40 -22 41 -12 -34 7 18 21 -21 35 21 1 -27 13 54 -16 -17 4 41 -25 -6 39 23 -20 -20 61
3455 61 -8 -26 -14 46 15 -49 16 15 -5 -40 36 22 -48 -29 19 36 -46 -9 7 7 -27 -7 29 -18 -21 -29 40 -4 -50 -16 21 2
3487 2 -62 17 3 -41 -33 33 33 -62 -18 29 19 -59 -7 22 -12 -26 2 44 -46 -30 6 37 -21 -38 21 0 13 -23 23 13 -52 -1
3519aM7Pj02L9M5pm8O0J2j06K3L1O8q7M7K4l4l6j9P4m8oOL6m6l6P5jj3n3N0J8
3551A9k7nJM0p6L4L2K0r3K1P0k5j5k9P8p3j2N9J1n3l8R8j5l3k8M9Rm6K9J4lo0
3583d7L8L5k3k7JN7m4JkN8n3k9O2Pm9l0R7j1o3J7K4on6O0K2m2m5N6L5m9j4ON2
3616C8n7K2ROl8j8P6k6l9j8O1Qo0K8J9Kn9N0K9m5k9M3M7p5J8J4J3n1K1M6o0J2
3648a3jN9m9j3J3J8om1M5mkm1M4L0o8MK8L7p7K3L7jm9OO5m7k1K1N9o3j8M6Mj9
3682Fk4P0k7m0kK9J7o0L1lL0n7J9L6j6l1RN9n4k1K1L7l5n0O5pk6nO3k0m9K2L3
3715B0Jp2N8Qj5k7J9L2m8J2mM9m8k0N2oj1m5P7k3m2J1N2rp3N2L0j9n7N1K9n8R
3748a5J8L4o6K7K9j6k8LM6k9lk0N1j5l1J4J8Pn8N1J4l5k6M0L5p8J1L9J1p0K4M4
$$ plain form
3519 -1 46 53 -49 -10 35 28 -20 40 52 -54 -31 0 68 -19 28 52 18 -18 -37 37 -11 -17 -11 25 -21 -57 18 17 4 -49 1 19
3551 19 -8 -13 -12 28 -48 -14 18 38 -55 -34 36 11 -4 -33 45 -28 -40 19 30 -23 -61 37 22 -11 -39 10 19 -27 2 16 13 -47
3583 -47 -9 26 3 -24 -23 34 -10 -9 -11 47 -6 -35 27 34 -15 -45 52 41 -22 -5 19 13 -43 17 39 -3 -48 8 43 -6 -20 -14 38
3616 38 -19 3 12 18 -20 -38 38 12 -27 -45 16 24 -36 -8 11 13 -46 4 33 -12 -41 2 49 -26 -8 6 19 -32 -11 35 -25 -13
3648 -13 -14 45 -4 -17 -4 14 8 -33 12 8 6 -35 9 39 -29 -25 3 40 -37 -14 23 22 -27 -21 44 -3 -24 -3 56 -7 -25 21 25 6
3682 6 -18 52 25 -15 -17 12 29 -31 0 -3 27 -30 -11 25 9 -22 -13 46 -8 -29 -8 29 -6 -56 9 2 -24 -29 34 14 -35 -13 20
3715 20 21 -51 7 15 0 -27 -8 24 -24 -12 -16 33 -15 -35 17 11 0 -45 32 9 -33 -22 30 21 -52 0 30 11 -46 5 34 -24 -15
3748 -15 3 37 -29 -2 27 11 -17 -14 32 3 0 -20 31 16 -15 -1 17 24 -34 17 31 -4 -30 10 45 -33 -22 17 28 -42 -18 26
3780B6k9j9kO3o4j2K4M2l4k8N2k1qk6N6j0l7mL6K5o5K0K6Ol4qO3o0rK1O1n9k0
3813b8L7Rl0k8P3l4k0J2L6mn4L6OJ5n8M5J0k6j3J6M1m5j2J7L8m2l5O2j3j5l0O6
3845C2k0m7L1K1mp1O2Mol7L9J5n1K0J2K9o1JL5opk0N4k8j2j9N3j7m8N1J4kn5L7
3879aK7l2k1L6L1q2L0M0Km7MM7m0j2KN6m9j4L6Kj2m7N8%om3L9K6n2J9J7Ro7L8
3913fL6j7l3J1O5o3j4K1L5m5k2O6k3k3k9O0j6k1J0K4Mm4J6J1Ml8K3L8n2jQM7m7
3946a5j6N1Ml0k4P4l2k9rO7k5n6M7J3jn0N9lk5j1K7L9n9NPL5n9OK8kj9k1O6k5
3980A7l5J1M1j1n9M4J6j1m6M4K7p4M3PJ9p0M2K6k4k7RM8m4NmK7l0j6L2J0pm1L8
4013GOk1j9L3K0n9J0K7J7o4L7M4m2j6MM9n5QK3Rk2k7O7k1rk0L7Km2K6kJ5o1N4
$$ plain form
3780 26 -3 -22 -24 39 -25 -37 -13 29 -5 -33 19 -2 -10 -36 20 10 -27 -31 5 30 -35 -15 11 17 -17 -25 38 -22 -31 -10 51 -8 -28
3813 -28 9 18 -12 -40 33 -1 -21 -9 27 23 -31 5 11 26 -32 13 23 -3 -16 0 41 -4 -16 1 39 -3 -38 24 11 -4 -34 32
3845 32 12 -35 -4 17 13 -58 4 8 2 -35 4 19 -32 -12 0 29 -32 -31 4 -2 -9 -29 25 -3 -15 -34 19 2 -46 5 19 17 -38 -1
3879 -1 26 -6 -27 9 40 -42 -12 28 30 -17 -13 34 -6 -18 -16 40 -9 -23 13 15 3 -44 14 14 8 -35 4 30 -22 -3 14 23 -44 -6
3913 -6 30 13 -20 -9 56 -7 -21 0 35 -10 -32 34 11 -12 -41 19 3 -18 -8 16 20 -24 -8 3 7 -31 -8 30 -22 -23 -15 32 -15
3946 -15 -31 20 24 -6 -30 44 12 -17 -26 41 16 -40 7 20 19 -31 28 25 0 -11 16 55 -4 1 8 43 -16 -10 18 16 -3 -24 42 17
3980 17 -18 -7 34 23 -36 8 24 13 -33 11 38 -36 7 14 33 -37 5 31 7 -20 -11 37 -7 -2 -6 21 -9 -25 7 17 10 -31 7
4013 7 13 -8 -27 6 26 -33 -23 4 21 -43 -6 38 -4 -20 -16 33 -22 -14 9 18 -4 -31 36 15 6 -14 23 25 -17 9 7 22 -39 15
4047A5J8j2m8J9N5n1kML7m9kM2j4j8l4Q3l3j7KL2j8m3N9j1nm6M3J7k8olM6n7J5
4081a0MJ9k3l1P1l5j0j4M8j3m1K7J4pn0O1Kk9j7L9M2p7K1nN6l5K9K1l6k7nN1m3
4114clpL6j1m1M4%lk6M2Ro0LM3J9p1L5J4nl9K6L4n1JJ0L4l4rL3j5Ol4N8l4j7%
4150a6M1ol2QJ1K3n9J8L1j9k6K1M2n6j0L3K5m8MM6m1okN0l7j6K6J1Kn8L5J9pl0
4184b3K1K6m7J7PL2n3KK3J8k0k5N5k0k3KM7l8m1O8npm2N0qj9%J6Rn1M1nJ7l6m
4219a6L5j9j2jL7l4pJ8K0j0m6N4mj4k7L1Nl0K0RK0o4L2L0k2k6J2M3n2J2J1Nl4
4252b4%M7j3ol0L9Nl2MK8jm8K9K3jn1L1K9l6nLM3n1OL2kk3j4N1k3j4rL1j0l1L1
4288HpJ4m0M0okk1J0L6n9J4J6J3l1kM8k9j7j1N0j7l1K2J8j6l6N3j2kl0L9Kl2J4
$$ plain form
4047 15 33 21 -27 -8 47 -4 -6 -2 35 -14 -16 26 12 -6 -40 43 10 -7 -5 27 9 -34 25 14 9 -37 6 23 -5 -11 -14 32 -25 -10
4081 -10 -6 13 -10 -41 30 -5 -15 -29 19 6 -35 -8 6 -1 -51 10 12 -17 -34 5 47 -30 -9 -14 42 7 36 57 21 -6 -11 40 -3
4114 -3 -6 -13 23 12 -29 15 15 12 -14 28 37 -23 -20 23 42 -29 6 20 15 -24 2 36 -15 -14 -4 30 -4 -13 20 5 11 -23 35 1 -16 -16
4150 -16 25 19 -13 -5 6 29 -30 -12 19 0 -26 -5 37 -19 -29 4 29 -19 -15 31 -10 -16 -18 32 -5 -21 5 16 18 -40 -5 14 7 -23
4184 -23 -2 24 -23 -6 1 33 -20 -18 5 23 3 -22 33 13 -10 -8 39 1 -40 28 23 16 -26 24 16 -3 -3 13 22 -29 12 7 24 -12 -16
4219 -16 19 0 -12 -13 24 -10 -17 1 21 11 -35 19 15 1 -26 5 10 -20 0 9 29 -35 -3 27 5 -21 -9 34 -18 -6 5 10 -24
4252 -24 -24 23 10 4 -26 13 18 -14 -10 18 17 -31 -2 21 20 -31 0 29 -7 -12 -9 34 -17 -11 21 19 -4 -18 33 10 -4 -13 18 8 -23 8
4288 8 1 15 -25 15 9 7 -14 -4 32 -27 -13 3 16 -15 -17 31 2 -15 -26 24 7 -24 -2 16 0 -36 17 5 3 -27 12 14 -18 -4
4322dKK7n6L1RJ4l7qM5j6j3NL2l1k5L9J2k8m0O6lk5j3L5Qm3K1NKl3K1K9k4j6O
4357fM4m3KJ3J1k2l1N5oj4l0L8J4m3J2J4J5n6K9J9j1k7J9L6n4QJ0L0n0NL3j0j9
4390a5j8N7k5k0J5J2Jl9L3RPm4L5J4k3j1J0K2l0NJ8Ml5oN0j6k0pM7k3l4K0J6r
4424@k0L0rlj5L0Pl5PJ7J7l9LK9j1j4qO1m4k0J4L2k2k3K7rj0k0N0j0l9K3J4Om4
4459b8K8%J0l0PK6k5lJ0K8k8j5K4J0rl7N0lk1j8M4rl3K8JJ8n7L1K8l8KJ4K1n5
4493b9J0J8K0k1rL3j7jk9M5j9j4lL1%m6L8Qll5L8J8m6LJ8K4m9%L9j0j6k0N8l1
4527Cj5PL4l4k1L5j2Mk4L9j1j6lK1J1m8K2J8mk8J2M4l6nmM7m1j9L2Nj3k8N6k4
4561Dj5JK5kk8J5RJ5n2L3K%k6K0J2rk0LM2l5j3L6Pk5k9N2j2l2J3K8nl8L3Nj1k4
$$ plain form
4322 -4 -2 25 -31 0 9 23 -14 -22 23 7 -6 -1 31 0 -25 14 26 -2 -42 24 21 -4 -17 18 26 -17 4 9 11 -22 -1 28 4 -12 -6
4357 -6 38 -5 -3 10 21 -1 -32 23 17 3 -27 11 25 -18 -6 8 23 -33 -4 15 4 -23 -4 32 -22 -14 -4 26 -24 -19 14 4 -15
4390 -15 -33 24 -1 -21 -6 6 7 -32 1 10 17 -27 8 22 -1 -12 -2 20 -10 -5 13 17 -18 -24 26 10 -10 -17 30 7 -27 -7 9 0
4424 0 -20 10 1 -2 -17 13 20 -15 -8 9 26 -13 -10 19 8 -6 -14 47 3 -17 -3 29 7 -16 11 2 -8 -28 22 12 -27 -4 10 16 -28
4459 -28 0 0 10 -20 -13 13 -12 -15 -5 23 -5 -20 4 14 5 -32 18 15 -6 -24 20 11 -22 6 7 25 -32 -1 27 -11 -9 5 26 -29
4493 -29 -19 -1 19 -2 -11 22 5 4 -25 20 1 -13 -16 15 15 -31 7 15 12 -23 15 33 -13 -10 8 32 -17 -17 22 12 -4 -24 34 3
4527 3 -12 -5 29 -5 -26 9 -3 1 -23 16 5 -11 -14 7 18 -30 -8 10 6 -22 -10 34 -2 -7 -11 36 -5 -24 8 13 0 -28 28 4
4561 4 -11 -10 15 13 -15 0 9 24 -28 5 7 7 -19 1 13 4 -16 -13 29 -6 -19 17 24 -1 -30 22 10 -22 -9 19 14 -24 9 14 3 -21
4597b1K7J1k5lJ7K3l8j4K4J1k7j4N5k4j1mJ4jk4K3O%m3L5Rqj9K2J8m5J6PLj6m
4632b0L0Jj2j0M4l9j5K4K3k1l3L4Ojk9K8J3l3J0J3J4o2J9K7Jk0nK4j4j9J4L4l2
4665fpK2Mj5k3L1lj0nL0j5k6J6J6Kk7OK9j5j3nK7j6j6J5J5k6k0M5j0mj9L3j5l4
4700c9J6P0J3j08P0j6Jk7L0Rl0J0NJ3l7PM2j9Jl5M0j0krK3nk5K6Nok6K7J5l1q
4735a0J1J4k2J3JJ0l3NL2j8rrK3j1qOK7k7j5L1Ok2j3J8Pk3J2jJ3l6K8K0k1k2%
4770b3N1m0nJ3K1j0k9J9Krj6L0Mj7kK1Ql0NJ1Nk3RK7k1qML2k5j7K2J2k6j0M3k9
4806aLmK2%m4L3pNj7J3J5k6mJ3K4m8J0MK6k6rK7j0Kk2M3j7k0K4Jnk2L0Kj6j5J5
4843aK3k8J3lJ7m0PJ1omjL2k7q%K4jl4J5J5jl4L9Rj3k6L1J1l2PLJ6l4K2K2j3j3
$$ plain form
4597 -21 6 17 -8 -11 6 29 -9 -23 1 12 -15 -29 26 2 -9 -13 1 0 -24 -1 5 5 -38 -3 6 -2 -21 1 19 -26 -10 -3 0 -16 -20
4632 -20 10 11 -1 -11 33 -6 -21 3 26 5 -28 6 12 11 -18 10 23 -10 0 13 27 -35 -16 11 12 -8 -13 11 -3 -22 -8 26 -6
4665 -6 -13 9 13 -2 -25 6 3 -7 -12 18 3 -23 -7 9 11 -16 -10 19 4 -9 -14 13 -3 -19 -4 11 -15 -35 10 0 -4 -23 10 -5 -39
4700 -39 -23 47 60 -48 22 6 7 -20 10 19 -11 -1 4 17 -20 -13 29 10 11 -24 16 6 4 -5 18 13 -12 14 19 13 -13 14 29 -2 -10
4735 -10 1 15 -7 6 7 17 -16 -11 21 3 -6 -15 8 -3 -11 -5 22 -5 -20 11 17 -5 -18 0 7 -16 -4 -5 8 -28 0 20 -1 -23 -23
4770 -23 28 -12 -17 -4 17 7 -22 -3 -1 -10 -26 4 8 -9 -11 10 18 -12 -7 4 9 -14 -5 22 1 -7 -3 29 4 -13 9 21 -5 -15 28 -1
4806 -1 2 -2 20 20 -24 9 2 7 -10 3 18 -8 -12 1 25 -23 -13 -9 17 -9 -18 9 -1 1 -21 22 5 -15 9 10 5 -17 13 15 -1 -16 -1
4843 -1 22 -6 7 4 21 -19 -12 -1 -7 -11 -12 20 -7 -15 -15 9 8 -26 -11 4 3 -31 8 17 4 -22 9 20 -12 -5 -2 14 -20 2 24 11 -2
4880bJL7m8%J8J7j8k3L1rnj6K6Jk5J3mJ4l5K3J4j7j3kM2l2lJ2K2l4j4K8JJ0k2
4915a2L0j8j9J3J2jk4K6nLk5K7Ok6qK1K2l8OJ5Mqk8N3j5k7rM1j7nJ3Jjk9M7k1
4951Dmj4J6J5l3J9jJ7k3NJ8j3j5kL3l4jkL4ol8K8J3k0j4K6lk7J1J2L1m7%J8kp
4987fkL4J0m6J0K0k5lJ6Kjk7K8Kqj5K8j0j8KK0j0j0%L5k3pjK8l1j0K5Ok0NJ9j4
5024Clj3L4nk3J1kJ2l0L2Nj5j5J4L2m1JJ5Ol2PK6j8j3JK6j5j5jJ8kk6L6mnl0M2
5061A3Kk2JJJ3k6J1JJ3k2%K4j7%nJ7Nk2J8Opk7L3Jk0KJ3J2l1PJ0Lk3J6J3rj0J
5099eK1k5ONJ3k4LJ5Pk0kRJ2j6mK2%m0K1K0j3l1L5J3k9J3j4K8k2j3J3Jkk0L2j2
5135cqqK8ok6K2Nnj9J0K0j4j2K2Ql2OJ1Pj6lL0j9kpJ9oNoJJ2l3J8J0j5O%Pj4%
$$ plain form
4880 -2 -1 36 -12 -12 6 23 5 -18 13 4 -1 -17 9 10 -15 -2 -6 8 -27 -4 10 -7 -20 -22 20 -12 -15 -3 19 -15 -29 -1 0 10 -12
4915 -12 18 0 -19 -6 6 5 -19 7 2 5 -20 7 13 -13 -21 0 22 -16 -10 5 9 1 -27 26 11 -16 -25 16 -1 -6 7 8 7 -22 25 4
4951 4 0 -14 2 17 -16 3 2 19 -4 1 19 6 -9 -11 22 -12 -13 -15 19 13 -25 3 16 -4 -18 8 5 -22 -11 1 32 -15 -15 3 1 -6
4987 -6 -8 26 36 -10 0 20 -5 -8 8 10 9 -18 10 12 4 -11 17 7 -11 -9 11 1 -9 -9 26 3 -4 -5 23 -8 -18 7 13 -7 -2 17 3
5024 3 0 -13 21 16 -7 4 2 14 -16 16 21 6 -9 5 37 -4 -3 12 18 -14 -7 19 1 -12 -11 15 0 -15 -16 2 0 -26 10 6 1 -29 13
5061 13 15 -7 -6 -5 8 -18 -7 -6 7 -15 -15 9 -8 -8 -13 4 9 -13 5 11 4 -23 10 11 -9 -7 6 18 -13 -6 4 7 -16 0 13 4 -6 -5
5099 -5 16 -9 -3 2 15 -9 -6 9 16 -4 -6 3 15 -1 -5 17 17 -23 -2 18 5 -26 9 22 -7 6 -8 20 -2 -15 -2 -1 -3 -23 9 -3
5135 -3 -11 -19 9 3 -23 -1 4 -1 -20 -10 10 -4 -16 6 14 -18 -12 -1 6 -10 -13 17 -2 -4 -11 8 2 7 1 2 14 -19 -1 9 -6 0 0 7 -7 -7
5175gj2L7m5M1j2NpLJ7ql3lK3p%K5L3k2j1k8OJ9l5O4o3O3n4J0J3j6OJ4k0opL2
5211A5k7J0nJ1j2oJ3Lj1qK1Ql8K2J0nl0L9j8j9L4j9K8k8J1NJ5k5mK3k2KpL2j2
5246Fj1kK0%l0J3KKj6J7Rk6lK4J4k6nJ1J4k0NK0k0j2OK3j2qOQKk9L4j5llJ2J4
5284B1k7MkJ4k6NJ5pmoK2k5J1lJ4pj2K2j1njPKj8QJ4J2l0J4J4mj8KK7j5j0%J8
5322A5j7mK1pmnJ3j6JLJ1ll0K3J2pl0K3J4k3NNQj5PnJ7k5NJ3Kmj6K6j4lNJ0ll3
5362b5J7K0qj9K5kk4J2K%j5NJ5oprL4j6pjJ6j6qK1mJ0l0K9%j7jJ5J6k3j3J6J1
5399A3k0kK4k0jJK1j8j2K1Oj2j1K4qj2j2J3J1j9J2JJj3J6Qj4j3ML0k7mJ2Qj3j3
5435a8K2j2Oj6K8jj6lJ0Ok1J4%Mj7J5Qj5jMK3j6j8NP%mJ7lj3JJ2nj9J6RLj6J4
$$ plain form
5175 -7 -19 18 -27 14 2 7 0 3 20 12 -21 -24 -1 -8 -8 17 50 28 17 -11 -5 14 -21 43 -20 43 -11 -1 12 -4 2 16 -4 -10 -17 15
5211 15 -12 -2 -7 4 -8 -14 -1 2 -9 -17 4 12 -26 -4 6 1 -29 10 -8 -27 7 -12 16 -12 -1 4 19 -6 -10 13 -9 -7 -14 18 6
5246 6 -5 -7 13 13 -17 -4 -2 0 -16 1 10 -16 -19 5 19 -7 -12 -1 13 -7 -2 18 -2 -14 -8 15 3 -5 1 9 11 -18 16 1 -2 -5 7 21
5284 21 -6 -2 -4 10 -16 -11 4 -3 -7 -13 9 -16 -5 -8 6 -1 -13 9 -2 -7 -8 -1 1 -17 -9 5 17 -13 1 15 11 -7 -5 22 7 -3 -3 15
5322 15 -2 -6 15 8 4 -1 12 -4 -3 0 11 8 -22 1 13 6 -24 -1 13 -10 -5 0 8 -7 0 -5 12 -13 -8 5 7 3 -13 13 -1 -4 1 11 8 -25
5362 -25 -8 12 4 -15 10 8 -16 -4 -2 -2 -17 -12 3 -3 -10 -19 15 -1 -8 -9 7 -9 -17 4 0 10 -20 9 9 -8 -9 6 22 -1 -14 2 13
5399 13 -7 -9 15 -5 -6 -5 16 -2 -14 7 13 1 -10 14 6 -6 -18 -5 6 -13 -1 0 1 -12 4 12 -2 -15 -11 19 -8 -12 0 8 -5 -18
5435 -18 4 -8 -2 -18 10 9 -7 -10 0 6 -15 -1 -1 3 -14 1 9 -6 -7 -3 20 4 -14 -9 -2 -2 -6 11 8 -5 -4 8 3 -16 0 9 12 -4 10
5474A0kj0jJ2Pk0kPNj8J3J1q%rJ9k2j1J8PLk3J2Olk1K6nj3pJ9J7k8J1J1pk0PK0
5513A1j2j2QJ1j7lK2j0%j1K0joj0J3jj4%J2OrpJ5pj1QJ0Kj7J5Mpj4L0j4j1MK4
5551B1j6j9K3nQk1J2OjqJ3Ql2J3j4K0j0kJ0lqoK2j1j1J4lJ2k7LJ8lpK0nj6LQJ
5590Gj9QJ1Nj2KJ3k4K0j6K2Nm5L2j7J6j3J2pJ1k0NJ6j8OJ0j0ooK7j0j2QJ1j9m
5626a1J1Pkj1K0mmj3J9mj6J5MNj7kK0j0j3J0%mMMPk2PNNok2K6j4okQRk4K0%Nr
5668eJLlpLL1l6LJ8mnJM%j4NJ9j4j5J2QJj7J9lj1kPJ8l1QkJ5l1J1%J7j5LJ6nq
5710elK0rj6J5jJj2K1lj2lJ4Ok4ORojpK2k7J5l2J7K7l2K2pJj5K0qj0mL0nj2oK3
5750IKj8LJ5j4oLK0k3J3Nqlj3J7lPk3J7LpJ8pJk8mK6j3LJ6lk8j4L7nk0oP0l7j3
$$ plain form
5474 10 8 -2 -3 9 16 -4 -6 1 6 -12 1 12 4 4 -5 14 -8 -19 -1 6 9 -14 -2 4 1 -20 6 1 -12 -19 0 17 -11 0 11 4 -16 -9 11
5513 11 -1 -13 -5 6 -11 -14 8 -2 -2 -13 7 6 0 -10 3 2 -12 -12 0 6 -3 -10 5 -2 -13 -5 5 7 -10 5 9 2 -12 18 4 -7 -3 21
5551 21 5 -14 9 4 12 -9 3 9 8 0 13 21 -11 2 -12 8 -2 -4 6 3 -5 -11 11 0 -11 3 0 12 -15 -12 6 3 -4 16 11 -5 -2 6 7
5590 7 -12 -4 7 12 0 2 15 -9 11 -5 17 22 -23 9 -8 8 -5 7 0 11 -9 -4 12 -6 0 10 0 -6 -12 15 5 -7 1 12 -7 -11
5626 -11 0 7 5 -6 14 10 6 -7 12 8 -8 7 11 16 -1 -3 17 7 -6 4 4 0 4 8 15 -7 0 5 10 4 -18 8 -6 -12 -14 -6 3 -21 -1 -1 4 -5
5668 -5 -4 -1 -4 -11 -8 23 -13 -10 8 4 -1 0 4 4 -10 -5 14 0 -15 -3 5 6 -11 8 5 -6 -8 -1 17 -14 -6 -8 7 -24 -13 -13 4 -11 -8 8 3 -5
5710 -5 -8 12 3 -13 2 1 2 -10 11 8 -4 -7 7 13 -11 -5 4 -2 -3 -10 12 -15 0 -32 -15 12 -20 2 -5 -4 -19 1 -7 -17 -21 9 4 -8 -14 9
5750 9 11 -7 -4 11 -3 -9 -6 14 -9 4 9 1 -2 -15 2 -1 6 -17 0 3 -4 14 7 8 -20 -24 2 -11 -8 8 5 -23 -37 0 -5 -25 -31 39 2 -11
5790a1nL1l0j8Q2k4L9r7N2j8j0nJ9NqkkJ1k1LJ3Jj4RJ1Jj8MK3k7k4K6NK6n2ML1
5827A0j6NMRj9ONjj6J8LKj8RJ8j8loJ9j1nJJkj6L4mj7KJ1Lj2J4%j1pOQpkkK1j4
5870BJ4j7J2j0qK7k0NjJ4mj9J0J1pj1KKmoLRj4PJ0%rkONj8ORJk0J2okJ3Roj0K
5913cOJ2k0NjK3k2Pj0J0qKJ2jj0lJ7j0j8J2pPj3J6pjMJ1Kl0J1OQqJJ7rj5JK7k3
5954bnJ3MqpJ7j0rMJ3j5j6J8Olj6OK1k3KjK0j1qJ4jj1lRmKKMMmnK3k2nJ3Orj3
5997a0RLjNkPj5nJ1OMk5L0j3kK5k7m%J1j%j2OP%j5J6mj0QOQk4KK4oj2nJ4j9KM
6040dOopONmpJ2LppjJ9k9K0rJ0jj4J8mlqL0j7oJ1Nj4mJ2NrnOOpJQLj1JOrlrJ9
6087GqOoJ5rj6J3Krj5J9Oj0%J0Kj9J1Njj3NJnJ2lOj2J8pjnpJ6mj4K5j9J1k3K6
$$ plain form
5790 -11 -16 15 -15 -33 49 25 64 -33 19 1 -9 -14 5 10 2 0 -2 9 -12 -9 4 5 -9 0 11 12 -6 -2 21 -6 -30 -4 1 27 -25 -21 10
5827 10 -6 -1 3 12 -7 -1 4 3 -13 5 8 10 -8 1 19 1 -2 -8 11 0 -5 -4 -3 -5 -21 13 9 -8 -6 5 8 -4 10 10 -1 -8 -2 6 -1 -3 -5 16 2
5870 2 16 -1 11 1 -7 20 0 5 4 18 14 -5 5 16 9 -2 0 2 -2 -8 -5 4 -10 -3 7 7 -2 -4 2 7 -11 -5 4 5 -15 -3 -9 -11 2 11 5 -5 -3
5913 -3 3 15 -5 0 -1 22 0 7 -3 7 -1 1 13 12 2 -1 16 6 -12 0 -7 0 -13 3 -4 -5 -1 10 12 -18 -7 -1 7 -1 0 17 8 -7 -6 21 -2
5954 -2 -7 6 10 2 -5 12 2 -7 -3 10 -5 -21 -3 3 0 -16 -10 11 -12 -10 -11 9 -2 -10 4 3 -8 -11 -2 -6 -4 -2 2 6 2 -3 20 -2 -7 6 12 3 -10
5997 -10 -1 2 1 6 4 11 -4 -9 2 8 12 -13 17 4 2 27 0 -4 -4 7 6 6 -6 0 7 7 -8 8 4 -6 2 8 16 -8 -6 18 12 0 -5 9 -10 -8 -4
6040 -4 2 -4 -11 -5 0 -4 -11 1 4 -3 -10 -11 8 -21 -1 -10 0 -1 -15 3 -1 -4 -12 18 1 -5 6 11 -3 -7 5 10 1 -4 2 8 1 2 10 13 2 3 9 0 -3 -12 7
6087 7 -1 5 -1 14 5 -11 2 4 -5 -20 -1 5 -5 -5 5 7 -12 -1 4 3 -10 -5 -4 -9 3 0 6 -6 12 5 4 -1 -8 8 4 -10 15 -4 7 -16 10
6128A0Poj9LNpJKJqOQJj3KJ0knoPMnLQj1j0L2j7Ok3K6Kj4NJLj2MJ0Ml3J4J8lj6
6173gJLJj2K1mpoQrMrJ6mQmkLj7K5Nj6QjKj0mJ8mj6QNoJj0J6JrLPKj0kL%j3J7
6220DKj9LJ9omlJ1qk%K4j6pNJ6j3j7J0Plj2J5kk9J5J0kj2RRj2Nj0J8j1Kj4K4j3
6260glJ2rNrJ5j0NMm%Lj3J6%j8PJ3j1mkJ8j5jJ5nnmJ4Lj3nRomPMKk0J6JlmKQj7
6306a3J4kQj5OJ5Ok1k6M9j2rjJ2omRllj9QQnjlJ6k2QPLj3nJ8j2JkJ4mj5OJ0lj1
6349a2J4OkrJ0Oj3KKPj5RnOrKK3k8MQPj7LJ4j5m%RMj2nJ0Kj0J0PQk8PJ6qj1NJ4
6393A2j1LMNkj1J0jqKJ5j3%jqQj9J2JnM%JrM%J2nj4J7j1J1j1J7%k3OLOojQk2J6
6437dJ0JmMQpj4NJ6j4Jj1J2j0OO%j4%lK0j6mNJLQnoKLQMj1rK0k4J2kJ0pOnOom
$$ plain form
6128 10 17 11 -8 -5 0 -7 -6 -4 -3 -11 -5 3 4 -9 -7 3 1 -4 -10 -3 1 -4 -1 7 -4 -14 18 1 7 -16 10 12 -2 3 4 7 -5 -1 9 13 -20 -6 12 9 -7
6173 -7 -6 -3 -2 -14 7 3 -4 -10 -2 -11 -7 -16 0 -4 4 0 -2 1 -16 9 14 -2 6 5 7 -3 -7 11 7 -9 -1 4 -2 -1 -11 5 6 -3 0 7 9 -1 -3 0 0 -13 4
6220 4 6 -13 -10 9 3 -1 -4 7 -1 -3 -3 21 5 -2 3 19 6 -11 -1 6 3 -9 6 4 -25 -10 0 -2 -14 -5 4 -8 -3 -13 5 -6 -4 -18 6 -7
6260 -7 -10 2 -7 -2 -11 4 -6 -1 3 -1 -1 2 -11 5 5 -13 -6 7 -4 -8 -10 8 -7 -8 7 2 -3 -7 7 10 -3 -8 1 -5 -9 -2 2 4 -16 0 1 -2 -6 -4 4 -13
6306 -13 1 -1 7 -8 -2 13 19 -2 -28 21 9 0 -1 11 5 1 10 7 4 -15 -7 1 -4 -5 -8 8 -14 -6 1 4 -9 -14 4 -8 -7 -9 5 1 -14 -8 2 -1 -12
6349 -12 2 8 6 -3 7 13 0 2 4 11 -4 5 0 6 -3 -1 22 -6 -2 6 13 -4 -1 13 -2 -6 -6 3 7 -5 -10 0 2 -8 2 9 17 -11 -4 12 4 -7 -2 12
6393 12 1 4 8 13 11 0 10 9 1 3 18 5 5 4 -4 4 -15 -3 -2 -7 -3 -3 -2 -11 -7 -7 5 0 -14 3 -8 3 -8 9 9 -14 -8 -5 1 -5 -6 2 -20 -4
6437 -4 6 7 3 7 15 8 -6 -1 15 1 2 -9 3 -7 -1 5 5 -9 -9 -12 8 -8 -12 -7 -6 -3 5 0 -6 -4 -1 7 11 0 -9 11 -13 -1 -3 7 0 6 1 7 1 -3
6483cJ5jKk0OJ1k3PjQj4RJ1Lj9PNnmKJ8j7oRNj1PPj3MlJ0Ok1J4LOj8OOjmJJjq
6529dnK5k2JNmkj1K4nj1JJ2Kk5J6qPNj0K1j1%%J3omRoj5J1NpOLj5m%J9k0LlP%
6573clnJ4nj5J0kMj8J4Rj1MJ0mkJ1j9J3Lj9K1qLKmLnjJ1KokJ0j4j4K5%qjknNK
6617@Pj2Kj7J4Mn%mJ5j4J1Qq%mQmKnJ3OpK0l6J2pJ2k7J5NP%j9JJ0Jj4JJ1lnJ2
6660Fmrn%J5rmJ6onPJ1q%NpLrOkkKmJ4j3Qj9J6qNOKnKnjK%Oj0nMMnj3J3jKRLJ1
6711A9k0J0j1Qj4K3qq%NPkj3NPmoMljpK2j1j6J4M%j0J3moj0NRmP%jOj2J2JmjJ7
6756B2j1LrlLlNollPLlmNPqoJ3lqmJ3j5nJ6j2J2pMRkr%Qj1NkL1l2LJ4nolPJ1j5
6804C%J0k0J0mJ7j6rJ0lOlPjJj3QlmJ2qkQLqMpMPOnoQomJ8k0JlJ2lrQJMl1J5J5
$$ plain form
6483 -3 12 11 13 -7 -1 10 -13 -6 -7 1 -13 -4 7 10 -9 -2 3 -2 -6 -4 14 -3 -9 0 5 -6 1 8 -5 -1 -4 6 12 -9 5 8 14 -4 2 8 7 3 4 5 4 -4
6529 -4 -9 16 -6 -5 0 -4 -6 -17 7 2 -9 -8 4 6 -19 -3 -11 -4 1 -9 12 1 1 1 14 8 4 13 7 -8 3 8 1 7 10 -5 -9 -9 10 -10 -7 -10 -3 -3
6573 -3 -6 -11 3 -2 -17 -7 -9 -5 -23 -9 0 -11 -7 3 -1 -3 8 -11 2 5 -14 7 -1 2 4 0 3 -2 -3 8 10 4 2 12 -2 -16 9 9 1 0 -2 -7 -2 0
6617 0 7 -5 -3 -20 -6 -2 -7 -7 -11 4 -10 1 9 1 1 -3 5 1 3 -2 11 17 10 30 -6 6 -1 11 -16 -1 4 11 11 -8 -7 3 4 -10 -9 2 -1 -6 6
6660 6 2 -7 -12 -12 3 -6 -10 6 0 -5 2 13 5 5 10 3 6 -3 3 1 -1 1 -3 11 -2 6 -13 3 -5 0 6 8 3 5 0 -1 1 1 7 -3 -8 -4 0 -5 -18 -5 -6 -4 5 8 19
6711 19 -1 9 -2 6 -8 15 7 -1 -1 4 11 9 -4 1 8 4 -2 2 -1 -2 -9 13 2 -14 0 4 4 -6 7 3 -3 -13 -8 1 -3 4 4 3 9 -3 9 10 6 5 22
6756 22 11 14 5 2 5 2 7 1 -2 -5 2 5 2 -2 3 10 2 -4 9 6 -2 -6 7 -8 -13 3 -9 3 -4 0 9 7 -2 -2 6 -5 0 -2 29 -3 0 14 9 3 0 7 18 3
6804 3 3 13 -7 3 -1 16 0 -9 1 -2 4 1 8 7 8 -5 3 0 -4 8 0 -2 6 9 1 5 -2 2 9 15 10 4 12 6 2 20 0 1 -2 10 7 -2 6 7 11 -20 -5 10
6852A0jj7MMk1J2OknmJ7%kpJ3j3jNJ2Lj0J2rlMqRqjLJ2k1JJ7rjj1J5pJ1k3J6p
6895ejJ4ppRj6KJ1KL1n2j6J1L9j0Qj2J2j4LrJ6kqJ5kpqOkjJJ0j2j4RJ6pj3J7j0
6936c%pJ1nkJjJ0mrKJ0j3OJ7j1j1K4j5Pj3P%kmOnpJ3%Mj2KJ3okoJ0Kj6MlNoRR
6982Ij2lJ3mJ1k2RNj0JJ4j0OoNJ0k5K3qkj3J0KoP%jj2MR%rJk%KLjomMOOrNJJ8
7029A9qk0j9K0Lj9K5j9K2k1l3L6K0%okMQj3KkJ1j2oONqnK3j5opJ8j5kPJ5kkkK
7070BlqnOJ1KNlnmJ9opqKJlMkOj8KJ0RjkomNNKj4PpQqRQj2LOjkMNrpKPoLJj3J4
7124DJj2QmkJ%NrNkpQrLlR%QqoOOj1RLMomMMjqJ2%jjRnknj1PrJ0mqJ4pllQkJ0
7178ErMmJjJ3j0mPMMj0MJ2rMmJ1j2pjOojJ8j1Oj0jjJ%L%j5J1%jj0QN%%j1J7kj2
$$ plain form
6852 10 9 -8 -4 0 -21 -9 -3 -5 -10 -14 3 3 1 -6 7 -6 -7 -2 10 13 3 15 6 3 7 -1 8 0 -1 2 14 -7 -6 11 2 1 -10 5 -2 9 -14 2 -5
6895 -5 -6 8 1 -6 3 -13 -11 0 2 33 -19 -35 -24 15 5 13 1 13 -1 2 -7 9 7 -1 14 12 5 -3 3 1 0 1 11 -1 -15 -6 10 3 -10 7 -3
6936 -3 -3 -10 1 -4 -6 -5 -6 4 0 -9 -7 3 -10 -4 13 2 -9 15 0 7 -6 1 1 -1 -5 1 -4 -11 2 2 6 -6 -4 9 3 1 -5 5 7 -9 -5 -8 -3 -9 0 9
6982 9 -3 -6 7 3 14 -8 1 6 -4 -3 11 1 7 1 6 16 -9 14 6 4 -9 1 3 -3 4 4 3 -9 -5 4 4 -5 -4 -6 -6 -4 -1 -2 -8 -12 -8 -2 4 -5 0 1 19
7029 19 11 -9 -28 -8 -5 -24 1 -18 4 -17 -50 -14 6 6 0 -2 2 10 -3 -1 -3 8 -4 -10 -4 1 -7 -12 11 -4 -10 -17 1 -14 -16 -9 6 4 2 0 2
7070 2 -1 -9 -14 -8 3 5 10 7 2 -2 17 11 4 -4 -2 -1 -4 0 -2 4 -14 -12 -2 7 6 4 -2 -6 -1 4 6 -8 -1 -8 0 -8 1 9 -3 0 6 5 3 7 12 3 -4 -2 5 -1 2 3 -10 4
7124 4 5 -7 1 -3 -5 -4 -4 1 -8 -3 -5 -12 -4 -13 -10 -13 -4 -4 4 -4 -10 -4 2 -9 0 3 7 1 -3 1 5 4 -4 8 8 7 6 15 10 8 3 -8 -1 -10 0 -4 -12 2 -5 -8 -11 -3 -5 5
7178 5 -4 0 -4 -3 -4 9 -1 -5 2 6 10 0 4 16 7 11 7 18 6 -1 -2 4 -2 -3 15 4 10 0 -1 -2 -1 -1 2 2 -13 -2 -2 -3 -13 -5 0 0 0 -11 6 4 -8
7225hNJ4nj7K0OpJj0RkqJ2ojLJkNn%%qJJ0o%mJ6j6NomJ3j5J1mpjKJJ2qQk2J3J4
7272A0plmQjpMJ2mJpMroJ1Qk1Mj%JRqOqlJ4Oj6NQnmPo%pORKj1PNLrJ7j6j3NlR
7323BoKQj1OnNj6kP%NPKnjonJ8rojJ7rMNkpJ0mo%oPQKnnRojJ2krQnqM%nnMNj4
7377a5J4mLlLmOorJ8kj1LK0j5pPNkrJ2oNkJjnn%LKL%J1j3qP%jk%mMJNJj2PJ5j0
7427@oQJj7K5%lnj2NlJ7kMj2Oj0Pj4OJ1qmNMj1LMpJ0j7QQj1QjnKMmjNjLkNKjl
7476AkMLJj6J3j1J7rLJrJ1lKo%KNj4kNQj1PmJj0QJ0j9RKLKnNPj0NQojnMLj5J0
7524BjOj9J2J0jlj0%knKkNM%KrlLLPpQlkOOrOJ%jkQkj5Rj2J8j4JKn%NMjn%Okj2
7577a1J1mMjQj0Oj4K1j0j1J4lJ0oJmMKLlOjJ%j3PlJ1j0j5K5k2K7J4j9Jj9K0m8
$$ plain form
7225 -8 -3 11 6 -11 9 15 8 9 -1 8 6 -2 10 4 3 6 7 5 10 5 5 5 -3 -2 8 2 2 -2 14 -2 3 -3 -7 6 -9 2 -2 -9 -10 -8 -7 5 -3 5 -17 -4 10
7272 10 3 0 -4 4 3 -4 0 12 8 9 2 6 -3 -9 2 10 -11 -7 -8 -8 -7 2 -6 0 -8 -11 3 9 -7 -2 6 1 -3 4 -2 -2 -9 -3 6 8 -3 4 9 12 3 20 4 -9 -4 -7 2
7323 2 -4 -2 6 -5 1 -4 1 -15 -17 -10 -10 -5 2 4 -1 -2 -8 -13 5 -4 -10 -11 6 -3 1 6 4 -3 7 3 -3 -3 -9 -2 6 8 3 -2 7 1 0 12 10 1 9 4 -4 0 0 -5 -10 -6 -1 -15
7377 -15 -1 -5 -2 -5 -2 -6 0 -6 -15 3 1 -10 -7 13 -2 -9 -2 3 1 -8 4 -2 3 1 2 1 -4 -9 -9 -6 -4 -1 -1 10 -3 -11 -4 -4 -5 -7 -7 -11 -7 -6 -1 0 -12 -5 10 0
7427 0 -6 2 3 -14 11 11 8 3 -9 -4 -7 10 8 12 0 6 -4 3 -11 -5 6 -2 -6 -1 3 -8 -5 -1 -8 2 -15 -7 1 -10 -2 -3 -8 -6 -2 -6 -7 -2 -3 0 -2 3 5 4 1
7476 1 -1 3 6 7 -9 4 -7 10 1 4 5 -4 7 4 6 0 0 2 7 -7 -9 -4 4 -7 0 -4 -3 -13 -5 5 -14 -5 -3 0 2 -3 2 9 -1 4 12 6 5 0 4 7 -8 2
7524 2 1 7 -12 0 10 9 6 -4 -4 -6 -11 -9 -11 -6 -2 -2 0 -9 -12 -9 -6 1 -6 2 -1 -3 3 9 0 6 7 7 6 4 12 10 -5 4 -8 10 -4 -3 -1 -6 -6 -1 3 2 -3 -3 3 1 -11
7577 -11 0 -4 0 -1 7 -3 3 -11 10 0 -11 3 0 10 4 5 1 5 7 10 7 13 12 13 13 0 7 4 15 5 -10 15 -7 20 34 15 16 -3 17 -31
7617c1L4m%l5N0j4kl0L0j6OK4mj0J1L9l2qOmkLooPjJ2j4j1J8Kj3OJ%j2J0mj6K0
7657Dk8M0l5pK4jklJ4mKnOPrmLQqQ%OrljJrJRjpNlK%J2j7mJ2jqpJ0kpNMRlpJ2
7708Io%kLKpRnNl%J1nkJkJ2j7kOpMj0J2qLj2J6Pj1MlLk0K4mk%J4Pl1K8j1K7j4
7753B3j2j2RJ0jk0L1L2m3l1j0P1k5n8Q7pp5M3j3MOkQj6LjlLlmOOj1kMJ5Jj6NN
7793G%j5K0nllJ3lO%prjPjknRMpkNj0olLJ1j5J0%LkKmQqJ0qJ5j1NNj4J3jLj6J3
7841A1jpnPNplkLkPj1J6Jj3nQjnKPj3MLRnQroPNmKnRMlJpk%LQmnmPLrjpNNrJ2
7896Gj1%JolKJ0llRoL%OKKokONj0LMoMjJ0j6kRLnpLmlPqmJ1jlPpJo%oJ1KLj4K4
7949A2j2MrQ%OJoNm%MKM%j3LknrJ5j0PoK%JOkoMJn%JJJLKKoLmNkLJ3j0oJ1kjJ
$$ plain form
7617 -31 3 -1 -1 -36 14 0 -2 -32 -2 -18 -12 12 8 -2 9 48 16 8 14 10 8 11 5 -1 6 5 17 3 -8 10 12 -1 5 6 6 -6 4 0 -16 4
7657 4 -24 16 -19 -26 -2 -3 -5 -8 6 2 4 -1 5 12 3 -1 2 10 2 10 10 16 7 4 3 4 -5 -4 5 4 -3 2 -1 1 1 13 -4 -8 4 3 -5 -12 -2 -4 -11 -6 -2 7 4 -3 9
7708 9 3 3 1 4 6 -1 8 3 8 5 5 16 11 9 10 8 20 3 1 7 0 4 -6 6 -2 1 -11 5 12 1 5 2 5 -15 9 5 3 3 17 24 -7 21 10 37 23
7753 23 11 -1 8 18 17 -3 28 60 17 -14 -24 47 22 -36 51 44 -31 12 -1 3 9 7 15 -1 2 1 -2 1 -2 -6 0 6 -5 -7 -3 12 13 -3 2 7
7793 7 7 -8 12 7 4 1 14 11 17 17 10 1 0 7 6 4 -1 8 12 5 3 8 -2 -8 -11 -8 3 -12 -2 -2 1 -1 1 -3 5 -3 7 -1 14 3 8 13 -1 12 11 14 -2 11
7841 11 10 3 -2 5 10 3 0 -2 1 -1 6 -5 11 12 -1 -6 2 1 -4 -2 5 -8 -4 -1 8 3 11 2 -4 3 8 4 6 1 10 14 11 12 5 3 3 6 14 10 5 1 8 11 2 1 -6 -1 4 -5 7
7896 7 -4 -4 -3 -9 -12 -10 0 -3 -6 3 -3 0 0 6 8 10 4 2 8 13 3 6 10 4 8 7 17 1 -1 8 11 6 -1 2 -2 -5 2 -6 -10 1 0 -3 4 -3 -2 -8 -8 -14 -3 -1 2 -12 12
7949 12 0 4 -5 3 3 9 10 4 9 5 5 9 11 15 15 2 5 3 -2 -11 4 -6 1 -5 -3 -3 -2 4 2 -4 0 1 -4 -4 -3 -2 -1 2 4 6 0 3 -1 4 2 5 18 8 2 13 11 10 11
8002A1%oRjkj2J2k0J8j3JRj0j1J5%JnmjjQkPnoJ6qnPN%Qj5lJ6pQNrpMjkJ3j9O
8049Dj6J3%QolkmJ0k2OJ2ljOj1KJ0QpPmk%kQOj2qJ7j4MPkq%PPmj8LJlLjNj0kJ
8098a0LLq%JJ1pPjKqRoJ1j9K4j0j1J1jNjJ0j0Nj5J7qonJ0kj1LMmkJNl%joRoOj0
8145a4MOkMKMoJRoNOpLkJ3j2MNj3Q7p1o2K1K5q3O7J3k%jJ0j1j1J5Qmnkj2J1Lp
8188gPNJ
$$ plain form
8002 11 11 5 14 13 11 -1 11 -9 9 -4 -3 6 -4 -15 0 0 1 -4 -8 -9 -10 -2 -4 3 -2 -8 8 0 -5 2 7 7 15 0 -3 13 6 14 19 10 3 7 6 4 17 -2 4
8049 4 -12 1 1 9 3 0 -2 -6 4 -18 -12 0 -3 -4 2 -9 -7 3 11 4 11 7 5 5 3 11 17 5 -3 14 0 4 11 9 1 1 8 15 11 -7 -4 -3 -6 -3 -4 1 -9 -11 -10
8098 -10 -7 -4 -12 -12 -11 0 -7 0 -1 1 -7 2 -4 7 -12 12 2 -9 2 1 6 5 15 5 10 -5 12 4 -2 -7 3 1 -10 -7 -3 -7 -9 -8 -3 -6 -6 -7 -13 -4 -10 -4 -14
8145 -14 -10 -4 -6 -2 0 4 -2 -1 8 2 7 13 6 9 7 20 8 12 17 4 91 20 -42 -21 4 -79 -12 1 -1 -1 -2 8 -3 -14 1 9 5 0 -2 -14 -3 0 -7
8188 -7 0 5 6
8191F
##END NTUPLES=NMR FID
##END=
