##TITLE=1H_EC-3237(31)
 CDCl3, 8 sc, 
 16.11.2020
##JCAMPDX= 6.0         $$ Bruker NMR JCAMP-DX V2.0
##DATA TYPE= NMR FID
##DATA CLASS= NTUPLES
##ORIGIN= UXNMR, Bruker Analytische Messtechnik GmbH
##OWNER= root
$$ XWIN-NMR		Version 3.5
$$ Mon Nov 16 10:57:22 2020 Russian Standard Time (UT+4h)  she@DPX200
##.OBSERVE FREQUENCY= 200.1315066352
##.OBSERVE NUCLEUS= ^1H
##.DELAY= (6, 6)
##.ACQUISITION MODE= SIMULTANEOUS
##.ACQUISITION SCHEME= undefined
##.AVERAGES= 8
##.DIGITISER RES= 18
##SPECTROMETER/DATA SYSTEM= spect
##.PULSE SEQUENCE= zg30
##.SOLVENT NAME= CDCl3
##.SHIFT REFERENCE= (INTERNAL, CDCl3, 0, 15.7039)
##AUDIT TRAIL= $$ (NUMBER, WHEN, WHO, WHERE, WHAT)
$$ ##TITLE= Audit trail, XWIN-NMR		Version 3.5
$$ ##JCAMPDX= 5.01
$$ ##ORIGIN= Bruker BioSpin GmbH
$$ ##OWNER= she
$$ F:/spectra/data/she/nmr/H-F/1/audita.txt
$$ ##AUDIT TRAIL=  $$ (NUMBER, WHEN, WHO, WHERE, WHAT)
(   1,<2020-11-16 10:55:19.95 +0400>,<she>,<DPX200>,
      <created by zg, POWCHK disabled, PULCHK disabled
       configuration hash MD5:
       00 E9 B6 7A A2 85 ED C7 34 08 36 98 17 FE 4E 26
       data hash MD5: 16K
       F0 67 8D 4E DE 2A 30 DF 4A 59 10 DF DC FD 3F FB>)
$$ ##END=
$$ 
$$ hash MD5
$$ C6 96 AF 79 86 C5 E3 28 A4 A6 F3 60 9C 34 71 E7
##$RELAX= 
##$RELAX= 
##$RELAX= 
##$RELAX= 
##$RELAX= 
##$RELAX= 
$$ Bruker specific parameters
$$ --------------------------
##$DU= <F:/spectra>
##$EXPNO= 1
##$NAME= <H-F>
##$PROCNO= 1
##$TYPE= <nmr>
##$USER= <she>
##$AMP= (0..31)
100 100 100 100 100 100 100 100 100 100 100 100 100 100 100 100 100 100 
100 100 100 100 100 100 100 100 100 100 100 100 100 100 
##$AQSEQ= 0
##$AQ_mod= 1
##$AUNM= <au_zg>
##$AUTOPOS= <>
##$BF1= 200.13
##$BF2= 200.13
##$BF3= 200.13
##$BF4= 200.13
##$BF5= 200.13
##$BF6= 200.13
##$BF7= 200.13
##$BF8= 200.13
##$BYTORDA= 1
##$CFDGTYP= 0
##$CFRGTYP= 5
##$CHEMSTR= <none>
##$CNST= (0..31)
1 1 145 1 1 1 1 1 1 1 1 1 1 1 1 1 1 1 1 1 1 1 1 1 1 1 1 1 1 1 1 1 
##$CPDPRG= <>
##$CPDPRG1= <>
##$CPDPRG2= <>
##$CPDPRG3= <>
##$CPDPRG4= <mlev>
##$CPDPRG5= <mlev>
##$CPDPRG6= <mlev>
##$CPDPRG7= <mlev>
##$CPDPRG8= <mlev>
##$CPDPRGB= <>
##$CPDPRGT= <>
##$D= (0..31)
0 1.2 0 0 0 0 0 0 0 0.06 0 0.03 0 0 0 0 0.0002 0 0 0 0 0 0 0 0 0 0 0 0 
0 0 0 
##$DATE= 1605509719
##$DBL= (0..7)
120 120 120 120 120 120 120 120 
##$DBP= (0..7)
150 150 150 150 150 150 150 150 
##$DBP07= 0
##$DBPNAM0= <>
##$DBPNAM1= <>
##$DBPNAM2= <>
##$DBPNAM3= <>
##$DBPNAM4= <>
##$DBPNAM5= <>
##$DBPNAM6= <>
##$DBPNAM7= <>
##$DBPOAL= (0..7)
0.5 0.5 0.5 0.5 0.5 0.5 0.5 0.5 
##$DBPOFFS= (0..7)
0 0 0 0 0 0 0 0 
##$DE= 6
##$DECBNUC= <off>
##$DECIM= 32
##$DECNUC= <off>
##$DECSTAT= 4
##$DIGMOD= 1
##$DIGTYP= 9
##$DL= (0..7)
0 120 120 120 120 120 120 120 
##$DP= (0..7)
150 150 150 150 150 150 150 150 
##$DP07= 0
##$DPNAME0= <>
##$DPNAME1= <>
##$DPNAME2= <>
##$DPNAME3= <>
##$DPNAME4= <>
##$DPNAME5= <>
##$DPNAME6= <>
##$DPNAME7= <>
##$DPOAL= (0..7)
0.5 0.5 0.5 0.5 0.5 0.5 0.5 0.5 
##$DPOFFS= (0..7)
0 0 0 0 0 0 0 0 
##$DQDMODE= 0
##$DR= 18
##$DS= 0
##$DSLIST= <SSSSSSSSSSSSSSS>
$$ [...]
##$SUBNAM2= <"">
##$SUBNAM3= <"">
##$SUBNAM4= <"">
##$SUBNAM5= <"">
##$SUBNAM6= <"">
##$SUBNAM7= <"">
##$SUBNAM8= <"">
##$SUBNAM9= <"">
##$SW= 16.9725356469052
##$SWIBOX= (0..15)
0 0 2 0 0 0 0 0 0 0 0 0 0 0 0 0 
##$SW_h= 3396.73913043478
##$TD= 16384
##$TD0= 1
##$TE= 0
##$TE2= 300
##$TE3= 300
##$TEG= 300
##$TL= (0..7)
0 120 120 120 120 120 120 120 
##$TP= (0..7)
150 150 150 150 150 150 150 150 
##$TP07= 0
##$TPNAME0= <>
##$TPNAME1= <>
##$TPNAME2= <>
##$TPNAME3= <>
##$TPNAME4= <>
##$TPNAME5= <>
##$TPNAME6= <>
##$TPNAME7= <>
##$TPOAL= (0..7)
0.5 0.5 0.5 0.5 0.5 0.5 0.5 0.5 
##$TPOFFS= (0..7)
0 0 0 0 0 0 0 0 
##$TUNHIN= 0
##$TUNHOUT= 0
##$TUNXOUT= 0
##$USERA1= <user>
##$USERA2= <user>
##$USERA3= <user>
##$USERA4= <user>
##$USERA5= <user>
##$V9= 5
##$VALIST= <valist>
##$VCLIST= <CCCCCCCCCCCCCCC>
##$VD= 0
##$VDLIST= <DDDDDDDDDDDDDDD>
##$VPLIST= <PPPPPPPPPPPPPPP>
##$VTLIST= <TTTTTTTTTTTTTTT>
##$WBST= 1024
##$WBSW= 4
##$XGAIN= (0..3)
0 0 0 0 
##$XL= 0
##$YL= 0
##$YMAX_a= 281356
##$YMIN_a= -541182
##$ZGOPTNS= <>
##$ZL1= 120
##$ZL2= 120
##$ZL3= 120
##$ZL4= 120
##$ABSF1= 10
##$ABSF2= 0
##$ABSG= 5
##$ABSL= 3
##$ALPHA= 0
##$AQORDER= 0
##$ASSFAC= 0
##$ASSFACI= 0
##$ASSFACX= 0
##$ASSWID= 0
##$AUNMP= <proc_1d>
##$AZFE= 0.1
##$AZFW= 0.1
##$BCFW= 1
##$BC_mod= 2
##$BYTORDP= 1
##$COROFFS= 0
##$CY= 11.3945322036743
##$DATMOD= 1
##$DC= 2
##$DFILT= <>
##$DTYPP= 0
##$F1P= 15.9154993809931
##$F2P= -4.1035820241983
##$FCOR= 0.5
##$FTSIZE= 0
##$FT_mod= 4
##$GAMMA= 1
##$GB= 0.15
##$INTBC= 1
##$INTSCL= 1
##$ISEN= 128
##$LB= 0.24
##$LEV0= 0
##$LPBIN= 0
##$MAXI= 10000
##$MC2= 0
##$MEAN= 0
##$ME_mod= 0
##$MI= 1.114404
##$NCOEF= 0
##$NC_proc= 0
##$NLEV= 6
##$NOISF1= 3.799351
##$NOISF2= 2.8
##$NSP= 1
##$NTH_PI= 0
##$NZP= 0
##$OFFSET= 15.70392
##$PC= 1
##$PHC0= -11202.8
##$PHC1= 8.400887
##$PH_mod= 1
##$PKNL= yes
##$PPARMOD= 0
##$PSCAL= 0
##$PSIGN= 0
##$REVERSE= no
##$SF= 200.130013532006
##$SI= 16384
##$SIGF1= 3
##$SIGF2= 2
##$SINO= 400
##$SIOLD= 16384
##$SREGLST= <1H.CDCl3>
##$SSB= 0
##$STSI= 0
##$STSR= 0
##$SW_p= 3612.71676300578
##$SYMM= 0
##$S_DEV= 0
##$TDeff= 0
##$TDoff= 0
##$TI= <>
##$TILT= no
##$TM1= 0
##$TM2= 0
##$TOPLEV= 0
##$USERP1= <user>
##$USERP2= <user>
##$USERP3= <user>
##$USERP4= <user>
##$USERP5= <user>
##$WDW= 1
##$XDIM= 8192
##$YMAX_p= 0
##$YMIN_p= 0
$$ End of Bruker specific parameters
$$ ---------------------------------
##NTUPLES= NMR FID
##VAR_NAME=  TIME,          FID/REAL,        FID/IMAG
##SYMBOL=    X,             R,               I
##VAR_TYPE=  INDEPENDENT,   DEPENDENT,       DEPENDENT
##VAR_FORM=  AFFN,          ASDF,            ASDF
##VAR_DIM=   8192,          8192,            8192
##UNITS=     SECONDS,       ARBITRARY UNITS, ARBITRARY UNITS
##FACTOR=    0.0002944,     1,               1
##FIRST=     0,             0,               0
##LAST=      2.4114304,     0,               0
##MIN=       0,             -541182,         0
##MAX=       2.4114304,     281356,          0
$$ Real data points
##PAGE= N=1
##DATA TABLE= (X++(R..R)), XYDATA
0@%%%%%%%%%Qj6J6j6K4l2M0n4O2p2R1j15J36j60J92k27K67l12L62m18M82n52O32
$$ 0 0 0 0 0 0 0 0 0 0 8 -8 8 -8 16 -16 24 -30 32 -40 51 -64 72 -88 104 -123 144 -168 194 -224 258 -294 338
32C38p20Q17r26J044j176J320j476J650j842K049k274K523k793L086l409L762
$$ 338 -382 435 -491 553 -623 697 -779 871 -971 1078 -1196 1327 -1466 1620 -1789 1973
48A973m149M572n036N547o111O739p438Q222r109J0117j1278J2635j4239J6173
$$ 1973 -2176 2396 -2640 2907 -3204 3535 -3903 4319 -4790 5327 -5951 6684 -7555 8618
62H618j8562K1597k5602L1164l9481N3441q2788K53884l18105j54473N51663k38661
$$ 8618 -9944 11653 -13949 17215 -22266 31175 -51613 202271 -115834 -270307 281356 42695
74D2695j81728K57608L4134k88265J13782J20569j43842n2101J33214r1179k4552
$$ 42695 -139033 118575 152709 -135556 -21774 98795 -45047 -97148 36066 -55113 -79665
85g9665Q6927p4184l6248J09918p777l8199P2330j2240j34456M8741J18997o0352
$$ -79665 7262 -66922 -103170 6748 -1029 -39228 33102 20862 -113594 -64853 54144 -6208
97f208j12686J26677Q9390j26155n1772R6575K5617o5853K2100M7410p1990p6493
$$ -6208 -118894 7783 97173 -28982 -80754 15821 41438 -24415 -2315 45095 -26895 -103388
109a03388J00474P7307r5888J7934N9686p3943m8770Q0766K1627p9909J5827M4094
$$ -103388 -2914 74393 -21495 -3561 56125 -17818 -66588 14178 35805 -44104 -28277 15817
121A5817l0743K2957O5316r5492n0371J22500J918p3736K9239L4351o2141J7000
$$ 15817 -14926 8031 73347 -22145 -72516 49984 51902 -21834 7405 41756 -20385 -3385
133c385P7326m6159l7043M9829j0425n7548O4654L0718q8034l689P2332l340o0529
$$ -3385 73941 27782 -9261 40568 30143 -27405 37249 67967 -20067 -23756 48576 45236 -15293
146a5293J3164K1652k186K458j7154j7834J5852L6311l3501k5798K6752J0070
$$ -15293 -2129 19523 17337 19795 2641 -15193 659 36970 3469 -22329 4423 14493
158A4493p528L099K39k9211Q285K1202l7j0482J060n547k9025K7793L2807j8612
$$ 14493 6965 10064 10303 -18908 -10623 10579 10542 60 1120 -4427 -33452 -5659 27148 8536
172H536m4124M202L7306m791j3800R52J2887j5982n596J7122L239q608l981J7578
$$ 8536 -35588 -31386 5920 1129 -12671 -11719 1168 -14814 -20410 -3288 -49 -8657 -12638 4940
186D940m044j141k569K116N402j3723P997K1422N904l8591j806M3751n497l5455
$$ 4940 896 -245 -2814 -698 4704 -9019 -1022 20400 26304 -12287 -14093 29658 24161 -11294
200a1294J7201L3203m0498j0926K8096n237p571K2546j490m3812J7887K3957k1877
$$ -11294 5907 39110 -1388 -12314 15782 10545 2974 25520 24030 -19782 -1895 22062 185
213A85j196K5255k2121k3757M1866n315k2375K5211Jm4398K1712N6878m8046m3125
$$ 185 -1011 24244 2123 -21634 20232 14917 -7458 17753 17754 -26644 -4932 51946 3900 -39225
227c9225M5502K8886m3599J667L3739k9604j0590J6396j099j0043J4683m467k4425
$$ -39225 6277 35163 -8436 -6769 26970 -2634 -13224 3172 2073 -7970 6713 2246 -22179
240b2179J7578J7286j7512j9637K5791l707k6719K0655J4368k4040j6008L5975
$$ -22179 -4601 12685 -4827 -24464 1327 -2380 -29099 -8444 5924 -18116 -34124 1851
252A851j677l3650K3096L4353m0928l6985N5341R861l8111J7930L2370l2231k2332
$$ 1851 174 -33476 -10380 23973 -16955 -53940 1401 11262 -26849 -8919 23451 -8780 -31112
265c1112M2375k988k2324J8930Q085k9196J7272K7470l8869M476L1479k2774j4882
$$ -31112 11263 8275 -14049 4881 12966 -16230 1042 28512 -10357 -5881 25598 2824 -12058
278a2058M9458j0665o8292L7904N4782m5375k8560O6220j1623p2476L7477N0593
$$ -12058 37400 26735 -41557 -3653 51129 5754 -22806 43414 31791 -40685 -3208 47385
290D7385l5688k6535M0183j0655l8971K4065K8669j7947j8053K1889n953j5010
$$ 47385 11697 -14838 25345 14690 -24281 -216 28453 10506 -7547 14342 8389 -6621
302f621L259O381O344n858n853L10J9727j0190k6460R032K8338q592l5552K3891
$$ -6621 -3362 3019 9363 3505 -2348 -2038 17689 7499 -18961 -9929 18409 9817 -25735 -1844
316a844J8255l5438j3132M6568M442n5453J1479L7549k7412k9603N3066J3093
$$ -1844 16411 -19027 -32159 14409 18851 -36602 -25123 12426 -14986 -44589 8477 21570
328B1570o4788O541M9216j5524l5995L4665J7615l4258m796K3079N926j6318Q79
$$ 21570 -43218 -36677 12539 -2985 -38980 -4315 13300 -20958 -25754 -2675 3251 -13067 -12188
341a2188J374J2095K253j7768J1927J4377k0663j4927L9813K263l8576J3678L1568
$$ -12188 -10814 1281 3534 -14234 -2307 12070 -8593 -23520 16293 18556 -20020 -6342 25226
354B5226j9644k6833L5926Q920l4483l106K9174O020k3554q7J0546K994j8418
$$ 25226 5582 -21251 14675 23595 -10888 -13994 15180 21200 -2354 -2441 8105 11099 -7319
367g319L097K5630r428k2675Q801K4516k1114j1154K2580j985k2211O783K5935
$$ -7319 -4222 21408 11980 -10695 -1894 22622 1508 -9646 12934 10949 -11262 -4479 21456
380B1456j4996j2292N608L311m280k843O998J788j573j7007M929J7293m838j1712
$$ 21456 6460 -5832 -224 3087 -1193 -4036 2962 4750 3177 -13830 -8901 8392 3554 -8158
394h158K431Q422j4927J739J3654q63j3066j501J1571l623m478m476J3108O61
$$ -8158 -5727 2695 -12232 -10493 3161 2298 -10768 -12269 -698 -4321 -8799 -13275 -167 494
408D94j6933P114J4525j3329k0804K6364J4270k0912l430K0232q224k5058K1727
$$ 494 -16439 -9325 5200 -8129 -28933 -2569 11701 -9211 -12641 7591 -633 -25691 -3964
421c964J2397j0364P68M323r119j130J5083l018p1k571p949j228J5922L028j9382
$$ -3964 8433 -1931 -1163 3160 -5959 -7089 7994 4976 4905 2334 -5615 -6843 9079 12107 -7275
436g275J6752R370k3210q59L0679r316l1583K0026K2860j6817k0693K5507Q211
$$ -7275 9477 18847 -4363 -5222 25457 16141 -15442 4584 27444 10627 -10066 15441 23652
449B3652k8724L358J9503n060k1870P661R972j0854q814J3554O998k0558M531
$$ 23652 -5072 -1714 17789 12729 -9141 -1480 8492 -2362 -11176 2378 9376 -11182 -6651
462f651P977n398o083J440L726l860K221l21O266L434o668j4659R584J8274j9659
$$ -6651 1326 -4072 -10155 -8715 -4989 -8849 -6628 -6949 -683 2751 -3917 -18576 -8992 9282 -10377
477a0377M6J4627j1553j3730K3191J5256k6980n751J8444k728j8458J8492O450
$$ -10377 -10331 4296 -7257 -20987 2204 17460 -9520 -15271 3173 445 -18013 479 6929
490F929k3227Q018J3645m670r223N695l555k516J3808j125j7744J097K5787r381
$$ 6929 -16298 -8280 5365 695 -8528 -2833 -6388 -8904 4904 3779 -13965 -12868 12919 3538
504C538j2058J4634N806r155n905J2213j585o153O717J0632q398q974J0569K87
$$ 3538 -8520 6114 11920 2765 -3140 9073 7488 1335 8052 18684 10286 1312 11881 12168
518A2168N08j028K195o638r171J2423R588o025j3923J526O693O467q304j0065
$$ 12168 12676 11648 13843 7205 -1966 10457 20045 14020 97 1623 8316 14783 6479 -3586
532c586R359k565p235Q26J4945o293k3024J0864J8337j3352j6037J8505j165j7133
$$ -3586 5773 3208 -4027 -3201 11744 5451 -17573 -6709 11628 -1724 -17761 744 -421 -17554
546a7554R249J7221j3016k2500K1774J1658j9006n837J4903K233j1560K958M356
$$ -17554 -8305 8916 -4100 -26600 -4826 6832 -12174 -18011 -3108 -875 -12435 -9477 -5121
559e121j60q182P484R238q964p897N115J7149p787j1112P631M974q858M532J7976
$$ -5121 -5281 -13463 -5979 3259 -5705 -13602 -8487 8662 875 -10237 -2606 2368 -6490 -1958 16018
574A6018j2101j6339N119K3377Q48k2538k005J3801O451j3185M233J1204j2967
$$ 16018 3917 -12422 -7303 16074 16922 -5616 -7621 6180 12631 -554 3679 14883 1916
587A916j3089K1990J2846l0314K810K1654j0294j5299J7998R283k7521K594K3867
$$ 1916 -11173 10817 23663 -6651 -3841 17813 7519 -7780 10218 19501 -8020 -5426 18441
600A8441m423j9966N917R474k699m323q363J1880N189j0802l272R844k038j5726
$$ 18441 14018 -5948 -31 9443 6744 2421 -5942 5938 11127 325 -2947 6897 4859 -10867
614a0867J0609J2836j0209j4554J1342O152q737J315J741Kj3959J987K2011k799
$$ -10867 -258 12578 2369 -12185 -843 5309 -3428 -2113 -372 -370 -14329 -12342 9669 6870
628F870k7368K366K8385r973j5839J0098O123j7832N990K5636j4951j4077R033
$$ 6870 -20498 -18132 10253 280 -15559 -5461 662 -17170 -11180 14456 -495 -14572 -5539
641e539N872k437N140l536o054R591l373k154P423J600j5270N713K3142j8301
$$ -5539 333 -2104 3036 -500 -6554 3037 -336 -2490 4933 6533 -8737 -3024 20118 1817
655A817j7638J9452J4271j9288m954J3652J271n331j705J0513o030r647O624J1110
$$ 1817 -15821 3631 17902 -1386 -6340 7312 8583 3252 1547 12060 6030 -3617 3007 14117
669A4117m304j4455Q324O978p853k350J3233p165j7660J0936J0442j907j1452
$$ 14117 9813 -4642 3682 10660 2807 457 13690 6525 -11135 -199 10243 8336 -3116
682c116j891P503M603n671n447J0692m504j2734O506J9444j2589j9641J7212N582
$$ -3116 -5007 2496 7099 1428 -4019 6673 2169 -10565 -4059 15385 2796 -16845 367 5949
696E949j3259P91J2793j1346j1411J3994O657j1905r656J4832M573r575m784O056
$$ 5949 -7310 -6519 6274 -5072 -16483 -2489 4168 -7737 -17393 -2561 2012 -7563 -12347 -6291
710f291P049q813L43O471j541r130P544J0632r611o050N283R656o125k730M595
$$ -6291 758 -8055 -7712 -1241 -2782 -11912 -4368 6264 -3347 -9397 -4114 5542 -583 -3313 1282
725A282k743k598M541J1186o869j0333J512J2610K724j0114Q86K162J038k802
$$ 1282 -1461 -4059 482 11668 4799 -5534 -4022 8588 11312 1198 2084 4246 5284 2482
739B482M502K573n937k176L076M764n920J906J846m139j984M883M345j0241j2
$$ 2482 6984 9557 3620 1444 4520 9284 3364 5270 7116 2977 993 5876 10221 -20 -32
754c2N945P51o562k08M686l016j7k858J642L63N82j598l268K718j723j59j025
$$ -32 5913 6664 102 -106 4580 1564 1547 -1311 331 694 1276 -322 -3590 -872 -2595 -2754 -3779
771c779N581k267q895K210P091J140r148L260M66n678M745R611o765j3871J1121
$$ -3779 1802 -465 -9360 -7150 -59 1081 -8067 -4807 -4341 -10019 -5274 4337 -2428 -16299 -5178
786e178O114o130k256M926k235m292P979o90j170j01k046j324P822J436j1889
$$ -5178 936 -5194 -7450 -2524 -4759 -9051 -1072 -1762 -2932 -3033 -5079 -6403 1419 2855 -9034
801i034P654O496q603k854J4448k130j4979J2132Q470j3101n847J9701O78j8457
$$ -9034 -1380 5116 -3487 -6341 8107 5977 -9002 3130 11600 -1501 -7348 12353 13031 -5426
815e426M970J2623l002j1585P843N062q128l254P710M741j0264m5K766O21j955
$$ -5426 -456 12167 9165 -2420 5423 10485 2357 -897 6813 11554 1290 1245 4011 4632 2677
830B677J024J525n011m51j040O090J156q111m289R367L802j5605N768J2348j1670
$$ 2677 3701 5226 215 -236 -1276 4814 5970 -2141 -6430 2937 6739 -8866 -3098 9250 -2420
845b420j3275J7746R279k2248P60J6143o055j4012J4263O755j7231R06J1450k081
$$ -2420 -15695 2051 11330 -10918 -10158 5985 -70 -14082 181 6936 -10295 -9389 2061 -20
859b0q993O841K380m912k90l89M275J284k279p796P060O457j0791P6R663j361
$$ -20 -9013 -2172 208 -4704 -4994 -5383 -1108 176 -2103 -9899 -2839 3618 -7173 -7097 2566 1205
875A205j3329R024J0082q569o243Q073M885j1073M920R930m832r247N645J0020
$$ 1205 -12124 -3100 6982 -1587 -7830 243 5128 -5945 -1025 8905 4073 -5174 471 10491
889A0491o772l815M415M709p583o68P830n18l854m357M756K196j049l455J102
$$ 10491 3719 -96 4319 9028 1445 777 8607 8089 4235 -122 4634 6830 5781 2326 3428
904C428L454n531q77N115L207j1429k43J0774n857o924O437O553j3286l261J1545
$$ 3428 6882 1351 474 5589 8796 -2633 -2876 7898 2041 -4883 1554 8107 -5179 -8440 3105
919C105J406j0472j371R672m569m209J383N942j624q747L516O076j097p734N392
$$ 3105 4511 -5961 -7332 2340 -2229 -6438 -5055 887 -737 -9484 -5968 108 -989 -8723 -3331
934c331L470p240j483Q763K904j3183K902Q663k632o527M366P734p807n042O520
$$ -3331 139 -7101 -8584 179 3083 -10100 -7198 1465 -1167 -7694 -3328 4406 -3401 -8443 -1923
949a923Q859q259n751Q263K598n268l186J0727j856r514L771Q949l573q134P690
$$ -1923 6936 -1323 -7074 1189 3787 -1481 -4667 6060 4204 -5310 -1539 7410 3837 -4297 3393
964C393L377n714m487J0164L917j2304N97Q500J422r579K824Q432n229p425N655
$$ 3393 6770 1056 -3431 6733 10650 -1654 -1057 7443 8865 -714 2110 10542 5313 -2112 3543
979C543P989r448j470L942q5l497N01N853n661l722K231M082k661l214L11J095
$$ 3543 11532 2084 614 4556 4471 974 1475 7328 1667 -2055 176 4258 1597 -1617 -1306 -211
995b11R71o276M805L233n229m704L242O270p020l143M984K101p188K163N636m948
$$ -211 760 -5516 -711 2522 -2707 -7411 -4169 2101 -4919 -8062 -3078 -977 -8165 -6002 -366 -5314
1011e314j160J373K644m846J641N640l841j920L061K171k680M180j781l576L618
$$ -5314 -6474 -5101 -2457 -7303 -5662 -22 -3863 -5783 -2722 -551 -3231 949 -832 -4408 -790
1026g90J791j555k238P725l263p385P416O920p974m905R181k668l704M251N019
$$ -790 1001 -554 -2792 4933 1670 -5715 1701 8621 647 -4258 4923 2255 -1449 2802 7821
1041G821n895m255J0079j762m472J949K080m428L20L431q34J783l119q41R28M343
$$ 7821 1926 -2329 7750 5988 1516 3465 5545 1117 1437 4868 4034 5817 2698 1857 2785 7128
1057G128l705q268Q548L045r216j131J2018m290r379P237M039q783m899J3546
$$ 7128 3423 -4845 3703 6748 -2468 -3599 8419 4129 -5250 1987 6026 -2757 -7656 5890
1071E890l062j1939O189O958n410m196P482k484o189L1O356J89o238O94M06N309
$$ 5890 2828 -9111 -2922 4036 -1374 -5570 1912 -572 -6761 -6730 -374 -185 -6423 -5729 -5323 -14
1087a4p71m370J570J344l145j378P684k508n517J711Q401k072q125P997K023p306
$$ -14 -785 -5155 -3585 -2241 -5386 -6764 920 -1588 -7105 -5394 3007 935 -7190 807 2830 -4476
1103d476j764J0138M1r072L225P477j657p585O830K279n038Q8J692J358k452K657
$$ -4476 -6240 3898 3939 -5133 -1908 5569 3912 -3673 3157 5436 398 486 2178 3536 1084 3741
1119C741L55Rj162j071J782J493k77n974M601J625m293K118M450l364q247O900
$$ 3741 4096 4105 2943 1872 3654 5147 4870 -1104 3497 5122 829 2947 7397 4033 -4214 2686
1135B686N531n083o313L678L117l909K010M69p30m671Q60N593r10n105k347O097
$$ 2686 8217 3134 -3179 499 3616 -293 1717 2186 1456 -3215 -2355 3238 2328 -2777 -5124 973
1151I73j438l006J049K704l590l924P013r1m979k398N538K136n853j057M181L321
$$ 973 -465 -3471 -2422 282 -3308 -7232 -219 -310 -5289 -7687 -2149 -13 -5866 -6923 -2742 579
1167E79o945N16N337j387m691L667P388q436l134O952L402n973n13N723k971k001
$$ 579 -6366 -5850 -513 -1900 -6591 -2924 4464 -3972 -7106 -154 3248 -2725 -3238 2485 -486 -2487
1183b487K365O296l514o995K822Q056J98r376M893N537n935k925R973P17j3198
$$ -2487 -122 6174 2660 -4335 -1513 6543 6741 -2635 2258 7795 1860 -1065 8908 9625 -3573
1198c573L166Q885j655p319L407K595n149J158K608J215n728j418M190L130n012
$$ -3573 -407 8478 6823 -496 2911 5506 357 1515 4123 5338 -390 -1808 2382 5512 500
1213E00n396Q266J639o633j974P574j556p630N334L670o236n547R086L275q165
$$ 500 -4896 3370 5009 -1624 -3598 3976 2420 -5210 124 3794 -2442 -7989 1097 4372 -3793
1228c793k342N060K004p142L671L952o026m820P559O217q279k569L336K159k561
$$ -3793 -6135 -1075 929 -6213 -2542 1410 -4616 -9436 -1877 4340 -3939 -6508 -3172 -1013 -3574
1243c574J309J378k801N86q67L874J782l486l972M329M239o014J470M099k459
$$ -3574 -2265 -887 -3688 -3102 -3969 -95 1687 -1799 -5771 -1442 2797 -3217 -1747 2352 -107
1258a07m813O954L959q847N38O815J25o549L498L572l437j41K233Q87l891K585
$$ -107 -4920 2034 5993 -2854 -2316 4499 4624 -1925 1573 5145 1708 1567 3800 4687 796 3381
1274C381J203p29m70j999J9J437L803m364k468K772R65k083P83K771p639m40P754
$$ 3381 4584 3855 3385 1386 1405 2842 6645 2281 -187 2585 3550 1467 2250 5021 -2618 -3058 4696
1291D696J202p778j125N949l439j607K399J204n235m98M378l75j009l052J342
$$ 4696 5898 -1880 -3005 2944 -495 -2102 297 1501 -3734 -4232 146 -229 -1238 -4290 -2948
1306b948J136L57j754j29K413k999L23K107J221m530K27N737k372m341J592O574
$$ -2948 -1812 -1455 -3209 -3338 -925 -3924 -3601 -1494 -273 -4803 -4576 1161 -1211 -5552 -3960 2614
1322B614m558m108N410K833n880j475R722k949p170K659O416k771l469N176j082
$$ 2614 -1944 -6052 -642 2191 -3689 -5164 4558 1609 -5561 -2902 3514 743 -2726 2450 1368
1337A368l281J109N300j425m210O74K248L521l445j137K225O53k874J073N782
$$ 1368 -1913 -804 4496 3071 -1139 -465 1783 5304 1859 722 2947 3600 726 1799 7581
1352G581m572m148L215N233m268l012M045o99k152l60L815k088l182J812K761
$$ 7581 3009 -1139 2076 7309 3041 29 4074 3375 1223 863 4678 2590 -592 1220 3981
1367C981j928n021M287J970l652l136L808J742m789J149J317p01k788J239J535
$$ 3981 2053 -2968 1319 3289 -363 -3499 309 2051 -2738 -1589 -272 -973 -3761 -2522 -987
1382i87m12j360k874L082J212q97j448J756n99l442M198J833k775k878L590J264
$$ -987 -1399 -2759 -5633 -2551 -1339 -2236 -3684 -1928 -2527 -5969 -1771 62 -2713 -5591 -2001 -737
1398g37k143P03J151J074l611R69L117P06l224j664N841l26l093J086M119l505
$$ -737 -2880 -2177 -1026 48 -3563 -2594 523 1229 -1995 -3659 2182 1856 -1237 -151 3968 463
1414D63k178M974J93k483j256M207q38k591J753K162N9m354M48L119R04m626J144
$$ 463 -1715 3259 3452 969 -287 3920 3082 491 2244 4406 4465 111 559 3678 4582 -44 1100
1431A100N242m630l277L758M969n927l277N131O30m496L91N598m215l747L074
$$ 1100 6342 1712 -1565 2193 7162 1235 -2042 3089 3719 -777 -386 5212 997 -2750 324
1446C24L926l880n105N839R85n007j274N783r87o125J926M403m82n535K299J742
$$ 324 4250 370 -4735 1104 2089 -2918 -4192 1591 604 -5521 -3595 808 326 -5209 -2910 -1168
1462a168j899j087Q48L773k622k958K099L719l824k277N484k95n384L08Q825l007
$$ -1168 -3067 -4154 -3306 467 -2155 -5113 -3014 705 -3119 -5396 88 -207 -5591 -5283 3542 535
1478E35o717N507L796m938k931P061L40m659K70M800n1m170K877P26o63j362J662
$$ 535 -6182 -675 3121 -1817 -4748 2313 2653 -2006 -1736 3064 3013 -1157 1720 2446 1783 421 2083
1495B083K033k567j299J596K778k922m97J777R97k309k246N052j72l686q88L621
$$ 2083 4116 1549 250 1846 4624 1702 1205 2982 3979 1670 -576 4476 4304 618 -270 3351
1511C351K00l369J501J954j610m149L721J149l214K72J286L03l409J577J935j796
$$ 3351 3551 182 1683 3637 2027 -2122 1599 2748 -466 -194 1092 1395 -2014 -437 1498 -298
1527b98k573J125J859j285j16j521J967n08k194O88J190Q79l524N51K823k48l405
$$ -298 -2871 -1746 113 -1172 -1288 -2809 -842 -1350 -3544 -2856 -1666 -787 -4311 -3760 -937 -1185 -4590
1544d590J590K244l424Q25K221J228l267K81L870k358j700K331K753l392q47K556
$$ -4590 -3000 -756 -4180 -3355 -1134 94 -3173 -2892 978 -1380 -3080 -749 2004 -1388 -2235 321
1560C21J962j954k662M017J52j972k27L092O58l670L35K765Q24l294K142J624
$$ 321 2283 329 -2333 1684 1836 -136 -363 2729 3387 -283 52 2817 3641 347 2489 4113
1576D113k132j404J337L687m052k262L793J674l947p47M656j746m221O00N586
$$ 4113 1981 577 1914 5601 1549 -713 3080 4754 807 60 4716 2970 -1251 -651 4935
1591D935l230l910M367O60k923j017L932j525l808R43L128q23l457K292O40j230
$$ 4935 1705 -2205 2162 2822 -101 -1118 2814 1289 -2519 -1576 1552 729 -2728 -436 204 -1026
1607a026k607J833L151l658k245J942K624k952q90J993R13j990j664L847n51j727
$$ -1026 -3633 -1800 1351 -2307 -4552 -2610 14 -2938 -3828 -1835 -922 -2912 -4576 -729 -1280 -3007
1623c007k50K114K62k788K110K003j542k583M091O07l606J203K222k09k752L253
$$ -3007 -3257 -1143 -881 -3669 -1559 444 -1098 -3681 410 1017 -2589 -1386 836 627 -2125 1128
1639A128J641k514p00Q39J286J13Q44k240J235Q38j383J269J743m06m180K198
$$ 1128 2769 255 -445 394 1680 1793 2637 397 1632 2470 1087 2356 4099 3693 -487 1711
1655A711K724k153j706K560J048l859J105J689n7l039K81L210k028j780K92K350
$$ 1711 4435 2282 576 3136 4184 325 1430 3119 3062 23 304 3514 1486 -294 -2 2348
1671B348k112j070J786J09k032j609K641q25q28k2J203K4k699k3J949J197l653
$$ 2348 236 -834 952 1061 -971 -2580 61 -764 -1592 -1614 -411 -387 -3086 -3109 -1160 37 -3616
1688c616P83L113k730k891L567N003o004k704M943R74m327O53M925l272k592K739
$$ -3616 -2833 280 -2450 -5341 -1774 3229 -2775 -5479 -536 438 -3889 -3236 1689 -1583 -4175 -1436
1704a436L576l167k794L506J032j322j605K864k69k386J493L608o37m955K347
$$ -1436 2140 -1027 -3821 -315 717 -605 -2210 654 385 -2001 -508 3100 2463 -2492 -145
1719a45K987j155k651K162K849l064q80K174K246l671p85L833m3m000o90N999
$$ -145 2842 1687 -964 1198 4047 983 103 2277 4523 852 67 3900 3857 -143 -833 5166
1735E166j325m001J661K445l391k030N403m98m321m79M036o67k872J401R7o35
$$ 5166 3841 -160 1501 3946 555 -1475 3928 3430 -891 -1370 2666 1999 -873 528 625 -10
1751a0j490J900N10j886j601R31K913k477j390Q86J045j500o02K253j365j479
$$ -10 -1500 400 910 -976 -2577 -1646 1267 -1210 -2600 -1714 -669 -2169 -2771 -518 -1883 -3362
1767c362j09L541l22k983K15J961O62l322J685J605j194j223K435J031l232Q86
$$ -3362 -3471 70 -252 -3235 -3020 -1059 -397 -3719 -2034 -429 -1623 -2846 -411 620 -2612 -1726
1783a726J661L82k077J22J425K56J497q49K66j058l21J192K175m04l469J803K222
$$ -1726 -65 317 -1760 -1638 -213 43 1540 691 957 -101 -422 770 2945 2541 -928 875 3097
1800C097m20k359J638J646k587k15J928R88m408L81M047k5l596l32M022k345j550
$$ 3097 2677 318 1956 3602 1015 800 2728 3716 -692 -311 3736 3711 115 -217 3805 1460 -90
1817i0K172J250l957j158M179k64j800n46K421j300k375O34O00j3k059J743J214
$$ -90 2082 3332 -625 -1783 2396 2132 332 -214 2207 907 -1468 -834 -234 -247 -2306 -563 651
1834F51j829k286J932K880l469j434J191J685k779M56L946j961l798J748N015
$$ 651 -1178 -3464 -1532 1348 -2121 -3555 -2364 -679 -3458 -3002 944 -1017 -4815 -3067 1948
1849A948l610l209L268K265k726j531M475j905k668K477L399j783k682J667J34
$$ 1948 -1662 -4871 -1603 662 -2064 -3595 880 -1025 -3693 -1216 2183 400 -2282 -615 -481
1864d81P22j34R95k98p02O78L79J628k031m91J738O52k550j09L679j198j236O9
$$ -481 241 107 1102 804 102 780 1159 2787 756 265 2003 2655 105 -4 3675 2477 1241 1310
1882A310K220k005k109K973J198j583k393K376O09j482n06J237j66k034K182k41
$$ 1310 3530 1525 -584 2389 3587 2004 -389 1987 2596 1114 608 1845 1679 -355 1827 1586
1898A586j397o40N18O39j60N1k024N03M65n2p98J109j79l436K289J874j569k063
$$ 1586 189 -451 67 706 546 597 -1427 -924 -459 -511 -1309 -200 -379 -3815 -1526 348 -1221 -3284
1916c284J787J030k314L56J299J18k470J732J466j565j075O56K748k120j319K233
$$ -3284 -1497 -467 -2781 -2425 -1126 -1008 -3478 -1746 -280 -1845 -2920 -2264 484 -1636 -2955 -722
1932g22J323k131p11K803o19r81m83K919P1k571N82J564J346k296q3J651j86k182
$$ -722 601 -1530 -2241 562 -57 -1038 -1521 1398 1469 -1102 -520 1044 2390 94 11 1662 1476 -706
1950g06K315K779m319m76L184J034l971M27M165k956k523L060K615l878j039K562
$$ -706 1609 4388 69 -407 2777 3811 -160 267 4432 1476 -1047 2013 4628 750 -289 2273
1966B273O27j725j528K813p28j913L85J788n06k534J256J188j138k537K573P84
$$ 2273 2900 1175 -353 2460 1732 -181 204 1992 1486 -1048 208 1396 258 -2279 294 1078
1982A078k781j40J145J430k906k77K218j35k684J85L090j395k069Q2L274j680
$$ 1078 -1703 -1843 -698 732 -2174 -2451 -233 -368 -3052 -2867 223 -1172 -3241 -3159 115 -1565
1998a565j787L064n28k259N6L301q27k323J115J644p20j603K820J4q35j008O09
$$ -1565 -3352 -288 -816 -3075 -3019 282 -545 -2868 -1753 -109 -829 -2432 388 402 -433 -1441 -832
2015h32K361q87o86L48J342j271k20P20O18m08j273K433k90r83j08J084L07k289
$$ -832 1529 642 -44 304 1646 375 155 875 1493 1085 -188 2245 1955 972 864 1948 2255 -34
2033c4J587J668j309k691K928J475k519k37J102M50k769J060J728p61r34m95L80
$$ -34 1553 3221 1912 -779 2149 3624 1105 868 1970 2420 -349 711 2439 1678 744 249 629
2050F29m43K74q70J250l32j984O81O93J05k439J676J648k594j507K763J304m022
$$ 629 186 460 -410 840 508 -1476 -795 -102 3 -2436 -760 888 -1706 -3213 -450 854 -3168
2067c168O15K634m84l408J318L517k871j233K298R19l177j95K750Q7r49k9K010
$$ -3168 -2553 81 -403 -3811 -2493 1024 -1847 -3080 -782 137 -3040 -3235 -485 -398 -1347 -1376 634
2084F34k127j117J490J703L1k314J161J246n07j612K420J294k617m80J572J820
$$ 634 -1493 -2610 -1120 583 614 -1700 -539 707 200 -1412 1008 2302 -315 -795 777 2597
2100B597k878O02K791q92k459Q48L003k138j233K032J710l564q92L904j101k185
$$ 2597 -281 321 3112 2220 -239 609 3612 1474 241 2273 3983 419 -473 3431 2330 145
2116A45P76K626j956k004J563M43j024n48J642r88l69m04J12J032j395j98j75
$$ 145 921 3547 1591 -413 1150 1593 569 21 1663 675 306 -98 14 1046 -349 -547 -722
2133g22N22j156K32J690r72j650r9K338j731q65J178M89p58j685K229L01j217
$$ -722 -200 -1356 -1124 566 -406 -2056 -2155 183 -1548 -2413 -1235 -746 -1504 -3189 -960 -659 -1876
2150a876n49J719j08j643J124M28m5j043J198L8n91R59m38K43J62M47q96J099
$$ -1876 -2425 -706 -814 -2457 -1333 -905 -950 -1993 -795 -757 -1348 -389 -827 -584 -422 25 -871 228
2168B28L15j358J100J310k92k095K110R10k191M20J997k16k640J698J586r61j336
$$ 228 543 -815 285 1595 1303 -792 1318 2228 37 457 2454 2238 -402 1296 2882 1921 585
2185E85Q99J304k279o5J247J271k014q91J888j35j321l69K241j156j575L43J101
$$ 585 1484 2788 509 444 1691 2962 948 57 1945 1810 489 120 2361 1205 -370 -27 1074
2202A074K48k123Q15Q24l22j983J046J546k506o17K018R51l709N82K746j595j955
$$ 1074 1322 -801 14 838 516 -1467 -421 1125 -1381 -1998 20 971 -2738 -2156 590 -1005 -2960
2219b960J903K013l892p63K995P40k443j78K776j310j461J99K318o53j257P98
$$ -2960 -1057 956 -2936 -3699 -704 36 -2407 -2585 191 -1119 -2580 -2381 -63 -716 -1973 -1175
2235a175Q26j70j439J870P11j071n68O14J253j385M33R21N62j464n7K318p36j645
$$ -1175 -349 -519 -1958 -88 623 -448 -1016 -402 851 -534 -101 820 1382 -82 -139 2179 1443 -202
2253b02L87K585j686j096K072K93j850k53L164j251k066O73J542p44j104J371
$$ -202 185 2770 1084 -12 2060 2353 503 250 3414 2163 97 770 2312 1568 464 1835
2269A835m68k09o74N80N50o78o96l91J633q28j166J79J165n36j462J230j45p96
$$ 1835 1367 1158 484 1064 1614 936 240 -151 1482 654 -512 -333 832 296 -1166 64 -81 -877
2287h77p57J571k0k034O12R37p9j779J375N11j327k70J234M61k527J038J665p
$$ -877 -1634 -63 -83 -2117 -1505 -568 -647 -2426 -1051 -540 -1867 -2137 -903 -442 -2969 -1931 -266 -273
2305b73j754j77J473l75j80K1J342p32j266Q86J646j75k472J660J617r36j364
$$ -273 -2027 -2204 -731 -1106 -1286 -1265 77 -655 -1921 -1035 611 436 -2036 -376 1241 305 -1059
2322a059J952Q81k435O45K013q2k867J405K600j926j041J304J424k699Q5K599
$$ -1059 893 1774 -661 -16 1997 1915 -952 453 3053 1127 86 1390 2814 115 200 2799
2338B799n13k487P54K779j970j325Q57J562j021j215J361j21r23j053J847N29
$$ 2799 2286 -201 553 3332 1362 37 894 2456 1435 220 1581 1460 537 -516 1331 1860
2354A860k015j211J848J597k936k36J272k37j941Q20K383k273j508J655J583k396
$$ 1860 -155 -1366 482 2079 -857 -1093 179 -58 -1999 -1179 1204 -1069 -2577 -922 661 -1735
2370a735o65J972o34j118L92K209j960j480K137R28j526j045J919k32l64l89R95
$$ -1735 -2400 -428 -1062 -2180 -1788 421 -1539 -3019 -882 46 -1480 -2525 -606 -838 -1202 -1591 -596
2387e96J9p42M04J28J328j273m28J741O34j482n17J870n03l22M51J000j254q58
$$ -596 -577 -1319 -915 -787 541 -732 -1160 581 1215 -267 -784 1086 583 261 712 1712 458 -400
2405d00K144M6r44q28J429K37p63J64O96l89j491J733N93q79n12K5Q47m43o5o39
$$ -400 1744 1790 846 18 1447 1684 921 1085 1781 1392 -99 1634 2227 1348 836 861 1708 1265 1200 561
2425E61J67J10l56O4N27l15k284K118O30k079o35J779L63k596Q71J529r82j913
$$ 561 728 838 482 546 1073 758 -1526 592 1222 -857 -1492 287 650 -1946 -1075 454 -528 -2441
2443b441J772P94k159m1Q51J356j677l79R50j82o01N90J175j659m42O55J521r18
$$ -2441 -669 125 -2034 -2075 -1224 132 -1545 -1924 -974 -1156 -1757 -1167 8 -1651 -2093 -1438 83 -835
2461h35j281J554K51k47o19Q09J130j674o77K126J162l014O41K117j91j926J087
$$ -835 -2116 -562 -311 -558 -1177 -368 762 -912 -1589 537 1699 -1315 -674 1443 1252 -674 413
2478D13K057k758k10K642K7k439R88J627r45q30K43J726j470n97J159K48n92j119
$$ 413 2470 -288 -498 2144 2171 -268 720 2347 1402 572 815 2541 1071 474 1633 1881 1289 170
2496A70J327N18j209r53J380J85j329N89k21L98j281K47J269j012j169L44J642
$$ 170 1497 2015 806 -147 1233 1418 89 678 457 855 -426 -179 1090 78 -1091 -747 895
2513H95j245j159P08J267j678r52K602r29j573K74J341l84j045O93J24k88k85
$$ 895 -350 -1509 -801 466 -1212 -2164 438 -491 -2064 -1790 -449 -833 -1878 -1185 -1061 -1349 -1634
2530a634R77o16L8J03m18J081p27J7L54O91o88m61J058O01p41r47K149j28j426
$$ -1634 -657 -1273 -1235 -1132 -1550 -469 -1196 -1179 -825 -134 -822 -1283 -225 376 -365 -1312 837 709 -717
2549g17M90J411M4j908J157J353r47j064J540L83j727P94R13Q9j535M58J342q01
$$ -717 -227 1184 1228 -680 477 1830 883 -181 1359 1742 15 809 1722 1811 276 734 2076 1275
2567A275m76J14Q87p36o29J52J519o65j869J461N99j084j115J472N50k250mK017
$$ 1275 799 913 1800 1064 435 587 2106 1441 -428 1033 1632 548 -567 905 1455 -795 -799 1218
2585A218n09k364J351J310j569j360J609J301k903qK193k86k147N49J780j380
$$ 1218 709 -1655 -304 1006 -563 -1923 -314 987 -1916 -1924 269 -17 -2164 -1615 165 -1215
2601a215r72P34J630j605p84J228N21o30r58J455K65j023l34J495K99j573O41
$$ -1215 -2187 -1453 177 -1428 -2212 -984 -463 -1093 -2051 -596 -331 -1354 -1688 -193 106 -1467 -826
2618h26J167N1j861J159J770j547r10J347J308j893j49J776P5j720L92K331j455
$$ -826 341 392 -1469 -310 1460 -87 -997 350 1658 -235 -384 1392 1467 -253 139 2470 1015
2635A015j027R46J006j022o18J710n45p36p7J140l80m49j46J2O72r69r9N58K01
$$ 1015 -12 934 1940 918 300 2010 1465 729 652 1792 1412 963 817 829 1501 532 433 991 1192
2654A192r74m13J364o19r07K8J298j189p51J078k0o43n41J051l18r08J12P09j11
$$ 1192 218 -195 1169 550 -357 -329 969 -220 -971 107 87 -556 -1097 -46 -364 -1272 -1160 -451 -562
2673e62j210Q77L06k47r04M97O65p77N3R0N92n80l63M53R85l84j340J287N77q18
$$ -562 -1772 -895 -589 -836 -1740 -1243 -578 -1355 -1302 -1212 -620 -1200 -1563 -1110 -125 -509 -1849 -562 15 -803
2693h03n22J819p2j938J143J398o07j667J803Q24j444q0J193M32j630N68J199
$$ -803 -1325 494 422 -1516 -373 1025 418 -1249 554 1378 -66 -146 1047 1479 -151 417 1616
2710A616j16j310M02J482j033o36O72R42j229n81J289r0o45m70J278k93r45j65
$$ 1616 1500 190 592 2074 1041 405 1077 2019 790 209 1498 1408 763 293 1571 1278 333 168
2728A68J092J87j753L32J104k73j917J259J365j977r71J514O42k262L48J625j152
$$ 168 1260 1447 -306 26 1130 857 -1060 199 1564 -413 -1384 130 772 -1490 -1142 483 -669
2745f69r79P95J196j581l99Q85L09o90n33J136j02n89l41R96k6q42J72N05L49
$$ -669 -1648 -853 343 -1238 -1637 -752 -443 -1133 -1666 -530 -632 -1221 -1562 -566 -592 -1434 -1262 -757 -408
2764d08j029O21O24k73n65L1J419o29n88N45J106j201k73J681k07j071J23J588
$$ -408 -1437 -816 -192 -465 -1030 -999 420 -209 -797 -252 854 -347 -620 1061 854 -217 -94 1494
2782A494p61o13R71P4l70m44Q27J8nl60P7L73k00k44n9R16o56p02P31L25p94o05
$$ 1494 733 120 1091 1165 795 351 1178 1196 1191 831 908 1281 1081 837 778 1694 1038 336 1067 1392 598 -7
2804gJ232k69r07n2J199m44j695R69Q16q32j245J174M86j379j54J118J90j843
$$ -7 1225 956 49 -3 1196 752 -943 26 842 10 -1235 -61 425 -954 -1108 10 200 -1643
2822a643O37Q52m57p30n4R46o97k93M53Q36r31q53J133N23p89j144J998J29j397
$$ -1643 -1006 -154 -611 -1341 -1395 -449 -1146 -1439 -986 -150 -1081 -1934 -801 -278 -1067 -2211 -213 -84 -1481
2841a481J92J578l40j641J422J189r28j898J840J262k075P75J235J60j715M07
$$ -1481 -1289 289 -51 -1692 -270 919 -9 -1907 -67 1195 -880 -105 1130 1290 -425 -18
2857a8J826j249r66R98J372j444m01R73O78q85m98J278l58r32o1J321qj387O4
$$ -18 1808 559 -407 591 1963 519 118 1091 1769 884 386 1664 1306 374 313 1634 1626 239 303
2876C03J145l4j499Q78L74j000m23Q44P57j814j94J428k6j537J58J209p98r88
$$ 303 1448 1414 -85 793 1167 167 -256 588 1345 -469 -663 765 739 -798 -640 569 -229 -1217
2894a217L46J294j204r31J485Jq46l28R22l12k86j67L7L85o17P37r7L05p14k69
$$ -1217 -871 423 -781 -1712 -227 -226 -1072 -1400 -478 -790 -1076 -1243 -1206 -821 -1438 -701 -798 -493 -1207 -1476
2914a476J162jq08l0J149m62m65O43P13q34q52J838Jp63j17P97J63o32M75M97
$$ -1476 -314 -315 -1123 -1153 -4 -466 -931 -288 425 -409 -1261 577 578 -185 -302 495 658 26 501 998
2934I98l51r45J340K98p82j32K75R61r86k19M71L64m61m20P57L19p10r54J804
$$ 998 647 -298 1042 1340 558 426 701 1662 676 457 928 1292 831 411 1168 1487 777 -177 1627
2953A627r8j714M52J023l94j478J171N37j580l94J832k09j979O66Q69j20j259
$$ 1627 1529 -185 267 1290 896 -582 589 1126 -454 -848 984 775 -1204 -538 331 211 -1048
2970a048L37R92r81m05N04P38j163l97P64M79q36p11J330m98l69K61N27j93j222
$$ -1048 -711 281 -700 -1105 -601 137 -1026 -1423 -659 -180 -1016 -1727 -397 -895 -1264 -1003 -476 -669 -1891
2989a891P76J156m39j420J266Q08j068k60R93P86j913N21J618n89j135Q17J148
$$ -1891 -1115 41 -398 -1818 -552 256 -812 -1072 -79 707 -1206 -685 933 344 -791 26 1174
3006A174r97j85M25N84q42J61R77m95l98j09J037J5p98j2P17N4q52O65j00j29
$$ 1174 177 -8 417 1001 159 320 1297 802 404 295 1332 1347 549 537 1254 1308 456 1121 1021 892
3026H92o03K56R62q38m66K05P03o53m67L59K00p91m6J223j005o60N19L61l57o09
$$ 892 289 545 1507 669 203 408 1111 458 -9 350 550 -241 -287 936 -69 -729 -210 151 -206 -815
3046h15M63r0m0l88L57r2j35k20r0R78r91m21P22M08o66l34Q49k45l59j7J042
$$ -815 -352 -442 -482 -870 -513 -605 -740 -960 -1050 -72 -1063 -1484 -762 -354 -1020 -1354 -505 -750 -1109 -1126 -84
3067h4n91o24Q79L67j98j120J172N66r36j6J148O7j485P72R87j51j140O62J035
$$ -84 -675 -1299 -420 -53 -251 -1371 -199 367 -569 -585 563 630 -855 -83 904 753 -387 275 1310
3086A310q78j68M46O55p49l51P80L12p76m75J486m33r21J80J026k04j402R55O57
$$ 1310 432 264 710 1365 616 265 1045 1357 581 106 1592 1159 238 418 1444 1240 -162 793 1450
3105A450q62j005J292N09j433k15R47L46j743M71J187r66r98Q44R82j559m03J087
$$ 1450 588 -417 875 1384 -49 -264 683 1029 -714 -243 944 -22 -1020 -176 806 -753 -1156 -69
3123f9K99j298o1J077o77l45m2R60l26q22K56P03j95r88P74M50m77o39P85O85
$$ -69 230 -1068 -1129 -52 -729 -1074 -1116 -156 -482 -1304 -1048 -345 -540 -1528 -754 -304 -781 -1420 -635 50
3143E0j209K87P61J44j041L26J080n39o27L85J079q37k32P19K75n23l42J171k25
$$ 50 -1159 -872 -111 33 -1008 -682 398 -141 -768 -383 696 -141 -373 346 621 98 -244 927 702
3162G02m32R7N51l2m67K46R3L90n94J06L75O9n37k07J096o82o12N94O00q72n83
$$ 702 270 367 918 886 419 665 758 1148 554 660 1035 1104 567 360 1456 774 162 756 1356 484 -99
3183i9R92r2o32k69Q68l66o59K81M37j87j155P50K86m53n09M22N94j283J31N40
$$ -99 893 801 169 -100 768 402 -257 24 461 274 -881 -131 155 -298 -807 -385 209 -1074 -943 -403
3203d03J94q26j50Q43n0o64m17J217k38r17L81R86m95j265J383N19j005m38J468
$$ -403 -209 -1035 -1185 -342 -392 -1056 -1473 -256 -494 -1411 -1030 -44 -539 -1804 -421 98 -907 -1345 123
3222A23M8j294N86R06k97j133J024O84q05l54P64Q48j165j82R72O4q30J47J176
$$ 123 171 -1123 -537 369 72 -1061 -37 647 -158 -512 252 1100 -65 -247 725 789 -41 106 1282
3241A282o62m73L83Q41l72q54O91M06l92q48J109J96r77j97J078J79j714N89Q67
$$ 1282 620 147 530 1371 999 145 836 1242 850 2 1111 1307 330 133 1211 1390 -324 265 1132
3260A132m42j081Q37N79j296l5N45L22r42kN06k83k74m46P73k94l66L8M48k52
$$ 1132 690 -391 446 1025 -271 -306 239 561 -381 -383 123 -160 -434 -880 -107 -401 -767 -729 -281 -533
3280e33o19N43J32j67o14M13K86l27N2p1N18n01j45M16M06o11k10J062l62l60
$$ -533 -1152 -609 -477 -644 -1258 -845 -559 -886 -834 -905 -387 -888 -1033 -617 -211 -822 -1032 30 -332 -692
3300f92O4Q45m45l33Q83p4j74l00O01K05k91k20K95O62o53l6L42M23p37j28Q56
$$ -692 -628 217 -228 -561 322 248 74 -226 375 580 289 69 364 1026 373 337 679 1102 365 237 1093
3321A093k10n41M7R84n61n90L90N99m77q33J085J70q43l01Q68L2j356N85P11m44
$$ 1093 883 342 389 1373 812 222 612 1211 734 -99 986 1156 313 12 880 912 -444 141 852 408
3341D08r88P66L53r38r4M60L63j122m1N78K19p77k77R31k08p09j01J181n66j047
$$ 408 -580 186 539 -399 -493 -33 330 -792 -833 -255 -36 -813 -1090 -159 -367 -1076 -1177 4 -562 -1609
3361a609J071L88q90m59J158J77j000O5J053j03j140O52P99m46n08N59Q60j153
$$ -1609 -538 -150 -1040 -1499 -341 -164 -1164 -1099 -46 -149 -1289 -637 162 -284 -792 -233 627 -526
3379e26j52J003J82q58L40P46l47l36J52Q24o29l12M31L51p8n92L79O20m70o44
$$ -526 -678 325 507 -351 -11 735 388 52 204 1028 399 87 518 869 791 199 578 1198 728 84
3399H4Q18K32p40j7M36K17q04K59N45m38m90K27M55n84j45K62L81p59l73R17l09
$$ 84 902 1134 394 377 813 1030 226 485 1030 592 102 329 784 200 55 317 698 -61 -434 483 174
3420A74n13j44N90j14m99P0K72l7n75K77R8P8o09k55J092k91o12L03N19p09k53
$$ 174 -339 -483 107 -7 -506 -436 -164 -201 -776 -499 -401 -323 -932 -1187 -95 -386 -998 -695 -176 -885 -1138
3441a138P98Q9p87k81J402m44o50L73O52o6p61M42N56l86m41Q56L06n95j01N65
$$ -1138 -340 -251 -1038 -1319 83 -361 -1011 -638 14 -52 -813 -371 185 -201 -642 214 520 -75 -176 389
3461C89O86j052M0P33j79n00K65O53k00p04M55R65q47r76J145K51p01k71J125
$$ 389 1075 23 63 796 617 117 382 1035 835 131 586 1551 704 -272 873 1124 423 152 1277
3480A277j91j228N31R27n69j017P65J41m95l39O55K55j027J02O15m0j046Q6R46
$$ 1277 1086 -142 389 1316 747 -270 495 636 141 -198 457 712 -315 -213 402 362 -684 -598 348
3499C48l13p68J08Q02q22k18N47P5l48n72P92M4n60l50P90J33p98L55M82j65p68
$$ 348 35 -733 -625 177 -645 -863 -316 -241 -589 -1161 -369 -325 -885 -1235 -445 -312 -1110 -755 -273 -438 -1206
3520a206P23O06j031j10P72L51o32J09M04j18l70K98O57n40R7J8N04ol84J98K76
$$ -1206 -483 123 -908 -1018 -246 105 -527 -418 -14 -132 -502 -204 453 -87 10 28 532 526 142 340 616
3541F16l9l49M96O4j81j66K68L74o55q2L57L32m99k37N90j02n87R6Q43o33m49
$$ 616 577 228 724 788 607 441 709 1083 428 346 703 1035 536 299 889 787 200 296 1139 506 57
3562E7K96K09j56o37M70Qk69j04J95Q7m56j23K99K56r70m3Q21q7o12R8P50q05
$$ 57 353 562 406 -231 239 247 -22 -126 69 156 -300 -423 -124 132 -838 -881 -60 -147 -759 -661 89 -716
3584g16l66N33N38p26n20Q71J92o49k84R40j11q17M90O87n24o77R88M96q79k52
$$ -716 -1082 -549 -11 -737 -1257 -386 -194 -843 -1127 -187 -298 -1115 -625 62 -462 -1139 -151 345 -534 -786
3604g86P25M02r14M34M62Jm60j81J000l04m87K36R89m83p09O61L58o10k21J070
$$ -786 -61 341 -573 -139 323 324 -136 -317 683 379 -108 128 1117 634 -75 586 944 334 113 1183
3624A183k36q08K14Q66k82q71N59L16l54m91N65M01r66r6N71J85q75N9O16k77
$$ 1183 947 139 353 1219 937 66 625 941 587 96 661 1062 96 0 571 756 -119 -60 556 279
3644B79n56K41L31n29j22K04K84l45m68K63K02j49n89N31J73m57r1M60M9p96N04
$$ 279 -277 -36 295 -234 -356 -152 132 -213 -681 -418 -216 -365 -954 -423 -250 -707 -798 -338 -289 -1085 -581
3665e81M10k69m96L65M20l88j04J84L10m59pM45Qj56l09P37Ml82OM78J64o04L38
$$ -581 -171 -440 -936 -571 -151 -539 -643 -459 -149 -608 -615 -170 -162 -318 -627 110 114 -268 -262 216 380 -224 114
3688A14K14J44n43J64O32k20m56K37P78o29l11O76L04p96j27Q70j84n43J45N73
$$ 114 328 472 -71 93 725 505 49 286 1064 435 124 800 1104 308 181 1051 867 324 469 1042
3708A042m54n09N87K34l65n72O65J28o95k52O53J84j055J66P07l02o40J15P36
$$ 1042 588 79 666 900 535 -37 628 756 61 -191 462 646 -409 -243 464 162 -478 -363 373
3727C73o12m68K48O01o89n12P89K04p17n35J261j92j034M25P45m01q18R44L86
$$ 373 -239 -707 -459 142 -547 -1059 -270 -66 -783 -1318 -57 -249 -1283 -858 -113 -514 -1332 -388 -2
3746bp56j98P56J61p00J25N08J64n67K08N57k50m43L97N92o57j00L69M84n23j36
$$ -2 -758 -956 -200 -39 -739 -614 -106 58 -509 -301 256 6 -437 -40 552 -105 -205 164 648 125 -11
3767a1P75k44l53L1N64p7m38L00M66j26q46N92K66m21k20M52K50p52J94L14j61
$$ -11 764 520 167 198 762 685 247 547 1013 887 41 633 899 478 258 710 960 208 402 716 555
3788E55m03K27J33k66m2j51M50k64l35J45O4j05l54K69O1k42m73M27J76m32P9
$$ 555 152 379 512 246 204 53 503 239 -96 49 113 8 -346 -77 -16 -258 -731 -304 -128 -560 -481
3809d81J0J99n09r7M75R8n55L4O59l43l65K35L94l42l14P09r2l30jM59J53l08
$$ -481 -471 -272 -781 -878 -403 -305 -860 -826 -167 -510 -875 -640 -246 -588 -902 -193 -285 -615 -616 -157 -4 -312
3831c12j23K37L66n68J97N04J30n73P5Q63o63k84O93L63p53k39Q15r3l89j4R45
$$ -312 -435 -198 168 -400 -203 301 431 -142 -67 796 133 -151 542 905 152 -87 728 635 246 232 1177
3852A177m38p02M07N39l57p12P02K20m38m14Q16K1p47K01K20m2p06K29N65m55
$$ 1177 739 37 444 983 626 -86 616 836 398 -16 800 821 74 275 495 453 -253 -24 541 86
3872H6j94J06L35n21m26M67M76p99m20J027j93q25K30N99k86o50N05K96l92l64
$$ 86 -108 -2 333 -188 -614 -147 329 -470 -890 137 -56 -881 -651 -52 -338 -988 -483 -187 -579 -943
3892i43O72O2m48K2K73J65n91K14N24k70l32L51L49l29j26J93M99m11k1K66L6
$$ -943 -271 -209 -657 -635 -362 -197 -788 -574 -50 -320 -652 -301 48 -281 -407 -214 285 -126 -147 119 155
3913A55M7l71L87K39k45k21N60J21n78K67L30M9p51M35M44m65M0J24K68l67j27
$$ 155 202 -169 218 457 212 -9 551 672 94 361 691 740 -11 424 868 403 443 567 835 468 341
3934C41J35L92m63k90N52r8k65k81K95P2m39J41J25k1n58K37L31j39n49K49M48
$$ 341 476 868 405 115 667 569 304 23 318 390 -49 92 217 196 -362 -125 206 67 -482 -233 215
3955B15o78l04N42L09q35o4P95k55p84L45O33n66l55N63J26k73k56N67J00n27
$$ 215 -463 -767 -225 84 -751 -815 -20 -275 -1059 -714 -81 -647 -1002 -439 -313 -586 -842 -275 -175 -702
3975g02K5N74J47p58K18M41J23p00L56P12o59n8L40M69n79j75N58K34m90j01Q36
$$ -702 -677 -103 44 -714 -496 -55 68 -632 -276 436 -223 -281 59 528 -51 -226 332 566 76 -25 811
3996H11k46n08K67O78m98o44P34M08o51l40R67j79n89J43L72N5p81M10L05l16
$$ 811 565 57 324 1002 504 -140 594 1002 351 11 978 799 210 353 725 780 -1 409 714 398
4016C98l38J88L26m57k28L09J62n67J5M92l22k39KL60j73l80N3L14j19m82L31
$$ 398 60 248 574 117 -111 198 360 -207 -192 300 -22 -261 -259 101 -72 -452 -399 -85 -204 -686 -355
4037c55J17j91m58N22K33o43P3L83K6m67K30L65l96N6J09L82l96m3J08K60O1m74
$$ -355 -238 -429 -887 -365 -132 -775 -702 -319 -293 -760 -530 -165 -561 -505 -396 -14 -410 -453 -345 -85 -24 -498
4059d98J60L86q9k95M60J16k24j24L14L46o32J16M17L4k96N7N27k93k77K60M25
$$ -498 -338 48 -41 -336 124 240 16 -108 206 552 -80 36 453 487 191 248 775 482 205 465 890
4080H90m65l17N17J65l98k93O22k4n53J62K40j21m43M1N08K1p98J64O87o48j70
$$ 890 425 108 625 790 392 99 721 697 144 306 546 425 -18 23 531 552 -246 -82 605 -43 -213
4101b13L12L64q75j21P82k53o24P4P94o64k58K28L19k64o29Q59Q2n76k81Q20P5
$$ -213 99 463 -412 -533 249 -4 -628 -554 240 -424 -682 -454 -135 -399 -1028 -169 -87 -663 -944 -124 -49
4122d9p04J17N11j64m56M27K95l60k17L42N06m38n73Q46J21l55j31N80j03l01
$$ -49 -753 -636 -125 -289 -745 -318 -23 -383 -600 -258 248 -190 -763 83 204 -151 -282 298 195 -106
4142a06M2P45l61n81N30L42k56l32O01n9l09O8M05n7n12Q1M42j11l56J03L12l16
$$ -106 -64 681 320 -261 269 611 355 23 624 565 256 324 729 672 160 241 683 572 216 319 631 315
4164C15p9J28J67k04k15K41L8j02l50J94J45k94k42K71J96m80K8K84j42o75M00
$$ 315 236 364 531 327 112 353 391 289 -61 133 278 -16 -258 13 209 -271 -243 41 -101 -776 -376
4185c76L11k54l54R2L71l19m0J58P2k74r1M11J09m66q3M67J05m50J65L55o0m67
$$ -376 -65 -319 -673 -581 -210 -529 -569 -411 -339 -613 -704 -293 -184 -650 -733 -266 -161 -611 -446 -91 -151 -618
4207f18L52K94k00l13L28M34m41j52L60M20n91nO28j66m57K07Q00n02m52N34L27
$$ -618 -266 28 -172 -485 -157 277 -164 -316 44 464 -127 -132 496 330 -127 80 880 378 -74 460 787
4228G87m64k81P26j51l40j13N99m4o02K91L92k23n76L90L37m49k95L52L53p52
$$ 787 323 42 768 617 277 164 763 719 117 408 800 577 1 391 728 279 -16 336 689 -63
4248f3j14M34J23n52l6M83k03m87L3N79l03o36O37J74n38l71Q39j61o00K19M49
$$ -63 -177 257 380 -172 -208 275 72 -415 -382 197 -106 -742 -105 69 -469 -840 -1 -162 -762 -543 -94
4269i4l03m44M70J21q2l45J43L29k67j81L62K31l77j51M17R3k25j97O10j86j88
$$ -94 -397 -841 -371 -250 -332 -677 -534 -205 -472 -653 -291 -60 -437 -588 -171 -78 -303 -500 110 -76 -264
4290b64jM28j9k47K39J52Ql03L69J22l35k2K91J11m25K60K45j92o8L3J12J6r4
$$ -264 -265 163 144 -103 136 288 296 -7 362 484 149 127 418 529 104 364 609 417 349 382 494 510 416
4313D16j77K50K1k89J09J68o8n55M49J17m00k08L94R7n84J34L77n5n91P7M81l07
$$ 416 239 489 510 221 330 498 430 -125 324 441 41 -167 227 324 -260 -126 251 196 -395 -318 163 -144
4335a44m26K62K77k11m27N20ml65k15O06k06k93L5K63Q7m57K83K92p7n25L60M00
$$ -144 -570 -308 -31 -242 -669 -149 -153 -518 -733 -127 -333 -626 -591 -328 -241 -698 -415 -123 -200 -725 -365 35
4357C5l11l88M72N70q66o0P52r2l94J30N94l86k78L97L29m12j95N72j8j94k19
$$ 35 -276 -664 -192 378 -488 -548 204 112 -282 -152 442 56 -222 175 504 92 -103 469 451 257 38
4378C8N67Mn28K17M54k66m21K04L83j08l88K83L22n85L2K44R8l05j94L36j9m48
$$ 38 605 609 81 298 752 486 65 269 652 544 156 439 761 176 208 452 550 245 51 387 368 -80
4400h0j5N69m75k67K31K79l73k52M68n9l43j27L86n7k57p1K9K25m09J04K63j63
$$ -80 -95 474 -1 -268 -37 242 -131 -383 85 26 -317 -444 -58 -115 -372 -443 -414 -189 -598 -494 -231 -394
4422c94k43J54K28k53j27J40J98j71k4K33%N9l18L66K38l81RK34J74l41J31M02
$$ -394 -637 -483 -255 -508 -635 -495 -297 -468 -492 -259 -259 -200 -518 -152 86 -295 -286 -52 122 -219 -88 314
4444C14j73k18K81K70m85K02O4J91j35k13M91q7j94lK01L2k30n7M30j01n13K98
$$ 314 141 -77 204 474 -11 191 255 446 311 98 589 502 308 305 506 538 308 251 681 580 67 365
4466C65K24k41k40K67K13l17j58J15K43n76k5M43o4l90m5O92o07m66O40Q3j92
$$ 365 589 348 108 375 588 271 113 228 471 -105 -130 313 249 -141 -186 506 -101 -567 73 156 -36
4487c6m64L96q8j89j25M28q4n46K82J79K7m70L26K13k11k78L48L15n97ML49J44
$$ -36 -500 -104 -192 -381 -506 -78 -162 -708 -426 -247 -220 -690 -364 -151 -362 -640 -292 23 -574 -570 -221 -77
4509g7l81k7N97j48l34J74M08k30l15L89K53k46k71N77k2l81J09M15j88l18L66
$$ -77 -458 -485 112 -36 -370 -196 212 -18 -333 56 309 63 -208 369 347 -34 75 490 302 -16 350
4530C50M4j54j62L45J44k40j00J9L50k05k98L18J49l04r4M30k04k49jJ07M1k68
$$ 350 394 240 78 423 567 327 227 246 596 391 93 411 560 256 162 592 388 139 138 245 286 18
4552A8J26P8k06j70J66J38k51r7J49J23m09K6J54P1k74J3J92k00j74Q8K27p5k30
$$ 18 144 222 16 -154 12 150 -101 -198 -49 74 -335 -309 -155 -84 -358 -345 -153 -353 -527 -439 -212 -287 -517
4575e17N4J81k1l54M05J62k84j31L41J55n88K93K48J35m11J78L47k25o0NL99l22
$$ -517 -463 -282 -303 -657 -252 -90 -374 -505 -164 -9 -597 -304 -56 79 -332 -154 193 -32 -92 -87 312 -10
4597a0k30L71L58m24j32O67j64l67J13L79j68k80K57K12k69k77L20K09k76j52
$$ -10 -240 131 489 65 -67 600 436 69 182 561 393 113 370 582 313 36 356 565 289 137
4617A37K52K31n44N0L43k1m58j9O09m28k87K47K90l92k54M10nl09k24M01o9l35
$$ 137 389 620 76 126 469 448 -10 -29 580 152 -135 112 402 10 -244 166 161 -148 -372 29 -40 -375
4639c75R7L03q5m88K44K16l02j58L57R1n49K59L4K06l07J0Q8Q8j31o9L83k02j75
$$ -375 -278 25 -60 -548 -304 -88 -390 -548 -191 -100 -649 -390 -356 -150 -457 -447 -359 -271 -402 -471 -88 -290 -465
4662d65K21L30k86r5L38k8l8j21K23J7j54J71J73K9k23P5K41j20j57P4K92k83
$$ -465 -244 86 -200 -295 43 15 -23 -144 79 96 -58 113 286 315 92 167 408 288 131 205 497 214
4684B14J14P3M%k11J21j5O5j63J76J04k10j50K03J87m74L6L35j96l96K82K31l43
$$ 214 328 401 405 405 194 315 300 365 202 378 482 272 122 325 512 38 74 409 213 -183 99 330 -13
4707a3r2K01J5l84L3L34k24q4j57L90k9l42r1L60k3l63Q9K12k14k42L57K09m23
$$ -13 -105 96 111 -273 -240 94 -130 -214 -371 19 -10 -352 -443 -83 -106 -469 -380 -168 -382 -624 -267 -58 -481
4730d81K0J77K11l70j7L57j7l59J20M63l18k28K65M41l98k08N47l0l17M8M39j69
$$ -481 -461 -284 -73 -443 -460 -103 -120 -479 -359 104 -214 -442 -177 264 -134 -342 205 175 -142 -94 345 176
4752A76k19L34J36om42K29L23j92k25K25L11m43l1L10n9l00K1L70k03j43L5K35
$$ 176 -43 291 427 421 -21 208 531 339 114 339 650 207 176 486 427 127 148 518 315 172 207 442
4774D42l43p6J71J79j85l16L89m8k92j57M69k29l62K31R5r4k72J65J20j63j74
$$ 442 99 23 194 373 188 -128 261 213 -79 -236 233 4 -358 -127 -32 -126 -398 -233 -113 -276 -450
4795d50K70J30k14j03mJ45j27p3K34q9k28O4L31n7k33O5J23O2l33L32J21j98q3
$$ -450 -180 -50 -264 -367 -371 -226 -353 -426 -192 -281 -509 -445 -114 -171 -404 -339 -216 -154 -487 -155 -34 -232 -315
4818c15K16J80k69n4L97J71m01N0L46k78J12m3K27j11r9K05J3j5j49J88L4%k53
$$ -315 -99 81 -188 -242 155 326 -75 -25 321 43 155 112 339 228 129 334 347 332 183 371 405 405 152
4841A52L34P8m53R4K70Ql93L1K82r0k84J34J97m17j4J54J51j82k54M22k00l69
$$ 152 486 564 111 205 475 483 90 121 403 313 29 163 360 -57 -71 83 234 52 -202 220 20 -349
4863c49j1L95q3l32K78j0n8l15L75N5k50q0J05N4k11m5K86L8l71J25N02l52j44
$$ -349 -360 35 -48 -380 -102 -112 -170 -485 -110 -55 -305 -385 -280 -226 -437 -482 -196 -158 -529 -404 98 -254 -398
4886c98K67K15m21j47M87j5k37k8L67j54m1N2J80k1l41L42K06j66p3J59J34k17
$$ -398 -131 84 -337 -484 3 -12 -249 -277 90 -64 -105 -53 127 106 -235 107 313 147 74 233 367 150
4908A50l1O6J77k62J51J18M3j73q5L97j96r7j1K66j89k16K16Lj71j19M29k05l71
$$ 150 119 185 362 100 251 369 412 239 154 551 355 258 247 513 324 108 324 327 156 37 466 261 -110
4931a10K30O6o0j99R4K5Kk90J22R0k37R5j24K45k34o6J09O5j20o8J39o2M0k17
$$ -110 120 186 126 -73 21 46 48 -242 -120 -30 -267 -172 -296 -51 -285 -351 -242 -177 -297 -365 -226 -288 -248 -465
4955d65K23J25k62RJ08L5k58J58L26j78q3J78M8k95N5L17p9M3j97M83j72j11o1
$$ -465 -242 -117 -379 -370 -262 -227 -485 -327 -1 -179 -262 -84 -36 -331 -276 41 -38 5 -192 291 119 8 -53
4978e3K33M4m08M69N0j11l48L99K09m09M8L29k6l54J72K09q1l21J47L68m15m8
$$ -53 180 224 -184 285 335 224 -124 275 484 75 123 452 426 72 244 453 372 51 198 566 151 103
5000A03J3L60k60l41N03j0l82m9N06m62j74J72K73k79k73L17M2j86j25J67Q5m41
$$ 103 116 476 216 -125 378 368 -14 -63 443 -19 -193 -21 252 -27 -300 17 59 -127 -252 -85 0 -441
5022d41J26J68N3m21K52K04j55j4j22L01k82oJ46N9j64j07L24J5j51j38M32j12
$$ -441 -315 -147 -94 -515 -263 -59 -214 -228 -350 -49 -331 -337 -191 -132 -296 -403 -79 -64 -215 -353 79 -33
5044c3k90K82J25r8j32K50k3lK4P2q2j06K05j7M9M9k12L60j22R2j42J49j36j31
$$ -33 -323 -41 84 -14 -146 104 81 78 102 174 92 -14 191 174 223 272 60 420 298 390 248 397 261 130
5068A30Q0J66l6k04J77J06j55j34J72rj19j40J11J35l24NJ95l2j48k5L09l72o8
$$ 130 210 376 340 136 313 419 264 130 302 293 174 34 145 280 -44 -39 156 124 -24 -49 260 -112 -180
5091a80R3Kn5r5R4O4r2k75K58Q4k65n9L00J7l37Q0L22k85q0Q2K96l01k6J74R5
$$ -180 -87 -85 -140 -235 -141 -77 -169 -444 -186 -102 -367 -426 -126 -109 -446 -366 -44 -329 -409 -327 -31 -332 -358 -184 -89
5116h9k21j2L58n6j19n4M26k31o4M9J48j94p5L80N0p9k08J75J48k47P9J28J32
$$ -89 -310 -322 36 -20 -139 -193 233 2 -62 -13 135 -59 -134 246 296 217 9 184 332 85 164 292 424
5139D24l92J18K95j37k53J63L96n60P3K32o1r7j15L10j99j81P7N1m8j63K72j44
$$ 424 32 150 445 308 55 218 614 54 127 359 298 201 86 396 197 16 93 144 96 -67 205 61
5161F1m1j32J96o6j41j01K29J0k78J33mrk19J10J46j28r2QJ40n0j69J25O8J5k99
$$ 61 20 -112 84 18 -123 -224 5 15 -263 -130 -134 -143 -362 -252 -106 -234 -326 -318 -178 -228 -397 -272 -204 -189 -488
5186d88K47p2R4r5J07J54k51J71QP3n9j9J70m3l3J7J65j95P2R2J3P9k19J83O5
$$ -488 -241 -313 -219 -314 -207 -53 -304 -133 -125 -52 -111 -130 40 -3 -36 -19 146 -49 23 115 128 207 -12 171 236
5211B36p3K2J31R2k04LJ71l1k91L9K39k35j69K51J73k73j0J28R7k26k3K81j49
$$ 236 163 185 316 408 204 207 378 347 56 95 334 99 -70 181 354 81 71 199 296 70 47 328 179
5234A79j49n8K02r3j78J56l5l8j75K25j13j25r6K39J07m73K06J29n1l97K16J44
$$ 179 30 -28 174 81 -97 59 24 -14 -189 36 -77 -202 -298 -59 48 -425 -219 -90 -141 -538 -322 -178
5256a78j86M6R9L30n53M7L18k4k27NM07k82r9K21J09k13NJ49j04J06j34K12Q1
$$ -178 -364 -318 -219 111 -442 -395 -77 -101 -328 -323 84 -198 -297 -76 33 -180 -175 -26 -130 -24 -158 54 135
5279A35j19Q8N4N2l08L86k31K20k83R0M07l55O2J03O9p2o9J21j43N6j90K81k1
$$ 135 16 104 158 210 -98 288 57 277 -6 84 491 136 198 301 370 298 229 350 207 263 73 354 333
5302C33k66Q4P6j20j23K78j21p9k6L9m0k43J84q3K00j46r3R2p7N3j78L1J16k33
$$ 333 67 151 227 107 -16 262 141 62 36 75 35 -208 -24 -107 93 -53 -146 -54 -131 -78 -256 -225 -109 -342
5326c42K71m2kk12P5N6M1j65N5J49j39LK5K39l04J21P3oj78O2K22j89J41l6Q8
$$ -342 -71 -113 -115 -327 -252 -196 -155 -320 -265 -116 -255 -252 -227 12 -292 -171 -98 -104 -282 -220 2 -187 -46 -82 6
5351FR7k03J85Nk3r3K00q6jo1J78J17l45K65J90k00j17J78J94l22O0J20L1k65
$$ 6 103 -100 85 90 67 -26 174 88 87 26 204 321 -24 241 431 231 114 292 486 164 224 344 375 110
5375A10L1J63q9Nj85L67j95j71J16J20k36r3K58j66j50k7K47r3k72J60J65lk89
$$ 110 141 304 215 220 35 402 207 36 152 272 36 -57 201 35 -115 -142 105 12 -260 -100 65 62 -227
5398b27P4J00j9k70Q9L01m14N3K29r5j14O1J40j86k4O7P8r1N9L5J7M2j78Q1J51
$$ -227 -153 -53 -72 -342 -253 48 -366 -313 -84 -179 -293 -232 -92 -278 -302 -235 -157 -248 -189 -154 -137 -95 -273 -192 -41
5423d1j40j6K03l0j04J93Pj6l7J57j04KJ42j55J90j20J2R8L3m8j82K24j07J36
$$ -41 -181 -197 6 -24 -128 65 72 56 19 176 72 74 216 61 251 131 143 241 274 226 44 268 161 297
5447B97k22J61m6j35J94K5L8j39k6M8Np2j04J83j60k1qJ30j52j13K21k03J9k6
$$ 297 75 236 190 55 249 274 312 173 147 195 200 128 24 207 47 26 18 148 -4 -117 104 -99 -80 -106
5471a06L7Ml06J63J21l8k07R3J72Pl32L6L54l44k4K48Mk46R5J66r4m4l5K30k31
$$ -106 -69 -65 -371 -208 -87 -125 -332 -239 -67 -60 -392 -356 -2 -346 -370 -122 -118 -364 -269 -103 -197 -241 -276 -46 -277
5496b77J69J14K0q5j75K37O7j71J8K18o6k66K70RO9j95K30J46j91r7K32J42l03
$$ -277 -108 6 26 -59 -234 3 70 -101 -83 135 69 -197 73 82 151 -44 186 332 141 44 276 418 115
5519A15O5J24O5k63l4M22l37j04K06J6j67M2R4j35Pq5J88j64K0m6J7R5k33N3J10
$$ 115 180 304 369 106 72 494 157 53 259 275 108 150 244 109 116 31 219 55 75 29 46 141 -92 -39 71
5544G1r7j28R5L6k09J01K8J35l02N3K08j86M3n1M0oJ7j65K40r0j80K62q7l1n2
$$ 71 -26 -154 -59 -23 -232 -131 -103 32 -270 -217 -9 -195 -152 -203 -163 -169 -152 -317 -77 -167 -347 -85 -172 -203 -255
5569b55Q3L6p7J33j50J68m2J2pK28j74r1K99p3n7l7J65r7j66K83n0ko8J91p0r7
$$ -255 -172 -136 -213 -80 -230 -62 -104 -92 -99 129 -45 -136 163 90 33 -4 161 64 -102 181 131 129 61 252 182 85
5595H5N2O3J16j92PO7J57j84K2P0n4r5J01J25j72p9J65j21J0j44J10lj05j5J61
$$ 85 137 200 316 124 131 198 355 171 193 263 209 114 215 340 168 89 254 133 143 -1 109 106 1 -14 147
5620A47r8k96J93P1j11k43K38K3k04J2N0L1j29N1J14nj11mJ25J4j06J3J36q5j94
$$ 147 49 -247 -54 17 -94 -337 -99 -76 -280 -268 -218 -187 -316 -265 -151 -156 -267 -271 -146 -132 -238 -225 -89 -174 -368
5645c68L51o5j14R5P1m3r2Q5Q3O9k9NK0J1j16J34R0k19J11L9O0j74J39J95j31
$$ -368 -17 -82 -196 -101 -30 -73 -165 -80 3 72 43 48 68 79 -37 97 187 -32 79 118 178 4 143 338 207
5670B07n5J04R0k05K1L8Lp1k3J34m6L4k35J59K5m7OJ7J2k01Q7Q2j38M8j5o9k2
$$ 207 152 256 346 141 162 200 203 132 109 243 197 231 -4 155 180 133 139 156 168 -33 54 136 -2 46 31 -38 -60
5697f0k9k5J7l0j17J07n8J44k48J26m9J3R6p5Lj52K56q4J5l9l9J57j68J44K6Q0
$$ -60 -89 -114 -97 -127 -244 -137 -195 -51 -299 -173 -222 -209 -113 -188 -185 -337 -81 -165 -150 -189 -228 -71 -239 -95 -69 11
5723A1r6j56J87N0k7j21K44j05j01J18Q7k4q7J34K0N4j77J41K02l44J53L4J2k13
$$ 11 -85 -241 -54 -4 -31 -152 92 -13 -114 4 91 67 -20 114 134 188 11 152 354 10 163 197 209 -4
5747dJ35J68k08k8J08J77k38O1M6j2r8qN6O3j79j9J52k3j65O9Jo3j57L37n6k20
$$ -4 131 299 91 63 171 348 110 171 217 205 107 99 155 218 39 20 172 149 -16 53 54 -9 -166 171 115 -105
5773a05O9M4k2j03l1J4M8r0NP6j17N9j32J66j61k6K12j32Kj61L81k20M6M0K9l9
$$ -105 -36 8 -14 -117 -148 -134 -86 -176 -171 -95 -212 -153 -285 -119 -280 -306 -94 -226 -224 -385 -4 -224 -178 -138 -109 -148
5799a48r6J87m6N6j17J83J17q7n7J04m6j32J98LO2p7o6J95j16J07k3k2n1m0J44
$$ -148 -244 -57 -103 -47 -164 19 136 49 -8 96 50 -82 116 119 181 104 38 233 117 224 201 179 128 88 232
5824B32J0K8j98L22k19m0j21P8M2j7J48j23j3o6L8o6J67j10j45J84l5k86K20p
$$ 232 242 270 72 394 175 135 14 92 134 117 265 142 129 63 101 35 202 92 -53 131 96 -190 30 23
5848B3j27j19K84j20Jq5l8K06l07Q9O7M9j28r2J59j18k1O0J17k26J76J09j72J9
$$ 23 -104 -223 61 -59 -58 -143 -181 25 -282 -193 -126 -77 -205 -297 -138 -256 -277 -217 -100 -326 -150 -41 -213 -194
5872a94n4K69j60JJ1J72q8l7n4J73p8o1K46R7k62P5P1P3k69K75j01ON0j7K01j96
$$ -194 -248 21 -139 -138 -127 45 -43 -80 -134 39 -39 -100 146 243 -19 56 127 200 -69 206 105 111 161 144 345 149
5898A49O9r2K14j96NJ18j13L6o1J92j96n4J51K3j47r1K43k04q7M6N8n8J1L2j00
$$ 149 218 126 340 144 149 267 154 190 129 321 125 71 222 245 98 7 250 46 -41 5 63 5 16 48 -52
5923e2J34j56kM2k9j0j26J74j28MK2J7j40N7J67k31R6p6J50q1K2N1l4k0p2J16
$$ -52 82 -74 -76 -34 -63 -73 -199 -25 -153 -149 -127 -110 -250 -193 -26 -257 -161 -237 -87 -168 -146 -95 -129 -149 -221 -105
5949a05p0l8J1J07J7l0P3j03N0PK7R7NPj20K65l3l7j6M9N4j02K09k35M5MR4L8
$$ -105 -175 -213 -202 -95 -78 -108 -35 -138 -88 -81 -54 43 48 55 -65 200 167 130 114 163 217 115 324 89 134 138 232 270
5977B70k03J61j30J20L3n0j04O1j34n5L32j04r8k4p4P1l1J00j13j1j20K73k25
$$ 270 67 228 98 218 251 201 97 158 24 -31 301 197 99 75 1 72 41 141 28 17 -103 170 -55
6000e5kj9qL6j95J77K9j15j33R5R8j68R7J09j56k8o6K00j46N2QJ3J11m8l8M7m
$$ -55 -57 -76 -84 -48 -243 -66 -37 -152 -285 -190 -92 -260 -163 -54 -210 -238 -304 -104 -250 -198 -190 -177 -66 -114 -152 -105 -109
6027a09j33K80j31O6r1J17P0j83J83L8o2K6O6r2k5Q4q6L33k86K8R2L2q9oK98l15
$$ -109 -242 38 -93 -27 -118 -1 69 -114 69 107 45 71 137 45 20 104 18 351 65 93 185 217 128 122 420 105
6053A05J18l3N7j41n6K31k5n5j49K30j96K4r4J57k4k72K26j1L5k66J08K1p7J9
$$ 105 223 190 247 106 50 281 256 201 52 282 86 110 16 173 149 -123 103 92 127 -139 -31 -10 -87 -68
6077f8j77R2m0J23o3j0J00k01J41o6J3o3J66n0j81J31j0jLJ1j07J75M0j14J42
$$ -68 -245 -153 -193 -70 -133 -143 -43 -244 -103 -169 -156 -219 -53 -103 -284 -153 -163 -164 -161 -150 -257 -82 -42 -156 -14
6102a4r5n5R2P0m8n0K37j07o0M1nJ6q3J36l0J78j73J16o3k6K4N4J30j94M2Q8P7
$$ -14 -109 -164 -72 -2 -50 -100 137 30 -30 11 6 22 -61 75 45 223 50 166 103 77 101 155 285 91 133 221 298
6129B98j18K1K7j42L6K2m9N4L8j34QK0n9J73j05j50JJ49l5j91K13J5q0k01J67
$$ 298 180 201 228 86 122 144 95 149 187 53 61 81 22 195 90 -60 -59 90 55 -136 77 92 12 -189 -22
6154b2p3n0Lk3%k3J18N2k84K17p3Qon7J8J17j14l1J91j78N4kO5n5o7K26l0p3L7
$$ -22 -95 -145 -142 -165 -165 -188 -70 -18 -302 -85 -158 -150 -156 -213 -195 -78 -192 -223 -32 -210 -156 -158 -93 -148 -215 11 -19 -92 -55
6183e5K3NJ14j77O7J43j81J24P3M1k05J57J2m1L7j49K78q9M7j12L4L2q4J40q3
$$ -55 -32 -27 87 -90 -23 120 -61 63 136 177 -28 129 141 100 137 -12 266 177 224 112 146 178 94 234 151
6208A51K1j41J38K1n6Q9j64J13n6M3p7K5Pj62J42j06J0j01J24j20o2J85r7m1l7
$$ 151 172 31 169 190 134 223 59 172 116 159 82 107 114 -48 94 -12 -2 -103 21 -99 -161 24 -73 -114 -151
6233a51L7lJ6k1j2Q6j21N2j54J65m0j03K01j91J35q3J54j46o1J88N6n6j60K52
$$ -151 -114 -117 -101 -122 -134 -48 -169 -117 -271 -106 -146 -249 -48 -239 -104 -187 -33 -179 -240 -52 4 -52 -212 40
6257D0k09J56j09J66m4j14J91KK5j04K4K49l01K9J97n0j53K05P8j12j2m1J10j43
$$ 40 -169 -13 -122 44 0 -114 77 79 104 0 24 273 -28 1 198 148 -5 200 278 166 154 113 223 80
6281H0J27j31M1N0m1K4O1m1q0jJ5p3J24r1K5j21R8j81M6J9K6J40k90K81k17L8
$$ 80 207 76 117 167 126 150 211 170 90 89 104 31 155 64 89 -32 66 -115 -69 -50 -24 116 -174 107 -110 -72
6307g2p6m1K17l09J29Q1J6q5K3P5j20Q3o9j7J0Qk6j8O5q2j1J28O0j73J57R7j72
$$ -72 -148 -189 28 -281 -152 -71 -55 -140 -117 -42 -162 -79 -148 -165 -155 -147 -173 -191 -126 -208 -219 -91 -31 -204 -47 50 -122
6334a22J52l4jk2M4%l0M1K9P6j09K2n8J31K4o0J6M8P3j38J34p7Q4q2J9J6j18J08
$$ -122 30 -4 -5 -27 17 17 -13 28 57 133 24 46 -12 119 143 83 99 147 220 82 216 139 223 141 160 176 58 166
6362A66j01R8l9j48K27j24J09j64J78p2j57J12l7k2j31Q5MJ1j43P1O3k05J36M6
$$ 166 65 163 124 -24 203 79 188 24 202 130 -27 85 48 26 -105 -20 -16 -5 -148 -77 -14 -219 -83 -37
6386c7j10j18J45Q5j61L0R9K1q5q4J25L0m3n2J14j12J11p0M5j33KJ08P0K3j27
$$ -37 -147 -265 -120 -35 -196 -166 -67 -46 -131 -215 -90 -60 -103 -155 -41 -153 -42 -112 -67 -200 -198 -90 -20 3 -124
6411a24J62j49PK01k6P2k58J54j1Nl0K18Kj79J08p8J04j8Rqo0J50k03J70j39J4
$$ -124 38 -111 -104 97 71 143 -115 39 28 33 3 221 223 44 152 74 178 160 169 161 101 251 48 218 79 93
6437I3lQ9m4l2K6o2N8j35J21Rj18J12o9J6j90J60L9j57N1j14J81j61J22j31j9
$$ 93 90 179 135 103 129 67 125 -10 111 120 2 114 45 61 -129 31 70 -87 -36 -150 31 -130 -8 -139 -158
6462a58N7O6j32M7J6j90O2L5K9K8j1K7n0J24k09J16O0lo0R1M3p7J11j15L4j4O5
$$ -158 -101 -35 -167 -120 -104 -294 -232 -197 -168 -140 -151 -124 -174 -50 -259 -143 -83 -86 -146 -55 -12 -89 22 -93 -59 -73 -8
6489hK9j04K80j12o8R2K7QQK3n7klJ15J8j60L9K7J39j74J0RJ6j08j4J08j7k0Q9
$$ -8 21 -83 197 85 17 109 136 144 152 175 118 116 113 228 246 86 125 152 291 117 127 136 152 44 30 138 121 101 190
6518A90l9m6q2R6Rm5j23J44L9k13J08K4r8j99L03j62k0P0j5Q4k40Q9k2k0rM8n9
$$ 190 151 105 23 119 128 83 -40 104 143 -70 38 62 -36 -235 68 -94 -114 -44 -59 25 -215 -126 -148 -168 -177 -129 -188
6545a88P4r3NJ85j65n6J49k2M5j07M5Q1j09M4L1O3j66J04q2K21j38O1O7k1o5N8
$$ -188 -114 -207 -202 -17 -182 -238 -89 -111 -66 -173 -128 -47 -156 -112 -81 -18 -184 -80 -162 59 -79 -18 49 28 -37 21
6571B1K11k80K87j35p7P1N8M0r9J16j6o0j2j9j1J26qj43P9k5j41J83r6N6o5L6
$$ 21 232 -48 239 104 27 98 156 196 97 213 197 137 125 106 95 221 213 70 149 124 -17 166 70 126 61 97
6597I7j25J07o4JL2j23J31k26J50LPj6r5P6j34J58o9n5O3KM0j00J22j31N4j50
$$ 97 -28 79 15 16 48 -75 56 -170 -20 -17 -10 -26 -121 -45 -179 -21 -90 -145 -82 -80 -40 -140 -18 -149 -95 -245
6623b45Q7K2J9kj9Q5o8k2J52j67pO1J41k41K52j31J13j54L2R0k0J06m2q5K29k09
$$ -245 -158 -136 -117 -119 -138 -53 -121 -143 9 -158 -165 -104 37 -204 48 -83 30 -124 -92 -2 -22 84 42 -43 186 -23
6649b3J97n8Q9j95J37P0q5j5OJ30k76J43o0J18j29j1K33j71k7j12J83n7j17J44
$$ -23 174 116 205 10 147 217 132 117 123 253 -23 120 60 178 49 38 271 100 73 -39 144 87 -30 114
6673A14J5j19m4J36n6n5q8J67j32j13J02J9K9q8LL5l7l2m8J02j30J38l3J45j53
$$ 114 129 10 -34 102 46 -9 -97 70 -62 -175 -73 -54 -25 -113 -110 -75 -112 -144 -192 -90 -220 -82 -115 30 -123
6698a23n2R4r1j2r1J13J8MM8mJ30k03J03p7K9M2O0K8j10J95j58J85oj54J64j85
$$ -123 -175 -81 -172 -184 -275 -162 -144 -140 -92 -96 34 -169 -66 -143 -114 -72 -12 16 -94 101 -57 128 122 -32 132 -53
6724e3Q2k8R5j5k0MpJ21r3J22l4m8p2K9J6m6J62k39K22j68J6O0%l2n2R7l1j60
$$ -53 29 1 96 81 61 65 58 179 86 208 174 126 54 83 99 53 215 -24 198 30 46 106 106 74 22 119 88 -72
6752g2J72K7q9k52K14N9L61j63m67q4L72r9j19J18k19J78n2j5p1J08J0j80J3J08
$$ -72 100 127 38 -214 0 59 420 257 -210 -294 78 -21 -140 -22 -241 -63 -115 -130 -201 -93 -83 -263 -250 -142
6776a42Q3l8l5K7JJ19k01J54k1L8n5P6l3j10J67J9m2j29J73Pj60K07j43J07q8
$$ -142 -59 -97 -132 -105 -104 15 -186 -32 -53 -15 -70 6 -27 -137 30 49 7 -122 51 58 -102 105 -38 69 -19
6801a9J90j59J3K9q7J09J8j5k7J90j39j19K21j85L3J24O6j50L9J7o1m9r1J46j41
$$ -19 171 12 25 54 -33 76 94 79 52 242 103 -16 205 20 53 177 243 93 132 149 88 39 -52 94 -47
6826d7J02j29P9M3m8k3q5J8nKJ02j53J65j58N1j22K4P4j7O9j40O9mJ09j90O8O7
$$ -47 55 -74 5 48 0 -23 -108 -90 -95 -93 9 -144 21 -137 -86 -208 -184 -110 -127 -58 -198 -129 -133 -24 -214 -146 -79
6853g9m6N0K5J9j94J28nkJ38o6M5L6k8L7k8oj06J23l4J63J05j79r5J19m4J6J6
$$ -79 -125 -75 -50 -31 -225 -97 -102 -104 34 -32 13 49 21 58 30 24 -82 41 7 170 275 96 1 120 76 92 108
6880A08j29P0P9n3J00j20K01j88Q7P0j18J1j29J07M3o9o2J27m4j36K18o6r0LM2
$$ 108 -21 49 128 75 175 55 256 68 155 225 107 118 -11 96 139 70 8 135 91 -45 173 107 17 20 62
6905F2m2n0KJ0Kn6J03o2n8rj9pPn4K9J28j41O3j42Q6K6M0M0r2L6r1J34J9j60K12
$$ 62 20 -30 -28 -18 -16 -72 31 -31 -89 -98 -117 -124 -117 -171 -142 -14 -155 -92 -234 -148 -122 -82 -42 -134 -98 -189 -55 -36 -196 16
6935A6j18P3j43K41l0j53P9j6K6p3O3L1K0L9k6L0N0m0o6K09k20M8N6M2J6m2nP
$$ 16 -102 -29 -172 69 39 -114 -35 -51 -25 -98 -35 -4 16 55 29 59 109 69 3 212 -8 40 96 138 154 112 107 114
6963A14J6o5Q7K5k04J48j16J77p4J1q1KL3o3K4M2q3N4n6j8o1m4J21Or2J00j06
$$ 114 130 65 152 177 -27 121 5 182 108 119 38 40 73 10 34 76 -7 47 -9 -27 -88 -132 -11 -5 -97 3 -103
6990a03n4L6N0J5j17K5Q0q0O5j3K3p3P6k6m3K1m1K28j40O7j62J54j57J74R7p7
$$ -103 -157 -121 -71 -56 -173 -148 -68 -148 -83 -96 -73 -146 -70 -96 -139 -118 -159 69 -71 -4 -166 -12 -169 5 102 25
7016B5m8RL5R9j00m6N8m9M8J2J44m4r6m1J33j44Q2M4P0j98J07%Q7j02O9J20j36
$$ 25 -23 -14 21 120 20 -26 32 -17 31 43 187 143 47 6 139 -5 77 121 191 -7 100 100 187 85 154 274 138
7043A38m7o9J13m6ql7L6m4L2K1j37JR4n0R2j98J35o9P4m4K6Lj32O2L0K8j56P4
$$ 138 91 22 135 89 81 44 80 36 68 89 -48 -47 47 -3 89 -109 26 -43 31 -13 13 16 -116 -54 -24 4 -152 -78
7071g8J17o2j5r0M3j34K11On7j9m1R7j02N7M0n0J18p0p1N2pr4J12J13p7q3J7J11
$$ -78 39 -23 -38 -128 -85 -219 -8 -2 -59 -78 -119 -22 -124 -67 -27 -77 41 -29 -100 -48 -55 -149 -37 76 -1 -84 -67 44
7099D4j07J03k2J21l8j17J12Qj43Q4M9J8q5P5m4Q8o9N9J1om1nMj62K05j20Q2k7
$$ 44 -63 40 18 139 101 -16 96 104 -39 45 94 112 27 102 58 146 77 136 147 141 100 95 99 -63 142 22 104 77
7127G7j00M9N3l6N9j6j35p7Q8j1P9j04M3k9J07j93J18K4j05rp0J90j38J6J9M8
$$ 77 -23 26 79 43 102 86 -49 -126 -38 -49 30 -74 -31 -60 47 -146 -28 -4 -109 -118 -188 2 -136 -120 -101 -53
7153e3r4m8J83k15Q2Q4On4m1O1o5R8p1J43Pq2OK3J18j51J82j3pr9J51J9k94K45
$$ -53 -147 -195 -12 -227 -145 -61 -55 -109 -150 -89 -154 -56 -127 16 23 -59 -53 -30 88 -63 119 106 99 0 151 170 -124 121
7181A21m9J2p4R6M2l6L1M0rj36K1J48o6q5L4k0K0K6j73J10K6r0O3M1K1j79J42
$$ 121 72 84 10 106 148 112 143 183 174 38 59 207 141 56 90 70 90 116 -57 53 79 -11 52 93 114 -65 77
7208G7j33J1Q6r1J42j18j07J18p9L2l1P0j28J63r2L7Qp6oO4o8m6J12Ml4q6J00
$$ 77 -56 -45 41 -50 92 -26 -133 -15 -94 -62 -93 -23 -151 12 -80 -43 -35 -111 -117 -53 -121 -167 -55 -51 -85 -171 -71
7235g1Mj64J69j0O3q5P8L9j80J30q3J61j43J11O9k2L2j52N9M2j8KJ79l6k32J34
$$ -71 -67 -231 -62 -72 -9 -94 -16 23 -157 -27 -110 51 -92 19 88 66 98 -54 5 47 29 31 210 174 -58 76
7261G6l8R6K8j53J18p5Q1k3J19k09l7J17J9L5q2J52j61l5j7N8nj53N9L5N6j14
$$ 76 38 134 162 9 127 52 133 110 229 20 -17 100 119 154 72 224 63 28 11 69 64 -89 -30 5 61 -53
7287e3O9m5m5q0P3J95k44J11m2k3j09M5J14j12J3l8J45l8Kj04N9N0n9J1k6K6M3
$$ -53 16 -29 -74 -154 -81 114 -130 -19 -61 -84 -193 -148 -34 -146 -133 -171 -26 -64 -62 -166 -107 -57 -116 -105 -131 -105 -62
7314f2n3R1j58J92j35J42L2q5J42j91N8N6j1L3o7j1j4JK4K53k17M7m1jR3jj05
$$ -62 -115 -24 -182 10 -125 17 49 -36 106 -85 -27 29 18 51 -16 -27 -41 -40 -16 237 20 67 26 25 118 117 12
7341A2J69k5j56J69r3J3j10l1J08J6lJ5o6N4l6Q0q8l1m2J60k37J15J69J58l91
$$ 12 181 156 0 169 76 89 -21 -52 56 72 69 84 18 72 36 116 28 -3 -45 115 -122 -7 162 320 -71
7366g1j24J96j26R2j18L0J12k04K25k00J49k15K04M7r5J1M6j4q2R6M9nm1o0J82
$$ -71 -195 1 -125 -33 -151 -121 -9 -213 12 -188 -39 -254 -50 -3 -98 -87 -41 -55 -137 -41 8 3 -38 -98 84
7391H4m7k8j05l0P7p4J49j4j8j5L8q0P3Q4k5k1q1J09K5r9pKK06k67K29r0O0l2
$$ 84 37 9 -96 -126 -49 -123 26 12 -6 -21 17 -63 10 94 69 48 -33 76 101 2 -5 -3 203 -64 165 75 135 103
7419A03L4l7j28O8oK07j07l1J2L7r7l2K5O5j78R2Jnj23J04k8K5j06R5r9N4n3R2
$$ 103 137 100 -28 40 34 241 134 103 115 152 55 23 48 113 -65 27 28 23 -100 4 -24 1 -105 -10 -109 -55 -108 -16
7447a6N2j73Kj1Q6k3m9P8p8k6%P4m8J2J02KO2k44K01or1J33q7Lm7JJ42k1p9O5
$$ -16 36 -137 -135 -146 -60 -83 -132 -54 -132 -158 -158 -84 -132 -120 -18 -16 46 -198 3 -3 -94 39 -48 -45 -92 -91 51 30 -49 16
7477A6N8j35R0l7l0R4KP4r4RK1J1O3p3n3J02L9q7J38j42J6r9J25j0m4p3Q4j2j02
$$ 16 74 -61 29 -8 -38 56 58 132 38 47 68 79 142 69 16 118 157 70 208 66 82 -17 108 98 54 -19 65 53 -49
7506d9L8J11n5L5n7M9j9j82J06Q5J3j42Q8l8n7K8M4J9j02k3j02J32n0k4P2o4K6
$$ -49 -11 100 45 80 23 72 53 -129 -23 62 75 -67 21 -17 -74 -46 -2 17 -85 -108 -210 -78 -128 -152 -80 -144 -118
7533a18l6K31j38q2J02J21k08lJ16P3pk15K40j55k0Q6O0pj27K28j75P0o2P8J02
$$ -118 -154 77 -61 -143 -41 80 -128 -131 -15 58 51 -164 76 -79 -99 -13 47 40 -87 141 -34 36 -26 52 154
7558A54j93L4L2R9m1q3J07pJ5n5O3o8m3M2M3l8J1J40j81Jm8J58Rj32m5l0J30p1
$$ 154 -39 -5 27 126 85 2 109 102 117 62 125 57 14 56 99 61 72 212 31 32 -16 142 151 19 -26 -56 74 3
7586CK3Q0j8j18k3L7m3nM9qn2J48%j52o5m8J88j04Jn3n9J37j89K14J5l4l6Q0K2
$$ 3 26 106 88 -30 -53 -16 -59 -64 -15 -23 -75 73 73 -79 -144 -192 -4 -108 -107 -160 -219 -82 -271 -57 -42 -76 -112 -32 -10
7615a0j64J51o5L3o0P9K5j0K9J3Q8j51J04j6O6p1j08J04K1Q0j34J33m2p9J7R0
$$ -10 -174 -23 -88 -55 -115 -36 -11 -21 8 21 109 -42 62 46 112 41 -67 37 58 138 4 137 95 16 33 123
7641A23M4j20Q6j32O6M9j2M7j88J22Kl2J13j22J27j03J6j36J96j01pj16R9j5q7
$$ 123 167 47 133 1 67 116 104 151 -37 85 87 55 168 46 173 70 86 -50 146 45 38 -78 21 6 -81
7666h1J13J0j36K3K3P2j41O8m8N4j05J54k8j13Kr4K67k16R8k4j0n3j1O4J78r1
$$ -81 32 42 -94 -71 -48 24 -117 -49 -97 -43 -148 6 -22 -135 -133 -227 40 -176 -78 -102 -112 -165 -176 -112 66 -25
7692b5n4K31j23r1N7l7J27k18K54r6j15Q9q9J13o9J61j41Q2Nj36K41r1k4k9J64
$$ -25 -79 152 29 -62 -5 -42 85 -133 121 25 -90 -1 -90 23 -46 115 -26 56 61 -75 166 75 51 22 186
7717A86j21j6q5J95p3l7J08j34J95k07P7J7m9l1j5Q9r4L7p8J28q8j8J69k20J6
$$ 186 65 49 -36 159 86 49 157 23 218 11 88 105 56 25 10 99 5 42 -36 92 4 -14 155 -65 -49
7742d9N1k3n1r1Q0Jq8J54k3ol4P0l8kq2K9N1j11P3m9P0p5J77j66R4l2L2Kj5j5
$$ -49 2 -21 -72 -163 -83 -82 -170 -16 -39 -45 -79 -9 -47 -49 -131 -102 -51 -162 -89 -138 -68 -143 34 -132 -38 -70 -38 -36 -51 -66
7772f6j7J09j04J19o7J14j15k8J43j18R0j18J23L9k10K94j35Q7j13%J4J00n5k6
$$ -66 -83 26 -78 41 -26 88 -27 -55 88 -30 60 -58 65 104 -106 188 53 140 27 27 41 141 86 60
7796F0J29j02l6Q5k9p3j03K43j45M3p4J29o9l0p9QP6j12J25K7k32J30M2nj00J30
$$ 60 189 87 51 136 107 34 -69 174 29 72 -2 127 58 28 -51 -43 33 -79 46 73 -159 -29 13 8 -92 38
7822C8r7M6j68J19R6j77J38p4R6j94J46o0K3K5o8M6l8P0q9N4N1mJ30j82J10k2
$$ 38 -59 -13 -181 -62 34 -143 -5 -79 17 -177 -31 -91 -68 -43 -111 -65 -103 -33 -122 -68 -17 -21 109 -73 37 15
7848A5q8M8M9l4K5L4n9m7M4Q0oo4J36j04P7mo8N8L0K2r2R5j77J74n9O2r4oP9j42
$$ 15 -73 -25 24 -10 15 49 -10 -57 -13 67 61 -3 133 29 106 102 34 92 122 144 52 147 -30 144 85 147 53 47 126 -16
7878a6J17j07P0qK1O6k35K35j02O7p5j64J49rLn2R0k4q9Qo1P4q1O4m2N8Nj15K15
$$ -16 101 -6 64 56 77 143 -92 143 41 108 33 -131 18 9 12 -40 50 26 -63 -55 -116 -42 -123 -59 -101 -43 -38 -153 62
7907F2k10R5K7K8j79Q2R6j03M1rQ6r0n2N5M2qj27J80n7J81k75J95M0j00L1P2o2
$$ 62 -148 -53 -26 2 -177 -95 1 -102 -61 -70 16 -74 -126 -71 -29 -37 -164 16 -41 140 -135 60 100 0 31 103 41
7934D1n9J33r3jk8R7M8j52L8k6J28q0k9M3j7m8N9N7k4L4j17J49n3j83J61q8L2
$$ 41 -18 115 22 21 -7 90 138 -14 24 -2 126 46 17 60 43 -5 54 111 87 121 4 153 100 -83 78 -10 22
7961B2M6k3Q7k44J37n5J01j1oq5m3l4K7Q5l0qnM6p4M9j0lj0p5O0nk9l5J14J1j28
$$ 22 68 45 132 -112 25 -30 71 60 54 -31 -74 -108 -81 4 -26 -34 -39 7 -67 -18 -28 -31 -41 -116 -56 -61 -90 -125 -11 0 -128
7992a28J23j00K6k5M8Q4m7O0j04M2r4Q8k6Mj2l1J61n5lm3R0N5j52M5O5J9m9J08
$$ -128 -5 -105 -79 -104 -56 28 -19 41 -63 -21 -115 -27 -53 -49 -61 -92 69 14 11 -32 58 113 -39 6 71 90 41 149
8020A49m0j59K26j4Km8r2P3L6Op0Q0j10J3J64j15o8o6J66j51N7l8L7K5o1MJ1n
$$ 149 109 -50 176 162 164 116 24 97 133 139 69 149 39 52 216 101 33 -33 133 -18 39 1 38 63 2 6 17 12
8048A2o4k9k2J44j28q6J23k2k1oJ46r2o4P8o7J26j55J84j60l3P9L5j4k6l7J19
$$ 12 -52 -81 -103 41 -87 -173 -50 -72 -93 -99 47 -45 -109 -31 -98 28 -127 57 -103 -136 -57 -22 -36 -62 -99 20
8074B0K6j54J34l5K3L6On6k2P5Ql9K0KKk6%J73q2n8K5L2j39M8N0R7o8J2L6j15
$$ 20 46 -108 26 -9 14 50 56 0 -22 53 61 22 42 44 46 20 20 193 111 53 78 110 -29 19 69 166 98 110 146 31
8104C1J45Oj04J2Nj45k9K27o2m9PPn5K6P3ok09N7J09m8j23J27O8n3j21Q5l4j21
$$ 31 176 182 78 90 95 -50 -79 148 86 37 44 51 -4 22 95 89 -120 -63 46 -2 -125 2 70 17 -104 -19 -53 -174
8132a74K1J46j19kJM2m7K3P4j30N7n7N2J67r9l3J52m7Mn3nJ6j2l8J7Rk9K14j73
$$ -174 -153 -7 -126 -128 -127 -85 -132 -109 -35 -165 -108 -165 -113 54 -45 -78 74 27 31 -22 -27 -11 -23 -61 -44 -35 -64 150 -23
8161b3J71j93J56q9r5J93r9qLJ6K9K7Np5J42q3L0n6L1j5p9J59j18N6J1p3O1nn5
$$ -23 148 -45 111 22 -73 120 21 13 16 32 61 88 93 18 160 77 107 51 82 67 -12 147 29 85 96 23 84 79 24
8190B4M0
$$ 24 64
8191F4
$$ Imaginary data points
##PAGE= N=2
##DATA TABLE= (X++(I..I)), XYDATA
0@%%%%%%%%%%Qj6J6j6K4l2M0n0N8p2Q8j04J25j49J75k05K38k74L14l60M12m70
$$ 0 0 0 0 0 0 0 0 0 0 0 8 -8 8 -8 16 -16 24 -26 32 -40 48 -56 69 -80 95 -110 128 -146 168 -192 220 -250
32b50N34o03O79p65Q60r63J075j199J335j484J646j820K012k224K454k704K976
$$ -250 284 -319 360 -405 455 -508 567 -632 703 -781 865 -955 1057 -1167 1287 -1417 1559
49A559l279L614l980M387m841N352n927O579p331Q206r240J0483j2009J3932j6446
$$ 1559 -1720 1894 -2086 2301 -2540 2812 -3115 3464 -3867 4339 -4901 5582 -6427 7505 -8941
64h941J9885k4878L2803m7289Q1915l07375k87302P01403j08831l17273K38112
$$ -8941 10944 -13934 18869 -28420 53495 -253880 -541182 160221 51390 -265883 -27771
75b7771J21021l05039O6291J97323j24044r1802J59653k4679p4624J07647j9777
$$ -27771 93250 -211789 -145498 51825 -72219 -164021 -4368 -29047 -103671 3976 -15801
86a5801o1839J13608J2051p1850L2323J4187j15352L9965J31226m4959j13999
$$ -15801 -77640 35968 48019 -23831 8492 22679 -92673 -52708 78518 33559 -80440
97h0440R5313J04420j35925p0146J12645L9470p9641n668N2735n0547n5014Q9178
$$ -80440 14873 119293 -16632 -86778 25867 65337 -14304 -19972 32763 -17784 -72798 16380
109A6380R1900j04829l4337P7068n6281n1783P8795M0511q2110J206O8154k2215
$$ 16380 108280 3451 -30886 46182 -10099 -61882 16913 57424 -24686 -23480 44674 22459
121B2459j2297M7899o0273o7698J20490K5512j01314J5683N2152m4576j0621P6975
$$ 22459 10162 58061 -2212 -69910 50580 76092 -25222 -9539 42613 -1963 -12584 64391
133F4391l7798o1333M6954J2121n6641L5892M7645q4789j4022Q0003o58o8606
$$ 64391 26593 -34740 12214 24335 -32306 3586 51231 -33558 -47580 32423 31765 -36841
145c6841P282M2464j2936o281j1479q685J5838K9006k3827l5024L4982J5626j4785
$$ -36841 -29559 12905 -31 -6312 -17791 -26476 -10638 18368 -5459 -40483 -5501 10125 -4660
158d660n510L906j8052M505K9170o195j3396l605O382j5532J9343L2978k7463
$$ -4660 -10170 -6264 -24316 -19811 9359 3164 -10232 -13837 -7455 -22987 -3644 29334 1871
171A871l6579R277M6513m289k3282K141J2378n955r876K1538L060r461m666J4775
$$ 1871 -34708 -25431 21082 16793 -6489 -4348 8030 2075 -7801 13737 16797 7336 2670 17445
185A7445J4j1084L517k628Q299q872L884J6692k972k9665p701M4652l419l8610
$$ 17445 17459 6375 9892 7264 15563 6691 10575 27267 24295 -5370 -13071 31581 28162 -10448
199a0448P842L4893l1352k4711L8992L42j5556J0796K865l7359R024L7664k2295
$$ -10448 -2606 32287 935 -23776 15216 15558 2 10798 13663 -23696 -14672 22992 697
212F97j0960K1554q699k8211L5864J0472l6559J6868Q787l3640Q999N4336l7463
$$ 697 -10263 11291 2592 -25619 10245 20717 -15842 1026 9813 -23827 -14828 39508 2045
225B045n2032M9073L5517m3180j6974M1866k1054k2164K4958K913j1528O257N107
$$ 2045 -49987 -914 34603 -8577 -25551 16315 -4739 -26903 -1945 968 -10560 -4303 804
238H04k2364J3614K0366j7583j9065K0501J1428k9029J6703J9901k0534j4483
$$ 804 -21560 -7946 12420 -5163 -24228 -3727 7701 -21328 -4625 15276 -5258 -19741
250a9741L0616J1002l6061J5070L2510l0056l7767N1891K7280m8138P301L3239
$$ -19741 10875 21877 -14184 886 33396 3340 -34427 17464 44744 -3394 3907 37146
262C7146k4295l0296M0471R874l4419J2974J4080k3710J844L2751l1767j2505
$$ 37146 12851 -17445 23026 32900 -1519 11455 25535 1825 3669 36420 4653 -7852
274g852L7685j5662k3627L3415L936o3413K6459O3736m2882m3423N3365R423p4715
$$ -7852 29833 14171 -9456 23959 27895 -35518 -9059 54677 11795 -31628 21737 31160 -43555
287d3555K8692O1948l8401m0333L5872P859m2550K2020L2637k0596k5475J9123
$$ -43555 -14863 47085 8684 -31649 4223 12082 -30468 -8448 24189 3593 -21882 -2759
299b759N136k0934Q504Q481L654p085n440J922J1038m331k5651J2016K5838o576
$$ -2759 2377 -18557 -10053 -1572 2082 -5003 -10443 -8521 2517 -1814 -27465 -15449 10389 3813
313C813l4437J5022K8145l0757j2976L9950J1235n3984L981M8049j7953l1493
$$ 3813 -30624 -15602 12543 -18214 -31190 8760 19995 -33989 -30008 18041 88 -31405
325c1405M0002K4668o2780m27N9052r811m1291K5379K8598l7622p747K8462O587
$$ -31405 8597 33265 -29515 -29942 29110 19299 -21992 3387 31985 -5637 -13384 15078 21665
338B1665k0053j692J0082L815M557j7736N113J5274j5961j5052K9979J1025m2711
$$ 21665 1612 -80 10002 13817 18374 638 5751 21025 5064 -9988 19991 31016 -11695
351a1695P173L3155j6496l1058K7796J8483l8168l406L0030N732k8649k668J5915
$$ -11695 -4522 28633 12137 -18921 8875 27358 -10810 -14216 15814 21546 -7103 -9771 6144
364F144O24j1824k193K4291q506k3722P557K3742j4737k0283K3930K384k1185
$$ 6144 6768 -5056 -7249 17042 8536 -15186 -7629 16113 1376 -18907 5023 7407 -13778
377a3778K950K4918j2053k0871J1573N347k758m252O571P23m147q811K217J9893
$$ -13778 -10828 14090 2037 -18834 -7261 -1914 -4672 -8924 -2353 -1630 -5777 -14588 -12371 7522
391G522o819j3416J621J1136q452l079J6390k960j1643j971J4333k009o812O86
$$ 7522 703 -12713 -11092 44 -8408 -11487 4903 1943 -9700 -11671 2662 653 -6159 -5473
405e473P556N390j7061M733J4788q767j7358K1027K0197k5424p824J8105p96k3970
$$ -5473 2083 7473 -9588 -4855 9933 1166 -16192 4835 25032 -392 -8216 9889 9093 -14877
419a4877J7520K1048j7898m231N276m031l809J4529k048q585O73n404K538J0880
$$ -14877 2643 23691 5793 1562 6838 2807 -1002 13527 11479 2894 3567 -1837 701 11581
433A1581N117k0102O526J4781k2274m621K5669l519l4204J6037K6102j9333k2285
$$ 11581 16698 -3404 3122 17903 -4371 -8992 16677 13158 -21046 -5009 21093 1760 -20525
446b0525J8776J5452l0743j369K2631n331k1334N491J6892j0179p099J0749J0117
$$ -20525 -1749 13703 -17040 -18409 4222 -1109 -22443 -16952 -60 -10239 -17338 -6589 3528
459C528j8665j090J5732o885m157K782O933k781J235K348J775K181p715p452O089
$$ 3528 -15137 -16227 -495 -7380 -11537 -8755 -1822 -4603 -3368 -1020 755 2936 -4779 -12231 -6142
474f142K0036j5463r597J8668o794j2067J6922J6257k7320j0665K2674J995j7861
$$ -6142 13894 -1569 -11166 7502 708 -11359 5563 21820 -5500 -16165 6509 8504 -9357
487i357J0256J5179k3531L293J8581o851j1045M420M585n060J0860j36j4482Q04
$$ -9357 899 16078 -7453 -4160 14421 7570 -3475 945 5530 470 11330 11194 -3288 -2484
501b484K3382l889k0807J4240O346j1394o709J0658K531r730M747O547p239j2565
$$ -2484 20898 17009 -3798 10442 16788 5394 -1315 9343 11874 2144 6891 13438 6199 -6366
515f366J0695L104n966j032k424j816p804J0811Q174j0213j3112K802J0625N47
$$ -6366 4329 7433 1467 435 -1989 -3805 -11609 -798 7376 -2837 -15949 -13147 -2522 -1975
529a975o059j1606R947L139p700K847R348j826k0971R878K0987j1166j7750J6384
$$ -1975 -8034 -19640 -9693 -6554 -14254 -11407 -2059 -3885 -24856 -14978 6009 -5157 -22907 -6523
543f523Q980j8600P956J5949r474k0564J8239J8829k1419o326J6209N342j3611
$$ -6523 2457 -16143 -8187 7762 -1712 -22276 -4037 14792 -6627 -12953 3256 8598 -5013
556e013K082P572o74m549K903J0757r828o738P089J3187n734j5578Q694P450o587
$$ -5013 -2931 4641 3967 -582 2321 13078 3250 -3488 3601 16788 11054 -4524 4170 11620 5033
571E033j174J4299r874j7395R828J8660p46k5760o49J7144N037j3047k647J2348
$$ 5033 3859 18158 8284 -9111 717 19377 18631 -7129 -7778 9366 14403 1356 -1291 11057
585A1057r945j1395J6136J4804k8091n692K7047q268j7590J2457J3446k4325k881
$$ 11057 1112 -10283 5853 20657 -7434 -13126 13921 5653 -11937 520 13966 -10359 -13240
598a3240K6178m711k2242M217J5554o534m648m033P774P849j3072l494Q441J860
$$ -13240 12938 8227 -14015 -9798 5756 -778 -5426 -9459 -1685 6164 -6908 -10402 -1961 -101
612a01j3721P054J4707j1162j3606J0022J2002j1840r14L742n99o056N84J9887
$$ -101 -13822 -6768 7939 -3223 -16829 -6807 5195 -6645 -7559 -3817 -4416 -10472 -9888 9999
626I999l246k3879J796L0256n890k2307J1015J0769j1629o79K4575j1759k0759
$$ 9999 6753 -17126 -15330 14926 9036 -13271 -2256 8513 -3116 -3795 20780 9021 -11738
639a1738J3446R586m745p73L57p850Q296J249o289N850Q60r904p4K0865j3038
$$ -11738 1708 11294 6549 5776 6133 -1717 6579 7828 1539 7389 8249 -1655 -1729 19136 6098
654F098k1167J9796J5949j9211j0625J7941J286q211k614O906k081j1536P781
$$ 6098 -15069 4727 20676 1465 -9160 8781 10067 1856 -758 6148 4067 -7469 312
667C12Q784m669j4228O013J0607q686m641R051j673j7673J1011J3746o989j0440
$$ 312 9096 4427 -9801 -3788 6819 -1867 -6508 2543 870 -16803 -5792 7954 965 -9475
681i475j181J0460K587n259o881Q431M49j1916O352J5193q222k1815J6167J2745
$$ -9475 -10656 -196 2391 -2868 -9749 -1318 -869 -12785 -6433 8760 538 -21277 -5110 7635
695G635j5450j808J2292n216j2903J4680Q201j1820q099J3832Q470j2963k744
$$ 7635 -7815 -9623 2669 -2547 -15450 -770 7431 -4389 -12488 1344 9814 -3149 -5893
708e893O790P838p576l058Q344j155o635M155J1710r946p401P571P860n029p305
$$ -5893 897 8735 1159 -1899 6445 5290 -1345 2810 14520 4574 -2827 4744 12604 7575 270
723B70O677j248k056L210P078o567j1526N101J0558J872j3237p64N178l38j822
$$ 270 6947 5699 3643 6853 13931 7364 -4162 939 11497 13369 132 -632 4546 4208 2386
738B386N86L223p266j750L421L884n010k492M340m764p44L237M042q437k629Q273
$$ 2386 2972 6195 -1071 -2821 600 4484 -526 -3018 1322 -3442 -4186 -949 3093 -5344 -7973 300
754C00o91n562j743O608k509j990O3L13K465j854L92l375L079N36q03P30J974
$$ 300 -391 -5953 -7696 -1088 -3597 -5587 -5524 -5211 -2746 -4600 -4208 -7583 -4504 -3968 -4771 -4041 -2067
771b067M62q350L950P402M62q437P42O172n038L912P027m768j2776R945J1099
$$ -2067 -1605 -9955 -6005 1397 1859 -6578 -5836 336 -4702 -790 6237 1469 -11307 -1362 9737
786I737r302k727M711J141n155O772J724n045J155j237N64M141L301j0960L333
$$ 9737 435 -2292 2419 3560 -1595 5177 6901 1856 3011 1774 2338 6479 9780 -1180 2153
801B153J0068q780l799J0595J612j6212P848J1437j3246o711J5611L936k1039
$$ 2153 12221 3441 -358 10237 11849 -4363 3485 14922 1676 -5035 10576 14512 -6527
814f527L075J4411m113j2513M472Q543r558l120O617M478j0116k898O772o86j449
$$ -6527 -3452 10959 6846 -5667 -1195 7348 -2210 -5330 1287 5765 -4351 -7249 -477 -1163 -2612
829b612j206K384m292k53K014K693J850q415j887P653N552j3115Q66J4599r357
$$ -2612 -3818 -1434 -5726 -5979 -3965 -1272 578 -7837 -9724 -2071 3481 -9634 -8768 5831 -3526
844c526j2000J4196J2958k1369l800J9715l467j4578R916J1808j7502j606J4547
$$ -3526 -15526 -1330 11628 -9741 -13541 6174 2707 -11871 -1955 9853 -7649 -9255 5292
857E292j335r921M372O464p125L99J633L048P85l258m215L831R423r778k907J0013
$$ 5292 3957 -5964 -1592 4872 -2253 -1854 -221 2827 3612 354 -3861 -30 9393 -385 -3292 6721
873F721N1j1178N345J2932j0026o935P388O881r868M0J1291o376q743M061J0521
$$ 6721 6772 -4406 939 13871 3845 -3090 4298 11179 1311 1351 12642 6266 -2477 1584 12105
888A2105p340o886N083L586n549m030Q629j691n687k667M001L387l772k188o03
$$ 12105 4765 -2121 2962 6548 999 -3031 5598 3907 -1780 -4447 -446 2941 -831 -3019 -3622
903c622M173m256j971M794J535q006l219J2477l908q230N614O565r636n570J3709
$$ -3622 551 -3705 -5676 -882 653 -7353 -10572 1905 -2003 -10233 -4619 1946 -7690 -13260 449
918D49J570j0001k182J0977j725o759M303M017r8q178L517P433j812o634L003
$$ 449 2019 -7982 -10164 813 -912 -7671 -3368 649 551 -7627 -4110 3323 1511 -5123 -2120
933b120O648p018r17P187L385j1327rJ2050l525o207K847P993o519n893P376O767
$$ -2120 4528 -2490 -3407 3780 7165 -4162 -4171 7879 4354 -1853 994 8987 2468 -3425 3951 10718
949A0718o898q342R624L024n710l278P716J123j1216L984Q405l011r389N982N320
$$ 10718 3820 -4522 5102 8126 2416 -862 6854 7977 -3239 745 9150 6139 -3250 2732 8052
964H052o980l138O709N205j2866j100R877J24q853m23R447n393p321M386P978
$$ 8052 1072 -2066 4643 9848 -3018 -4118 5759 5883 -2970 -3393 6054 661 -6660 -2274 5704
979E704q203n420P161q72k414r73N130l921m878M190L260j822m323K265R64J427
$$ 5704 -2499 -7919 -758 -1630 -4044 -5017 113 -3808 -8686 -4496 -1236 -3058 -7381 -5116 -4152 -2725
995b725l886J679N650o098k834L445O658n244m541O600K605n148l87Q068m505
$$ -2725 -6611 -4932 718 -5380 -8214 -4769 1889 -3355 -7896 -1296 1309 -3839 -4226 3842 -663
1010f63k443L519K042k007j018O833l430k863L385K548k921Q55J032n054M040
$$ -663 -3106 413 2455 448 -570 6263 2833 -30 3355 5903 2982 3837 4869 -185 3855
1025C855J962j557k494M205J41q776O202O468p273p048R258R36o813M481L083
$$ 3855 5817 4260 1766 5971 6112 -2664 3538 10006 2733 -4315 4943 5879 -934 3547 6630
1040F630m306n875Q653O30q190K198K289k848j617M944j789m11j831j885K243
$$ 6630 2324 -3551 5102 5732 -2458 -260 2029 -819 -2436 2508 719 308 -1523 -3408 -1165
1055a165J233j226p769O762N679r051j977J0206r62j2105O493N774p576m705J0929
$$ -1165 68 -1158 -8927 -2165 3514 -5537 -7514 2692 1730 -10375 -3882 1892 -5684 -10389 540
1070E40K005j3982O102R079n390o000O549P43p183K503N858J414p054J188L592
$$ 540 2545 -11437 -5335 3744 -1646 -7646 -1097 -354 -7537 -5034 824 2238 -4816 -3628 -36
1085c6K548L88n824J772K335j075j649O218k23o687L132O444n84r419N433N008
$$ -36 2512 2900 -2924 -1152 1183 108 -1541 4677 4454 -2233 899 7343 6759 -2660 2773 7781
1101G781p884j138Q371J901j0583K456P791k267p878L897N504p528o7K382J218
$$ 7781 -103 -1241 7130 9031 -1552 904 8695 6428 -1450 2447 7951 423 356 2738 3956
1116C956k429P52J327k379k36j704J974J60p05m174J945M681n583Q58L338k591
$$ 3956 1527 2279 3606 1227 991 -713 1261 1421 716 -3458 -1513 3168 -2415 -1557 1781 -810
1132h10p086N186P016o816n554L560N592m580o2J995k072j858J66N965j718m785
$$ -810 -7896 -2710 4306 -2510 -8064 -4504 1088 -3492 -3554 -1559 -3631 -5489 -5323 642 -1076 -5861
1148e861j220N951R95n034K052J876j152l965O163J948o091l31M656L613o235
$$ -5861 -7081 -1130 -135 -5169 -3117 -1241 -2393 -6358 -195 1753 -4338 -4669 -13 3600 -2635
1163b635n01M743K964n280j755P401j463l907J926O792o366n283Q488K806n582
$$ -2635 -3136 1607 4571 -709 -2464 4937 3474 -433 1493 8285 1919 -3364 5124 7930 2348
1178B348k816O651j901l196K802L586k716p572M171O658m46r461J735P767o003
$$ 2348 -468 6183 4282 1086 3888 7474 4758 -2814 1357 8015 7569 -1892 -157 7610 1607
1193A607l911O888K096j2837J415J1070l062q153J610N576n306j84L526n55m137
$$ 1607 -2304 4584 6680 -6157 -4742 6328 3266 -4887 -3277 2299 -3007 -3191 335 -220 -4357
1208d357j763N589J417l641n146P089L544p918j463O503J103q603M246N082n777
$$ -4357 -6120 -531 886 -2755 -7901 -812 2732 -5186 -6649 -146 957 -7646 -3400 1682 -4095
1223d095m218P626N081r271k187N891L057o259R11O365n432l194O504O503q701
$$ -4095 -8313 -687 4394 -4877 -7064 -1173 1884 -4375 -3464 2901 -2531 -5725 779 7282 -1419
1238a419m090O168K305j943r25K820k781M74J020J557J748m130k292L233N284
$$ -1419 -5509 659 2964 1021 96 2916 135 609 1629 3186 4934 804 -1488 1745 7029
1253G029n583j177N129k140l877M236N293r005j181P610j16o829J209N657m647
$$ 7029 1446 269 5398 3258 -619 3617 8910 -95 -1276 6334 6218 -611 598 6255 1608
1268A608j251K091N91l459L87K990l023l57j386M79J315J979l062l994M126Q92
$$ 1608 357 2448 3039 -420 -33 2957 -66 -423 -1809 -1330 -15 1964 -1098 -5092 -966 -74
1284g4j792j087K606m497j736Q295L66p670k165P484j523l297K989Q57l094j508
$$ -74 -1866 -2953 -347 -4844 -6580 1715 2081 -5589 -7754 -270 -1793 -5090 -2101 -1244 -4338 -5846
1300e846N948m18k309j443J180K895q44o22p62K764j701l10K668L62k663j235
$$ -5846 102 -316 -2625 -4068 -2888 7 -837 -1459 -2221 543 -1158 -1468 1200 1562 -1101 -2336
1316b336O145j662m556J959N703k619n949N891L040m784k757Q186o14q835L309
$$ -2336 3809 2147 -2409 -450 5253 2634 -3315 2576 5616 832 -1925 6261 5647 -3188 121
1331A21O388j886n670M561P38m202J525L797r32n554J757K545J816k896k916K930
$$ 121 6509 4623 -1047 3514 4252 50 1575 5372 4440 -1114 643 3188 5004 2108 -808 2122
1347B122K82j986o65M691l508n173L916M331l541n302M609L59k895k1K674q00
$$ 2122 2404 418 -247 4444 936 -4237 -321 4010 469 -4833 -224 135 -2760 -2781 -107 -907
1363i07m206K393K240j307m426L167L469m380k028L112L351n010K43L017j144
$$ -907 -5113 -2720 -480 -1787 -6213 -3046 423 -3957 -5985 -2873 478 -4532 -4289 -1272 -2416
1378b416j437O90K881j415o05j521K723K494k051o59O12J529k955K959K851l329
$$ -2416 -3853 -3163 -282 -1697 -2302 -3823 -1100 1394 -657 -1316 -704 825 -2130 829 3680 351
1394C51k122L088K857l337O09J316K84k212l7L859p75k358j781N151M61m400Q06
$$ 351 -1771 1317 4174 837 1446 2762 3046 834 797 4656 3881 1523 -258 4893 5354 954 1760
1411A760L037j856l959M978N36l618q88K930O20m027J674J443o91l770L4L819
$$ 1760 4797 2941 -1018 3960 4496 878 -10 2920 3540 -487 1187 2630 1939 -1831 -1797 2022
1427B022j26l537p93N599l772m051M114L853m858m932O107J346m394n92N152k484
$$ 2022 1896 -1641 -2434 3165 -607 -4658 -544 3309 -1549 -6481 -374 972 -3422 -4014 1138 -1346
1443a346n110M167L048k736n336N072L210n526n72N016O01o353K240N032q81m864
$$ -1346 -6456 -2289 759 -1977 -7313 -2241 969 -4557 -5129 -113 488 -5865 -3625 1407 526 -4338
1459d338J200M426k643m01J149K940j599l515K697L371k321l558N573N50m916
$$ -4338 -3138 1288 -1355 -1756 -607 2333 734 -2781 -84 3287 966 -2592 2981 3531 -1385
1474a385M24P272q62q669N131M874n111l377O236J655o196N63M152L40n117J581
$$ -1385 -961 6311 5449 -3220 1911 6785 1674 -1703 4533 6188 -8 555 4707 5047 -70 1511
1490A511K250k158n35L50K073k682j523J760K156k347k216K657j31j539k334M001
$$ 1511 3761 1603 1068 1418 3491 809 -714 1046 3202 855 -1361 1296 1165 -374 -2708 1293
1506A293O57m926R7L044J010m049P80K148j626l236K509L120m196K62J520L16
$$ 1293 1950 -2976 -2879 165 1175 -2874 -2094 54 -1572 -4808 -2299 821 -3375 -3113 -1593 -1277
1522a277k375L55K959k150j677J069K889j483p73j38Q36J087k452J450J500M15
$$ -1277 -3652 -3297 -338 -2488 -4165 -3096 -207 -1690 -2463 -2601 -1765 -678 -3130 -1680 -180 235
1538B35k315j22L786m61k562M72L704k795j99L244J08k350j078M263j484k380
$$ 235 -2080 -2202 1584 1123 -1439 -967 2737 -58 -257 2987 3095 745 -333 3930 2446 66
1554F6K364K274k856k000L449Q46j680k921L225J341l173L80J861O76l863J74
$$ 66 2430 4704 1848 -152 3297 4143 2463 -458 2767 4108 935 1315 3176 3852 -11 163
1570A63K960K17l142K34K682l144r44J013K786k950l410M179J453l634j966M564
$$ 163 3123 3340 198 432 3114 -30 -974 39 2825 -125 -3535 644 2097 -1537 -3503 1061
1586A061r18m467R94M742j462n441M349J791l522r68L121k35m157J864L017n22
$$ 1061 143 -4324 -3330 1412 -50 -5491 -1142 649 -2873 -3841 -720 -955 -5112 -3248 -231 -753
1602g53l570J820J939j904j046J109L519l046k515L059K563j952k012L184M74
$$ -753 -4323 -2503 -564 -2468 -3514 -2405 1114 -1932 -4447 -1388 1175 -777 -2789 395 869
1617H69j278j452L445P04k937P66J523J053k783J463K336j730k299K736K087m320
$$ 869 -409 -1861 1584 2288 -649 117 1640 2693 -90 1373 3709 1979 -320 2416 4503 183
1633A83Q39K434k98k288J471K468l499o44J137J303o16k15j360k27K055j914M81
$$ 183 1022 3456 3158 870 2341 4809 1310 666 1803 3106 2490 2275 915 688 2743 829 1310
1650A310R06q63l434J166L815k745k038J746J610l798j16K821j044j983n53L654
$$ 1310 2216 1353 -2081 -915 2900 155 -1883 -137 1473 -2325 -2441 380 -664 -2647 -3200 454
1666D54j769k369R09K071j003k142K368N1j493j287K774M86j965J176M56N00k329
$$ 454 -1315 -3684 -2775 -704 -1707 -3849 -1481 -1430 -2923 -4210 -1436 -950 -2915 -1739 -1283 -783 -3112
1683c112N21K386Q73k650m52M056k096k477L117M455m814m140N992J567m003n47
$$ -3112 -2591 -205 668 -1982 -2434 1622 -474 -2951 166 4621 -193 -4333 1659 3226 -777 -1324
1699a324N216k161l651L287K869k451l634L947J569k121j417J958J024k856J528
$$ -1324 3892 1731 -1920 1367 4236 1785 -1849 2098 3667 1546 129 2087 3111 255 1783
1714A783K380p56m511J327M224k106k354J107L114l091j713K385J271k948k124
$$ 1783 4163 3407 -1104 223 4447 2341 -13 1094 4208 1117 -596 1789 3060 112 -2012
1729b012M109k21l702p12N075l56n623J580K675k080k774M681M83n239L10L717
$$ -2012 2097 1876 -1826 -2538 2537 2181 -3442 -1862 813 -1267 -4041 640 1123 -4116 -3806 -89
1745h9M74l992J367J020j004o12R36J482k403m87J003K597j728k007J876J000
$$ -89 385 -3607 -2240 -1220 -2224 -2836 -1900 -418 -2821 -3308 -2305 292 -1436 -3443 -1567 -567
1761e67n45j095K427o37j561P89K611L52l664P24K243P77k846P70K975j743q00
$$ -567 -1112 -2207 220 -417 -1978 -1189 1422 1774 -1890 -1166 1077 1854 -992 -222 2753 1010 210
1778B10J410J707l308K44K547m11j510m01K572k47M35j137m90j37o65J766N18
$$ 210 1620 3327 19 263 2810 2399 889 488 3060 2813 3248 2111 1621 1484 819 2585 3103
1795C103k70l505J153K800j317k157L92K296k881o60J892O69l248p24M750o60
$$ 3103 2833 -672 481 3281 1964 -193 199 2495 -386 -1046 846 1515 -1733 -2457 2293 1633
1811A633l812o78M154j305k917K405P26k768j625M504K23k887k65J657k37k932
$$ 1633 -2179 -2857 1297 -8 -2925 -520 206 -2562 -4187 317 540 -2347 -2612 -955 -1192 -4124
1827d124J457J109K12j419R52J756j992j344J480L316l115j855K659J661j723
$$ -4124 -2667 -1558 -1346 -2765 -1813 -57 -2049 -3393 -1913 1403 -1712 -3567 -908 753 -970
1842i70o93L966j577l455J739M778k410m387L792K656k388k236M001n5l601K668
$$ -970 -1663 2303 726 -2729 -990 3788 1378 -3009 783 3439 1051 -1185 2816 2761 -840 1828
1858A828K636j839l472K070J270j30Q5j79K29j610R32J37O38j358j362J928L41
$$ 1828 4464 2625 -847 1223 2493 2363 2448 2269 2498 888 1820 1957 2595 1237 -125 1803 2144
1875B144j957q78L516r63k411M17J097o49k592K712J388k372k008J764J675k428
$$ 2144 187 -691 2825 1862 -549 -132 965 316 -2276 436 1824 -548 -2556 -792 883 -1545
1891a545k90R14L19k075J369R42k370L24N06J092p79K2j213K57J370l63j60k3
$$ -1545 -1835 -921 -602 -2677 -1308 -366 -2736 -2412 -1906 -814 -1593 -1571 -2784 -2527 -1157 -1520 -1680 -1703
1909a703Q94k568J602K987k052j655J383K073k269J52J596J12j585O61K698k214
$$ -1703 -809 -3377 -1775 1212 -840 -2495 -1112 961 -1308 -1156 440 552 -1033 -372 2326 112
1925A12n19Q25K048j125k027K448J176j695j499K915j35j707K28J679O15l176
$$ 112 -407 418 2466 1341 -686 1762 2938 1243 -256 2659 2524 817 1045 2724 3339 163
1941A63P76J538N89j988q99K053m47j553P70K866l826j785L948L51l253q40M257
$$ 163 939 2477 3066 1078 179 2232 1785 232 1002 3868 42 -1743 2205 2556 -697 -1537 2720
1958B720k215l150K830K457l512k223L513K04j856j560K363L53k585P94J411j53
$$ 2720 505 -2645 185 2642 -870 -3093 420 624 -1232 -2792 -429 -76 -2661 -1867 -456 -609
1974f09k567R89J686j249j824J673K126l014L7J673R63j901r87K802j30j743j34
$$ -609 -3176 -2187 -501 -1750 -3574 -1901 225 -2789 -2752 -1079 -116 -2017 -3004 -202 -332 -2075 -2209
1991b209L262q57k469R65K604k90k970L020N34k625O93K713j39l189J572J807
$$ -2209 1053 196 -2273 -1308 1296 1006 -1964 1056 1590 -1035 -342 2371 2232 -957 615 2422
2007B422m05j824J944P85k047K0L81J766j062p32N17O79q99j067J201J4o9j371
$$ 2422 2017 193 2137 2922 875 895 1276 3042 1980 1248 1765 2444 1545 478 1679 1693 1624 253
2025B53J308O78k200L74N82N36k100O38J801j525k300J634K474l329n21J325J98
$$ 253 1561 2239 39 413 995 1531 -569 69 1870 345 -1955 -321 2153 -1176 -1697 -372 -174
2042a74j740NK492j484j172l32P86j71J63j19J4P37k096J037R95Mj483O87K319
$$ -174 -1914 -1909 583 -901 -2073 -2405 -1619 -1790 -1627 -1746 -1732 -995 -3091 -2054 -1059 -1055 -2538 -1851 468
2061D68k405j096K605J763l709PL466n91k726O95M097k360k175K683J081k395
$$ 468 -1937 -3033 -428 1335 -2374 -2367 1099 508 -2218 -1523 2574 214 -1961 722 1803 -592
2077e92o82L555k6j491m60J671q17j883K411J066k41k237O95J765r26j204J183
$$ -592 -1274 2281 2255 764 304 1975 1158 -725 1686 2752 2511 274 969 2734 1808 604 1787
2094A787J729k971o68J884J433k270r50L157j386k414N37K774j723k182K011J031
$$ 1787 3516 545 -123 1761 3194 924 -26 3131 1745 -669 -132 2642 919 -1263 748 1779
2110A779k620j917M077k83l110Q74J988j142k813K001Q94j148m95J241k11j430
$$ 1779 -841 -2758 1319 1036 -2074 -1200 788 -354 -3167 -1166 -272 -1420 -1915 -674 -885 -2315
2126b315Q01k69R96r69n00N44L29j42m09J828r04j441L52K187o31j774K096M42
$$ -2315 -1514 -1783 -787 -1756 -2256 -1712 -1383 -1525 -1934 -106 -1010 -2451 -2099 88 -543 -2317 -221 221
2144B21o79j336J993R64j712j32J441O80j956R63R48n36n30O29R89j294R65k99
$$ 221 -458 -1794 199 1163 -549 -681 760 1440 -516 447 1395 859 329 958 1947 653 1618 1319
2162A319j37M90M6n90R3J240j722O72J337p56j928J020J847k732K01J614j89k607
$$ 1319 1182 1672 1718 1128 1221 2461 739 1411 2748 1992 64 1084 2931 199 400 2014 1825 -782
2180g82J037K138j827j177L80J541j987o14J838M36j719j280K157j69j472l02
$$ -782 255 2393 566 -611 -231 1310 -677 -1291 547 983 -736 -2016 141 -28 -1500 -1802
2196a802J862l49k438J224Q24J88j790K77J500p30j094K60K115j962r25K111J085
$$ -1802 60 -289 -2727 -1503 -679 -491 -2281 -2004 -504 -1234 -2328 -2068 47 -1915 -2840 -729 356
2213C56k663o21L884j481k071J716K328k922j484L941P29k302o98K879o32k177
$$ 356 -2307 -2928 956 -525 -2596 -880 1448 -1474 -2958 983 1712 -590 -1288 1591 959 -1218
2229a218J205J815J01k498J858N90m03j005Q67J570j836l63L74J420j065m05J082
$$ -1218 -13 1802 1903 -595 1263 1853 1450 445 1312 2882 1046 683 1057 2477 1412 1007 2089
2246B089j18q47q06K185o72j956M16K020r78k342K385L19j824p07K538o03k991
$$ 2089 1971 1124 318 2503 1831 -125 291 2311 1333 -1009 1376 1695 -129 -836 1702 1099 -1892
2263a892J155J348l63j609J059O3q81j04J21R36j087m36j45J209j98j521P07Q49
$$ -1892 -737 611 248 -1361 -302 -239 -1120 -1224 -1103 -167 -1254 -1690 -1835 -626 -824 -2345 -1638 -789
2281g89m4j684J168M85r84j41J012P42k073Q34J264j02j384Q30J457j611M9J123
$$ -789 -833 -2517 -1349 -864 -1848 -1989 -977 -235 -2308 -1474 -210 -312 -1696 -866 591 -1020 -971 152
2299A52P62k052N99K352p64j270m63K073k26n49K10R19k41j697J351J200j47k280
$$ 152 914 -1138 -539 1813 1049 -221 -684 1389 1163 614 824 1743 1502 -195 1156 2356 2209 -71
2317g1R05K228j579j192J190J380k518O9K091o28k315N07L074k178j750J310J346
$$ -71 834 3062 1483 291 1481 2861 343 412 2503 1875 -440 67 3141 963 -787 523 1869
2334A869k115r97K805n72k379K24K785j469k154J333J207p68j756J335J18r60
$$ 1869 -246 -1243 1562 990 -1389 -1165 1620 151 -2003 -670 537 -231 -1987 -652 -534 -1494
2350a494n30J231Q29k204n06J471J712k484j042K311k49j257L39K703j853j857
$$ -1494 -2024 -793 36 -2168 -2674 -1203 509 -1975 -3017 -706 -955 -2212 -1873 830 -1023 -2880
2366b880K141J653j925j313K654k35j158M09J856j118k004K426R60j527r07J909
$$ -2880 -739 914 -1011 -2324 330 95 -1063 -654 1202 84 -1920 506 1466 -61 -968 941
$$ [...]
8191a03
##END NTUPLES=NMR FID
##END=
