##TITLE=1H_EC-3236x
 DMSO, 8 sc, 
 20.10.2020
##JCAMPDX= 6.0         $$ Bruker NMR JCAMP-DX V2.0
##DATA TYPE= NMR FID
##DATA CLASS= NTUPLES
##ORIGIN= UXNMR, Bruker Analytische Messtechnik GmbH
##OWNER= root
$$ XWIN-NMR		Version 3.5
$$ Tue Oct 20 11:45:38 2020 Russian Standard Time (UT+4h)  she@DPX200
##.OBSERVE FREQUENCY= 200.1315066352
##.OBSERVE NUCLEUS= ^1H
##.DELAY= (6, 6)
##.ACQUISITION MODE= SIMULTANEOUS
##.ACQUISITION SCHEME= undefined
##.AVERAGES= 8
##.DIGITISER RES= 18
##SPECTROMETER/DATA SYSTEM= spect
##.PULSE SEQUENCE= zg30
##.SOLVENT NAME= DMSO
##.SHIFT REFERENCE= (INTERNAL, DMSO, 0, 15.7039)
##AUDIT TRAIL= $$ (NUMBER, WHEN, WHO, WHERE, WHAT)
$$ ##TITLE= Audit trail, XWIN-NMR		Version 3.5
$$ ##JCAMPDX= 5.01
$$ ##ORIGIN= Bruker BioSpin GmbH
$$ ##OWNER= she
$$ F:/spectra/data/she/nmr/H-F/1/audita.txt
$$ ##AUDIT TRAIL=  $$ (NUMBER, WHEN, WHO, WHERE, WHAT)
(   1,<2020-10-20 11:44:40.28 +0400>,<she>,<DPX200>,
      <created by zg, POWCHK disabled, PULCHK disabled
       configuration hash MD5:
       00 E9 B6 7A A2 85 ED C7 34 08 36 98 17 FE 4E 26
       data hash MD5: 16K
       D6 C7 83 86 4C 7B 34 CC FA E4 36 37 74 A8 E9 22>)
$$ ##END=
$$ 
$$ hash MD5
$$ C9 95 48 A4 EB C4 69 78 3E D3 98 BF 0D 69 AD 49
##$RELAX= 
##$RELAX= 
##$RELAX= 
##$RELAX= 
##$RELAX= 
##$RELAX= 
$$ Bruker specific parameters
$$ --------------------------
##$DU= <F:/spectra>
##$EXPNO= 1
##$NAME= <H-F>
##$PROCNO= 1
##$TYPE= <nmr>
##$USER= <she>
##$AMP= (0..31)
100 100 100 100 100 100 100 100 100 100 100 100 100 100 100 100 100 100 
100 100 100 100 100 100 100 100 100 100 100 100 100 100 
##$AQSEQ= 0
##$AQ_mod= 1
##$AUNM= <au_zg>
##$AUTOPOS= <>
##$BF1= 200.13
##$BF2= 200.13
##$BF3= 200.13
##$BF4= 200.13
##$BF5= 200.13
##$BF6= 200.13
##$BF7= 200.13
##$BF8= 200.13
##$BYTORDA= 1
##$CFDGTYP= 0
##$CFRGTYP= 5
##$CHEMSTR= <none>
##$CNST= (0..31)
1 1 145 1 1 1 1 1 1 1 1 1 1 1 1 1 1 1 1 1 1 1 1 1 1 1 1 1 1 1 1 1 
##$CPDPRG= <>
##$CPDPRG1= <>
##$CPDPRG2= <>
##$CPDPRG3= <>
##$CPDPRG4= <mlev>
##$CPDPRG5= <mlev>
##$CPDPRG6= <mlev>
##$CPDPRG7= <mlev>
##$CPDPRG8= <mlev>
##$CPDPRGB= <>
##$CPDPRGT= <>
##$D= (0..31)
0 1.2 0 0 0 0 0 0 0 0.06 0 0.03 0 0 0 0 0.0002 0 0 0 0 0 0 0 0 0 0 0 0 
0 0 0 
##$DATE= 1603179879
##$DBL= (0..7)
120 120 120 120 120 120 120 120 
##$DBP= (0..7)
150 150 150 150 150 150 150 150 
##$DBP07= 0
##$DBPNAM0= <>
##$DBPNAM1= <>
##$DBPNAM2= <>
##$DBPNAM3= <>
##$DBPNAM4= <>
##$DBPNAM5= <>
##$DBPNAM6= <>
##$DBPNAM7= <>
##$DBPOAL= (0..7)
0.5 0.5 0.5 0.5 0.5 0.5 0.5 0.5 
##$DBPOFFS= (0..7)
0 0 0 0 0 0 0 0 
##$DE= 6
##$DECBNUC= <off>
##$DECIM= 32
##$DECNUC= <off>
##$DECSTAT= 4
##$DIGMOD= 1
##$DIGTYP= 9
##$DL= (0..7)
0 120 120 120 120 120 120 120 
##$DP= (0..7)
150 150 150 150 150 150 150 150 
##$DP07= 0
##$DPNAME0= <>
##$DPNAME1= <>
##$DPNAME2= <>
##$DPNAME3= <>
##$DPNAME4= <>
##$DPNAME5= <>
##$DPNAME6= <>
##$DPNAME7= <>
##$DPOAL= (0..7)
0.5 0.5 0.5 0.5 0.5 0.5 0.5 0.5 
##$DPOFFS= (0..7)
0 0 0 0 0 0 0 0 
##$DQDMODE= 0
##$DR= 18
##$DS= 0
##$DSLIST= <SSSSSSSSSSSSSSS>
$$ [...]
##$SUBNAM2= <"">
##$SUBNAM3= <"">
##$SUBNAM4= <"">
##$SUBNAM5= <"">
##$SUBNAM6= <"">
##$SUBNAM7= <"">
##$SUBNAM8= <"">
##$SUBNAM9= <"">
##$SW= 16.880792210976
##$SWIBOX= (0..15)
0 0 2 0 0 0 0 0 0 0 0 0 0 0 0 0 
##$SW_h= 3378.37837837838
##$TD= 16384
##$TD0= 1
##$TE= 0
##$TE2= 300
##$TE3= 300
##$TEG= 300
##$TL= (0..7)
0 120 120 120 120 120 120 120 
##$TP= (0..7)
150 150 150 150 150 150 150 150 
##$TP07= 0
##$TPNAME0= <>
##$TPNAME1= <>
##$TPNAME2= <>
##$TPNAME3= <>
##$TPNAME4= <>
##$TPNAME5= <>
##$TPNAME6= <>
##$TPNAME7= <>
##$TPOAL= (0..7)
0.5 0.5 0.5 0.5 0.5 0.5 0.5 0.5 
##$TPOFFS= (0..7)
0 0 0 0 0 0 0 0 
##$TUNHIN= 0
##$TUNHOUT= 0
##$TUNXOUT= 0
##$USERA1= <user>
##$USERA2= <user>
##$USERA3= <user>
##$USERA4= <user>
##$USERA5= <user>
##$V9= 5
##$VALIST= <valist>
##$VCLIST= <CCCCCCCCCCCCCCC>
##$VD= 0
##$VDLIST= <DDDDDDDDDDDDDDD>
##$VPLIST= <PPPPPPPPPPPPPPP>
##$VTLIST= <TTTTTTTTTTTTTTT>
##$WBST= 1024
##$WBSW= 4
##$XGAIN= (0..3)
0 0 0 0 
##$XL= 0
##$YL= 0
##$YMAX_a= 113585
##$YMIN_a= -98259
##$ZGOPTNS= <>
##$ZL1= 120
##$ZL2= 120
##$ZL3= 120
##$ZL4= 120
##$ABSF1= 10
##$ABSF2= 0
##$ABSG= 5
##$ABSL= 3
##$ALPHA= 0
##$AQORDER= 0
##$ASSFAC= 0
##$ASSFACI= 0
##$ASSFACX= 0
##$ASSWID= 0
##$AUNMP= <proc_1d>
##$AZFE= 0.1
##$AZFW= 0.1
##$BCFW= 1
##$BC_mod= 2
##$BYTORDP= 1
##$COROFFS= 0
##$CY= 11.3945322036743
##$DATMOD= 1
##$DC= 2
##$DFILT= <>
##$DTYPP= 0
##$F1P= 16.9975609425685
##$F2P= -3.02152046262296
##$FCOR= 0.5
##$FTSIZE= 0
##$FT_mod= 4
##$GAMMA= 1
##$GB= 0.15
##$INTBC= 1
##$INTSCL= 1
##$ISEN= 128
##$LB= 0.24
##$LEV0= 0
##$LPBIN= 0
##$MAXI= 10000
##$MC2= 0
##$MEAN= 0
##$ME_mod= 0
##$MI= 1.114404
##$NCOEF= 0
##$NC_proc= 0
##$NLEV= 6
##$NOISF1= 3.799351
##$NOISF2= 2.8
##$NSP= 1
##$NTH_PI= 0
##$NZP= 0
##$OFFSET= 15.70392
##$PC= 1
##$PHC0= -10484.13
##$PHC1= 5.800892
##$PH_mod= 1
##$PKNL= yes
##$PPARMOD= 0
##$PSCAL= 0
##$PSIGN= 0
##$REVERSE= no
##$SF= 200.130013532006
##$SI= 16384
##$SIGF1= 3
##$SIGF2= 2
##$SINO= 400
##$SIOLD= 16384
##$SREGLST= <1H.CDCl3>
##$SSB= 0
##$STSI= 0
##$STSR= 0
##$SW_p= 3612.71676300578
##$SYMM= 0
##$S_DEV= 0
##$TDeff= 0
##$TDoff= 0
##$TI= <>
##$TILT= no
##$TM1= 0
##$TM2= 0
##$TOPLEV= 0
##$USERP1= <user>
##$USERP2= <user>
##$USERP3= <user>
##$USERP4= <user>
##$USERP5= <user>
##$WDW= 1
##$XDIM= 8192
##$YMAX_p= 0
##$YMIN_p= 0
$$ End of Bruker specific parameters
$$ ---------------------------------
##NTUPLES= NMR FID
##VAR_NAME=  TIME,          FID/REAL,        FID/IMAG
##SYMBOL=    X,             R,               I
##VAR_TYPE=  INDEPENDENT,   DEPENDENT,       DEPENDENT
##VAR_FORM=  AFFN,          ASDF,            ASDF
##VAR_DIM=   8192,          8192,            8192
##UNITS=     SECONDS,       ARBITRARY UNITS, ARBITRARY UNITS
##FACTOR=    0.000296,      1,               1
##FIRST=     0,             0,               0
##LAST=      2.424536,      0,               0
##MIN=       0,             -98259,          0
##MAX=       2.424536,      113585,          0
$$ Real data points
##PAGE= N=1
##DATA TABLE= (X++(R..R)), XYDATA
0 0 0 0 0 0 0 0 0 0 0 0 0 0 0 8 -8 8 -8 8 -16 16 -20 24 -31 32 -40 48 -56 64 -72 84 -96 110 -125 142 -160
35 -160 181 -204 228 -256 285 -318 356 -394 436 -482 535 -589 652 -717 789 -870 960 -1057
53 -1057 1164 -1285 1419 -1574 1748 -1947 2179 -2455 2787 -3197 3714 -4396 5335 -6727 9027
68 9027 -13806 46531 -87188 -21190 75626 -12189 48370 -58570 7691 61479 -36044 -13705
80 -13705 -7852 7721 19946 -57293 -15830 31206 17057 -37402 -26793 29613 8841 2021 -12635
93 -12635 -3487 47853 -10828 -24518 6395 28425 24956 -50380 -6872 41513 -6186 -17438 -29647
106 -29647 31406 22075 -48564 10565 8362 5014 8513 -39046 24903 30403 -12059 -12076 -15763 41862
120 41862 9736 -35731 11367 10542 12750 -15849 -20879 31532 7802 -13477 -20021 13502 37760
133 37760 -32153 -15824 19724 13456 9063 -35142 9392 31283 -16294 -4849 -9047 23552 12819
146 12819 -39015 11840 6961 924 6981 -35858 15225 20037 -23452 -7942 -7965 22082 2502
159 2502 -39069 11990 21912 -9572 -13153 -743 13692 10658 -7457 -19700 21970 18863 -26758
172 -26758 2577 6385 9353 3228 -35486 21123 16379 -24832 7527 -11748 10882 15768 -29569
185 -29569 6843 11130 7332 -2632 -25360 29784 13010 -26692 1567 7348 13054 -11467 -16831
198 -16831 13761 1538 -1153 -12894 -6222 20964 -5089 -14055 -2856 14908 9596 -24396 5303
211 5303 13097 -4749 2821 -14214 5171 12480 -11090 -7522 -6779 17092 -1055 -28354 10902
224 10902 9093 -2363 -9975 -9930 23234 -3979 -12908 7223 -2167 13969 -7171 -16361 17525 5253
238 5253 -7108 -9189 2870 14309 -6782 -8519 -81 11854 3079 -15227 6263 4948 4739 -1390
252 -1390 -17909 20682 6750 -17925 4161 -3102 14138 -2880 -23092 19671 2694 -7947
264 -7947 688 -8524 17059 -1525 -15117 8036 1800 5441 -7048 -10109 12334 1921 -6968
277 -6968 -7818 3848 9885 -9893 -6522 3169 8679 -1658 -13494 7929 5760 101 -3225 -10585
291 -10585 16590 2672 -15156 3949 1432 7383 -7845 -11661 16547 -2276 -5808 787 -3586
304 -3586 11935 -1686 -7787 2355 6381 7823 -14187 70 14281 -6098 -2496 -4678 4797
317 4797 8020 -13692 -199 3779 1618 2414 -12352 4640 10131 -4442 -5848 152 12475 -4817
331 -4817 -7945 6294 -1704 5361 -6749 -8535 11780 -4642 -2419 -3518 -5698 15073 -8804 -10867
345 -10867 11312 319 -1428 -5320 14 8637 -3201 -3879 -2253 5086 3781 -8982 -1306 4005
359 4005 4541 -5385 -7394 11070 409 -4042 693 -2137 10711 -2872 -7094 6676 50 4723
373 4723 -6152 -5500 12541 -4358 -4591 -247 -125 8311 -9063 -3739 8194 -828 355 -5519 2386
388 2386 7881 -5096 -2210 -38 5261 900 -8650 2766 2636 810 -3433 -5857 8572 -135 -4969
403 -4969 462 -355 7355 -4651 -5028 6649 -387 1442 -5309 -1944 8836 -4832 -3438 -630 2341
418 2341 4620 -9815 1789 6236 -3086 2334 -4073 3272 7249 -4984 -122 1751 4933 769
432 769 -6868 4564 3518 -1349 -2632 -1284 6332 -1770 -2304 550 196 6919 -5015 -3148 7042
447 7042 -175 665 -4486 1483 7281 -6961 -882 1520 -49 2697 -6908 778 3898 -1299 12
462 12 -4697 5386 4141 -6588 1658 2605 2618 -1539 -3815 4771 328 -275 -2377 -2833 6737 -2430
478 -2430 -4241 1553 958 3408 -5501 -252 6307 -2437 685 -1965 1480 5754 -5222 -507 1773
493 1773 1427 1393 -6290 2938 3452 -2877 79 -1860 4674 1255 -4607 2915 1136 2509 -964 -3674
509 -3674 5024 523 -2015 -1850 -303 4201 -4144 -2565 1498 -179 1654 -4965 -112 4290 -2174
524 -2174 -356 -2333 2754 2829 -5784 1681 943 -284 690 -5266 2684 1972 -3130 -638 -1649 4252
540 4252 -579 -4342 3298 459 1236 -1038 -2113 4402 -423 -1360 -1261 302 3831 -4413 -1633 2343
556 2343 -334 544 -3988 1463 3173 -2879 738 -1170 2219 2547 -4301 1513 1464 564 -555 -3811
572 -3811 3634 289 -3228 123 -1058 2523 -1647 -2735 2055 -153 1619 -2887 -1245 5146 -2451
587 -2451 -1476 295 159 1981 -4122 -133 1235 -1360 858 -4049 1284 2853 -3402 347 -222 2218
603 2218 852 -3692 3086 777 -123 482 -2869 3573 220 -2825 696 -588 2424 -1901 -2468 3325
619 3325 -357 11 -1043 134 3425 -1894 -156 514 432 2089 -3319 59 1975 -1090 -482 -2268
635 -2268 1808 936 -2878 890 -547 1481 580 -2933 2171 1100 -156 -1004 -1033 3380 -1643 -1806 1010
652 1010 -931 1575 -2213 -1444 2231 -907 260 -1763 628 3149 -2692 337 1067 293 1474 -2565
668 -2565 923 1522 -1055 9 -1929 1802 791 -2752 598 172 1479 -697 -1936 3062 97 -355
684 -355 132 -552 2729 -1028 -1362 802 -100 1164 -2583 -531 2212 -1560 -284 -824 604 1413 -1882
701 -1882 587 39 1074 879 -2993 1994 1132 -1648 22 -1258 1708 -618 -2252 1197 -840 961
717 961 -708 -1851 2799 -329 -530 281 -4 2288 -1500 -381 1305 -519 1018 -1894 -70 1634
733 1634 -1494 160 -1143 829 1613 -2597 1043 893 122 703 -1701 1953 709 -1371 691 -1047
749 -1047 1225 -29 -2278 966 123 23 -1124 -514 1799 -934 112 153 -191 2035 -1199 -285 1149
766 1149 9 567 -1932 727 1265 -1997 302 -705 433 771 -2013 920 451 253 183 -1251 2203
783 2203 201 -1067 855 -516 1361 -591 -1335 1444 -611 162 -532 -773 1837 -711 -303 307 555
800 555 1518 -1383 514 1447 -443 604 -931 639 883 -1271 119 -573 818 -23 -1914 1413 179
817 179 -323 312 -654 1536 -117 -309 660 -470 1558 -849 -1098 1575 -611 -202 -587 -236 1141 -1033
835 -1033 -10 95 312 986 -1317 812 898 -266 549 -979 1227 371 -1587 777 -601 297 -49
852 -49 -1530 1184 -304 -195 244 -936 1669 -72 -794 940 92 746 -728 -210 1172 -800 230
869 230 -654 -352 1133 -1317 -253 358 169 248 -1185 926 515 -541 572 -783 850 300 -1162
886 -1162 412 -409 420 -664 -1278 1138 -732 -342 -69 -629 1268 -694 -385 875 -204 822 -783
903 -783 -7 1187 -832 138 -459 96 646 -1464 164 133 -357 249 -890 649 393 -269 215 -430 1195
922 1195 -148 -824 943 -512 335 -384 -923 989 -764 -207 -128 -515 1225 -1008 -262 1174 -483
939 -483 554 -325 132 838 -511 128 -447 198 333 -1237 300 -135 -280 28 -958 717 0 -369 418
958 418 -353 948 -98 -626 870 -281 289 -475 -598 1010 -816 -287 -12 -329 654 -880 93 447
976 447 -310 725 -664 345 1014 -713 242 42 251 97 -890 523 -334 -208 125 -925 767 71
994 71 -554 364 -33 683 -353 -125 900 -294 433 -309 -227 801 -835 -42 -88 -262 537 -981 137
1013 137 436 -454 510 -477 421 714 -696 531 56 119 223 -680 367 -64 -178 -232 -542 769 -542
1032 -542 -340 474 -305 575 -252 -69 775 -203 397 -318 26 802 -868 170 93 -417 330 -788 88
1051 88 196 -323 281 -456 613 364 -603 701 56 205 237 -503 493 -28 -201 -199 -407 545 -592 -244
1071 -244 233 -318 497 -413 -52 697 -228 355 -154 189 578 -705 275 -68 -194 213 -863 278 114
1090 114 -565 149 -302 424 55 -423 652 -161 410 161 -478 706 -97 -264 -5 -166 274 -584 -126
1109 -126 94 -350 388 -484 74 606 -322 306 -28 341 413 -596 503 -66 -172 296 -706 315 -32
1128 -32 -540 152 -377 223 1 -366 508 -53 364 35 -173 712 -265 -59 175 -281 310 -447 -193 106
1148 106 -290 161 -555 202 404 -470 424 -44 163 450 -371 369 62 24 121 -505 469 -174 -468 189 -351
1169 -351 138 -86 -331 357 -100 224 -34 -11 624 -287 169 151 -183 291 -438 -89 122 -238 16 -431 154
1190 154 174 -377 313 -72 296 265 -380 496 72 -25 206 -313 363 -225 -249 130 -419 235 -264 -381 416
1211 416 -178 56 7 61 402 -194 234 51 14 414 -444 108 179 -326 29 -309 117 -59 -328 245 -205
1232 -205 239 151 -379 543 -1 41 178 -221 341 -191 -208 118 -408 179 -351 -302 312 -389 60 -53 -92 401
1254 401 -219 151 124 22 225 -347 257 31 -395 223 -419 33 63 -436 113 -195 120 -71 -240 486 -173
1275 -173 59 315 -230 431 -12 -172 139 -196 140 -405 -160 196 -432 52 -48 -115 272 -262 132 138 72
1296 72 175 -210 248 26 -160 86 -331 102 -69 -402 131 -196 23 -56 -151 347 -118 124 149 -88 494
1317 494 -165 -19 328 -214 73 -187 -88 -8 -248 99 -216 -10 204 -374 256 120 -90 138 4 274 4
1338 4 -2 191 -248 235 -38 -320 207 -202 -26 -66 -109 231 -146 127 67 -66 385 -175 91 273 -139 184
1360 184 -189 -18 22 -300 -15 -181 -2 23 -273 227 -71 1 228 -228 313 186 -84 104 -54 172 -210
1381 -210 -122 242 -335 35 -17 -247 226 -180 33 130 20 270 -222 193 211 -159 302 -93 16 141 -266
1402 -266 4 -158 20 -16 -251 222 -124 27 202 -149 332 43 -11 210 -29 117 -99 -54 102 -231 113
1423 113 -148 -151 197 -276 25 52 -92 147 -128 220 115 -5 254 -164 81 92 -279 82 -127 -105 -30 -217
1445 -217 93 -110 67 72 -133 334 -124 0 278 -121 160 -12 -44 94 -154 118 -154 -137 138 -279 56
1466 56 28 -167 104 -118 151 96 0 181 -145 185 76 -174 150 -156 12 2 -230 137 -175 -130 -21 -107
1488 -107 127 -135 95 144 -119 262 -112 31 239 -86 -41 -130 -26 -24 -297 122 -115 -157 153 -222 107 107 -23
1511 -23 64 15 231 -23 -35 209 -151 15 -7 -192 46 -128 -40 -47 -106 91 -166 33 74 -26 156 -60 70
1534 70 197 -178 156 -46 -69 18 -151 51 -136 2 19 -240 177 -2 -81 175 -32 109 0 -9 185 -88
1556 -88 100 -53 -140 137 -200 -47 -39 -105 62 -153 12 21 21 143 -92 156 151 -64 175 -32 -9 86 -178 51
1580 51 -106 -43 2 -168 160 -76 -101 197 -49 122 65 -11 115 58 135 -3 1 115 -172 -46 -56 -80 52 -225
1604 -225 -36 38 -136 80 -43 88 36 5 163 -54 108 121 -197 67 17 -96 -29 -78 -22 -140 -24 88 -209
1627 -209 133 27 -25 125 41 72 -15 21 67 -167 104 28 -178 30 -135 6 -41 -80 50 -84 23 99 -43
1650 -43 105 20 96 10 -128 149 -126 -91 139 -179 -40 -66 -56 -48 -137 153 -118 13 197 -65 45 116 -4 28
1674 28 9 77 -94 -33 52 -131 16 27 -146 19 -99 47 33 -62 87 97 106 -31 80 158 -73 92 43 -193
1698 -193 32 32 -101 26 -91 -18 -139 110 144 -100 134 68 -45 92 29 83 -26 -2 23 -157 52 -60 -77
1721 -77 -25 -106 -9 26 -54 125 6 21 105 10 61 18 50 2 -7 133 -171 -106 41 -84 -98 -48 49 -64 -29 188 1
1748 1 33 200 -57 41 55 3 48 -82 57 -86 -102 66 -144 -30 -18 -6 117 -56 122 78 -56 92 6 58
1772 58 -26 35 54 -136 -17 25 -162 17 -28 -83 -34 -29 -16 -97 165 60 -98 169 58 -4 111 -7 -48 -74 -12
1797 -12 -90 -142 17 -51 -104 43 -74 15 40 11 151 -43 85 97 -17 27 -31 27 -41 -94 87 -163 -88 61 -117
1822 -117 9 41 48 -23 -62 198 -102 40 117 -64 55 41 -24 -20 -22 1 -126 -60 31 -31 4 10 41 54 -48 55 44
1849 44 -72 79 -26 -5 -42 -54 -50 -116 17 7 -153 12 -15 -88 -10 82 66 19 155 38 -77 159 -6 -69 25
1874 25 -15 -39 -98 21 -13 -129 20 -29 -36 80 -13 102 4 -24 112 -45 7 69 -38 -33 -15 46 -129 -58 108 -89
1900 -89 -86 54 -56 5 38 50 -15 98 136 -30 26 83 -31 34 -78 -47 -52 -14 36 -87 5 -32 -58 45 16 -24 35
1927 35 -13 106 44 -87 9 -39 -5 -10 -30 -24 -99 43 18 -116 70 15 -19 46 63 66 -19 96 27 -112 132 -57 -69
1954 -69 19 -107 -9 -50 -57 -12 -39 1 -32 2 61 20 91 -29 -7 87 -62 31 56 -76 -74 -24 -44 -110 -12 53 -130 -7
1982 -7 116 -31 12 35 69 20 -28 100 -45 -35 1 -109 -33 -55 -38 -3 -11 17 -54 3 -3 -22 31 -25 50 71 -19 66 -40
2011 -40 -95 20 -10 -16 -42 -10 -7 -69 37 -32 -42 66 -4 14 39 76 37 -15 93 -20 -56 59 -46 -10 -55 -83 19
2038 19 -66 -5 48 -27 50 -36 -5 50 -7 31 0 -1 44 -54 2 4 -42 -69 -51 -33 -81 -21 24 -51 -13 60 -25 67 79 2 -42
2069 -42 -18 36 -108 -19 28 -95 -11 -53 -29 -7 10 24 10 -4 -28 -8 43 -32 27 59 -53 52 -16 -41 -28 -41 -65 12
2097 12 -10 1 -45 27 49 -78 88 30 31 14 75 17 -56 52 -53 -14 -4 -49 -8 -25 -10 44 -54 -37 37 49 64 6 28
2126 28 7 -37 11 -58 -28 25 -99 -44 29 -41 -56 -23 35 -29 -18 53 -11 -26 -3 -15 73 15 -29 -3 -29 0 -67 24 -54 -43
2156 -43 23 -61 36 60 -52 31 8 6 21 -20 59 -84 12 -62 -109 28 -41 -73 -10 -38 -45 22 -10 -8 -49 53 -35 15 116
2185 116 9 -11 -34 -29 44 -5 -20 -16 -22 12 -64 17 -9 -66 36 -52 22 8 60 17 16 -17 -9 -46 -33 -49 -54 5 -99 -19 2
2216 2 -37 -9 -34 15 -68 57 43 -28 21 15 8 40 -4 -69 -64 -32 6 -48 12 -65 -65 49 33 -45 15 -10 51 13 11 -1 -7 45 -11
2249 -11 14 -13 -81 50 -35 -12 -27 11 -12 -21 80 -4 15 48 72 37 9 -4 -25 -51 27 -39 -71 39 -64 -75 -2 -64 27
2278 27 29 -32 53 38 22 61 3 46 -10 29 33 -10 24 -54 -43 22 -45 23 -13 16 51 3 63 31 80 32 -42 45 13 -15 7
2309 7 -49 -49 11 -28 -11 -33 33 -27 -33 53 29 39 36 -29 34 4 18 7 -15 17 3 -47 -21 -51 -42 1 -88 7 -13 9 -9 51 11
2342 11 -15 118 -35 -11 34 -41 -45 -25 -65 -13 -22 -18 -133 23 40 -31 18 62 19 57 6 28 11 -89 -8 30 19 -42 1
2371 1 -48 -65 -44 33 26 34 19 19 -33 46 58 -46 10 45 -1 78 13 0 -3 -53 -25 26 -9 -12 -36 28 -41 2 50 -23 46 26 -40
2404 -40 -34 52 8 -1 27 -16 -18 -7 -42 -59 17 23 -37 47 -18 31 45 28 2 19 48 -2 21 37 -75 0 0 -43 -39 -3 -15 -23 32
2437 32 59 -19 50 15 -10 23 23 53 -5 12 15 -27 23 -9 -17 -3 -21 23 59 -20 20 35 -33 16 -19 8 -10 5 -38 -35 -26 -16 -54
2470 -54 -22 32 -30 -62 3 1 -5 63 52 18 29 38 15 28 -23 51 10 -2 -29 -21 -7 -47 -13 -16 -4 100 28 12 32 1 15 12 44
2503 44 15 -14 47 7 -37 14 -41 5 -29 20 21 -38 48 51 -35 -25 -24 9 1 -24 19 8 -45 -51 4 0 -53 -15 -39 -45 49 -8 22 24
2537 24 3 1 -9 -15 51 6 2 -15 0 -15 -79 -60 -29 -50 2 2 8 1 -20 -14 43 53 38 13 20 44 -4 44 -54 -11 -14 -52 -20 -11 -37
2572 -37 -35 37 -42 -17 17 26 16 25 34 35 -2 -12 17 -5 22 -35 -4 54 21 -28 25 43 -19 39 -26 12 -19 34 48 29 -4 -91 -8
2605 -8 -11 -34 -5 19 -43 1 45 -4 -42 51 -40 53 15 -37 39 22 -41 -16 -11 -1 57 -1 19 12 43 -15 -3 -5 25 7 16 0 -18
2638 -18 31 28 -36 -6 -14 -42 4 5 -32 8 1 -30 -24 1 24 -25 43 36 2 -21 -32 30 45 -17 9 -22 3 -57 -11 48 -30 57 -19
2671 -19 -38 15 59 18 49 24 -6 -4 24 47 8 -32 -4 -21 17 -24 -29 -13 -42 -18 11 -35 -6 -30 45 -5 33 45 -14 8 2 -16
2703 -16 -30 27 -13 4 -9 -53 -33 -13 7 -1 69 22 5 1 -2 -27 36 10 -60 12 -34 -42 -51 -12 -48 10 -22 -49 29 -18 36 3 59
2736 59 10 -14 61 -18 -5 77 -14 -24 10 -13 35 6 -12 12 -9 -47 -56 63 20 46 -38 19 -37 14 59 2 -27 -13 -92 -2
2766 -2 -45 -70 -10 -51 2 7 13 -9 -33 -18 34 -23 20 -38 -26 40 -9 -15 7 0 3 -13 12 3 -2 -21 15 26 -18 38 -37 12 -11 18
2800 18 -11 -66 -6 19 18 -23 -36 -21 25 44 4 8 -21 21 -13 19 65 53 23 60 -31 1 32 10 -62 4 11 -20 33 -16 -22 23
2832 23 47 8 -5 47 10 -49 0 -19 10 -19 -39 -68 -10 -57 -25 -23 -33 -65 25 5 -58 26 0 -13 49 13 3 52 -3 -14 -21
2863 -21 3 11 -20 -19 6 55 19 -31 45 60 6 -33 19 -19 -15 38 -13 -34 -10 -46 -21 24 -15 10 38 27 -6 -8 -46 8 -2 13
2895 13 64 -15 -40 -16 22 -14 -11 15 8 -5 -26 -38 2 1 7 22 4 30 -13 16 3 -32 -60 -34 18 -12 2 -63 -28 -56 -57 -40 -8
2928 -8 -44 -39 -10 6 -17 19 -17 -9 33 -6 -22 9 -12 -26 -36 21 -11 -4 22 -29 -18 -13 -4 7 17 10 -4 5 27 -18 -11 46 -26 -21 -3
2963 -3 -33 -9 37 -57 -38 -47 27 -2 36 -42 -1 13 33 2 -40 38 -25 -12 -34 8 16 23 14 -28 -1 -57 -54 43 -21 12 36 11 18 10
2997 10 2 9 14 28 7 -47 -7 -33 -35 48 -6 11 22 -25 20 0 -19 -2 47 -7 -26 27 -24 -37 13 -12 -46 -4 -58 0 24 -17
3029 -17 -7 -2 61 37 41 -5 -3 14 -12 -1 -39 -61 -23 -40 -27 23 -43 -11 8 18 25 -5 7 12 18 4 12 57 -20 10 3 -22 10 -53
3063 -53 -63 -26 -18 -5 -6 -24 39 35 58 17 9 63 4 18 -7 -31 -19 23 -74 2 8 -21 23 -14 15 20 27 26 -1 9 40 20 -22 -1
3097 -1 13 -6 0 23 -2 80 32 7 16 5 29 -49 -26 38 -25 22 -7 36 54 -28 2 -7 17 -33 -23 -40 -33 -21 -11 5 -26 36 36
3130 36 56 -9 20 -1 -23 25 28 23 -17 48 17 20 -30 -8 2 -6 35 -7 -27 32 -15 60 -20 -2 -3 -34 1 -13 33 11 -21 12 25
3163 25 -3 -20 -39 -9 -5 0 -52 -6 -16 20 28 27 20 27 50 12 37 -26 14 -38 5 19 -16 -20 22 -59 -1 -5 43 14 -4 -12 2 -14 -4
3198 -4 37 -35 -34 -1 9 1 -33 19 66 13 2 -2 -32 -12 33 14 39 -8 -36 -59 17 -27 -38 7 -41 -69 -2 -21 7 -3 -8 65 16
3231 16 36 -14 10 52 -12 53 -55 -61 -17 -38 -24 30 -38 -74 -82 20 -3 20 -42 -28 47 34 20 -25 36 -29 18 19 -34 -21 -11
3262 -11 -13 -20 5 77 33 5 -23 6 34 84 -14 18 26 -5 40 -43 -31 -17 -19 -23 -43 -44 -26 27 47 16 -33 11 4 20 59 -42 -9
3295 -9 24 -47 -23 48 16 -47 -20 8 -27 -9 44 21 -7 7 -16 -22 -9 8 -48 3 -4 -28 -32 -2 28 -12 -3 -15 -24 -18 5 18 25 -29
3329 -29 19 13 48 -14 -14 -11 2 -23 -16 -13 -6 27 59 16 0 29 5 -23 -1 -30 65 40 8 -56 -13 17 0 29 -25 40 -42 -2 7 -37
3363 -37 11 -44 31 -3 -30 -2 31 25 -51 23 -7 -41 -24 -6 -23 41 9 -2 -42 -2 -21 23 19 -18 12 38 22 -68 -24 -21 15 -11
3395 -11 13 -21 -29 -27 4 -3 -29 -46 0 3 -11 -14 41 -9 -11 -63 16 41 34 34 66 -30 -36 -8 11 27 -29 28 -20 17 18 6 -7 -1 2 -20
3431 -20 -7 7 -48 -48 -5 -29 -27 34 -4 -32 19 -1 -10 1 -41 19 71 0 -53 -34 10 22 -30 12 17 -45 -3 -18 -32 -20 45 -11
3463 -11 -43 18 19 29 8 19 37 21 40 -25 5 -23 -77 -33 0 9 17 -12 12 38 -15 -24 -44 -34 -29 9 -27 -36 -12 1 -16 1 25
3496 25 45 -33 -3 6 17 -34 15 48 24 26 35 -36 25 -62 -12 72 -19 -10 33 -74 -14 -2 -26 15 3 -21 -4 -22 11 17 35 -41
3528 -41 7 -19 15 -58 -16 -37 22 8 0 -39 6 -27 42 -7 -24 62 72 -12 -16 45 -22 12 11 -65 -17 -30 -3 21 -5 -38 -36 32
3560 32 -62 -5 4 31 -16 -6 16 -23 58 -6 -57 -27 -10 -65 -44 31 -41 34 68 23 -5 58 -9 33 5 -43 20 38 30 -11 21
3591 21 7 -4 19 -13 -38 16 29 17 5 -17 13 -44 -37 -4 4 -24 -31 13 32 -27 -53 70 -33 -47 38 -23 -71 18 27 3 -2 -21
3623 -21 -14 5 20 -40 51 -21 9 16 54 36 -25 25 -11 -16 -48 -23 -16 -4 14 17 54 -17 0 18 -7 -37 13 -27 -51 63 2 -30
3655 -30 -35 -40 28 -12 16 -3 -5 16 8 21 -10 -12 -1 -37 -29 37 27 -38 -14 -5 10 10 16 27 8 11 18 0 -4 -23 -43 30 -21 -31 -3 -12 14
3692 14 -17 19 -42 -29 19 11 -43 7 -3 8 22 -8 50 -27 -5 6 -10 -42 -56 -42 -27 -45 -28 -43 -43 -34 15 43 -14 -21 0 24
3724 24 -7 -6 -47 -29 -5 0 -49 30 -17 10 24 29 -6 -3 36 5 44 -26 -5 -13 20 44 -67 -25 -61 32 23 -6 -40 -14 -8 1 -19 -30
3758 -30 -41 -42 -11 -25 -26 26 -17 28 3 -41 11 -51 -13 -40 -13 -9 51 -25 -47 8 2 49 32 11 48 -8 -19 -3 -12 -17 -48 -26 -3
3791 -3 -65 -4 -24 5 -8 55 -8 -9 6 0 -43 -21 12 -70 -8 36 -10 4 -22 -61 19 -14 -18 -28 59 5 42 -29 11 13 4 -8 -31
3824 -31 -1 -9 -17 47 -29 20 -36 4 16 22 -53 -17 -18 -63 -40 -44 -28 4 43 8 22 41 -13 6 -23 -111 30 39 -10 -10 -54 36 11
3857 11 2 14 14 -32 24 25 25 2 20 7 76 -55 53 -22 5 -1 -12 -40 -44 53 26 -20 2 -9 -31 -1 -10 14 -40 -19 -21 -20 49 -26
3891 -26 -5 1 12 -5 14 7 13 2 4 27 -31 50 28 -11 44 12 -47 19 7 -57 -15 -45 30 10 -23 -50 20 -2 7 -44 -31 -18 -29
3924 -29 16 0 -20 -43 0 8 25 -31 -25 33 -31 3 -23 -5 -1 -22 18 2 1 -65 15 -23 16 39 -2 12 -16 -16 -5 9 -13 -19 48
3957 48 29 24 -14 -3 21 -32 -6 -38 -12 -39 -32 4 -11 -53 37 -12 20 10 47 -11 50 -7 8 45 14 4 24 40 7 7 -41 31
3989 31 -22 12 13 30 -7 2 -48 -58 35 -8 -12 -50 -63 -12 -11 -10 -10 -67 37 4 12 0 -32 -7 12 27 -59 32 -43 3 28 -27 -29 8
4023 8 12 -27 3 48 -24 -46 56 20 51 -19 -15 -43 39 -54 -21 20 9 11 -10 -5 -51 -3 -14 -10 0 -38 -20 -20 -6 -58 -12 -42 20
4056 20 7 11 -2 5 2 47 12 -42 10 -35 36 46 1 -19 -20 -49 -9 -5 -2 16 1 -36 16 -23 0 -25 4 29 -37 -1 -63 -6 17
4089 17 26 -23 8 -18 -54 4 -6 1 15 39 -12 61 -17 -21 -22 1 -6 3 3 -14 -6 -23 -19 10 51 -14 -10 -51 -5 -13 1 -34 27 11 -24 23
4125 23 32 -43 -29 21 35 5 -3 14 -21 -1 44 31 40 3 -17 -11 -11 -4 13 -20 -1 -41 -17 -18 -45 -38 14 7 8 44 15 -3 4 -31 -60 31
4161 31 -2 -9 26 31 -66 -48 17 -1 -12 -45 12 -26 6 -54 -64 -47 -4 -5 24 22 21 10 19 7 22 -2 54 -1 19 6 -11 -33 9
4194 9 23 -54 71 -59 -20 1 26 25 -34 -5 -37 -21 -80 50 -40 -42 -29 -1 -25 -56 -18 18 39 4 6 13 -58 -31 16 6 -6
4225 -6 -28 -20 -29 -51 -20 13 0 27 48 24 -3 -2 -17 -17 -25 -23 -38 1 15 -1 -17 -29 23 2 -18 -1 -7 8 5 14 19 -27 3 -28 23 -26
4261 -26 8 -38 15 -7 23 22 6 73 -64 -4 -51 61 -76 2 -14 -12 17 23 -66 13 -69 -7 15 -15 -46 -53 -17 -35 4 3 21
4292 21 -40 -23 -6 2 -6 -8 -28 3 26 8 43 -27 -34 -9 -42 22 -12 14 -8 -1 -9 -20 -15 37 -8 -34 13 -39 -56 -8 -21 -2 -66 20
4326 20 -8 -14 10 5 33 -20 -7 20 -12 10 32 19 -54 -39 42 -23 55 24 7 57 10 -2 -22 -47 -21 0 -14 -77 -24 44 5
4357 5 -25 15 -12 0 -8 -20 22 -14 48 -60 -10 -28 6 46 10 28 -23 -19 -7 24 -21 3 38 -23 31 -29 23 17 11 24 -3 45
4389 45 -17 -48 -9 -6 20 -13 33 -23 15 47 31 2 -17 -23 -10 -18 -6 -18 -12 -10 47 10 42 -23 -11 28 -19 -16 64 -5 12 1 6 4
4423 4 -17 23 20 -34 17 6 36 39 2 7 -21 21 11 -6 -25 70 -11 20 18 -9 -37 2 -26 -20 -37 1 -29 -9 -16 72 40 -14 -34 38
4457 38 -53 22 -38 -48 -14 26 18 -27 9 2 18 -5 -13 14 11 -31 3 -21 -34 -7 3 -18 -53 -74 -38 -65 -10 -50 -22 14 -24 3
4489 3 32 -14 42 -18 -17 -2 -47 -54 0 -18 13 7 -8 2 28 -16 47 -10 26 -45 -9 24 16 -40 -29 22 20 55 -10 -36 -41 -28 4 -31
4523 -31 22 -12 2 39 -1 5 -12 16 -31 -10 35 -45 8 14 -11 14 31 26 26 -4 3 29 25 -2 42 -42 -14 -30 -47 -59 40 10 19 -40
4557 -40 33 56 -11 11 14 16 0 46 -24 -15 10 -5 9 -9 25 -16 31 8 15 -56 18 -7 13 53 -17 53 34 8 24 3 5 47 -15
4590 -15 -19 -21 15 11 -3 16 -7 -3 33 -34 35 3 -40 0 13 23 -17 -36 -32 -7 -27 16 -3 -42 -2 -49 -15 36 28 -9 8 -6 -54
4623 -54 7 20 3 -9 33 4 -5 24 23 -15 -18 -30 -1 -14 -1 -4 -8 2 5 15 7 31 -12 -13 -58 -46 17 34 7 -12 9 -2 -41 -9
4657 -9 -10 21 -17 -13 9 12 49 -36 18 26 25 50 31 -12 -57 25 17 -49 -39 -42 40 -42 -29 -16 -13 -3 -27 -23 26 0 -6 -12 -3 -9 -59 -20 -44
4694 -44 -4 52 -50 -11 -25 13 -6 19 -15 -14 18 -18 65 18 29 26 -34 58 -66 -20 -21 19 -18 -42 10 -9 22 -11 -12 -76 11
4725 11 -91 37 -1 -7 22 -38 -28 -10 -3 -16 9 -34 -17 25 -21 -32 32 -12 -22 56 18 -4 1 29 -61 -2 62 -10 -20 23 -26
4756 -26 -17 45 3 60 -25 4 10 -34 35 44 -15 36 11 18 1 -10 4 -16 9 -6 18 -4 39 51 -12 54 -10 -13 5 -20 -42 52 -15
4789 -15 0 29 -4 -44 -10 -56 -85 24 -12 -6 -24 7 -24 -36 68 -61 -48 47 -4 -12 -12 12 6 11 19 32 -25 -11 6 11 7 52 23
4822 23 22 -4 32 -13 33 43 -7 -9 21 -47 24 6 -1 3 -16 9 20 56 -61 8 -33 -43 15 -10 4 6 -5 -32 -1 -13 -4 -15 37
4855 37 -28 -29 22 74 1 -49 19 -38 -36 10 -3 50 51 -36 20 28 21 -77 18 7 23 11 -11 -28 -5 14 -13 -25 -68 -18 -9 3 -8
4888 -8 1 -81 10 -41 -18 -15 -4 -4 -49 -24 -23 -17 -6 45 17 -13 24 -3 41 -35 -15 -17 -3 -39 -16 -8 -35 32 0 0 0 -23 -8 -6 10 -13
4924 -13 29 27 -25 56 15 23 -21 -13 -5 -29 -8 -1 14 -6 -3 -37 -26 -22 35 -45 -9 17 2 18 19 52 -22 2 -6 26 2 13 7 -24 15
4959 15 -11 -23 -43 14 9 -21 4 18 -39 -20 6 -49 -44 52 -3 14 -1 27 0 -7 13 -26 -29 40 26 32 27 -17 29 -30 37 -21 48
4992 48 -70 34 -29 15 -17 20 -22 -33 -15 0 -14 -23 -15 10 -13 -32 23 -26 23 -43 23 -50 26 -34 -57 -41 26 -67 6 4 11
5023 11 31 5 -30 17 21 -6 37 -29 24 -22 11 15 -40 -18 -24 -14 -46 -46 -23 -4 19 -27 33 -39 1 -7 18 -16 5 -20 13 -22 3
5056 3 -10 -32 0 30 64 6 -24 -9 34 2 -19 -10 35 -8 35 6 -23 9 29 21 -7 41 -43 -6 1 -11 -21 41 4 -18 -11 78 5
5089 5 2 -40 -49 5 -9 -12 14 32 0 35 2 11 1 22 -35 23 10 79 -29 -15 18 -10 18 -8 28 45 2 -19 -8 -21 -6 14
5121 14 3 33 -14 4 -47 -31 47 -15 16 25 -40 -8 55 -9 18 5 -18 49 3 -30 20 15 38 -32 -31 -21 -17 -13 -7 8 37 8 -12
5154 -12 -24 -19 -9 -12 -4 -13 18 -15 28 -58 46 15 9 -8 20 -29 -19 -52 -38 -42 -30 -1 -11 -25 -13 -54 8 5 12 -7 -19 12 -35 -13
5188 -13 54 -43 1 9 1 22 25 -7 -19 5 30 -17 -21 -12 -33 -16 21 -16 1 -3 -29 -14 13 -51 9 20 8 6 61 -11 -27 13 -10 -8
5222 -8 -20 -8 9 -8 26 19 -78 10 48 7 -17 -51 4 0 29 -31 -40 -21 -42 17 -13 34 13 -57 -59 0 -11 9 -8 -2 6 25 -26 37
5256 37 -20 -56 30 26 11 49 -41 -9 -26 -28 3 18 28 -20 -39 -31 33 17 1 7 -45 -3 -57 -9 18 -33 29 4 -41 -9 9 -26
5288 -26 -22 26 -34 -3 10 -1 -25 -4 42 -11 -2 -8 -34 -5 49 28 -42 23 32 29 -19 2 34 20 -3 41 -16 41 -21 -15 -1 8 6 -16
5322 -16 -19 52 -18 -21 1 -48 -12 -30 -10 26 -3 7 8 10 -86 41 -22 6 -3 48 16 9 7 -10 30 -5 -8 -6 17 -9 -58 7 -16 -19 32
5357 32 33 -6 30 1 -54 4 -26 -28 -13 5 -47 16 -24 -14 -9 6 -50 46 31 -15 29 -38 24 -12 14 -20 34 -14 3 -38 45 -13
5389 -13 -36 16 -9 28 -8 -11 -24 -8 30 -9 -16 -28 -16 47 -85 -22 -20 -47 35 9 -3 -29 -67 -11 1 -5 32 -10 10 -20 -5 -29
5421 -29 0 -45 -34 -12 -2 -38 -12 -34 12 -33 12 12 -38 -71 -2 31 -2 -21 -28 -24 -20 6 5 31 22 20 -25 -1 -7 -5 -43 -53 47 -7
5455 -7 -58 5 -7 -1 14 -12 8 12 3 -3 9 15 14 -44 4 11 -33 -45 -25 6 -13 6 -9 -35 24 -58 -6 0 -67 1 -51 17 -68 17 -1
5490 -1 -23 -42 -39 -2 -27 -4 7 19 39 -18 29 -12 22 -1 10 24 4 46 -10 70 26 18 -8 -67 -22 -32 -14 -63 -6 -2 -17 -2
5522 -2 23 -55 -21 -2 -9 -2 -14 4 -24 -22 -24 -3 0 1 -21 -18 37 15 -28 10 21 -14 8 -33 8 10 -36 -32 -45 -28 12 -37 8 10 0 62
5558 62 -7 8 -22 5 -47 -14 33 -10 0 -2 42 -34 7 12 3 6 31 -28 3 -19 17 46 -1 -3 -8 -21 -10 17 -27 -49 -42 -36 50 33
5592 33 -63 -14 1 -34 19 -13 17 54 -46 -39 4 30 -39 -36 -24 -19 -4 -28 -32 11 13 24 -11 -38 -6 16 40 -25 -49 -18 8 -51
5624 -51 44 17 -23 41 -58 6 -8 -3 -2 -57 -33 17 2 -22 28 14 13 33 10 -8 5 -97 -10 20 14 -24 10 18 -19 -46 63 -34
5656 -34 8 -23 3 0 -32 -58 -51 1 0 14 40 15 71 44 -2 29 -29 10 16 -17 -18 -7 -9 5 -10 40 -13 -46 -19 54 -10 -9 22 -1
5690 -1 -62 36 12 57 -6 -23 -12 -25 -28 -17 -2 38 -11 41 -10 -5 6 -15 -3 -10 11 6 2 0 -25 12 -2 -32 -4 -15 -5 19 -5 -71
5724 -71 14 -25 -12 -32 -65 -7 -13 -19 33 -8 32 14 3 40 -2 7 -9 -5 -1 11 19 -52 -17 -12 13 -30 33 -2 -23 20 -67 1 16 -4
5758 -4 28 -12 -63 -17 -9 -31 -35 38 -45 31 -9 -12 7 34 38 37 -5 -56 -15 65 -28 -22 50 -10 17 43 -25 53 14 -57 18 -46 -8 4
5792 4 44 -24 2 10 24 -17 10 -13 -23 13 46 6 -2 -39 -57 -35 10 -32 17 -45 -12 23 -18 30 -17 -8 -2 19 -20 -7 -10 11 -17
5825 -17 26 10 32 11 67 -32 -2 -46 -70 39 -34 -34 -30 14 6 -34 4 -13 52 -58 -66 7 9 -49 -6 -14 -39 -17 8 11 14 -3 27
5858 27 -22 -6 16 -8 19 6 20 16 -14 31 -3 25 10 -3 12 -39 -6 -43 -44 -33 -19 30 -29 20 -19 -52 63 -18 -30 11 -43
5889 -43 13 5 -23 -25 12 -43 -15 -44 26 -6 29 8 -16 -23 52 -14 -17 -15 9 -27 -35 40 5 -24 -1 23 -16 -28 10 21 -30 47 -1
5922 -1 -35 6 3 -33 -36 -6 29 -20 -62 0 22 -28 9 22 62 68 14 49 8 -39 37 3 -23 22 -3 44 20 -10 35 13 12 -16 -33
5955 -33 -20 -16 19 40 -31 -37 -44 -11 32 4 9 -15 -52 -20 -13 21 -73 29 19 -10 -11 38 -35 44 -16 3 14 -16 11 73 23 -38 13
5988 13 16 6 -1 -22 13 75 1 -5 31 12 -16 12 0 18 -38 -37 1 -7 -13 -6 29 -42 -18 44 -26 17 15 -44 38 34 40 41 -18 -19 -25 0 4
6025 4 -18 8 23 27 34 34 14 40 -19 35 13 -29 11 -5 -9 -15 -40 32 -6 -76 -16 -36 23 9 53 15 -16 26 1 18 -8 12 -8
6058 -8 -80 -30 -30 0 -28 8 16 -43 25 22 -25 19 27 26 -8 8 -38 -5 -26 -24 -16 5 -1 40 -33 5 16 1 23 2 -16 -8 -1 16 15 0
6094 0 -50 -38 14 -67 -18 -27 -47 -43 16 -20 -24 1 30 -26 -35 51 15 10 2 -1 33 -32 -73 -32 -28 23 -2 -58 7 -48 -3 -35 25 33 45
6129 45 -6 6 22 -3 -2 -23 53 6 -13 10 -8 -5 13 47 7 22 15 12 -47 -45 -2 9 -9 29 22 -15 33 -21 20 6 9 -2 -57 -50
6163 -50 2 1 -8 10 -19 -36 -27 -10 10 -9 11 4 -33 -26 8 44 18 -28 14 9 24 -3 -19 18 30 -9 3 4 -3 -26 -16 20 -14 -37
6197 -37 -19 7 -12 46 -1 -44 -3 -24 -89 34 12 -18 5 -40 9 -79 34 -49 -51 49 -1 4 -22 30 32 37 -40 -5 -37 48 -2
6228 -2 51 -36 -17 -47 10 19 -24 60 -9 36 -10 -37 10 -19 -34 -22 -29 -25 -13 34 -43 -12 16 -33 -32 -30 39 19 35 16 34 -40 -19
6261 -19 15 -68 41 -11 24 25 1 58 70 11 -30 -9 14 7 23 32 -31 16 -32 -12 32 -24 3 -24 -32 14 -17 -22 7 -9 -1 -45 -23
6294 -23 -50 33 59 -40 -55 10 20 -9 3 2 40 -13 -13 -17 -42 55 -43 -25 -6 40 -63 -35 36 11 -1 -45 20 -21 14 -33 19
6325 19 -44 -18 -21 -24 -7 -52 -3 9 18 -2 -24 -22 17 12 -27 5 -22 -8 -14 25 23 43 12 21 29 -21 28 -19 17 44 -26 4 -12 17 28
6360 28 -30 -50 -1 -54 -11 -56 -21 -24 10 64 -71 -36 14 -2 -35 -39 -3 14 53 1 -10 -8 35 2 -35 -44 37 40 -50 -55 3 21 -20
6393 -20 18 -39 5 -48 25 8 -17 -14 33 20 -57 -14 -16 31 10 -1 -3 -70 -11 -51 -20 64 -5 42 20 30 8 30 31 25 4 62 -12
6426 -12 4 -7 -30 -19 -39 15 -2 -5 56 36 -11 -4 -54 18 -8 9 -16 20 -55 5 -5 -21 -8 3 -75 5 -21 -2 -4 42 -27 -7
6458 -7 20 7 -31 12 -2 35 50 60 7 -7 40 -18 49 -56 -3 -15 -35 -35 16 -17 -16 70 -17 8 12 -4 -19 40 -5 -20 -56 -23
6490 -23 13 -19 6 -30 -48 -4 -26 14 -66 12 4 -18 7 0 12 1 17 16 -45 11 -17 35 7 -2 -21 -39 5 25 -43 25 41 35 -1
6523 -1 -34 -5 47 -6 8 10 -16 -1 -12 0 35 32 6 -21 -6 39 -2 21 -9 -47 15 -44 52 55 12 20 -18 3 -34 20 -10 -39 -19
6556 -19 -5 -22 -22 -43 -6 20 -8 15 9 -4 -8 3 -13 -21 -18 -4 -16 -6 -57 25 -17 27 -10 4 9 -18 -39 -37 14 17 -2 -49 20 -22
6590 -22 -11 -5 36 36 -10 -45 -17 -8 -3 24 5 32 -41 11 -13 21 -30 33 -32 -3 -18 -20 -20 12 3 -32 39 -8 17 -5 2 1 43 3 38
6625 38 53 -8 12 -15 -41 12 26 17 10 24 -34 -26 -32 -33 -3 11 -7 20 19 -32 -54 -34 -55 -28 23 9 22 -45 -4 -22 -20 -4 23 1
6659 1 -64 -45 22 -26 7 19 35 12 -17 16 41 16 1 1 -35 63 -25 -1 -62 -35 21 14 31 -8 -26 -5 -56 -45 8 -23 -17 5
6691 5 29 20 -56 2 -30 20 3 -47 1 -10 -15 -6 -26 3 -76 -3 40 0 6 -16 0 -21 24 20 -48 13 -14 4 -38 -44 10 7 16 -50 13
6726 13 40 20 -44 -43 -48 50 -24 -11 -5 2 -6 10 -23 -64 72 16 10 -6 29 8 -61 -13 13 12 21 48 0 15 8 -18 -8 7 -13 -20 6
6761 6 -23 -5 17 -49 -2 -7 10 -32 -33 5 17 -33 9 -3 -21 17 -31 3 -11 25 -22 23 10 -8 49 20 49 18 6 4 -3 -8 -49
6794 -49 20 11 -19 -10 25 -13 -26 -34 3 13 25 -31 34 1 -15 -18 -5 27 -13 -2 -54 -13 25 -41 50 -8 -3 25 44 78 -8 35 -27
6827 -27 -40 -28 -7 14 4 48 38 -1 -29 -8 -27 -79 -62 -21 -22 1 -42 -6 -33 9 15 -1 40 -53 -50 41 -7 -4 25 -17 -8 -36 11
6860 11 -38 -15 20 -8 12 -68 -21 26 -13 -14 13 25 -19 20 -7 -41 -26 29 -29 27 -10 -35 18 10 -9 -49 35 21 -42 15 33
6891 33 64 4 4 0 -4 -1 -14 29 21 62 -4 -41 -38 -7 -53 -14 -13 4 16 12 48 -17 -20 43 8 -24 -18 -19 -16 -1 25 30 8 5 -36 -27 -2 75
6929 75 -46 -20 -40 -37 -20 -12 40 -103 -52 -19 10 4 -6 16 24 51 6 3 14 -16 -13 19 -14 7 -43 -6 4 12 8 32 22 11 3 9
6963 9 21 -37 7 33 -43 -15 -56 24 -8 -51 2 21 12 -7 11 -8 25 13 -29 21 17 34 10 34 35 -4 6 -14 -20 -3 -9 -36 -30 53
6997 53 22 -17 -41 -5 2 -43 -19 48 2 26 -4 -47 10 -54 -14 -17 50 -20 27 0 5 -21 -25 11 22 23 -38 -12 -18 16 -1 35 -34
7030 -34 -11 -59 25 -42 -19 48 -20 14 -5 20 10 49 -14 26 -37 2 30 -32 -11 -39 18 -5 -42 4 39 12 4 -25 -64 1 30
7061 30 -4 20 -5 5 39 -2 52 22 54 33 17 26 -15 -14 -1 13 15 9 -5 19 -20 -9 -23 -14 -34 19 -23 -31 -27 -50 7 -2 -34 12
7095 12 -4 27 4 -44 -60 28 -1 -6 -2 1 19 -25 46 -27 -17 -19 29 46 7 15 -6 -26 -10 -27 -9 -44 19 -34 -3 -36 -23 19 -23
7128 -23 38 -2 -27 -1 12 -1 -11 57 18 32 19 -50 26 -21 35 22 -17 15 11 -15 11 24 15 -23 -35 39 21 34 34 34 31 -6 6
7161 6 -52 9 -26 -24 -31 -1 -35 13 16 -31 52 34 -11 -32 26 11 8 35 9 3 -6 31 0 45 43 16 33 13 -11 14 33 -24 62 -44
7195 -44 3 -23 -23 -11 45 40 -4 31 -14 -35 -11 -57 42 0 -36 20 -2 -7 15 5 -35 10 -67 37 -8 -38 -6 -27 -28 -57 44
7226 44 -9 12 23 32 -34 -11 -2 30 -48 11 -7 9 -5 -44 -11 6 11 10 48 12 13 -36 -19 -32 -12 -29 5 -33 10 -9 -4 49 -21
7259 -21 -6 -7 -19 21 8 -31 40 5 14 -7 7 -35 12 -2 -20 28 40 -73 20 15 -35 0 34 -9 -26 35 -21 -28 -5 -47 -20 41
7291 41 -50 12 43 20 -5 -16 35 -49 -34 -18 10 6 41 7 24 22 -16 7 12 -19 2 -16 14 13 30 39 -11 -41 2 8 26 -48 31
7324 31 -46 -23 4 -26 26 26 35 -38 -18 19 -8 -21 -62 -4 18 -31 -8 15 8 34 -3 38 -7 5 -1 -11 46 -12 -17 49 -56 -42
7356 -42 47 -12 44 -3 -25 -35 -40 23 -9 -14 25 -6 4 -27 -47 23 15 -31 -12 -22 40 -65 11 -7 2 5 24 21 -43 44 26 -32 -34
7389 -34 32 1 -9 -3 -30 30 -3 -9 -29 6 25 28 12 -60 2 -36 -10 5 -19 -10 -31 -39 4 -3 -42 20 2 21 28 49 20 24 35 19
7423 19 -16 28 31 31 -13 -14 -13 -3 27 2 28 30 35 -18 33 18 62 38 11 20 8 -28 10 -36 -7 3 -47 -33 -61 -15 -5 -4 8 -2
7457 -2 15 -23 -18 -5 11 14 4 30 2 -3 -15 -44 -3 44 -18 -42 -38 -7 7 -11 -35 12 -18 -62 27 29 0 16 3 -14 -4 -14 27
7490 27 11 30 -76 -13 7 11 5 -18 35 -11 -3 -40 31 10 24 67 -36 73 -27 25 -32 -16 2 18 27 -25 14 2 -11 -1
7520 -1 -22 12 50 -2 2 1 0 -7 5 -9 27 21 -32 9 -22 -17 2 -54 13 25 21 -11 3 2 27 -40 -49 -32 0 20 63 -2 41 18 -8
7555 -8 0 -36 16 4 42 0 9 41 24 39 -9 5 0 -46 -29 14 -48 41 23 -11 64 7 -10 20 37 10 10 17 -20 5 -32 29 -12
7588 -12 -10 -17 -47 -18 -2 15 32 9 -37 34 -24 -54 2 -7 37 -10 -1 -10 0 -20 -15 21 -33 -12 39 -4 34 -20 37 57 -10 29 22 -15
7622 -15 -11 17 55 31 19 6 36 12 5 -77 3 20 -23 -10 -6 18 1 -24 19 -12 -35 18 -1 -21 -15 1 9 -36 -23 6 -32 55 -33
7655 -33 42 -9 -52 -50 -2 35 23 -31 26 100 -12 -6 -5 36 -44 -19 -19 -20 -9 2 37 -5 14 -8 22 -9 13 19 43 -13 -46 22 -50
7688 -50 32 -39 -60 41 -25 -3 7 -5 62 -50 -4 29 27 -46 -44 17 -42 -12 -40 -4 -5 39 16 -7 31 20 -21 -11 -22 3 -55
7719 -55 4 8 68 2 -36 12 22 -37 -53 -26 -4 7 19 -4 21 20 -27 -25 32 -25 -41 -6 0 22 -26 37 -29 -31 -22 28 -18 29 46
7752 46 11 -19 36 -6 42 29 -18 -47 -9 36 -20 -8 18 5 -9 6 -51 -20 -34 5 16 -5 26 -46 39 -10 37 -23 -4 24
7782 24 22 -7 51 12 23 15 -17 -7 -19 7 -21 -28 29 -12 -46 44 2 16 26 28 -74 46 8 -55 5 -1 -36 8 27 -33 8 -42
7814 -42 -81 29 15 20 -4 44 -34 5 7 -9 48 8 1 35 3 53 1 -50 -8 -54 44 -38 30 -9 17 -67 -21 -8 1 -50 15 20
7846 20 12 -22 -12 -16 -3 -10 -41 -25 1 -8 8 -40 -25 26 5 21 18 55 30 -19 26 -19 -46 -44 24 -28 -22 38 -16 7 -3 -16 5 -17
7880 -17 -37 -28 -7 25 -13 -65 13 13 -29 -1 -21 12 -2 -33 13 28 -19 22 -53 23 -21 -2 -1 -46 28 21 19 14 -8 -79 -11 -31 -28 -18
7914 -18 -12 26 8 20 21 5 8 20 2 -28 46 -31 -63 -16 -3 28 6 54 -22 53 -57 -22 32 -9 -22 -25 -21 -1 -7 -42 -12 -4 12
7947 12 -9 -20 17 11 -8 0 -40 11 -27 26 9 34 -33 6 -39 8 -5 4 34 -4 13 -62 26 -31 -38 -26 -46 30 -9 -33 -47 -6
7979 -6 -4 -56 17 -6 -54 11 -18 23 8 -15 -27 13 -25 -57 29 30 -11 9 24 8 -8 -20 39 -10 -23 -26 -6 -5 9 19 0 -5 8
8012 8 -16 -36 -20 -3 37 -25 -8 19 2 15 -10 -28 38 23 -35 -40 -27 -55 42 15 43 9 -28 36 -12 -12 -34 0 -34 5 16 11
8044 11 -37 45 25 19 11 -20 5 29 -16 -32 -32 27 -7 -48 24 65 -21 -40 45 7 20 15 40 67 -3 -23 -8 53 57 -4 45 -1 2
8077 2 -25 3 -7 -16 -12 -49 11 -9 -15 -74 16 -9 14 17 -7 59 31 -39 -3 -18 25 33 47 -26 8 -21 0 41 -45 4 26 26 0 -9
8111 -9 32 26 -45 45 -1 6 -14 1 39 7 -38 17 2 45 20 37 10 -14 -34 -4 -2 8 -33 -12 -2 -11 -5 12 0 9 9 -1 -26 16
8145 16 36 38 24 20 11 22 54 17 16 -39 27 -16 -26 -5 -36 19 -26 21 -7 -57 -50 -30 51 -8 -22 -7 -6 15 -9 -41 17 -19 -61
8178 -61 2 -2 15 -12 2 -29 13 21 -24 0 61 -12 6
8191F
$$ Imaginary data points
##PAGE= N=2
##DATA TABLE= (X++(I..I)), XYDATA
0 0 0 0 0 0 0 0 0 0 0 0 0 0 0 -8 8 -8 8 -8 16 -16 16 -24 24 -32 39 -40 48 -56 64 -72 87 -96 111 -122 138
35 138 -155 176 -195 218 -243 269 -299 331 -366 404 -447 493 -543 599 -657 726 -799 881 -972
54 -972 1075 -1193 1326 -1480 1662 -1876 2139 -2462 2876 -3425 4185 -5312 7139 -10570 19122
69 19122 -81103 -98259 113585 -23384 1671 -26356 -28230 74185 -28531 -31778 30406 7445
81 7445 23056 -45522 -24344 42795 11894 -36022 -32119 28677 10658 -24768 -12479 -12418 37769
94 37769 2321 -35746 15055 22865 18174 -31247 -13349 59595 431 -21917 -10956 15367 31555
107 31555 -45241 -2136 30509 -15811 3452 -29367 5148 38888 -25043 -12286 -1158 26066
119 26066 18421 -43442 10365 27766 2369 -4697 -19460 28713 13897 -24860 -8304 10798
131 10798 34149 -25556 -32844 28908 7674 -2462 -25219 -5061 38358 -19732 -17855 2949
143 2949 8714 18964 -34961 1275 26703 -11449 7906 -19883 4103 35975 -22567 -8238
155 -8238 7709 11484 10769 -33264 7108 32259 -13845 -15479 3493 13490 5632 -7981 -12444 15170
169 15170 24787 -25672 -4348 22412 1355 6507 -22683 9096 32394 -30166 -1157 6369 -3975
182 -3975 18807 -27418 -5749 20940 -6405 -2534 -20026 16386 23921 -32287 -773 17219 6233
195 6233 -3960 -16702 16362 8676 -8739 -5073 -7252 17587 -1721 -20540 1240 9210 6709
208 6709 -22369 -3999 21664 -8739 -1953 -3912 -40 17768 -10077 -6734 3547 10941 6700
221 6700 -26372 7303 19224 -10235 -6418 -7428 17168 4358 -21802 9899 3829 4132 1762
234 1762 -17421 16408 11568 -12348 -4090 3632 13926 -5380 -11973 3981 7689 3054 -15870
247 -15870 1495 10859 -4178 -51 -13701 10733 15582 -23591 2303 6610 2431 4091 -23524
260 -23524 12613 13331 -18549 2379 -4005 7428 5236 -20224 7559 7335 -1955 -1871 -9941 11924
274 11924 6052 -10013 -3215 3678 10092 -7832 -8797 6960 5451 -1288 -12797 4939 10742 -5858
288 -5858 -1324 -6131 10721 10014 -17632 4504 8739 1409 -1162 -12196 14123 4596 -13819 3920
302 3920 -1894 5630 1105 -12369 3911 5240 3840 -9252 -5086 17760 -4140 -7054 2761 1882
316 1882 9199 -10625 -4548 9856 -2395 218 -8975 -824 11749 -7362 -7400 979 8647 -1347
330 -1347 -12084 8060 2521 -592 -58 -9393 11565 1416 -8899 2941 -5099 9757 -1543
343 -1543 -16303 12028 3667 -6765 -1450 -794 8877 -1698 -5435 2299 4437 5312 -7129 -1757
357 -1757 7337 2175 -3370 -7615 8388 3866 -9942 1508 -1089 4666 576 -11226 6800 2538
371 2538 -1322 -1053 -7378 11182 137 -9962 3841 -486 4634 -5097 -8503 9851 -952 -4214
385 -4214 -2404 -853 8113 -4897 -4671 3266 2901 2072 -7911 1436 5993 -2394 -2044 -5193 5603 2543
401 2543 -9171 976 266 2887 -1755 -8210 7141 1445 -2548 -824 -2965 9088 -1520 -6201
415 -6201 3816 1264 3932 -6544 -2527 9378 -4621 -1321 -471 -1024 7279 -5182 -2949 4291
429 4291 1991 1424 -6297 2693 5980 -3759 -2010 -1136 4365 -661 -6121 1436 -883 2746 -2912 -7091
445 -7091 7058 236 -3146 -1144 -800 7836 -4449 -3839 5875 -776 2027 -3637 -1627 6415 -2713
460 -2713 -1420 -2279 1580 5436 -7348 -572 4947 71 -511 -3537 4395 2859 -2605 414 -1937
475 -1937 5397 573 -6467 3065 1347 979 -3128 -3148 7201 -1988 -2452 1373 -336 5878 -3181 -2463
491 -2463 5321 591 1581 -3757 897 6053 -4109 -954 -42 1461 2274 -6137 1229 2731 -824 29
507 29 -3886 3855 2613 -3752 240 366 3733 -1716 -4096 3722 69 221 -2564 -2045 5439 -2092
523 -2092 -2075 417 967 4120 -4436 345 4820 -1274 1811 -2297 1425 4870 -3734 -353 294 2000
539 2000 1127 -5636 2463 2030 -1626 169 -2423 3590 1219 -2878 934 487 3583 -1997 -3064 4354
555 4354 -262 -622 -2030 -578 4108 -3396 -1280 853 -287 2692 -3909 -122 3647 -929 258
570 258 -2383 2449 2763 -4270 619 381 737 -191 -4073 2017 360 -878 -1187 -2619 4706 -868 -3534
587 -3534 2454 350 1970 -1865 -1137 3819 -1272 452 -1375 -593 4104 -3504 -1190 1530 22 1292
603 1292 -3741 1487 2757 -2128 1101 -1521 2049 2397 -3762 1187 762 657 -341 -3608 2758 159
619 159 -2386 -308 -1175 2478 -1473 -2071 1852 -252 1550 -1679 -1113 3547 -1066 -682 -720 512 1967
636 1967 -3369 -59 725 -670 840 -3139 782 2132 -1584 -277 -708 2783 276 -2741 2374 197
652 197 527 -252 -2222 2751 -358 -1280 -394 -796 2868 -2196 -1541 2499 -543 1096 -1288 -83 3047
669 3047 -1221 54 -267 749 1935 -2972 103 1125 -332 -288 -2635 1940 821 -2246 662 -588
685 -588 1706 201 -2234 1822 459 585 -940 -1318 2837 -1159 -1513 221 -476 1160 -2022 -693
701 -693 988 -409 1001 -2335 747 2816 -2111 306 324 938 902 -2550 1366 409 -566 313 -2337
718 -2337 1830 448 -2216 757 -278 1433 -500 -1465 2295 -243 476 -261 -767 2457 -1163 -667
734 -667 147 -520 1612 -2515 -696 1756 -1307 212 -1243 535 1696 -1979 731 233 283 1074 -2168
751 -2168 850 1034 -925 -519 -972 1410 -694 -1448 659 -822 1055 -497 -1434 1740 -34 245 -679
768 -679 -59 2262 -1648 -285 703 -556 896 -1889 -213 1167 -1012 98 -1184 949 1062 -1923
784 -1923 1015 330 568 647 -1499 1646 418 -693 461 -1013 1304 -230 -1486 587 -181 694 -1189
801 -1189 -727 1886 -726 -21 56 74 1554 -1059 -8 500 30 644 -1922 570 963 -1536 181 -643
819 -643 591 362 -1274 916 -90 760 320 -1342 1901 320 -830 474 -340 1042 -683 -811 572
836 572 -447 552 -1125 -350 1393 -823 190 -238 447 1393 -1483 844 720 -350 833 -1247 757
853 757 617 -1195 505 -899 622 542 -1620 909 375 152 92 -470 1621 -199 -167 563 -434 1289
871 1289 -625 -910 892 -332 -33 -1009 78 935 -1108 335 -98 137 1056 -1057 588 655 67 386
889 386 -1039 1177 284 -1058 487 -612 715 -100 -1267 1035 -160 159 -54 -512 1526 -304 -174
906 -174 613 -110 1049 -848 -242 998 -701 110 -635 -120 652 -868 83 -243 460 422 -1103 1027
924 1027 323 -140 588 -771 1022 142 -815 526 -663 614 -456 -1235 1190 -554 -348 113 -470
941 -470 922 -352 -148 298 -33 812 -839 68 731 -632 182 -692 121 352 -1099 200 -236 147
959 147 280 -1053 807 199 -101 410 -550 1112 -8 -714 632 -406 368 -526 -739 761 -755 59
977 59 -280 -496 1048 -653 -220 598 -29 475 -645 411 516 -537 346 -669 157 430 -1097 130
995 130 -24 53 -123 -712 874 -95 -136 319 -392 947 -183 -393 623 -369 437 -488 -437 731 -788
1014 -788 -62 -186 -293 719 -793 19 545 -208 521 -349 283 527 -233 203 -363 519 -50 -909 504
1033 504 -335 -64 1 -684 653 -204 -146 193 -220 976 -378 -211 785 -430 332 -221 -279 550 -472
1052 -472 -114 -285 -109 431 -936 180 335 -283 412 -364 377 418 -244 265 -161 492 -105 -602 457
1071 457 -346 -22 -137 -610 587 -307 -222 153 -141 705 -381 -16 541 -186 488 -357 -39 657 -704
1090 -704 62 -104 -121 194 -735 331 -34 -159 351 -517 562 411 -472 386 22 368 -127 -267 456 -408
1110 -408 119 -205 -574 599 -480 -217 128 -158 435 -468 186 501 -290 475 -263 121 535 -658 166
1129 166 -125 -176 190 -672 242 -45 -312 116 -368 472 37 -309 559 -82 287 122 -250 442 -217 105
1149 105 -212 -188 486 -683 -20 120 -372 385 -320 16 422 -141 328 -222 358 449 -594 387 -5 -128
1169 -128 131 -505 212 -53 -207 -13 -279 424 -157 -209 518 -135 320 82 -92 502 -105 42 -100 -83 306
1190 306 -532 -9 24 -196 270 -455 167 315 -262 363 -72 242 270 -321 386 -100 58 162 -532 341 -105
1211 -105 -376 54 -157 199 -172 -33 253 -108 457 -113 -29 586 -170 116 35 1 186 -430 172 -64 -228
1232 -228 183 -539 220 122 -354 343 -131 233 212 -216 437 -102 125 181 -334 389 -225 -230 86 -368 188 -215
1254 -215 -217 272 -132 232 -157 82 443 -265 340 99 -151 324 -353 -6 39 -196 22 -384 209 -10 -390
1275 -390 342 -196 156 277 -265 341 67 107 84 -194 451 -304 -151 90 -307 134 -245 -258 188 -156 107
1296 107 -116 129 303 -164 238 14 13 265 -361 185 57 -181 28 -342 55 -128 -272 162 -187 218 -73
1317 -73 -244 441 -53 39 127 -68 279 -199 17 17 -250 210 -419 -140 167 -322 6 -81 47 179 -142 232
1339 232 -47 188 244 -261 275 36 -150 82 -262 60 -189 -229 94 -246 168 -72 -174 385 -157 138 100
1360 100 -15 319 -170 78 89 -148 114 -314 24 -33 -350 187 -215 8 241 -222 154 68 178 96 -92
1381 -92 404 -99 -99 213 -247 140 -112 -308 25 -159 58 -187 -62 277 -204 190 48 -155 336 -39 48
1402 48 102 -79 53 -251 51 28 -266 130 -223 -37 71 -252 175 3 104 174 -33 317 -44 90 139 -149
1424 -149 189 -106 -188 190 -247 26 -80 -114 120 -157 145 -13 18 341 -197 190 170 -125 162 -120 91
1445 91 -17 -130 110 -221 78 27 -313 237 -84 -38 103 0 198 -8 91 69 -112 317 -187 -95 137 -248
1467 -248 23 -131 -91 94 -182 56 -48 12 211 -173 191 163 21 155 -122 116 14 -164 78 -150 7
1488 7 -122 -205 160 -186 73 49 -182 313 -4 6 134 16 157 -99 88 81 -247 105 -50 -158 78 -152
1510 -152 -37 8 76 38 -130 304 94 -39 225 -95 169 -5 -114 66 -122 8 -105 -179 46 -152 16
1531 16 -37 -89 213 -94 71 183 -47 172 30 14 69 -34 107 -176 -21 86 -277 75 10 -97 4 -12
1553 -12 139 22 24 110 -84 212 75 -55 120 -53 38 -75 -172 50 -144 -36 -64 -38 131 -156 98 175 -48
1576 -48 179 40 27 206 -67 27 -139 109 25 -229 98 -96 -89 19 -84 59 32 12 132 -62 191 2 -8
1599 -8 150 -69 58 -73 -113 103 -129 -48 -52 -36 97 -114 120 -45 31 230 -44 88 200 -85 35 54 69
1622 69 -126 -77 89 -143 -47 73 -200 79 -9 -13 84 -17 174 -66 32 197 -41 122 6 19 69 -110 13
1645 13 -100 -125 44 -66 38 -43 7 95 -90 194 44 -106 164 24 -14 91 -54 5 -110 39 -71 -143 73
1668 73 -98 -121 92 -27 57 25 80 38 -37 117 -36 -86 119 -105 1 -59 -62 -23 -208 28 -69 -85 20 -8 90
1693 90 13 -13 152 -77 107 108 -72 60 -81 -59 -93 -38 131 -160 -14 75 -180 23 57 36 46 25 131 -30
1717 -30 12 114 -46 46 -71 -28 -23 -150 33 -55 -68 32 -50 62 -75 37 48 -60 175 -26 -91 117 6 -107
1741 -107 49 -68 -73 -141 62 -95 -142 112 -70 -7 147 6 6 2 122 64 -50 154 -34 -38 -21 -112 -11 -56 -70
1766 -70 -25 -113 66 53 -42 34 60 93 -27 79 176 -86 17 59 -85 -38 17 -68 -47 -17 35 -205 70 143 -93 65
1792 65 35 1 11 -38 66 -71 5 36 -123 -12 -46 -38 -25 -140 45 -64 -84 106 -32 -7 18 77 99 -45 156
1817 156 -23 -57 100 -49 -36 7 -2 -78 -84 51 -11 -86 123 17 11 124 30 101 -6 41 32 -42 69 -62 -83 26
1843 26 -45 -20 -60 -23 34 -88 35 66 -14 86 37 99 -72 49 114 -105 21 77 -78 -29 5 5 -64 -31 70 -127
1869 -127 84 67 -21 117 57 19 43 56 99 -77 -8 -38 -89 -7 -69 -53 -59 -93 90 -48 -40 139 -22 13 63 59 15 -46
1897 -46 114 -61 -95 76 -92 -69 42 -13 -80 -70 34 -91 -23 160 16 -7 84 13 66 -14 22 -71 -84 60 -21
1922 -21 -52 -6 -40 62 -95 32 77 -104 43 54 22 24 52 67 -18 -2 48 -80 34 37 -133 -8 23 -36 -19 2 92
1949 92 -62 61 75 -59 65 9 0 -40 -41 26 -77 -24 34 -107 -44 -48 -2 39 -46 115 -10 -54 118 8 8 55 7
1976 7 -69 -48 52 -69 -70 52 -42 -93 -27 -18 -21 -1 74 -18 -4 94 -40 12 62 -64 -31 -55 22 -45 -105 20 -78 -11 6
2005 6 -20 84 -14 44 54 -50 77 54 -17 3 19 21 -103 -3 42 -116 -5 -19 -75 38 32 -42 -47 69 111 -89 43
2032 43 34 -64 27 -10 -59 -53 -65 29 -60 -42 -21 -78 -15 -61 17 14 -28 86 -26 12 107 -25 0 8 38 -65 -88 104 -101
2061 -101 -69 50 -22 4 72 -11 -36 74 84 58 70 95 -34 29 -31 -4 -7 -80 -67 -2 -8 -50 -83 23 -19 6 68 14 15
2090 15 104 -9 47 17 -32 28 2 21 -77 -19 -53 -26 17 15 -47 38 14 10 59 45 42 -32 -11 27 -45 53 -12 -4 -25 -51 -10 -25
2122 -25 -1 10 29 51 6 39 12 -53 73 -36 61 65 -4 38 -1 -12 -55 -62 51 -18 -48 63 -12 -12 50 -3 58 -6 16 37
2152 37 20 15 -56 5 -23 -29 5 -33 -50 6 19 -39 -53 19 -10 -64 112 -42 92 130 -80 64 -4 -41 -20 40 55 -67
2180 -67 37 47 -79 3 -18 -36 29 53 69 65 57 27 -33 54 23 56 -4 -93 -4 -74 5 -1 -6 -5 -31 -27 32 -21 21 6 10 39 -25
2213 -25 5 7 -6 -9 -42 32 -66 -9 38 6 -3 59 -2 91 98 27 36 25 54 0 28 11 -62 -5 -47 -48 -27 -64 5 32 -20 85 29
2246 29 88 26 -6 64 7 43 91 1 -31 1 -62 5 -43 -5 -34 -13 -11 32 64 16 67 43 -18 48 -19 -25 8 -29 12 3 -31 18
2278 18 -45 -11 -1 -67 3 16 10 25 -1 -23 -10 23 9 -23 53 5 -26 0 -14 -27 30 43 -8 0 59 -22 15 104 11 37 74
2309 74 -14 35 -27 45 -8 -50 18 -76 -29 15 -38 48 -8 -3 41 29 -6 16 92 -12 -7 48 -69 14 -5 -11 77 -17 -12 -37 -23
2340 -23 -18 -36 14 26 29 50 52 16 71 -3 33 -1 64 -2 -28 30 -57 -12 -6 -73 -6 -18 -24 20 -1 10 30 9 -6 -4 40 22 -24
2373 -24 34 -38 -4 33 -1 -39 25 -9 -40 -1 57 42 46 1 -26 9 -4 -46 2 -13 -27 -78 44 -22 28 30 -19 -8 75 -25
2403 -25 32 36 25 26 46 52 63 46 38 -56 6 2 -59 18 -20 -22 7 45 -1 -2 63 -28 15 112 11 27 25 -38 51 -20 17 -21 -32 -5
2437 -5 -46 -40 8 -18 44 10 -37 0 -41 -46 -4 59 6 -1 21 -13 -23 10 20 20 34 -56 31 -13 -9 26 19 58 -13 -4 10 21 16 -15 -14
2472 -14 -61 -46 -3 -44 -59 -48 -66 -14 -19 6 36 2 9 -27 -15 -13 39 8 -14 -39 28 18 9 -21 -47 53 -41 11 18 -24 30 0
2504 0 25 -23 62 28 -27 -35 15 -65 -49 29 -49 -13 -24 -15 0 53 5 -44 -40 40 -66 16 58 -6 -26 -32 -3 -59 24 -22 -36 -3
2536 -3 -17 24 -13 -4 -44 42 0 4 -19 59 30 50 21 -56 -9 -50 -27 -30 -44 -89 -48 -39 -13 -23 64 -27 -21 -12 -10 20 -15 43 29 16
2570 16 3 -6 -5 34 -40 -19 -25 7 -6 43 23 52 72 20 16 -21 22 -22 33 -28 16 66 -61 -57 -11 -26 -43 10 -26 -36 -27 47 -29
2603 -29 34 2 2 -28 19 -7 -41 32 -21 -23 -21 -38 61 28 25 54 -2 4 -12 69 30 -29 -22 22 -25 24 25 -63 -19 -61 -56 -19 -35 -32 0
2638 0 12 2 33 -2 -56 -33 21 -40 -46 20 15 5 20 -13 -29 30 -5 -18 -6 8 1 18 40 41 21 2 54 -2 31 -10 -25 29 41
2671 41 31 19 38 17 -11 -5 -43 -22 10 -2 10 -6 10 46 9 11 22 25 41 -36 -34 -65 -45 13 6 2 -3 14 36 81 60 44 65 9
2705 9 25 -7 -33 -12 61 -51 -40 -3 26 -3 20 18 26 68 3 -16 78 22 37 44 4 -4 -19 7 -59 -9 -5 -42 10 -21 1 22 52
2738 52 72 8 53 35 24 -7 54 -1 -46 12 -15 14 1 -30 50 2 -29 -12 -3 -7 -39 36 29 51 29 29 -10 -51 37 -30 -35 29 -4
2771 -4 -24 67 -29 16 -33 8 -30 29 70 24 61 -37 16 58 -40 -10 62 12 4 -14 -17 -22 9 -25 -3 10 -10 33 4 -17 66 -5
2803 -5 -8 9 5 -8 24 13 -11 -2 -11 -55 19 11 50 51 -6 17 -9 69 28 40 20 -53 -6 -29 32 -21 -33 -15 29 -5 -45 -6 -2 -5 -8
2838 -8 -9 -3 53 -1 -4 -24 32 3 45 2 24 6 -15 45 86 -48 -20 -6 0 13 4 -8 30 1 -8 27 38 33 24 -38 9 28 -53 -2
2872 -2 -46 -2 -7 38 5 -7 -25 22 33 -22 16 21 -11 -26 6 -55 -33 2 17 -32 -30 -51 0 7 19 18 18 27 20 20 6 26 -15 -26 -37
2907 -37 12 31 -57 19 -33 -41 -32 20 -27 -56 -33 -6 27 13 -10 -22 -28 -11 36 -25 31 -70 -30 18 50 -17 -5 -18 -9 -3 9 24
2939 24 47 39 -7 68 6 58 -35 28 2 -65 -24 -13 -11 29 -1 19 -31 -18 11 47 32 14 -2 8 2 3 -32 -16 -31 18 -57 -42
2971 -42 10 -21 -6 1 -7 10 10 13 67 36 -43 -10 2 -37 26 -33 29 40 -13 -18 -65 10 -14 -24 -36 -2 -31 26 46 -28 -18 26 -17
3004 -17 -10 -12 -19 -8 -45 18 1 -25 -22 42 -26 18 11 41 26 61 33 22 15 13 -5 38 3 -54 -42 -11 24 -21 -4 -31 25 -31 29 -19
3038 -19 27 -4 -41 10 12 -6 -61 15 -31 11 -18 14 -6 -24 9 5 27 35 36 41 52 10 -17 -10 -44 21 -1 -10 14 1 -41 -30 3 28
3072 28 -1 0 -36 -7 36 69 -34 -36 69 -23 -13 -27 -35 -38 10 -3 -18 -28 -4 -35 17 8 18 33 18 15 1 33 -99 1 47
3103 47 -12 50 -73 -49 -43 18 -22 31 -27 -16 19 31 -16 2 -20 30 16 -10 -1 -16 17 -41 23 23 -20 -18 -4 0 55 34 18 25 -3
3136 -3 6 11 30 25 -40 26 -7 -13 1 23 -37 3 8 13 9 48 23 16 3 6 5 -25 -26 21 -17 9 25 -23 -63 -12 0 1 -23 19 26 -20 41
3173 41 20 24 50 45 -38 70 41 20 -6 31 -1 -16 9 2 -53 -46 -19 26 2 43 6 0 -19 -9 -5 45 37 -24 -32 -60 -33 -47 -13 -49
3207 -49 -30 -26 1 -10 -21 42 40 60 20 -21 -23 17 1 18 13 1 27 -12 11 0 9 -24 -2 -20 -39 0 23 33 17 -37 -2 2 -42
3240 -42 -16 6 -54 0 25 -13 -20 9 -30 -33 4 -7 0 12 -15 33 31 -20 44 -44 -7 -9 -16 10 -34 1 -35 69 -85 -18 12 14 -8
3273 -8 1 44 27 -35 -27 -39 -52 -54 30 37 22 0 -1 37 -30 -6 -45 -50 -3 19 9 15 13 45 3 -4 21 -73 -1 46 26 9 21 19 -61 10
3309 10 54 12 26 -33 18 -15 16 13 2 26 -57 -2 -13 5 22 25 -7 -36 -18 2 16 -26 52 -13 -37 -64 3 -60 -49 -6 10
3340 10 -29 -29 -32 -4 14 -2 -7 -1 18 23 51 -27 1 -20 40 -25 33 17 -73 -11 12 6 -4 -33 7 -57 32 21 11 1 30 -8 3
3373 3 8 -22 -65 -61 -2 -18 -18 1 -30 10 14 3 11 8 -27 44 43 24 6 -21 -24 6 -18 -13 12 19 15 36 -18 -42 -2 -12 7 -25 -18 2 25
3410 25 0 -32 -2 17 1 15 37 23 -1 -2 53 37 2 -3 2 -67 -6 -3 46 -10 -12 7 37 -16 -29 -10 8 -19 -6 46 -8 -17 27
3443 27 -25 -29 -14 26 -15 -4 0 50 16 58 7 6 -25 -5 9 11 48 -17 27 11 -17 1 34 -16 4 17 -7 9 -20 -28 42 -22 -28
3476 -28 -32 -17 -11 14 -42 -22 27 9 -37 -54 -7 19 2 -16 -5 -11 -20 24 2 -8 12 -11 -42 1 -4 -5 -14 23 -12 19 10 -30 -9 4
3510 4 27 64 -13 21 -35 11 14 -8 15 26 -32 17 23 -4 53 -7 17 6 -24 -7 0 -8 14 4 -35 -49 17 -2 14 -30 -3 -4 -2 26
3544 26 -46 15 10 -12 -36 8 49 32 -1 50 -41 -37 29 -38 -11 -12 -31 -29 -3 34 4 -21 -2 4 -14 56 14 11 -35 -10 43 -4 28
3577 28 -43 4 -18 -53 -44 -16 -50 -37 -28 -31 22 -35 7 -5 -13 42 9 18 -17 -23 -19 -19 -43 -14 -24 -26 -38 -37 -8 -14 -33 25 -13 -3 -26 61
3613 61 -14 -21 -44 40 38 -17 -74 61 3 -27 9 33 17 -27 -49 -8 12 41 49 -35 -13 -38 17 -57 -19 -15 -17 -24 -17 41 76 22 31 -3
3647 -3 -53 4 45 -2 -28 10 2 41 23 -15 -38 -19 58 12 3 -25 3 10 -5 22 6 0 -29 30 -18 -59 -3 -11 -28 -7 16 21 -28 9
3681 9 -60 14 -51 -6 -53 40 -31 32 30 -70 -2 -33 -6 -28 -17 -25 -1 -34 -25 -11 0 18 14 8 -1 -11 47 -6 -52 -22 -48 -88 -16
3714 -16 47 -2 -29 7 -17 -2 -27 19 27 -18 -69 19 41 49 -48 -11 -5 -38 10 -13 21 -52 24 -20 31 55 -41 21 9 12 12 49 10
3747 10 1 7 21 19 -17 -23 -14 30 -10 18 -43 36 -10 11 -50 -14 -2 -1 19 -33 51 -4 -3 -47 35 16 49 -63 -21 -9 -16 0 12 -20
3781 -20 3 32 -18 -23 17 -21 38 -77 0 -18 26 25 -19 -31 6 -47 44 -23 9 12 29 -19 -27 3 28 19 19 -35 25 -18 -43 29 32
3814 32 8 -32 36 -17 30 -30 25 14 -41 15 4 45 -8 56 27 8 13 10 -15 16 30 -9 -16 -20 -13 -12 -36 -33 49 48 -12 39 1 -43
3848 -43 3 -2 27 6 -51 -47 48 2 53 19 13 -16 8 16 15 -20 -11 -3 -11 1 -7 1 1 -12 -31 6 -48 2 -42 9 -20 -51 -18 -49 13 -25
3884 -25 -12 -51 46 -7 7 28 37 -20 -7 -8 19 -48 53 18 -34 -52 -15 -21 25 63 23 49 -44 40 -21 -19 28 -15 38 -31 -5 19
3916 19 14 -28 -12 2 -18 51 -38 25 5 -26 -9 6 -41 -18 31 -32 -35 27 2 -37 -36 20 13 11 42 -18 -16 -36 -11 -18 -9 23 73 -28
3950 -28 18 -4 5 -9 -32 -26 60 7 -11 44 -7 34 -1 27 -38 -43 16 -67 -9 11 -39 9 -1 -29 2 -7 -8 62 17 37 6 64 -5
3983 -5 46 2 -37 -12 -22 50 -56 -13 12 -39 -10 -17 -57 -19 -12 31 13 6 -51 -49 34 -10 9 -39 6 3 36 61 7 -15 44 -3 12
4016 12 29 37 -18 70 1 27 -21 -22 -28 -31 2 -2 7 -9 22 2 -7 -9 47 -29 3 -40 -17 -19 -21 -48 -33 -22 -23 3 -58 -47 -11 -4 39 10
4052 10 16 14 -60 5 -17 20 15 36 14 -13 22 -31 -16 -15 35 8 1 34 29 -38 -19 -23 -2 7 -36 -20 7 -8 11 -5 54 57 -3 -44 28
4087 28 1 10 24 -26 11 1 -16 -32 -24 44 42 26 45 -13 0 1 61 -11 -72 -1 -27 29 38 6 -12 22 -9 7 -39 47 -14 -1 22
4120 22 -58 -3 -32 -33 -27 -17 -25 44 42 -43 -4 -12 -23 -33 -30 41 -12 20 24 -29 22 -5 54 44 -35 -1 24 0 -10 -63 35 7 10 8 4
4155 4 -19 7 10 5 36 27 2 37 7 36 -2 -24 2 -28 9 72 5 -43 30 29 16 33 -31 -28 -14 52 -14 -59 -13 6 -29 -30 23 -3
4189 -3 20 -15 -41 22 17 -14 -5 -5 -46 21 -50 -5 -1 -30 22 29 29 -46 5 -41 49 28 34 -18 41 48 62 -6 -16 4 34 19 8 6 -16
4224 -16 21 30 43 20 -28 34 22 -9 4 -26 -7 5 7 57 -42 39 -49 -6 -22 -39 -59 0 6 -10 -12 -37 4 -18 8 -7 -14 6 11
4257 11 -8 31 49 6 0 30 9 -18 -32 11 27 15 9 -30 -4 10 -3 -16 15 -11 30 -25 37 9 -20 24 -56 -40 -10 -25 20
4288 20 -16 -49 18 -10 19 -15 53 -13 0 13 9 18 26 21 -16 17 11 35 -19 15 0 38 13 1 4 -7 49 35 -1 16 18 -16 -26 -8
4322 -8 10 3 3 -1 -14 9 -39 -3 6 25 26 -18 37 5 55 -2 11 22 35 17 8 37 8 -2 23 -34 -29 -22 23 -42 -9 -42 27 31 -30
4357 -30 0 -45 -32 48 -10 34 7 31 -34 -66 -2 10 34 -26 -18 34 -31 0 -18 -9 -15 24 -1 -15 10 -2 -4 8 -5 -26 36 49
4389 49 66 32 46 -6 46 10 17 -24 -13 -50 -26 46 43 -5 11 -36 -42 18 -32 13 0 24 26 40 16 0 38 -18 10 50 -53 -24
4421 -24 -13 29 5 -54 -6 -10 36 -31 -62 -14 3 -16 -12 11 47 18 -20 6 2 -42 -35 10 -58 8 21 -53 -37 6 13 -31 0 15 -1
4454 -1 -49 -26 45 31 43 1 57 -13 -7 -19 25 41 -20 38 47 -10 29 43 -10 -8 -40 -1 -31 0 -7 29 14 -17 -3 -75 -26 -16 -42
4487 -42 -20 30 -7 35 -6 77 -23 -15 68 41 10 26 33 -48 -6 -32 -6 -14 30 36 -49 -25 37 44 -28 5 23 -19 -9 -14 35 -10 85
4520 85 1 4 -7 -16 28 35 3 -42 0 -44 -11 -22 58 -6 12 -20 31 13 -15 35 24 -51 36 45 -20 12 -9 -24 -1 21 -7 13
4552 13 8 -18 3 19 -4 10 42 -6 -60 -68 42 19 -18 13 -10 -29 -20 -16 -18 20 5 14 28 4 -32 83 -23 -33 11 -5 -25 -20
4584 -20 35 -6 32 -17 -16 -2 5 -7 -26 21 13 -1 -24 -7 10 47 27 18 -19 -29 15 -15 -11 -1 72 34 -29 23 23 -7 -29 2 -11
4617 -11 32 -53 5 -53 -32 -31 3 8 51 -79 35 -17 -44 -2 -24 1 -27 -20 -22 12 -20 -35 -1 -35 13 -40 -5 26 -13 26 62
4648 62 30 -67 -4 -56 -21 -29 3 -22 36 9 12 -41 27 50 -4 35 11 -5 46 -16 21 13 33 19 8 -15 25 14 33 16 3 11
4680 11 12 -11 1 -43 -32 15 23 -2 -30 59 -38 -6 -26 -2 -53 -6 -26 -9 -1 8 38 14 24 -11 15 -22 15 -15 -37 18 20 14 12 41
4714 41 -56 -7 7 28 37 26 -7 -30 -25 12 -31 43 -28 35 48 16 27 23 40 29 48 -26 43 42 -4 16 41 -22 10 2 7 9 17 18 30
4749 30 40 -8 -17 23 35 -30 16 -50 5 21 41 29 35 -32 -46 -14 -14 -46 22 -6 -15 -43 -20 23 6 18 -57 -32 33 -61 -29 -25 66
4782 66 -17 6 12 36 -19 14 0 -27 15 9 5 -31 25 29 14 7 4 10 18 -4 32 -3 -2 23 -28 -29 -18 13 8 -6 -12 -37 6 -8 48 43 14
4819 14 5 -27 31 25 15 4 -15 51 14 -17 10 -17 43 79 3 -4 18 -21 45 -1 -35 14 -3 -12 9 10 3 30 -79 -32 -1 -4 23
4852 23 44 53 19 27 30 36 -9 -32 -22 -9 -24 0 54 -13 2 45 -16 -36 23 -19 35 -38 19 37 36 -17 23 -39 -19 -19 2 17 -41
4885 -41 49 -29 -20 16 -14 2 -28 -21 20 1 -36 29 -20 12 8 -15 -26 -6 6 32 13 18 -23 -2 71 38 -47 27 2 6 -51 -5 -6
4918 -6 39 -15 -29 -13 -61 22 -24 -6 14 -12 20 14 -26 17 11 3 6 -3 8 -11 -17 39 43 32 23 -11 -3 -36 46 19 -19 21 -15 -3 23
4953 23 -8 -6 -68 19 -56 -40 0 -6 14 -22 11 -14 -3 29 14 12 76 10 -41 26 9 -13 2 9 68 15 -11 68 47 -8 18 -18
4985 -18 29 -14 -27 5 12 23 -36 -16 -34 0 13 -15 -20 30 9 48 -10 17 -2 -18 4 35 -14 -5 -33 -11 36 4 -3 20 -14 36
5017 36 31 -17 77 14 -2 43 6 -36 21 25 -2 -2 20 32 14 -9 -34 -6 -17 5 22 14 12 -17 -23 39 -7 34 -8 -24 0 -24 -61
5050 -61 45 -33 -2 -34 -18 -39 -8 25 2 29 33 34 -9 -31 -2 -40 35 7 8 7 22 68 -42 -5 -24 -1 -16 -1 -7 -21 27 -35
5082 -35 5 18 21 8 3 18 -1 6 8 -9 19 56 -6 -3 13 -4 29 1 -6 -11 -23 -14 -38 2 -3 -25 38 14 -33 -35 3 -11 -60 34 12
5117 12 21 -9 -42 -46 21 52 -5 3 44 -17 42 39 60 53 9 35 -11 -17 54 81 -35 33 9 35 6 12 29 40 -18 48 73 17 26 57
5151 57 9 0 17 21 4 -18 20 -19 -33 19 -40 16 9 0 -25 -43 3 12 7 -9 8 7 -20 -18 26 3 28 -10 -5 -6 -21 -4 13 7 -25 1
5187 1 5 39 -6 -13 -33 -36 21 7 -34 -12 30 33 20 -2 38 38 -42 9 43 26 -20 7 -5 -3 12 -48 -14 -3 -1 -23 -10 -13 1 4 49
5222 49 32 24 15 27 -9 -15 -4 -8 -19 -35 47 -6 -37 -12 -32 -4 -11 22 -24 -3 20 -34 6 7 20 32 14 -17 -73 -17 -47 63 -14
5255 -14 43 1 28 5 -8 0 6 -16 32 -19 25 -21 23 10 -13 -24 -6 18 -16 61 13 29 2 13 14 -22 -28 -12 -33 2 -21 9
5287 9 35 20 42 -15 -23 -6 -31 14 -35 45 -7 55 9 29 8 62 3 -31 9 -4 38 5 17 -8 23 13 33 17 11 17 21 24 66
5320 66 13 4 -6 1 -18 -6 -42 34 30 -35 28 33 10 -41 51 38 12 37 -45 -53 -27 -24 -2 29 28 17 10 35 -41 3 -48 26 -15 -14 -27
5355 -27 33 -28 -31 -6 -46 53 50 0 -25 23 -40 49 -17 37 -63 -24 1 -5 18 2 12 19 -17 3 23 -7 -16 13 -15 8 1 60 48
5388 48 -11 37 -39 -34 11 -18 -49 -39 -18 -11 -19 40 -27 -13 2 -50 27 -37 -1 -37 -4 5 23 55 -52 -5 16 56 30 12 33 8
5420 8 -32 -14 -16 36 50 19 59 35 -18 0 16 -51 -20 -35 -7 -63 -5 19 0 23 41 -16 8 61 11 4 2 41 -18 -21 -60 -25 15
5453 15 6 55 45 -24 -1 30 7 -42 25 17 23 -16 38 -6 28 -18 -68 -20 -13 -20 2 -14 13 22 28 -19 -21 -1 11 61 -13 -22 42 -42 -32
5488 -32 33 -46 -10 57 24 -3 -28 13 44 27 -17 -35 -11 25 23 16 -5 -38 -13 -9 -16 -22 -32 -64 -7 -4 18 62 23 57 38 -6 22
5521 22 48 -14 -54 10 -12 19 -13 10 23 25 6 44 33 34 19 25 54 30 22 54 17 71 32 2 -13 12 26 -10 6 -6 -39 -24
5553 -24 31 -26 10 -8 -37 51 -23 -14 -20 -20 29 15 43 9 15 58 -18 23 22 -6 5 12 -11 12 24 52 14 5 29 8 -24 20 11 45
5587 45 2 10 19 2 -5 -44 -6 -14 -11 52 3 44 -28 10 -35 16 -13 33 0 13 27 7 -7 -27 38 -23 30 -26 -3 -3 -45 59 5
5620 5 -39 43 5 29 52 7 -10 21 -5 4 -36 -19 6 -34 -10 -19 -17 3 -43 -43 0 20 28 5 10 -20 -26 -31 10 -34 -27 -3 -40 5 34
5655 34 -1 -29 75 21 58 -8 34 -21 5 19 40 -21 11 16 -16 5 -20 -47 -46 41 -3 -10 -6 -20 -11 -46 -29 7 0 -34 -40 -28 -1
5688 -1 6 -6 2 16 -18 33 -43 -28 54 -5 16 36 -35 -33 -56 1 11 37 31 24 6 64 9 13 27 12 40 2 64 -28 14 -15 -17 -2
5722 -2 10 -4 15 19 -1 14 -2 17 54 2 -14 21 -36 36 -2 22 -43 -3 3 42 40 -21 47 8 -2 5 40 -14 89 2 -22 25
5754 25 39 -17 11 -29 8 37 -28 25 15 -32 -85 15 29 1 7 36 -19 -26 -6 -9 29 8 8 8 36 60 -15 -23 34 11 -6 -41 10
5787 10 12 32 -24 -33 2 -41 -23 -25 -22 19 -6 -38 -19 -2 -18 8 -32 5 -21 -11 8 38 -25 -19 21 16 47 31 11 54 -26 55 24
5820 24 -9 4 23 -23 2 14 1 66 16 41 -43 -4 -10 -14 -19 -34 -3 4 -4 5 34 6 16 -14 -40 -69 -2 -41 1 37 -22 40 6
5853 6 -8 -10 19 46 -7 24 11 -27 -1 37 17 -10 33 -24 -45 -12 -1 52 1 -22 15 5 -19 3 38 -4 -10 -8 15 54 21 29 2
5886 2 -34 10 -6 22 16 -22 50 -23 -18 -22 71 34 44 -4 -8 -31 -20 17 23 58 28 29 27 74 -29 -19 40 29 13 8 -32 37 6 -27
5920 -27 -15 6 3 10 29 -64 -11 -6 -62 -84 6 -8 61 24 6 9 13 71 -17 63 41 30 30 57 -3 40 32 -6 -57 36 7 -52 -24 -7
5954 -7 -19 -16 -45 -8 56 -54 -23 -26 -12 16 36 26 20 21 31 -24 -51 -13 -40 -43 36 -4 43 -15 -10 48 -21 -12 8 3 43 3 48 28
5988 28 47 2 53 -9 22 -20 -15 53 11 -42 -5 14 2 6 65 2 23 -10 -6 2 12 -31 35 22 31 24 84 -9 -30 24 5 50 40
6021 40 -5 -10 38 -5 0 -32 48 6 35 46 6 -3 -2 -14 -15 -25 -10 -46 53 23 -22 -1 -17 2 -16 -18 13 25 9 57 9 22 12
6054 12 53 19 14 3 2 -35 15 49 42 -38 1 10 25 -4 29 24 40 43 -23 -2 -7 10 3 23 6 -7 -41 -33 -9 -25 -52 -7 0 8 -37 33
6090 33 53 10 -26 10 43 34 -26 -6 31 -86 -28 11 36 45 15 19 -14 5 24 45 13 -6 -7 -11 -10 14 14 19 -61 -28 -22 61 37 -17
6124 -17 6 -29 -6 49 -32 12 38 -38 -52 16 19 9 23 44 44 19 62 39 -10 -47 22 14 13 28 5 20 -30 -21 10 -23 36 -11 12
6157 12 -45 -11 -8 -11 -31 -38 -6 19 12 0 18 13 33 3 -13 55 -6 -24 13 22 -45 40 9 52 19 -5 -10 38 32 16 57 -61 -19 24
6191 24 -16 -14 -49 -8 4 35 13 -40 34 8 -9 40 31 6 -3 12 52 -33 -9 2 18 8 9 15 67 -8 -30 10 3 40 62 31 4
6224 4 -15 1 39 -22 66 11 61 9 -12 16 -18 -14 13 3 -22 7 -32 54 15 29 36 1 8 28 23 -7 -61 0 8 -16 -2 -15 50
6257 50 -2 20 -5 39 7 -4 -16 4 31 34 23 84 10 32 50 28 -14 13 -58 37 -44 -15 -39 18 -25 -21 -4 -29 -13 -24 38
6288 38 -22 7 -12 67 14 20 -20 -20 0 16 -18 -40 -30 -14 37 8 -36 39 18 54 -9 -7 28 -16 -10 -24 0 -2 16 43 15 5 -6
6321 -6 -72 -54 -31 4 -70 -23 21 -1 -5 -6 2 4 -12 18 55 -12 20 45 -10 -34 -46 -50 21 -52 -7 15 -15 -4 -8 14 14 -8 -19 12
6355 12 -1 -23 -32 20 -23 -1 -17 -14 15 9 52 -5 40 -26 41 -3 -48 -22 -24 16 -15 -26 2 23 -9 -21 20 -29 -16 -7 28 74 12
6388 12 21 16 -65 19 13 28 -21 -64 -47 -33 5 -7 38 -25 -22 -37 8 -35 2 -23 -21 15 5 9 -21 6 -15 14 16 3 29 43 33 28
6422 28 -4 8 8 36 -3 31 -11 -29 -46 29 -26 -12 8 17 -11 -6 -24 40 -13 9 15 -15 14 51 -5 -28 41 -14 9 -39 -40 6 31
6455 31 -46 -4 -16 -41 32 29 -18 21 -18 14 20 38 20 10 51 -4 11 12 -24 -25 11 3 16 3 -21 14 11 -19 -12 26 66 27 7 -11
6489 -11 33 28 -11 -33 -3 -3 19 24 1 -32 -5 -23 10 18 -8 34 -35 5 26 -7 7 40 16 -14 -31 30 25 -33 30 36 -23 -50 51
6522 51 7 -19 -13 24 28 -15 -35 10 36 2 32 43 -6 -6 -52 43 15 -22 12 27 -5 -21 9 22 27 -8 -18 -71 29 -45 -62 8
6554 8 -9 2 10 9 -26 30 -29 0 4 -7 0 -54 -20 26 15 0 1 61 -78 19 18 55 37 0 -52 8 24 -27 9 22 26 51 -16 6
6588 6 6 -17 -7 -24 4 -52 62 -13 18 22 33 -21 -16 -39 13 21 -52 29 -5 21 3 -2 14 -28 12 -36 8 10 18 -26 11 30 13 9
6622 9 16 31 8 -8 -16 4 -30 12 59 -9 -35 6 -7 -8 16 0 -33 9 -22 37 -20 -59 -29 20 -47 -53 -13 33 0 28 -7 -67 -1
6655 -1 10 -17 -37 29 48 11 -16 25 -6 33 12 -6 -31 6 -22 -21 -9 -51 -11 -35 2 30 -43 -2 -17 -18 -70 34 -42 -4 7
6686 7 10 -49 9 66 24 -7 -9 45 4 -5 -21 33 -10 -34 25 59 -24 -2 5 -8 -37 -44 63 16 -18 -14 7 51 12 -2 56 -40 -6
6719 -6 10 -22 2 -7 -3 14 38 -62 -11 -6 -20 -44 -23 43 -5 34 -22 18 30 -8 -58 8 -10 21 5 67 -38 -29 18 47 8 2
6751 2 40 18 -4 -20 -56 -27 54 -3 -21 -46 11 4 -12 -16 -59 -17 25 39 26 41 19 -1 38 38 29 9 36 20 0 14 -7 -30 5
6784 5 14 -15 35 -11 27 1 11 -26 12 -28 -14 0 16 -12 -13 8 6 67 25 21 -17 12 7 -43 -1 -15 -65 -36 32 19 -37 -18 15
6817 15 -5 39 -22 33 52 -12 52 -9 0 -33 9 44 6 10 2 34 -49 19 28 11 26 -40 -17 -44 -28 22 -30 -25 2 -17 34 25 18 4
6851 4 8 18 -51 3 4 -23 38 16 -34 -1 -21 53 51 -10 -28 25 -34 -8 7 -1 -19 12 23 -29 70 -39 11 1 14 -22 0 -4 2
6884 2 -38 -56 33 1 -19 -9 12 45 -50 8 42 3 -18 22 40 -35 -30 -14 53 59 -8 -2 19 -1 38 1 3 -30 23 22 -18 20 -13
6917 -13 -5 -17 38 -31 -26 -46 -35 7 -45 -24 22 -25 14 39 3 12 -35 9 42 -11 -1 -28 20 24 -21 15 16 12 -24 56 3 -26 3
6950 3 18 -15 -8 -6 -36 19 -8 -46 -40 -22 -28 5 -44 -26 33 4 13 7 7 -2 0 45 23 -22 -4 26 -21 -36 31 -19 -19 4 -73 38 23
6985 23 -6 7 19 41 23 21 -9 -21 -6 -30 1 -25 -27 -4 4 4 -23 6 -46 -19 3 -8 -13 -24 -29 16 -62 -34 -12 -44 8 53 -1
7018 -1 23 6 6 -19 -16 9 59 25 -21 -27 19 39 -55 42 5 -36 -36 -9 -37 19 -10 -26 61 10 62 -52 -53 8 -11 6 -52 14 10
7051 10 -12 34 60 -26 -14 -17 12 22 23 39 -10 -22 -18 34 21 -27 -9 9 11 -48 -50 74 -35 39 -39 -38 -1 -16 53 13 6 -39 22
7084 22 -34 -6 -24 -38 -32 -8 20 25 20 26 7 -27 13 34 41 -1 -1 44 68 -20 45 10 -13 8 -22 22 44 -47 52 -12 -19 -12 26 30 -37
7119 -37 5 3 24 -41 -13 -29 37 -15 67 17 -69 77 -54 22 8 24 40 13 -5 -18 14 23 13 11 21 36 4 3 26 -18 -1
7150 -1 12 38 -28 -15 3 20 -36 -1 56 -9 -33 -13 28 48 9 37 -20 -29 -16 25 -8 1 -3 -7 5 7 -12 -9 34 44 -28 9 31 19
7184 19 -1 14 15 2 34 -9 -1 14 44 38 -16 -31 -23 17 40 -9 64 -2 -8 6 15 39 -45 -28 -30 -9 11 -8 -48 -71 15 -14 -35 4
7218 4 -10 24 39 -21 5 21 13 -54 -15 -44 -21 2 15 -47 38 -27 38 -30 16 47 64 6 -11 -1 -59 38 14 46 33 6 15 -30
7250 -30 -38 27 -16 29 -8 -18 -3 -16 17 -2 -20 89 9 -14 -15 43 34 5 -6 5 15 12 -19 -66 -8 28 -26 -5 -10 17 59 23
7282 23 30 12 15 -18 -50 -54 -34 2 -12 18 -26 -64 30 19 52 -3 4 7 7 52 3 -9 37 -15 41 9 -55 -15 -35 9 -59 17 -1
7315 -1 8 71 10 6 11 18 -3 37 -20 -56 -4 7 -12 -2 -36 28 -58 -21 -28 -5 -15 4 6 7 -23 -8 5 2 3 1 23 -37 -22 36 -18 31
7351 31 -25 -26 -32 37 -16 -26 -34 -5 -9 -13 10 -43 -9 17 11 23 15 -41 -8 44 -2 -23 6 45 -20 -5 -14 2 33 37 12 16 14 -63 -39 -13
7387 -13 29 3 -15 12 13 17 -48 24 3 -31 17 -1 17 11 -49 -5 -17 -13 -42 -7 -6 -23 7 7 -3 -23 45 7 -8 26 -24 -40 5
7420 5 -19 34 -18 -27 -25 -18 -19 -11 -9 -15 26 14 -24 -40 -34 -25 -14 -44 -22 -20 8 14 37 21 10 24 62 -43 -30 -8 5 27 -3 -28 -26 -20 29
7457 29 -8 -3 -58 -6 -30 -14 5 -33 23 18 -51 -21 11 39 4 22 -28 -26 4 33 6 -14 -19 7 18 15 25 -17 -23 -34 -21 -25 47 55
7491 55 -20 -29 -43 19 33 36 28 5 -13 -16 20 -32 19 -21 33 54 18 5 -17 21 -28 -5 26 -84 71 -17 8 15 -13 -15 26 -3
7523 -3 -4 3 -10 -2 4 -22 8 -41 13 -62 -9 18 -53 21 -4 37 -7 81 33 -13 -38 -27 -14 -26 -20 -11 -24 -41 -16 -35 23 -35 0 -54
7557 -54 -6 13 44 -13 -14 -36 -13 25 21 55 -12 -8 -12 -17 -11 17 27 -6 -39 13 27 14 -13 -6 3 24 25 11 30 -16 -10 18 -19 -16 -8 -15 -7
7594 -7 -30 -4 -43 33 -15 24 26 -48 -11 17 -43 32 51 23 1 22 56 38 -11 -67 29 -45 30 3 -27 28 9 -19 5 -28 0
7625 0 -55 -17 -14 57 18 -27 -3 -2 25 28 7 -59 -63 -26 2 -52 -16 15 -27 14 -21 -17 14 -50 12 19 -24 21 -44 39 -13 39 15 -3
7659 -3 58 -49 0 -8 -9 -22 6 -17 -36 -16 -36 -27 -48 -39 -18 17 29 -33 -9 29 5 -30 44 10 7 9 -20 -27 1 -22 -26 -10 -18 22 -41
7694 -41 -20 30 -58 -11 -30 23 -8 21 -27 -1 17 3 -1 41 -22 -54 -12 44 37 4 9 -2 -37 -26 -19 -20 -16 -9 -34 -3 -17 -29 -9 -22
7728 -22 15 -34 11 -33 14 -12 23 -49 16 8 1 17 22 -1 -27 17 -17 61 -14 13 -10 -26 -33 -25 27 -4 2 18 6 -15 42 -35 18
7761 18 -15 54 25 -7 -19 25 1 -5 -4 13 23 -29 33 -15 12 11 54 32 38 -12 16 9 -20 -39 26 -12 14 -2 -8 18 -9 10 -13
7794 -13 -4 -28 9 -35 -11 -6 -3 1 0 -36 -19 -57 -9 15 0 3 -2 10 -19 -11 3 -45 5 3 34 24 -8 -6 -21 22 -11 -13 8 61 -9 -51
7830 -51 -9 -22 -32 6 21 13 17 -12 53 -36 -14 -18 48 -16 17 -19 -19 30 17 -33 -45 34 -13 15 59 41 13 -11 -5 51 15 12 13 66
7864 66 -21 -11 -79 -46 20 0 -17 -34 -1 -1 37 -11 18 -15 0 -50 20 9 50 24 14 -9 9 -26 -13 37 2 6 -39 -31 2 3
7896 3 20 -24 4 -28 34 59 -16 18 28 11 31 -22 -34 29 4 -3 -32 -1 -29 -6 14 2 -24 2 1 9 -5 -15 -28 30 -7 7
7928 7 -21 51 4 -7 25 -30 -19 4 -31 -9 -13 26 0 -12 -19 1 24 23 2 -17 -1 3 -28 3 -19 12 -57 -46 30 -2 -4 -17 4
7961 4 40 -9 -42 3 -42 -17 -26 21 29 86 23 18 27 5 20 -11 -24 -35 17 -53 30 31 12 -39 -28 36 -20 5 -10 33 20 -35 -6
7994 -6 -19 21 32 5 -10 -23 19 -8 -37 -42 -2 -16 2 -44 38 -17 28 -31 4 2 7 22 45 38 51 -24 18 16 32 12 -33 8 15 28
8028 28 6 26 -25 19 6 2 -9 -17 -1 -25 -45 46 -33 8 -26 -19 72 7 -16 41 -41 -22 -6 39 -20 -39 -24 -24 6 -10 -3 -9 17
8061 17 33 10 -58 -4 -6 -10 12 6 44 -43 7 32 -22 2 -28 14 5 -3 -18 -13 -26 23 -30 -13 26 -7 -32 11 48 17 -11 -33 46
8094 46 -33 -9 -13 12 -23 -16 -3 -66 12 -10 5 -45 -50 -43 9 -6 -33 -9 5 13 64 17 -44 15 23 37 21 10 -11 -24 -21 25 2 -24
8128 -24 37 21 5 28 -6 20 38 70 -2 14 -21 14 -5 2 22 -7 -3 -13 0 -34 -6 10 0 -24 8 21 -6 -45 -6 -15 -18 -73
8160 -73 -13 -55 -44 -40 37 -16 44 -4 -7 -22 -3 -55 34 25 19 -45 32 6 7 5 6 9 -24 -8 -10 16 12 -23 25 -15 -46
8191d6
##END NTUPLES=NMR FID
##END=
