##TITLE=1H_EC-3236x-oc
 CDCl3, 8 sc, 
 21.10.2020
##JCAMPDX= 6.0         $$ Bruker NMR JCAMP-DX V2.0
##DATA TYPE= NMR FID
##DATA CLASS= NTUPLES
##ORIGIN= UXNMR, Bruker Analytische Messtechnik GmbH
##OWNER= root
$$ XWIN-NMR		Version 3.5
$$ Wed Oct 21 11:18:57 2020 Russian Standard Time (UT+4h)  she@DPX200
##.OBSERVE FREQUENCY= 200.1315066352
##.OBSERVE NUCLEUS= ^1H
##.DELAY= (6, 6)
##.ACQUISITION MODE= SIMULTANEOUS
##.ACQUISITION SCHEME= undefined
##.AVERAGES= 8
##.DIGITISER RES= 18
##SPECTROMETER/DATA SYSTEM= spect
##.PULSE SEQUENCE= zg30
##.SOLVENT NAME= CDCl3
##.SHIFT REFERENCE= (INTERNAL, CDCl3, 0, 15.7039)
##AUDIT TRAIL= $$ (NUMBER, WHEN, WHO, WHERE, WHAT)
$$ ##TITLE= Audit trail, XWIN-NMR		Version 3.5
$$ ##JCAMPDX= 5.01
$$ ##ORIGIN= Bruker BioSpin GmbH
$$ ##OWNER= she
$$ F:/spectra/data/she/nmr/H-F/1/audita.txt
$$ ##AUDIT TRAIL=  $$ (NUMBER, WHEN, WHO, WHERE, WHAT)
(   1,<2020-10-21 11:17:51.39 +0400>,<she>,<DPX200>,
      <created by zg, POWCHK disabled, PULCHK disabled
       configuration hash MD5:
       00 E9 B6 7A A2 85 ED C7 34 08 36 98 17 FE 4E 26
       data hash MD5: 16K
       4E A9 B0 D4 D0 A8 C2 F0 46 BA 6A DA 8C 38 AC 6A>)
$$ ##END=
$$ 
$$ hash MD5
$$ 2C 82 2E C8 1B 6C 45 29 90 75 E9 4E 32 8B 5E E3
##$RELAX= 
##$RELAX= 
##$RELAX= 
##$RELAX= 
##$RELAX= 
##$RELAX= 
$$ Bruker specific parameters
$$ --------------------------
##$DU= <F:/spectra>
##$EXPNO= 1
##$NAME= <H-F>
##$PROCNO= 1
##$TYPE= <nmr>
##$USER= <she>
##$AMP= (0..31)
100 100 100 100 100 100 100 100 100 100 100 100 100 100 100 100 100 100 
100 100 100 100 100 100 100 100 100 100 100 100 100 100 
##$AQSEQ= 0
##$AQ_mod= 1
##$AUNM= <au_zg>
##$AUTOPOS= <>
##$BF1= 200.13
##$BF2= 200.13
##$BF3= 200.13
##$BF4= 200.13
##$BF5= 200.13
##$BF6= 200.13
##$BF7= 200.13
##$BF8= 200.13
##$BYTORDA= 1
##$CFDGTYP= 0
##$CFRGTYP= 5
##$CHEMSTR= <none>
##$CNST= (0..31)
1 1 145 1 1 1 1 1 1 1 1 1 1 1 1 1 1 1 1 1 1 1 1 1 1 1 1 1 1 1 1 1 
##$CPDPRG= <>
##$CPDPRG1= <>
##$CPDPRG2= <>
##$CPDPRG3= <>
##$CPDPRG4= <mlev>
##$CPDPRG5= <mlev>
##$CPDPRG6= <mlev>
##$CPDPRG7= <mlev>
##$CPDPRG8= <mlev>
##$CPDPRGB= <>
##$CPDPRGT= <>
##$D= (0..31)
0 1.2 0 0 0 0 0 0 0 0.06 0 0.03 0 0 0 0 0.0002 0 0 0 0 0 0 0 0 0 0 0 0 
0 0 0 
##$DATE= 1603264670
##$DBL= (0..7)
120 120 120 120 120 120 120 120 
##$DBP= (0..7)
150 150 150 150 150 150 150 150 
##$DBP07= 0
##$DBPNAM0= <>
##$DBPNAM1= <>
##$DBPNAM2= <>
##$DBPNAM3= <>
##$DBPNAM4= <>
##$DBPNAM5= <>
##$DBPNAM6= <>
##$DBPNAM7= <>
##$DBPOAL= (0..7)
0.5 0.5 0.5 0.5 0.5 0.5 0.5 0.5 
##$DBPOFFS= (0..7)
0 0 0 0 0 0 0 0 
##$DE= 6
##$DECBNUC= <off>
##$DECIM= 32
##$DECNUC= <off>
##$DECSTAT= 4
##$DIGMOD= 1
##$DIGTYP= 9
##$DL= (0..7)
0 120 120 120 120 120 120 120 
##$DP= (0..7)
150 150 150 150 150 150 150 150 
##$DP07= 0
##$DPNAME0= <>
##$DPNAME1= <>
##$DPNAME2= <>
##$DPNAME3= <>
##$DPNAME4= <>
##$DPNAME5= <>
##$DPNAME6= <>
##$DPNAME7= <>
##$DPOAL= (0..7)
0.5 0.5 0.5 0.5 0.5 0.5 0.5 0.5 
##$DPOFFS= (0..7)
0 0 0 0 0 0 0 0 
##$DQDMODE= 0
##$DR= 18
##$DS= 0
##$DSLIST= <SSSSSSSSSSSSSSS>
$$ [...]
##$SUBNAM2= <"">
##$SUBNAM3= <"">
##$SUBNAM4= <"">
##$SUBNAM5= <"">
##$SUBNAM6= <"">
##$SUBNAM7= <"">
##$SUBNAM8= <"">
##$SUBNAM9= <"">
##$SW= 16.880792210976
##$SWIBOX= (0..15)
0 0 2 0 0 0 0 0 0 0 0 0 0 0 0 0 
##$SW_h= 3378.37837837838
##$TD= 16384
##$TD0= 1
##$TE= 0
##$TE2= 300
##$TE3= 300
##$TEG= 300
##$TL= (0..7)
0 120 120 120 120 120 120 120 
##$TP= (0..7)
150 150 150 150 150 150 150 150 
##$TP07= 0
##$TPNAME0= <>
##$TPNAME1= <>
##$TPNAME2= <>
##$TPNAME3= <>
##$TPNAME4= <>
##$TPNAME5= <>
##$TPNAME6= <>
##$TPNAME7= <>
##$TPOAL= (0..7)
0.5 0.5 0.5 0.5 0.5 0.5 0.5 0.5 
##$TPOFFS= (0..7)
0 0 0 0 0 0 0 0 
##$TUNHIN= 0
##$TUNHOUT= 0
##$TUNXOUT= 0
##$USERA1= <user>
##$USERA2= <user>
##$USERA3= <user>
##$USERA4= <user>
##$USERA5= <user>
##$V9= 5
##$VALIST= <valist>
##$VCLIST= <CCCCCCCCCCCCCCC>
##$VD= 0
##$VDLIST= <DDDDDDDDDDDDDDD>
##$VPLIST= <PPPPPPPPPPPPPPP>
##$VTLIST= <TTTTTTTTTTTTTTT>
##$WBST= 1024
##$WBSW= 4
##$XGAIN= (0..3)
0 0 0 0 
##$XL= 0
##$YL= 0
##$YMAX_a= 146514
##$YMIN_a= -119241
##$ZGOPTNS= <>
##$ZL1= 120
##$ZL2= 120
##$ZL3= 120
##$ZL4= 120
##$ABSF1= 10
##$ABSF2= 0
##$ABSG= 5
##$ABSL= 3
##$ALPHA= 0
##$AQORDER= 0
##$ASSFAC= 0
##$ASSFACI= 0
##$ASSFACX= 0
##$ASSWID= 0
##$AUNMP= <proc_1d>
##$AZFE= 0.1
##$AZFW= 0.1
##$BCFW= 1
##$BC_mod= 2
##$BYTORDP= 1
##$COROFFS= 0
##$CY= 11.3945322036743
##$DATMOD= 1
##$DC= 2
##$DFILT= <>
##$DTYPP= 0
##$F1P= 16.9975609425685
##$F2P= -3.02152046262296
##$FCOR= 0.5
##$FTSIZE= 0
##$FT_mod= 4
##$GAMMA= 1
##$GB= 0.15
##$INTBC= 1
##$INTSCL= 1
##$ISEN= 128
##$LB= 0.24
##$LEV0= 0
##$LPBIN= 0
##$MAXI= 10000
##$MC2= 0
##$MEAN= 0
##$ME_mod= 0
##$MI= 1.114404
##$NCOEF= 0
##$NC_proc= 0
##$NLEV= 6
##$NOISF1= 3.799351
##$NOISF2= 2.8
##$NSP= 1
##$NTH_PI= 0
##$NZP= 0
##$OFFSET= 15.70392
##$PC= 1
##$PHC0= -10687.57
##$PHC1= 11.40089
##$PH_mod= 1
##$PKNL= yes
##$PPARMOD= 0
##$PSCAL= 0
##$PSIGN= 0
##$REVERSE= no
##$SF= 200.130013532006
##$SI= 16384
##$SIGF1= 3
##$SIGF2= 2
##$SINO= 400
##$SIOLD= 16384
##$SREGLST= <1H.CDCl3>
##$SSB= 0
##$STSI= 0
##$STSR= 0
##$SW_p= 3612.71676300578
##$SYMM= 0
##$S_DEV= 0
##$TDeff= 0
##$TDoff= 0
##$TI= <>
##$TILT= no
##$TM1= 0
##$TM2= 0
##$TOPLEV= 0
##$USERP1= <user>
##$USERP2= <user>
##$USERP3= <user>
##$USERP4= <user>
##$USERP5= <user>
##$WDW= 1
##$XDIM= 8192
##$YMAX_p= 0
##$YMIN_p= 0
$$ End of Bruker specific parameters
$$ ---------------------------------
##NTUPLES= NMR FID
##VAR_NAME=  TIME,          FID/REAL,        FID/IMAG
##SYMBOL=    X,             R,               I
##VAR_TYPE=  INDEPENDENT,   DEPENDENT,       DEPENDENT
##VAR_FORM=  AFFN,          ASDF,            ASDF
##VAR_DIM=   8192,          8192,            8192
##UNITS=     SECONDS,       ARBITRARY UNITS, ARBITRARY UNITS
##FACTOR=    0.000296,      1,               1
##FIRST=     0,             0,               0
##LAST=      2.424536,      0,               0
##MIN=       0,             -119241,         0
##MAX=       2.424536,      146514,          0
$$ Real data points
##PAGE= N=1
##DATA TABLE= (X++(R..R)), XYDATA
$$ [...]
$$ plain form
1938 880 -1089 907 -852 487 -49 11 455 -598 743 -781 638 -774 486 -219 230 334 -560
1955 -560 1012 -928 1049 -786 631 -104 -113 589 -842 914 -676 727 -414 686 -194 106 508
1972 508 -479 804 -807 1130 -708 511 -149 -356 418 -546 866 -749 732 -582 347 -176 -82
1989 -82 89 -545 786 -1314 912 -1024 478 -283 -121 212 -749 737 -1026 621 -600 109 -500
2006 -500 -232 161 -652 715 -869 771 -786 251 -130 -145 654 -825 845 -893 483 -571 649
2023 649 -14 -271 490 -472 659 -680 630 -684 503 163 22 487 -572 972 -807 804 -577
2040 -577 362 94 -247 556 -347 482 -944 797 -321 459 -53 -37 499 -722 898 -963 776 -700
2058 -700 59 -70 -314 377 -763 546 -807 546 -385 373 -315 -214 418 -879 551 -882 608
$$ packed form
1938H80j969J996j759J339n36O0M44j053J341j524J419j412J260p05M49J04q94
1955e60J572j940J977j835J417p35rP02j431J756j590J403j141J100q80L00M02
1972E08r87J283j611J937j838J219o60k07P74r64J412j615J481j314R29n23R4
1989h2J71o34J331k100K226j936J502p61J62L33r61J486j763J647j221P09o09
2006e00K68L93q13J367j584J640j557J037l81j5P99j479J670j738J376j054J220
2023F49o63k57P61r62J131j339J310j314J187l40j41M65j059J544j779J611j381
2040e77R39k68l41Q03r03Q29j426J741j118P80n12J6N36j221J620j861J739j476
2058g00P59j29k44O91j140J309j353J353r31P58o88J01O32j297J430j433J490
$$ plain form
2075 608 -712 449 40 -393 462 -700 486 -807 536 -525 294 -3 -231 482 -657 512 -772
2092 -772 775 -601 217 139 -106 743 -704 858 -563 774 -408 217 105 -61 558 -576 894
2109 894 -866 692 -473 263 251 -154 778 -863 996 -662 644 -368 282 77 -97 612 -379 708
2127 708 -347 457 -456 171 -32 -223 462 -810 662 -691 620 -260 205 58 -526 540 -589 485
2145 485 -812 457 -627 119 -57 -555 371 -560 581 -837 614 -499 55 -76 -633 465 -840
2162 -840 725 -734 386 -473 138 48 -255 404 -912 1070 -893 623 -366 262 38 -417 828 -652
2180 -652 666 -593 689 -421 205 101 -318 749 -464 678 -626 745 -478 284 252 -377 650
2197 650 -505 757 -740 451 -338 -104 323 -368 588 -502 618 -871 621 -229 176 205 -375 475
$$ packed form
2075F08j320J161m09m33Q55j162J186j293J343j061Q19k97k28P13j139J169j284
2092g72J547j376Q18p8k45Q49j447J562j421J337j182O25j12j66O19j134J470
2109H94j760J558j165P36j2m05R32j641J859j658J306j012O50k05j74P09r91J087
2127G08j055Q04r13O27k03j91O85j272J472j353J311q80M65j47n84J066j129J074
2145D85j297J269j084P46j76m98R26r31J141j418J451j113N54j31n57J098j305
2162h40J565j459J120q59O11r0l03O59j316J982j963J516r89O28k24m55J245j480
2180f52J318j259J282j110O26j04m19J067j213J142j304J371j223P62l2o29J027
2197F50j155J262j497J191p89K34M27o91R56j090J120j489J492q50M05K9n80Q50
$$ plain form
2215 475 -846 692 -708 550 -392 -72 86 -299 396 -832 583 -753 179 -474 45 10 -502 521
2233 521 -855 531 -627 247 -432 60 153 -503 478 -577 587 -527 574 -594 270 81 -315 830
2251 830 -646 738 -495 542 -109 104 436 -480 730 -434 654 -313 534 -208 115 460 -327 472
2269 472 -590 976 -773 667 -154 -37 203 -329 679 -525 635 -532 541 -169 107 148 -450
2286 -450 493 -953 706 -694 420 -155 -72 256 -501 516 -681 686 -550 257 -356 -67 195 -370
2304 -370 555 -656 686 -719 427 -219 -169 279 -431 632 -690 443 -633 402 -92 41 370
2321 370 -501 538 -429 648 -783 404 -125 -105 438 -306 616 -624 935 -472 167 -35 -101 383
2339 383 -352 607 -611 703 -356 415 -110 219 343 -504 763 -523 583 -488 475 -139 -57 348
$$ packed form
2215D75j321J538j400J258r42L20J58l85O95j228J415j336R32o53N19l5n12J023
2233E21j376J386j158Q74o79M92R3o56R81j055J164j114J101j168Q64j89l96J145
2251H30j476J384j233J037o51K13L32r16J210j164J088r67Q47p42L23L45p87P99
2269D72j062J566j749J440q21J17K40n32J008j204J160j167J073p10K76M1n98
2286d50R43j446J659j400J114n75Q3L28p57J017j197J367j236Q07o13K89K62n65
2304c70R25j211J342j405J146o46N0M48p10J063j322J133j076J035m94J33L29
2321C70q71J039r67J077j431J187n29K0N43p44R22j240J559j407O39k02o6M84
2339C83p35R59j218J314j059P71n25L29J24q47J267j286J106j071R63o14Q2M05
$$ plain form
2357 348 -496 590 -824 498 -362 316 -251 -134 365 -755 551 -812 466 -525 170 -47 -274 306
2375 306 -392 502 -676 541 -447 118 -113 -293 277 -605 608 -624 746 -531 86 -121 -403 522
2393 522 -572 596 -591 583 -507 299 -63 -2 471 -547 595 -468 587 -265 150 182 -187 564
2411 564 -719 787 -506 635 -388 267 -51 -21 440 -483 755 -352 703 -540 503 -27 -258
2428 -258 498 -503 585 -652 359 -411 108 112 -313 419 -599 551 -843 399 -620 55 -104 -480
2446 -480 312 -565 524 -814 482 -432 -16 45 -349 337 -718 615 -570 383 -234 31 -181 -290
2464 -290 388 -449 760 -647 388 -104 66 120 -177 699 -554 534 -591 401 -141 381 127 -371
2482 -371 653 -485 700 -550 627 -346 278 191 -446 803 -551 528 -460 445 -264 -25 115 -131
$$ packed form
2357C48q44J086j414J322q60O78n67J17M99j120J306j363J278r91O95k17k27N80
2375C06o98Q94j178J217r88N65k31j80N70q82J213j232J370j277O17k07k82R25
2393E22j094J168j187J174j090Q06l62O1M73j018J142j063J055q52M15L2l69P51
2411E64j283J506j293J141j023O55l18L0M61r23J238j107J055j243J043n30k31
2428b58P56j001J088j237J011p70N19Mm25P32j018J150j394J242j019O75j59l76
2446d80P92q77J089j338J296r14M16O1l94O86j055J333j185R53o17K65k12j09
2464b90O78q37J209j407J035m92J70N4k97Q76j253J088j125R92n42N22k54m98
2482c71J024j138J185j250J177r73O24q7o37J249j354J079r88R05p09K39J40k46
$$ plain form
2500 -131 319 -474 670 -598 410 -99 112 193 -219 380 -312 660 -606 241 -301 -58 29 -267 484
2519 484 -508 591 -467 470 -406 35 235 -218 253 -611 625 -523 357 -135 -140 121 -422 323 -413
2538 -413 645 -484 350 -168 92 86 -388 746 -488 222 -617 304 -266 -27 190 -564 624 -408 492
2557 492 -399 506 -114 126 214 -380 443 -482 588 -382 529 -81 -73 364 -318 620 -348 577 -422 253 -94
2578 -94 54 98 -331 404 -576 439 -486 487 -74 -188 261 -289 558 -602 461 -462 87 -136 4 308
2598 308 -515 427 -560 444 -479 301 -313 -100 282 -485 452 -684 284 -360 344 71 -308 265 -335
2617 -335 305 -505 525 -348 301 -262 165 307 -338 531 -587 515 -198 267 -1 -14 355 -455 501
2636 501 -426 729 -280 347 -30 -92 284 -603 861 -516 443 -473 330 125 -199 362 -511 409 -362
$$ packed form
2500a31M50p93J144j268J008n09K11Q1m12N99o92R72j266Q47n42K43Q7k96P51
2519D84r92J099j058R37q76M41K00m53M71q64J236j148Q80m92nK61n43P45p36
2538d13J058j129Q34n18K60om74J134j234P10q39R21n70K39K17p54J188j032R00
2557D92q91R05o20K40Q8n94Q23r25J070r70R11o10QM37o82R38r68R25r99O75l47
2578i4J48M4m29P35r80J015r25R73n61j14M49n50Q47j160J063r23N49k23J40L04
2598C08q23R42r87J004r23P80o14K13L82p67R37j136R68o44P04k73l79N73o00
2617c35O40q10J030q73O49n63M27J42o45Q69j118J102p13M65k68j3L69q10R56
2636E01r27J155j009O27l77o2L76q87J464j377R59r16Q03k05l24N61q73R20p71
$$ plain form
2655 -362 326 -403 166 -19 -24 212 -560 435 -527 513 -657 241 -227 -275 210 -645 677 -546 423 -315
2675 -315 200 -29 -245 374 -581 371 -570 393 -464 60 -175 -175 275 -513 367 -655 536 -162 116 118 -103
2696 -103 214 -293 671 -633 410 -545 300 -27 44 423 -402 670 -229 418 -125 142 114 -306 365 -404
2716 -404 444 -521 519 -282 -8 45 -85 629 -436 686 -407 537 -509 -12 177 -325 323 -524 472
2735 472 -820 365 -139 162 -31 -192 328 -530 730 -707 466 -461 -78 104 -299 398 -519 402
2753 402 -661 472 -307 67 79 -157 328 -761 567 -638 370 -235 145 105 -295 495 -655 479
2771 479 -433 395 -232 241 240 -84 569 -598 608 -254 457 -448 153 230 -151 453 -457 377 -565 461
2791 461 -139 169 180 -230 452 -544 706 -487 356 -363 -27 267 -237 230 -658 602 -625 436 -232
$$ packed form
2655c62O88p29N69j85nK36p72R95r62J040j170Q98m68m8M85q55J322j223R69p38
2675c15N15k29k16O19r55R52r41R63q57N24k35%M50p88Q80j022J191o98K78Kk21
2696a03L17n07R64j304J043r55Q45l27P1L79q25J072q99O47n43K67k8m20O71p69
2716d04Q48r65J040q01K74N3j30P14j065J122j093R44j046M97J89n02O48q47R96
2735D72j292J185n04L01j93j61N20q58J260j437J173r27L83J82m03O97r17R21
2753D02j063J133p79L74J2k36M85j089J328j205J008o05L80m0m00P90j150J134
2771D79r12Q28o27M73jl24O53j167J206q62P11r05O01P7l81O04r10Q34r42J026
2791D61o00L08J1m10O82r96J250j193Q43p19L36K94n04M67q88J260j227J061o68
$$ plain form
2810 -232 -185 184 -232 433 -573 322 -417 292 -82 -278 -66 -492 317 -818 469 -518 296 0 177
2829 177 219 -440 308 -576 539 -357 361 -260 210 358 -441 420 -554 538 -530 426 -209 111 117 -392
2849 -392 599 -397 541 -499 332 -231 -4 255 -248 373 -467 551 -308 211 -2 49 303 -283 544 -515
2869 -515 527 -314 432 99 -63 331 -170 322 -549 720 -334 222 -205 -171 345 -443 653 -498 411
2888 411 -349 359 -201 -253 139 -432 385 -372 363 -528 360 -218 -87 348 -524 329 -601 582 -456 346
2908 346 -208 -151 302 -370 475 -455 711 -435 197 -69 -232 451 -319 315 -488 518 -152 230 51
2927 51 -78 379 -368 713 -512 409 -104 158 -211 -61 145 -491 547 -476 352 -225 108 26 -168
2946 -168 499 -362 545 -460 512 -369 150 -26 -52 418 -419 467 -614 403 -425 12 -2 -270 217 -368
$$ packed form
2810b32M7L69m16O65j006Q95p39P09l74j96K12m26Q09j135J287r87Q14k96J77
2829A77M2o59P48q84J115q96P18o21M70J48p99Q61r74J092j068R56o35L20On09
2849c92R91r96R38j040Q31n63K27K59n03O21q40J018q59N19k13N1K54n86Q27j059
2869e15J042q41P46l33j62L94n01M92q71J269j054N56m27L4N16p88J096j151R09
2888D11p60P08n60n2L92n71Q17p57P35q91Q88n78J31M35q72Q53r30J183j038Q02
2908C46n54N7M53o72Q45r30J166j146O32k66j63O83p70O34q03J006o70L82j79
2927E1j29M57p47J081j225R21n13K62l69J50K06o36J038j023Q28n77L33q2j94
2946a68O67q61R07j005R72q81N19j76k6M70q37Q86j081J017q28M37j4k68M87n85
$$ plain form
2966 -368 270 -567 345 -299 -155 151 -450 260 -421 452 -593 401 -445 8 -59 -148 274 -509 615 -742
2986 -742 337 -336 163 95 -10 397 -472 521 -321 355 -193 129 -78 -244 594 -421 506 -389 310 -233
3006 -233 142 62 -77 286 -528 719 -390 457 -255 224 99 -132 516 -266 511 -289 431 -280 266 17
3026 17 -351 338 -404 383 -704 431 -123 197 123 -435 223 -568 484 -516 142 -296 -185 -56 -192
3045 -192 341 -556 496 -598 205 -353 -68 -89 -274 409 -540 417 -344 351 -173 97 -3 -451 423 -392
3065 -392 365 -512 341 -234 175 150 -355 592 -268 393 -412 594 -320 73 205 -362 243 -345 449 -401
3085 -401 575 -69 141 261 -70 470 -376 458 -531 424 10 81 -15 -405 475 -382 547 -464 135 -195
3105 -195 85 100 -322 239 -676 268 -354 222 -232 -282 37 -322 349 -482 298 -535 268 -293 84 222 -555
$$ packed form
2966c68O38q37R12o44J44L06o01P10o81Q73j045R94q46M53o7q9M22p83J124j357
2986g42J079o73M99o8j05M07q69R93q42O76n48L22k07j66Q38j015R27q95O99n43
3006b33L75q0j39L63q14J247j109Q47p12M79j25k31O48p82P77q00P20p11N46k49
3026A7l68O89p42P87j087J135n54L20p4n58O58p91J052j000O58m38J11J29j36
3045a92N33q97J052j094Q03n58K85k1j85O83r49R57p61O95n24K70j00m48Q74q15
3065c92P57q77Q53n75M09k5n05R47q60O61q05J006r14L93J32n67O05n88P94q50
3085d01R76o44K10J20l31N40q46Q34r89R55m14P1r6l90Q80q57R29j011N99l30
3105a95K80J5m22N61r15R44o22N76m54n0L19l59O71q31P80q33Q03n61L77J38p77
$$ plain form
3126 -555 321 -534 487 -386 206 -283 -56 255 -509 533 -525 460 -457 519 -162 -299 229 -310 496
3145 496 -343 469 -472 340 181 -106 98 -271 398 -371 627 -291 363 -64 -84 145 -354 652 -427 404
3165 404 -275 245 57 -122 191 -334 416 -637 450 -391 113 -91 -206 149 -395 486 -481 309 -295
3184 -295 297 21 -259 252 -457 246 -416 331 -400 91 -88 -131 214 -385 334 -568 334 -416 -10 -7 -232
3205 -232 193 -281 301 -505 233 -148 157 -118 -200 163 -385 479 -415 223 -463 226 -91 -73 356 -433 380
3226 380 -427 333 -127 199 79 -136 309 -294 579 -329 397 -262 267 22 -209 471 -528 438 -408 312
3246 312 -265 151 84 -151 427 -456 371 -347 345 -308 18 116 -410 279 -269 435 -327 275 -120 -37 53
3267 53 -252 140 -472 409 -420 331 -250 50 61 -143 441 -606 214 -397 204 -261 -88 189 -87 268
$$ packed form
3126e55Q76q55J021q73N92m89K27L11p64J042j058R85r17R76o81j37N28n39Q06
3145D96q39Q12r41Q12j59k87K04l69O69p69R98r18O54m27k0K29m99J006j079Q31
3165D04o79N20j88j79L13n25P50j053J087q41N04k04j15L55n44Q81r67P90o04
3184b95N92k76k80N11p09P03o62P47p31M91j79m3L45n99P19r02R02p50M06Lk25
3205b32M25m74N82q06P38l81L05k75q2L63n48Q64q94O38o86O89l17J8M29p89Q13
3226C80q07P60m60L26j20k15M45o03Q73r08P26o59N29k45k31O80r99R66q46P20
3246C12n77M16o7k35N78q83Q27p18O92o53L26R8n26O89n48P04p62O02l95Q3R0
3267E3l05L92o12Q81q29P51n81L00J1k04N84j047Q20o11O01m65J73K77k76L55
$$ plain form
3287 268 -576 356 -234 328 -166 -25 139 -229 467 -521 374 -159 167 -273 157 155 -288 449 -248 510 -232
3308 -232 406 -41 5 278 -270 620 -242 338 -171 245 -68 271 55 -56 112 -449 346 -419 243 -105
3328 -105 -116 262 -321 323 -297 547 -187 221 -28 -95 73 -219 282 -439 452 -312 169 -155 -11 181 -297
3349 -297 419 -629 238 -377 10 -123 -41 -56 -272 166 -531 438 -186 167 70 -22 26 -175 266 -381 388
3370 388 -448 240 -151 -40 248 -206 225 -576 405 -425 514 -6 207 290 -173 483 -53 501 -381 62
3390 62 -218 301 199 -273 292 -307 367 -150 179 -181 128 -34 -536 220 -311 291 -424 329 -255 -228 219
3411 219 -216 220 -336 6 -114 179 -128 -155 75 -269 247 -387 279 -299 -61 -53 -159 180 -181 154 -494
3432 -494 226 -423 149 -35 -47 173 -202 83 -322 282 -348 262 -117 88 233 -238 307 -424 493 -286
$$ packed form
3287B68q44R32n90N62m94J41J64l68O96r88Q95n33L26m40M30km43P37o97P58p42
3308b32O38m47M6K73n48Q90q62N80n09M16l13L39k16j11J68n61P95p65O62l48
3328a05j1L78n83O44o20Q44p34M08k49o7J68k92N01p21Q91p64M81l24J44J92m78
3349b97P16j048Q67o15L87j33Q2j5k16M38o97R69o24L53r7r2M8k01M41o47P69
3370C88q36O88l91J11K88m54M31q01R81q30R39n20K13Q3m63O56n36N54q82M43
3390F2k80N19j02m72N65n99O74n17L29l60L09j62n02P56n31O02p15P53n84K7M47
3411B19m35M36n56L42j20K93l07k7K30l44N16o34O66n78K38Qj06L39l61L35o48
3432d94P20o49N72j84j2K20l75K85m05O04o30O10l79K05J45m71N45p31R17p79
$$ plain form
3452 -286 149 94 -55 145 -343 426 -299 321 -16 120 -15 98 132 -307 414 -251 6 -328 182 -13 140
3473 140 164 -213 310 -215 177 -90 111 -171 13 85 -562 262 -424 280 -326 68 32 -12 99 -188 326
3494 326 -263 168 -266 167 -147 -134 262 -336 327 -278 112 -289 30 86 -61 266 -388 273 -422 390 -81
3515 -81 -92 60 -55 344 -296 196 -275 177 -142 284 38 -146 163 -320 440 -310 101 -191 127 120 -168
3536 -168 339 -284 414 -71 348 115 -3 149 -199 316 -286 127 -341 468 -244 9 141 -246 199 -228
3556 -228 153 -463 328 50 175 157 -192 -47 -288 316 -67 90 -233 -36 51 -161 122 -466 331 -180 93
3577 93 -99 -223 -19 -96 220 -502 234 -243 59 -145 -6 7 -135 151 -335 136 -260 105 -169 152 143 -169
3599 -169 337 -343 360 -259 300 -181 107 265 -97 185 -418 290 -286 108 -25 -13 98 -144 130 -226
$$ packed form
3452b86M35n5j49K00m88P69p25O20l37J36j35J13L4m39P21o65K57l34N10j95J53
3473A40K4l77N23n25L92k67K01k82J84P2o47Q24o86P04o06L94l6m4J11k87N14
3494C26n89M31m34M33l14J3L96n98O63o05L90m01L19N6j47L27o54O61o95Q12m71
3515h1j1J52j15L99o40M92m71M52l19M26k46j84L09m83P60p50M11k92L18pk88
3536a68N07o23O98m85M19k33j18J52l48N15o02M13m68Q09p12K53J32l87M45m27
3556b28L81o16P91k78J25j8l49J45k41O04l83J57l23J97Q7k12K83n88P97n11K73
3577I3j92j24K04p7L16p22P36m77L02k04J39J3j42K86m86M71l96L65k74L21rl12
3599a69N06o80P03o19N59m81K88J58l62K82o03P08n76L94j33J2J11k42K74l56
$$ plain form
3619 -226 475 -212 73 139 168 172 -205 281 -354 180 -319 199 31 32 94 -260 223 -455 202 -254 259 -156
3641 -156 -142 -42 27 318 -468 197 -422 185 -140 -12 -3 -210 70 -181 417 -200 229 -148 1 191 -132
3662 -132 184 -86 193 -166 6 65 -86 95 -60 148 -367 206 -417 123 127 -91 196 58 195 -499 469
3683 469 -310 321 -59 -116 254 -48 267 -154 144 -146 107 -29 -206 149 26 254 -99 365 -278 27
3703 27 29 -19 205 -316 165 -274 130 -30 -9 -71 -219 132 -25 249 -228 188 -176 263 -222 -59 274 -261
3725 -261 381 -337 231 -251 -45 75 58 210 -303 246 -192 257 -228 187 42 30 217 -153 115 -140 327
3746 327 -148 -57 110 -58 263 -225 244 -89 212 -145 143 147 -88 209 -282 485 -51 365 -45 198 40
3767 40 -16 228 -139 143 -187 243 -279 -37 47 -51 170 -115 94 -210 153 -106 212 -94 -109 119 -347 -45
$$ packed form
3619b26P01o87K85O6K9Ml77M86o35N34m99N18j68JO2l54M83o78O57m56N13m15
3641a56J4J00O9K91p86O65o19O07l25J28Rk07K80k51N98o17M29l77J49J90l23
3662a32L16k70K79l59J72N9j51J81j55K08n15N73o23N40Mk18K87j38J37o94R68
3683D69p79O31l80n7L70l02L15m21K98k90K53j36j77L55j23K28l53M64o43L05
3703B7Km8K24n21M81m39M04j60K1o2j48L51j57K74m77M16l64M39m85J63L33n35
3725b61O42p18N68m82K06J20j7J52n13N49m38M49m85M15j45j2J87l70K68k55M67
3746C27m75R1J67j68L21m88M69l33L01l57K88Mk35K97m91P67n36M16m10K43j58
3767D0n6K44l67K82l30M30n22K42Q4r8K21k85K09l04L63k59L18l06j5K28m66L02
$$ plain form
3789 -45 -264 153 -63 222 -87 -17 98 -370 220 -193 130 -130 15 -64 -195 214 -310 152 -294 204 -141
3810 -141 15 21 -252 33 -212 436 -119 212 72 64 151 -100 253 -62 281 -190 92 -111 -44 242 -309 273
3832 273 -145 428 -155 72 -164 142 -48 -254 242 -203 185 -193 172 -223 136 107 -202 190 -184 57
3852 57 -326 -10 -4 41 92 71 66 -245 258 -235 85 -191 65 -37 -22 289 -136 305 -234 240 -181 132 -33
3875 -33 -112 155 -89 345 -334 69 125 322 1 -162 47 -214 24 -102 25 -139 6 155 -148 391 -147
3896 -147 284 -185 372 -81 -85 82 -119 149 -243 199 -195 49 -128 -77 70 -190 69 -85 393 -354 198
3917 198 -12 164 69 16 118 -78 371 -416 67 -35 -76 -4 -199 -113 -194 180 -391 84 -155 97 145 -149
3939 -149 80 -333 115 -17 278 66 280 29 -134 203 -271 193 -130 131 118 -151 62 -125 136 -235
$$ packed form
3789d5k19M17k16K85l09P0J15m68N90m13L23k60J45p9j31M09n24M62m46M98l45
3810a41J56Ok73K85k45O48n55L31j40qQ7k51L53l15L43m71K82k03O7K86n51N82
3832B73m18N73n83K27k36L06j90k06M96m45L88l78L65l95L59k9l09L92l74K41
3852E7l83L16OM5N1k1nl11N03m93L20k76K56j02J5L11m25M41n39M74m21L13j65
3875c3p9K67k44M34o79M03N6J97l21j63K09k61K38j26J27j64J45J49l03N39n38
3896a47M31m69N57m53mJ67k01K68l92M42l94K44j77N1J47k60K59j54M78p47N52
3917A98k10J76r5n3J02j96M49p87M83j02m1P2j95Q6q1L74n71M75k39K52M8k94
3939a49K29m13M48j32K95k12K14k51j63L37m74M64l23K61j3k69K13j87K61l71
$$ plain form
3959 -235 33 -307 254 -201 -33 -217 -147 312 -148 243 -109 163 -47 -63 267 -212 124 -268 265 -222 201
3980 201 -224 -346 2 -169 293 -217 455 -247 36 -126 5 156 -143 248 -281 355 -281 90 -162 -38
4000 -38 205 -329 287 -194 275 -116 166 -270 -96 133 -172 81 -271 25 -159 -10 -5 -134 358 -32 102
4021 102 26 96 -210 51 13 -10 175 -198 37 -202 129 -383 -3 -213 16 91 -240 14 -282 344 -272 22
4043 22 -59 39 269 -87 260 -246 -2 62 69 -73 -34 219 -110 65 -18 216 -7 171 -62 18 183 -275 203
4066 203 -53 265 139 324 38 18 149 -154 137 -219 52 -164 197 27 -93 82 -282 141 -397 82
4086 82 -316 -32 -258 172 -64 -437 13 -407 224 -155 -85 12 -28 25 -368 344 -205 203 -47 -67 -114 -183 36
4109 36 -289 243 -164 137 -60 125 -99 -138 69 -280 26 4 128 -107 167 -280 -257 147 -233 94 -35
$$ packed form
3959b35K68l40N61m55J68j84P0M59m60L91l52K72k10j6L30m79L36l92N33m87M23
3980B01m25j22L48j71M62n10O72p02K83j62J31J51k99L91n29O36o36L71k52J24
4000c8K43n34O16m81M69l91K82m36J74K29l05K53l52K96j84J49Nj29M92l90J34
4021A02p6P0l06K61l8k3J85l73K35k39L31n12L80k10K29P5l31K54k96O26o16K94
4043B2q1R8K30l56L47n06K44O4Pj42L9K53l29J75q3K34k23J78k33Q0J65m58M78
4066B03k56L18j26J85k86k0J31l03K91l56K71k16L61j70j20J75l64M23n38M79
4086H2l98K84k26M30k36l73M50m20O31l79P0R7m0N3l93P12n49M08k50k0m7o9K19
4109C6l25N32m07L01j97J85k24l9K07l49L06k2J24k35K74m47K3M04l80L27j29
$$ plain form
4130 -35 396 -188 -64 18 -41 148 -271 154 -310 168 -101 81 -55 64 -55 -86 208 -175 62 -227 -28
4151 -28 -302 -84 263 -257 140 -237 124 -322 0 49 31 161 -45 178 -306 56 -154 -86 39 -174 44
4172 44 -238 258 -184 52 -94 148 164 -74 296 -91 98 -14 137 -62 -207 46 78 71 -354 220 -250 116
4194 116 -161 -7 101 48 26 -152 389 53 147 -47 -48 64 -238 134 15 163 -114 369 -24 -78 180 -96
4216 -96 -12 -309 225 -154 221 5 72 168 -63 158 -194 318 -190 13 -137 -134 179 -124 190 -295 265 38
4238 38 1 -175 -62 21 -143 157 -205 28 -151 192 -96 107 78 -177 57 -137 292 -131 56 9 -55 176
4260 176 -135 168 -256 98 -119 144 143 19 80 -133 233 -280 14 -76 176 7 171 81 -83 107 -340 135
4282 135 -183 -88 33 -112 45 -249 112 -147 124 -95 -78 -204 119 132 -104 258 -139 260 -88 -6 -56 -15
$$ packed form
4130c5M31n84J24Q2n9J89m19M25m64M78k69J82j36J19j19l1K94l83K37k89J99
4151b8k74K18L47n20L97l77L61m46L22M9j8J30k06K23m84L62k10O8J25k13K18
4172D4k82M96m42K36j46K42J6k38L70l87J89j12J51j99j45K53L2pm25N74m70L66
4194A16k77J54J08n3k2j78N41l36R4j94jJ12l02L72j19J48k77M83l93n4K58k76
4216i6Q4k97N34l79L75k16O7R6k31K21l52N12n08K03j50LL13l03L14m85N60k27
4238C8l7j76J13Q3j64L00l62K33j79L43k88K03k9k55K34j94M29m23J87m7o4K31
4260A76l11L03m24L54k17K63jj24O1k13L66n13K94r0K52j69J64r0j64J90m47M75
4282A35l18R5J21j45J57k94L61k59K71k19J7j26L23J3k36L62l97L99l48Q2n0M1
$$ plain form
4304 -15 96 -179 285 -327 134 -111 73 15 -152 108 -92 -32 -133 178 -241 -49 81 143 2 47 59 -166
4326 -166 245 -164 282 -90 -29 112 -429 105 -385 130 -187 -134 -148 -113 222 -9 78 -308 254 134 -7 13
4348 13 190 52 -156 254 -145 30 -48 154 140 -132 282 1 143 -108 132 -9 64 -212 -77 -13 -126 -43
4370 -43 -125 -3 -170 62 -77 -91 114 -90 -106 -129 211 -19 -52 -122 95 15 -177 183 -240 75 22 -39 -84 -37
4394 -37 30 -190 233 -291 158 -28 126 90 -183 94 -404 198 -189 58 -177 -3 -71 67 286 -165 167
4415 167 -116 -7 70 223 97 -81 266 -131 92 -140 281 -330 86 167 -90 -1 -288 343 -225 157 -152
4436 -152 69 104 -43 69 -291 223 -247 78 -22 154 -22 -128 156 63 136 -68 43 -150 -282 -123 -124 325
4458 325 17 217 -110 89 -100 76 68 -102 188 -115 241 -73 30 -138 111 163 -20 -22 -97 -24 -245 102
$$ packed form
4304a5J11k75M64o12M61k45J84n8j67K60k00O0j01L11m19J92J30O2j41M5J2k25
4326a66M11m09M46l72O1J41n41N34m90N15l17N3j4L5L35k31Q7l86N62j20j41K0
4348A3J77j38k08M10l99J75p8K02j4k72M14k81J42k51K40j41P3k76J35O4j13Q3
4370d3q2J22j67K32j39j4K05k04j6k3L40k30l3p0K17q0j92L60m23L15n3o1m5M7
4394c7O7k20M23n24M49j86J54l6k73K77m98O02l87K47k35J74o8J38K19m51L32
4415A67k83J09P7J53j26j78L47l97K23k32M21o11M16Q1k57Q9k87O31n68L82l09
4436a52K21L5j47J12l60N14m70L25j00J76j76j06K84r3P3k04J11j93j32J59jM49
4458C25l08K00l27J99j89J76qj70K90l03L56l14J03j68K49N2j83kp5P3k21L47
$$ plain form
4480 102 -231 -6 -23 -210 298 -426 36 67 244 -170 -195 20 -106 76 -137 108 -48 67 20 32 133 -146
4502 -146 138 -36 271 -268 -7 177 -5 11 -94 245 -7 256 62 -145 -105 225 101 71 192 -135 104
4523 104 -70 3 -42 93 93 -165 148 -216 26 -41 60 -81 28 -43 -71 99 70 -10 -134 -31 -195 103 89
4546 89 -78 -83 -90 100 -305 -58 40 -136 -333 -106 32 -276 140 -161 -8 -182 -76 -125 -138 171 -177 -34 -136
4569 -136 -40 213 237 -22 118 238 -257 43 -97 22 26 -25 160 46 39 25 404 -133 -12 98 192 193 105 204
4593 204 11 -42 -227 123 -53 -331 152 -142 337 -57 30 -298 -193 -52 -185 23 -3 117 -226 51 -143
4614 -143 73 6 -81 -120 -14 142 -242 82 -287 55 28 -200 122 -303 86 -92 102 -87 60 69 -72 82
4636 82 28 128 -67 48 -55 44 35 173 82 -60 202 8 205 -138 -39 -100 -101 14 126 23 -207 112 -117
$$ packed form
4480A02l33K25j7j87N08p24M62L1J77m14k5K15j26J82k13K45j56J15m7J2J01k79
4502a46K84j74L07n39K61J84j82J6j05L39k52K63j94k07M0L30j24l0J21l27K39
4523A04j74P3m5J35%k58L13l64K42o7J01j41J09p1k8J70k9q0j24J03j64K98j4
4546H9j67npJ90m05K47R8j76j97K27J38l08M16l01J53j74J06m9j3L09l48J43j02
4569a36R6K53K4k59J40J20m95L00j40J19Mn1J85j14pj4L79n37J21J10R4Jq8R9
4593B04j93n3j85L50j76k78M83k94M79l94Q7l28J05J41j33K08k6J20l43K77j94
4614a43K16o7q7l9J06J56l84L24l69L42k7k28L22m25L89j78J94j89J47Rj41J54
4636H2n4J00j95J15j03R9rJ38r1j42K62j94J97l43R9o1jJ15J12j03k30L19k29
$$ plain form
4659 -117 -10 -75 -37 -23 136 255 -231 236 -38 134 81 115 -29 -165 155 -52 287 -19 11 152 118 -4
4681 -4 -205 -20 -352 16 -46 -85 -214 -114 208 -187 179 -187 47 46 60 96 -282 57 -313 3 -68 135 -142
4704 -142 -138 3 -33 170 -6 137 -168 66 -46 -24 48 -127 112 -204 124 25 -106 25 -83 153 -55 22
4726 22 -76 48 -122 204 13 -46 83 84 151 -187 34 30 164 -52 -25 111 -13 -23 -180 170 -64 -81 -94 -168
4750 -168 -3 -137 31 -58 305 -17 -69 115 -34 63 28 -1 -45 77 -116 175 -87 -55 136 -23 -51 -231 -59
4773 -59 64 134 104 -11 -110 -22 20 -51 -9 -328 192 98 32 169 -132 -157 -118 313 -207 38 -10 -21 117 11 98
4798 98 -99 195 -202 -89 110 0 -30 -140 5 -109 319 -48 -19 -35 44 53 -69 170 -87 -90 -142 -64 -154 35
4822 35 -122 -31 -46 -200 -51 -143 183 203 30 -6 -64 79 -270 -50 -112 231 75 -102 -179 -142 -38 -137 36 -16
$$ packed form
4659a17J07o5L8J4J59J19m86M67k74J72n3L4j44j36L20k07L39l06L0J41l4j22
4681dk01J85l32L68o2l9j29J00L22l95L66l66K34jJ4L6l78L39l70L16p1K03k77
4704a42MJ41l6K03j76J43l05K34j12K2P2j75K39l16L28r9j31J31j08K36k08P7
4726B2r8J24j70L26j91n9J29JO7l38K21mJ34k16K7J36j24j0j57L50k34j7j3p4
4750a68J65j34J68q9L63l22n2J84j49R7l5k9m4J22j93K91k62L2J91j59k8j80J72
4773e9J23P0l0j15r9Q8M2p1M2l19N20r4o6J37l01k5L9M31n20K45m8j1J38j06Q7
4798I8j97K94l97J13J99j10l0j10J45j14M28l67K9j6P9Rj22K39k57ln2P8r0J89
4822C5j57R1j5j54J49r2L26K0j73l6n8J43l49K20o2L43j56j77p7L7J04r9J73n2
$$ plain form
4846 -16 73 -52 -140 84 16 1 30 227 73 -84 78 -117 -119 -5 168 -109 191 -308 161 -25 -62 11 -99
4869 -99 254 -214 89 -106 0 -56 86 -13 -216 243 -96 77 46 87 -43 16 126 -7 -72 -272 31 -109
4891 -109 -133 47 57 258 124 192 -52 148 -233 -17 -62 -32 -42 61 271 -23 99 -51 -12 15 27 -77 -36
4914 -36 164 49 -92 90 235 118 66 -65 -19 191 -254 217 -173 141 -91 255 -47 -227 -44 -47 144 -62
4936 -62 156 -187 -122 100 -11 -1 -125 140 -56 122 9 0 291 -18 53 78 194 14 259 -99 57 155 -42
4959 -42 25 -110 -23 56 146 -34 -162 -109 1 24 -110 10 -201 -20 -207 -61 260 -116 54 -136 248 -203
4981 -203 44 -24 -85 -127 89 -78 2 -141 -39 31 -73 -14 58 -86 148 59 150 -4 -43 -65 -204 -100 -96 20
5005 20 2 114 37 188 -73 -276 75 -57 7 32 -56 -74 -11 7 71 112 -110 132 -36 125 4 104 -83 88
$$ packed form
4846a6Q9j25q8K24o8j5K9J97j54j57J62j95kJ14J73k77L00m99M69j86l7P3j10
4869i9L53m68L03j95J06n6J42r9k03M59l39J73l1M1j30N9J10j33o5k00L03j40
4891a09k4J80J0K01j34O8k44K00l81K16m5L0j0J03K10k94J22j50L9K7J2j04M1
4914c6K00j15j41J82J45j17n2j31M6K10m45M71l90L14k32L46l02j80J83lJ91k06
4936f2K18l43O5K22j11J0j24K65j96J78j13rK91l09P1K5J16j80K45l58J56R8j97
4959d2O7j35Q7P9R0j80j28N3J10K3j34J20k11J81j87J46L21l76J70j90L84m51
4981b03K47o8o1m2K16j67Q0j43J02P0j04N9P2j44K34q9R1j54l9k2j39J04MJ16
5005B0j8J12p7J51k61k03L51j32O4K5q8j8O3J8O4M1k22K42j68J61j21J00j87J71
$$ plain form
5029 88 75 -19 255 -154 219 -105 23 -105 32 97 -191 142 35 -157 94 -177 27 77 89 -132 197 -3
5051 -3 41 -133 -57 -81 -97 105 -105 157 -49 11 7 80 6 -227 50 -27 231 55 -21 24 -95 136 8 38 -127
5076 -127 18 -164 172 -35 -68 -179 60 11 -81 134 -104 -41 -82 42 22 -194 150 -234 120 -48 -14 -91 2
5099 2 38 -73 -81 -65 209 -137 186 -62 103 -144 -184 151 -101 -84 28 -54 36 190 -102 -55 85 -28 398 -103
5123 -103 -73 -124 135 66 -285 111 -84 199 -76 -14 5 -66 64 48 -49 -310 24 -66 235 242 118 3 7 95 -69
5148 -69 36 -238 137 -7 -176 46 -254 47 -79 130 110 -9 -152 -62 76 -36 54 -97 -86 -176 111 -78
5170 -78 88 159 36 155 -27 103 15 -124 4 173 82 -125 -29 -173 71 -49 188 -109 -50 66 28 90 -4
5193 -4 80 -45 177 7 -86 3 41 106 -115 145 -104 37 -14 -106 98 23 -1 -214 25 84 98 83 -87 1 -73
$$ packed form
5029H8j3r4K74m09L73l24J28j28J37O5k88L33j07j92K51k71K04N0J2k21L29k00
5051cM4j74P6k4j6K02k10K62k06O0mP3p4k33K77p7K58j76p6M5j19K31j28L0j65
5076a27J45j82L36k07l3j11K39m9r2K15k38O3m1J24k0k16L44l84L54j68L4p7R3
5099BL6j11qJ6K74l46L23k48J65k47m0L35k52J7J12q2R0J54k92M7J40j13M26n01
5123a03L0n1K59o9l51L96j95K83k75O2J9p1J30j6r7k61L34r0L01Pj24j15MQ8j64
5148f9J05k74L75j44j69K22l00L01j26K09k0j19j43R0J38j12R0j51J1r0K87j89
5170g8J66P1j23J19j82J30q8j39J28J69r1k07R6j44K44j20K37k97N9J16l8O2r4
5193dQ4j25K22j70r3Q9L8O5k21K60k49J41n1r2K04p5k4k13K39N9J4j5j70Q8p4
$$ plain form
5218 -73 312 46 176 -120 -54 12 126 339 -148 55 -135 171 -83 17 125 77 130 -209 -36 -72 87 -46
5240 -46 75 -44 134 -30 21 56 -335 153 -261 80 69 89 121 -67 -4 -12 76 161 198 -93 4 33 -150 40 -8
5265 -8 252 -24 -76 63 -120 -99 -136 -45 -80 -95 -205 27 -9 41 115 -99 113 -80 -13 61 26 27 -78 42 -145
5290 -145 -4 -98 30 114 143 -151 -79 142 -117 -17 -173 -80 -252 19 -54 6 -5 -99 11 -200 290 79 148
5313 148 65 -59 110 46 35 -179 132 -55 -30 218 79 -28 -118 64 -88 -141 -241 -18 151 -124 75 36
5335 36 174 87 54 -38 134 -59 -188 94 -71 128 -266 180 141 -45 -28 -11 68 39 -18 -14 193 -61 125 23
5359 23 -2 -86 -122 14 37 131 -46 -167 -12 -3 180 67 -15 97 146 139 251 -92 -33 138 -60 -8 -97 147 -236
5384 -236 -32 70 -13 29 29 -84 -51 140 -9 42 -6 -48 80 96 92 155 88 31 -20 34 -123 185 31 176 61
$$ packed form
5218g3L85k66J30k96O6O6J14K13m87K03j90L06k54J00J08m8N3l39J73l6J59j33
5240d6J21j19J78j64N1L5l91M88m14L41j1K0L2j88O3qQ8Q5L7k91R7K9j83J90m8
5265hK60k76n2J39j83K1l7R1l5j5j10K32l6N0P4k14K12j93O7P4l5Jj05J20j87
5290a45J41r4J28Q4K9k94P2K21k59J00j56R3j72K71p3O0j1r4J10k11M90k11O9
5313A48q3j24J69o4j1k14L11j87K5K48j39j07r0J82j52n3j00K23J69k75J99l9
5335C6J38q7l3r2J72j93j29K82j65J99l94M46l9j86J7J7P9k9n7MK07k54J86j02
5359B3k5q4l6J36K3R4j77j21J55RJ83j13q2J12M9pJ12l43N9J71j98N2q9K44l83
5384b36K04J02q3M2%j13L3J91j49N1m8m2J28J6mO3o7n7n1N4j57L08j54J45j15
$$ plain form
5409 61 79 -24 64 23 26 13 -13 72 -47 -217 118 144 27 55 98 34 110 -124 68 -102 148 70 -125 -81 -65 204
5435 204 -203 220 -82 54 -3 -51 32 -18 99 -171 -28 -135 -52 26 -103 61 -112 171 -148 40 39 -37 -48
5458 -48 10 96 92 172 10 -91 50 -14 94 97 111 -50 137 140 28 -32 142 73 -106 154 -81 -34 -136 127 23
5483 23 149 171 -74 229 -145 66 -126 22 35 30 -173 -152 115 -175 261 -6 99 -156 51 -30 -356 -71
5505 -71 -113 148 -74 -101 2 -79 117 -30 228 -60 27 75 56 120 -16 -140 155 82 -321 142 13 -37 -52 -146
5529 -146 10 -1 143 -47 167 104 -5 -141 -35 -6 -67 67 -205 281 -106 106 -2 -67 -129 -44 24 -33 67
5552 67 -163 165 -72 47 50 -246 40 10 165 -74 51 -192 -83 98 -99 46 -50 85 227 -121 88 -67
5574 -67 -161 -107 -7 -132 255 -216 -78 -31 -33 61 -154 34 -222 59 65 34 -76 -95 -96 -244 106 45 -74 -175 320
$$ packed form
5409F1J8j03Q8m1Lj3k6Q5j19j70L35K6j17K8M3o4P6k34J92j70K50p8j95M4J6K69
5435B04m07M23l02J36n7m8Q3n0J17k70J43j07Q3P8j29J64j73K83l19J88jp6j1
5458d8N8Q6mQ0j62j01J41o4J08LJ4j61J87Lj12o0J74o9j79K60k35M7j02K63j04
5483B3J26K2k45L03l74K11j92J48J3nk03K1K67k90M36k67J05k55K07q1l26K85
5505g1m2K61k22k7J03q1J96j47K58k88Q7M8j9O4j36j24K95p3m03M63j29n0j5r4
5529a46J56j1J44j90K14o3j09j36J06K9o1J34k72M86l87K12j08o5o2Q5O8n7J00
5552F7k30L28k37J19Lk96K86l0J55k39J25k43J09J81j97J45r6J35J42l48K09j55
5574f7r4N4J00j25L87m71J38M7kR4k15J88k56K81Ol1j10j9jj48L50o1j19j01M95
$$ plain form
5599 320 76 55 84 4 78 -356 103 -113 -186 74 74 22 70 -143 -71 85 -20 -66 -62 147 -16 -64 62 -65 88
5624 88 -68 178 -67 49 97 -134 58 -245 95 -290 -56 -114 -7 -13 -193 34 -139 -78 -253 120 138 73 29
5647 29 -126 48 79 9 10 17 -2 12 161 31 101 -98 238 90 -135 -90 60 40 -129 115 -102 73 -118 -86
5671 -86 56 -98 90 -156 -35 -37 110 -34 -103 -94 48 87 -55 2 4 164 -105 4 -72 171 16 -86 187 100
5695 100 -35 -113 -123 -56 -65 294 -105 106 -113 42 -160 -71 275 -38 162 32 12 -90 11 -51 12 98 -195
5718 -195 120 -3 115 -64 90 -184 -151 -21 -71 115 -93 164 -74 145 -127 -110 12 -90 23 -49 15 -194
5740 -194 124 -66 10 -16 -136 64 15 88 -32 77 -74 -90 76 -130 85 26 -78 90 58 -188 68 175
5762 175 -80 124 54 32 -205 -36 -60 -120 147 96 -8 -65 -129 -24 -29 -60 -37 83 -142 81 -217 52 85 86 12
$$ packed form
5599C20k44k1K9q0P4m34M59k16p3K60%n2M8k13P2J56j05m6MK09j63m8J26j27J53
5624H8j56K46k45J16M8k31J92l03L40l85K34n8J07oj80K27j73O1j75L73J8o5m4
5647B9j55J74L1p0JPj9J4J49j30P0j99L36j48k25M5J50k0j69K44k17J75j91L2
5671h6J42j54J88k46J21kJ47j44o9RJ42L9j42N7KJ60k69J09p6K43j55j02K73q7
5695A00j35p8j0O7rL59l99K11k19J55k02Q9L46l13K00j30k0j02J01o2O3Q6k93
5718a95L15j23J18j79J54k74L3J30n0J86k08K57k38K19k72J7J22j02J13p2O4k09
5740a94L18j90P6k6j20K00m9P3j20J09j51j6J66k06K15n9j04J68l2k46K56J07
5762A75k55K04p0k2k37J69k4o0K67n1j04n7o4J05nl1K3J20k25K23k98K69L3Jp4
$$ plain form
5787 12 -55 52 -6 185 -104 76 -91 20 104 -147 104 -148 104 -47 147 -3 -2 19 -20 96 -153 154 -7
5810 -7 -242 -104 -94 174 -84 182 -88 103 -68 -89 -65 218 69 107 102 -136 15 -49 18 32 142 44 28 78 -132
5835 -132 341 -74 -15 -123 -25 -64 -140 133 -205 38 42 -1 -46 6 40 110 71 -83 -11 -232 -156 -144 169 6 -87
5860 -87 81 -138 89 13 133 -9 13 -56 70 69 69 152 -159 -99 -70 -177 163 103 107 -115 220 -83 -69 -42 -20 -82
5886 -82 -44 205 -9 -106 -30 -82 -112 -170 2 -162 -1 34 -57 1 24 -11 47 135 -52 111 -169 -87 52 64 -52
5911 -52 30 -138 -54 -26 -96 6 2 -70 -69 -41 65 -21 -83 -58 -71 -109 117 -180 92 -55 -131 -6 -34 171 -165 -35
5937 -35 -173 -86 68 -161 39 113 -4 -168 50 -28 -102 -38 -137 106 -26 137 -86 75 134 -20 108 -346 113
5960 113 -224 -107 -276 -75 -71 87 141 -23 -110 91 13 -177 -70 99 -95 37 -51 84 12 -20 -134 95 46
$$ packed form
5787A2o7J07n8J91k89J80j67J11Q4k51K51k52K52j51J94j50JK1l9J16k49L07j61
5810gk35J38J0K68k58K66k70J91j71k1K4K83j49L8nk38J51o4O7J4J10r8j6N0k10
5835a32M73m15N9j08R8l9p6K73l38K43Mm3m5N2L4P0l9j54P2k21P6J2L13j63r3
5860h7J68k19K27p6J20j42K2o9J26j%Q3l11O0K9j07L40o0Mk22L35l03J4K7K2o2
5886h2L8K49k14r7P6n2l0n8J72j64J61L5r1N8K3l5N8Q8j87J63k80Q2J39J2j16
5911e2Q2j68Q4K8p0J02mp2JK8J06q6o2K5j3l8K26k97K72j47p6J25k8K05l36J30
5937c5j38Q7J54k29K00P4j17j64K18p8p4O4r9K43j32J63k23J61N9j54J28m54M59
5960A13l37J17j69K01MJ58N4j64q7K01p8j90J07J69j94J32q8J35p2l2j14K29m9
$$ plain form
5983 46 162 -30 -75 209 -81 34 -74 -8 -92 -38 -43 81 -85 -59 17 123 104 5 82 169 -12 -21 -21 -24 -232 19
6009 19 -59 74 92 9 226 -10 140 -41 94 -96 -39 69 123 78 -203 -46 -223 -11 -180 -333 77 -80
6031 -80 -46 -72 248 -77 -32 -43 7 -140 88 110 -175 -18 4 24 -140 -27 154 -187 77 -118 187 -203 -39
6054 -39 -185 -138 108 -132 70 -88 -49 -15 -123 34 217 69 8 -11 -5 240 -177 273 170 197 -11 -64 90
6077 90 -5 277 124 -57 224 -173 -114 59 97 -290 109 -104 107 -54 -226 70 -147 154 41 64 -14 203
6099 203 139 64 74 -186 43 -48 57 -32 24 -154 125 -38 -181 109 -51 163 -138 -76 -138 181 -10 -16 29 -28
6123 -28 -16 -20 -79 -155 -148 54 66 -91 -217 -76 -188 25 77 -39 79 -54 -58 -190 -273 -107 141 78 131 94 -4 11
6149 11 -65 -49 -98 -242 140 19 2 -179 250 159 129 280 9 -33 -183 12 -116 -67 -39 -26 -2 174 -23 -32 5
$$ packed form
5983D6J16j92m5K84k90J15j08O6q4N4nJ24j66K6P6J06j9r9P7Q7j81r%lk08K51
6009A9p8J33J8q3K17k36J50j81J35j90N7J08N4m5k81J57j77K12j69j53M10j57
6031h0L4k6L20l25M5j1N0j47K28K2k85J57K2K0j64J13J81l41K64j95L05l90J64
6054c9j46M7K46k40K02j58L9L4j08J57J83j48o1j9OK45m17M50j03K7k08n3J54
6077I0r5K82j53j81K81l97N9J73L8l87L99k13K11j61j72K96k17L01j13K3p8K17
6099B03o4p5J0k60K29r1J05q9N6j78K79j63j43K90j60K14l01O2o2L19j91oM5n7
6123b8J2mn9p6PK02J2j57j26J41j12K13N2j16J18j33mj32q3J66K48o3N3l7r8J5
6149A1p6J6m9j44L82j21j7j81M29r1l0J51k71m2j50J95j28M9K8J3K4J76j97rL7
$$ plain form
6174 5 18 10 72 -81 -60 31 33 -82 -17 -139 80 -136 -165 -217 61 -44 -12 60 -207 -216 -84 -52 93 35 12 -104 117
6201 117 -49 -22 -124 146 -36 -123 53 -86 61 55 -80 -47 84 -30 -186 -154 -46 46 -20 99 0 -39 215
6224 215 -47 -58 -172 56 -208 79 -19 60 -119 -79 142 -104 -63 -194 -8 50 -10 56 -45 227 56 -64 -190
6247 -190 -93 -39 111 -24 -41 76 -134 -33 -110 -79 135 72 -165 222 -97 45 97 12 47 -1 -42 22 -149 33
6271 33 -127 -85 -117 26 -85 190 -29 -35 -20 -16 137 -99 12 -59 128 3 106 -58 108 -211 -194 128 -89
6294 -89 -127 -12 -182 -152 -63 62 -30 18 85 86 141 -156 297 -107 23 -42 88 47 12 -43 -45 101 174 114 -98 110
6320 110 93 46 -274 30 40 -69 -22 -91 3 -42 -49 103 -27 -2 -117 33 -303 -17 -82 -15 111 -47 124 67
6344 67 68 -228 156 153 53 163 -88 96 -73 28 -235 17 -113 62 -85 -122 49 -157 88 133 106 69 -59
$$ packed form
6174EJ3qO2j53K1R1Kj15O5j22K19k16k9n2K78j05L2P2k67rJ32L2J45n8k3j16K21
6201A17j66K7j02K70j82q7J76j39J47oj35L3J31j14j56L2J08R2o6J19r9l9K54
6224B15k62j1j14K28k64K87r8P9j79M0K21k46M1j31J86N8o0O6j01K72j71j20j26
6247a90R7N4J50j35j7J17k10J01p7L1K14o3k37L87l19J42N2q5L5m8m1O4j71J82
6271C3j60M2l2J43j11K75k19oJ5MJ53k36J11p1J87j25J03j64J66l19J7L22k17
6294h9l8J15j70L0Q9J25r2M8O7JN5k97M53m04J30o5J30m1l5n5kJ46P3o0k12K08
6320A10j7m7l20L04J0j09M7o9R4m5pJ52j30K5j15J50l36K86o5O7J26j58J71n7
6344F7Jk96L84lj00J10k51J84j69J01k63K52j30J75j47l7J71k06K45M5k7l7j28
$$ plain form
6367 -59 164 -47 15 -56 175 97 2 52 75 79 79 -34 54 30 -99 27 -35 -169 17 -209 -163 13 -147 16 -63
6392 -63 122 -15 -45 -16 -108 -41 -49 180 190 12 -88 -142 -26 -153 5 -36 61 48 -11 -6 66 192 -96 52 -5 5
6418 5 112 -119 -154 -7 46 -36 63 83 -80 3 -32 -126 36 1 -71 117 -89 -167 -100 -40 -55 104 48 3 51 58 -128
6445 -128 155 186 121 7 -1 37 90 108 -21 117 -25 -184 -78 15 -59 165 -38 22 33 0 -25 -1 30 117 -19
6470 -19 48 94 67 -105 -94 58 -89 98 119 121 101 -6 16 -50 59 -83 148 110 -180 -151 -97 57 14 3 -5 -17
6496 -17 -141 64 -44 -33 73 27 -102 19 49 -143 -39 170 98 -30 -111 292 41 15 -104 -112 4 -28 10 62
6520 62 -9 112 -52 -111 -39 -103 15 -126 -46 -95 65 -9 -67 33 1 -36 44 42 -7 -94 -3 -56 -34 -44 119 58 -201
6547 -201 40 -85 -104 -93 44 79 19 34 -89 119 -25 180 133 104 94 33 -16 53 93 13 145 -86 180 -176
$$ packed form
6367e9K23k11O2p1K31p8r5N0K3M%j13Q8k4j29J26o2j34J86k26M6J76j60J63p9
6392f3J85j37l0K9r2O7qK29J0j78j00n4J16j27J58m1R7j3n9NP2J26k88J48n7J0
6418EJ07k31l5J47N3q2R9K0j63Q3l5r4J62l5p2J88k06p8O7O0j5J59n6m5M8Pj86
6445a28K83L1o5j14qL8N3J8j29J38j42j59J06R3p4K24k03O0J1l3k5K4L1Q7j36
6470a9O7M6k7j72J1J52j47J87K1Kk0j07K2o6J09j42K31l8k90K9N4J54m3j1qj2
6496a7j24K05j08J1J06m6j29J21L0j92J04K09p2j28q1M03k51k6j19qJ16l2L8N2
6520F2p1J21j64n9P2o4J18j41Q0m9J60p4n8J00l2l7Q0km9q7R1n3K2j0J63o1k59
6547b01K41j25j9J1J37L5o0J5j23K08j44K05m7k9j0o1m9O9M0q0J32k31K66l56
$$ plain form
6571 -176 145 88 80 -164 -98 -37 -55 5 4 -40 -29 83 -52 -96 57 -45 46 -43 -129 118 -101 99 -37 156 -21
6596 -21 207 -138 -174 40 -66 -17 -78 -93 -10 100 134 122 71 -19 -17 23 229 -33 -19 -14 94 -144 58 -117 -139 -24
6622 -24 -54 73 -85 -50 53 142 39 -73 203 -105 -70 106 160 -219 -148 -112 -123 -73 -60 102 -153 -42 -130 -52
6646 -52 131 23 -122 -23 -114 35 -201 24 15 43 95 -15 -76 -51 -18 48 58 147 137 41 242 -139 138 -43 -56
6671 -56 193 -51 132 123 186 29 17 -204 -144 -44 -83 -107 6 41 59 132 66 -113 75 108 -38 -120 -129 -52 -63 -122
6697 -122 -69 -135 10 65 -132 -51 -179 -149 83 337 42 -98 -2 -6 34 -107 61 54 32 -10 -111 45 -84 -62 -73
6722 -73 15 -159 -183 262 -93 100 80 7 -65 -73 -54 89 -260 -97 10 -131 -49 -153 89 -154 -113 -156 -115 117
6746 117 74 65 -35 1 -87 90 175 -124 149 -22 162 -61 47 -112 60 -27 -188 -23 16 48 -108 -24 15 -109
$$ packed form
6571a76L21n7qk44O6O1j8O0jm4J1J12j35m4J53j02R1q9q6K47k19K00j36J93j77
6596b1K28l45l6K14j06M9o1j5Q3J10L4j2n1r0KM0K06k62J4NJ08k38K02j75k2J15
6622b4l0J27j58L5J03Q9j03j12K76l08L5J76N4l79P1L6j1N0J3J62k55J11q8P8
6646e2J83j08j45R9r1J49k36K25rK8N2j10o1K5L3O6J0Q9j0r6K01l81K77j81j3
6671e6K49k44J83rO3j57j2k21O0J00l9k4J13L5J8P3o6j79J88L3j46q2rP7j1n9
6697a22N3o6J45N5j97Q1j28L0K32K54k95j40R6mM0j41J68pk2m2j01J56j29K2j1
6722g3Q8j74k4M45l55J93k0p3p2qJ9J43l49J63J07j41Q2j04K42k43M1m3M1K32
6746A17m3rj00L6q8J77Q5k99K73j71J84k23J08j59J72q7j61J65L9L2j56Q4L9j24
$$ plain form
6770 -109 -27 -62 -140 14 -92 31 112 -3 -78 -126 -62 91 -115 72 -54 -2 -84 50 30 18 92 55 35 59 -91
6795 -91 131 23 -168 -32 40 -113 188 -97 90 -248 -67 -60 199 67 -53 -1 40 93 -1 18 13 -11 -109 -53 -119
6820 -119 118 36 45 62 40 -18 -17 116 -1 -81 197 128 256 60 75 77 59 -82 -173 19 -58 -135 134 89 144 43
6846 43 -133 -215 -102 -164 45 -85 -105 167 -81 148 -142 211 -204 53 -117 -149 139 83 -11 -8 136 -174 -76
6869 -76 98 -5 11 0 -56 -94 83 -116 132 40 -56 -107 65 -55 -77 -59 107 -147 -67 12 -10 77 28 37 -96 2
6895 2 238 115 -93 91 -64 74 -111 -212 170 46 -100 24 -39 -139 102 115 -39 -6 84 32 116 131 -128
6918 -128 52 -67 2 40 69 96 -6 4 120 141 -87 -54 75 43 -14 -132 198 -114 37 -2 25 -58 -171 -52
6942 -52 29 180 -78 -67 -152 83 -220 -146 55 -87 129 -104 -13 -53 49 82 179 116 154 32 -187 127 -87 125
$$ packed form
6770a09Q2l5p8J54j06J23Q1j15p5m8O4J53k06J87j26N2q2J34k0j2P4l7k0K4j50
6795i1K22j08j91J36P2j53L01k85J87l38J81PK59j32j20N2M1N3r4J9nk4r8N6o6
6820a19K37q2RJ7k2n8JJ33j17q0K78o9J28j96J5Kj8j41r1J92p7p7K69m5N5j01
6846D3j76q2J13o2K09j30k0K72k48K29k90L53m15K57j70l2K88n6r4LJ44l10R8
6869g6J74j03J6j1n6l8J77j99K48r2r6n1J72j20k2J8J66k54Q0P9k2Q7m9Rj33R8
6895BK36j23k08J84j55J38j85j01L82j24j46J24o3j00K41J3j54L3R0n2Q4J5k59
6918a28J80j19O9L8K9K7j02J0J16K1k28L3J29l2n7j18L30l12J51l9K7q3j13J19
6942e2Q1J51k58J1q5K35l03P4K01j42K16k33R1m0J02L3R7o3L8j22k19L14k14K12
$$ plain form
6966 125 93 -34 135 -60 82 56 131 -27 12 -175 -4 2 -18 -67 -130 70 -56 153 136 -16 155 -180 8
6989 8 -108 200 29 114 -116 17 -14 -78 129 -16 82 48 36 97 -156 -27 90 112 6 137 170 -98 83 98
7013 98 -144 -51 12 -87 255 -195 82 -147 -46 98 -125 -104 -207 106 -97 -59 56 20 69 66 -23 -197 -36 -32
7037 -32 77 24 59 202 63 4 225 19 -40 -12 138 -142 -106 -84 111 -17 42 -37 47 -51 57 -28 -186 26
7061 26 -14 198 -233 75 35 38 102 38 151 -261 -139 89 -19 -145 14 54 -71 42 -141 -8 -114 0 24
7084 24 -125 -54 -43 178 -3 -200 -80 4 -197 -140 127 -89 136 30 117 -106 -149 185 -102 64 -168 18
7106 18 72 39 101 80 199 -316 -14 -285 79 57 -34 -14 -81 208 -55 111 -102 322 2 -75 -89 -14 -27 97
7130 97 227 12 69 32 -95 136 7 74 31 48 107 93 202 -53 51 -53 -17 123 207 -29 -7 -169 -177 88
$$ packed form
6966A25l2j27J69j95J42k6P5j58L9j87J71Ok0m9o3K00j26K09j7j52J71l35J88
6989Hj16L08j71Q5k30J33l1o4K07j45R8l4j2O1k53J29J17K2j06J31L3k68J81J5
7013I8k42R3O3r9L42m50K77k29J01J44k23K1j03L13k03L8J15l6M9lq9j74J61M
7037c2J09n3L5J43j39n9K21k06n9K8J50k80L6K2J95j28N9p9Q4r8J08q5j58K12
7061B6m0K12m31L08m0LO4o4J13m12J22K28j08j26J59M0j25J13j83J33j06J14K4
7084B4j49P1J1K21j81j97J20Q4k01N7K67k16K25j06Q7k23m3L34k87J66k32J86
7106A8N4l3O2k1J19n15L02k71L64k2r1K0o7K89k63J66k13M24l20p7j4P5j3J24
7130I7J30k15N7l7j27K31j29O7m3J7N9j4J09k55J04j04L6J40Q4k36K2j62qK65
$$ plain form
7154 88 -140 83 -60 -7 29 156 -120 -55 41 -59 117 62 -41 -87 -219 6 -36 32 -58 20 -119 -106 -8 130
7178 130 -47 12 -114 -107 -56 -55 206 -162 -109 -89 125 -80 -99 -44 38 -115 53 147 138 -43 94 -65 -12 -6 144 -206
7204 -206 151 124 -62 148 123 -230 -157 -2 116 131 138 72 -118 -153 157 -86 -28 122 -62 -195 120 -5 -156
7227 -156 57 161 31 41 100 -14 0 15 -23 34 -52 88 -91 146 126 -67 -194 231 111 -39 41 -222 -33
7250 -33 34 40 102 -173 -24 81 -169 24 91 143 109 93 148 -115 -43 135 -191 108 25 113 -52 140 205 -105 22
7275 22 -116 -8 87 45 -45 12 -122 -47 -34 -209 134 92 55 -116 -23 62 -57 182 6 190 153 -121 -159 -96 17
7300 17 -53 -22 115 -118 -55 111 -22 -132 149 -77 57 -18 41 35 -225 57 -18 -107 -125 -99 -35 161 -87 -3 2
7325 2 62 115 -136 130 -33 303 -112 -100 -12 -73 6 35 -188 131 109 -103 -18 -50 -159 168 156 74 14 -17 60 127
$$ packed form
7154H8k28K23j43N3L6J27k76O5R6j00J76n5j03m6j32K25m2O8r0P8j39J3R8J38
7178A30j77N9j26PN1JK61l68N3K0K14k05j9N5Q2j53J68R4rj81J37j59N3OJ50l50
7204b06L57k7j86K10k5l53P3J55J18J5Po6j90l5L10k43N8J50j84j33L15j25j51
7227a56K13J04j30J0N9j14J4J5l8N7q6J40j79K37k0j93j27M25j20j50Q0k63J89
7250c3O7OO2k75J49J05k50J93O7N2l4j6N5k63P2J78l26K99q3Q8j65J92O5l10J27
7275B2j38J08R5m2r0N7j34P5J3j75L43m2l7j71R3Q5j19K39j76J84l7k74l8O3J13
7300A7p0L1J37k33O3J66j33j10K81k26J34p5N9ok60K82p5q9j8K6O4J96k48Q4N
7325BO0N3k51K66j63L36m15J2Q8o1P9K9k23L19k2k12Q5l2j09L27j2q2o0l1P7O7
$$ plain form
7351 127 -242 -50 56 -262 -114 -143 134 2 52 -51 238 -49 -89 -37 -105 -265 -105 -82 -208 200 215 -144
7373 -144 29 109 -84 -59 -129 -139 158 70 -230 5 68 -113 81 12 -80 69 124 16 -16 -92 -34 151 -75 112
7397 112 -68 -64 -92 45 13 2 29 -296 -125 131 -113 100 92 -7 193 -105 -13 126 5 -96 7 54 116 104
7421 104 84 -11 -1 80 43 132 84 -88 57 -11 -92 63 34 71 -40 82 136 -115 -118 -155 -170 -44 -23 -163 -116 58
7447 58 -127 -182 -126 9 -154 28 1 -94 -149 176 230 -125 225 -27 119 56 -41 91 -122 161 -43 -224 4
7470 4 82 -107 -3 -170 -67 -144 -31 -2 -61 70 -143 -52 -20 81 2 15 6 -124 158 161 20 77 63 136 294 15
7496 15 40 80 3 -56 -15 157 65 -59 -17 150 74 -103 61 103 32 66 115 -74 -136 -56 -24 100 13 106 174 89 -147
7523 -147 -161 72 23 -107 57 -91 -56 112 -71 90 67 -86 -148 -85 -157 114 88 53 12 207 50 90 207 0
$$ packed form
7351A27l69J92J06l18J48k9K77j32N0j03K89k87m0N2o8j60J60K3j26M08J5l59
7373a44J73Q0j93K5p0j0K97q8l00K35O3j81J94o9r2J49N5j08l2p6N8J85k26J87
7397A12j80Mk8J37l2j1K7l25J71K56k44K13qr9K00k98R2J39j21j01J03M7O2j2
7421A04k0r5J0Q1l7Q9m8j72J45o8q1J55k9L7j11J22N4k51ll7j5J26K1j40M7J74
7447E8j85n5N6J35j63J82k7r5n5L25N4l55L50k52J46o3r7J32k13K83k04j81K28
7470DP8j89J04j67J03p7J13K9n9J31k13R1L2J01p9J3rj30K82Lj41N7j4P3J58k79
7496A5K5M0p7n9M1J72r2j24M2J67p6j77J64M2p1L4M9j89o2Q0L2J24q7R3O8q5k36
7523a47j4K33m9j30J64j48L5J68j83J61k3j53o2O3p2K71k6l5m1J95j57M0J17k07
$$ plain form
7547 0 52 -16 -43 -92 73 -112 124 27 45 -94 49 124 6 -97 104 1 0 -68 20 -1 195 102 4 112 -62
7572 -62 -59 -71 -45 85 78 71 160 -17 105 -135 90 80 99 127 1 63 -133 -7 -113 -156 150 -23 97 50 260
7597 260 -29 -135 -28 48 -19 -138 -59 118 106 -63 -64 15 -95 -6 43 -81 182 -143 -119 -142 32 70 -31 -44
7621 -44 -177 -64 92 -58 -165 -101 -9 -70 -48 117 44 -68 -56 24 -36 -62 -30 -72 25 -25 101 -47 -45 -69 21 -217
7647 -217 -105 -5 -67 43 72 107 -19 -22 53 -23 20 12 -91 47 53 53 90 -31 -21 14 25 -35 31 16 16 101 125 19
7675 19 29 62 106 4 -91 -175 28 107 117 178 64 130 14 20 -174 180 -123 -29 -29 -71 -19 -116 96 -177 -153 -96 -141
7702 -141 29 -6 31 2 -17 -191 -50 183 -4 43 40 154 92 82 133 53 34 60 35 13 -12 32 -18 -99 26 41 -39
7729 -39 -89 100 49 22 -143 -8 -1 -14 103 119 -87 -14 -1 -5 -140 -55 38 -210 -85 -132 51 -62 -64 3 -204 37
$$ packed form
7547@N2o8k7m9J65j85K36r7J8j39J43P5j18j03K01j03jo8Q8k1J96r3r8J08j74
7572f2Lj2K6J30ppQ9j77J22k40K25j0J9K8j26O2j96J26j06m3L06j73J20m7K10
7597B60k89j06J07P6o7j19P9J77j2j69jP9j10Q9M9j24K63l25K4k3J74L8j01j3
7621d4j33J13J56j50j07O4R2o1K2J65p3j12J2Q0o0k6L2m2R7n0J26j48Kk4R0k38
7647b17J12J00o2J10K9L5j26lP5p6M3qj03J38O%L7j21J0L5J1o0O6j5%Q5K4j06
7675A9J0L3M4j02r5q4K03P9J0O1j14O6j16Oj94L54l03R4%m2N2r7K12k73K4N7m5
7702a41J70l5L7k9j9j74J41K33j87M7lJ14o2j0N1q0j9K6k5k2k5M4n0q1J25J5q0
7729c9n0J89n1k7j65J35Pj3J17J6k06P3J3mj35Q5R3k48J25m7J83j13kO7k07K41
$$ plain form
7755 37 -61 -50 -83 61 81 28 146 38 -2 -79 72 -125 -148 9 -43 -5 -40 66 -63 -73 -30 -110 37 -88 117
7780 117 1 -40 -86 -42 91 -110 -60 33 -101 -23 14 133 15 -208 107 0 38 68 -120 140 -11 -5 -102 -40
7804 -40 114 191 -122 9 125 38 160 9 6 -137 -1 42 -197 71 51 -264 -83 -84 0 198 -212 -57 132
7827 132 16 -99 130 13 -16 188 104 8 -40 -35 182 15 60 21 41 -61 -119 7 -88 20 -155 -2 32 93
7851 93 -15 -15 -103 -17 14 20 91 24 148 -153 -187 47 -54 43 -8 -67 -6 -52 -46 -110 139 -110 45 -17 19 36 -4 -10
7879 -10 -16 -24 -99 19 -167 -17 -33 -15 -198 -84 105 -89 -55 43 -221 -43 -34 -162 68 50 -219 28 -179 149
7903 149 -125 -4 -114 82 60 167 -60 73 101 -152 48 16 30 -10 -30 -54 77 -120 -53 168 138 17 87
7926 87 -271 -74 -162 -12 -37 -100 45 37 83 -180 -16 -21 -156 -203 94 -139 -44 113 -92 -33 69 -76 -5 11 127
$$ packed form
7755C7r8J1l3J44K0n3J18j08m0p7J51j97k3J57n2L8l5J06j29j0M3q0J47j25K05
7780A17j16m1m6M4J33k01N0R3j34P8L7J19j18k23L15j07L8L0j88K60j51Or7O2
7804d0J54P7l13J31J16q7J22j51lj43J36M3k39K68k0l15J81jQ4J98m10J55J89
7827A32j16j15K29j17k9K04q4r6m8NK17j67M5l9K0j02n8J26r5J08j75J53L4O1
7851I3j08%q8Q6L1OP1o7J24l01l4K34j01R7n1n9O1m6Oo4K49k49J55o2L6J7m0o
7879a0oqp5J18j86J50j6J8j83J14J89j94L4R8k64J78Rj28K30j8k69K47k07L28
7903A49k74J21j10J96k2J07k27J33K8k53K00l2J4m0k0k4J31j97O7K21l0j21P0
7926H7l58J97q8J50k5o3J45qM6k63J64nj35m7K97k33R5J57k05N9J02j45P1J6J16
$$ plain form
7951 127 -90 50 -83 -2 -150 -42 24 14 -171 -99 -55 66 -55 65 91 -131 -130 -173 -11 158 113 -76 -137 -34
7975 -34 -81 12 -189 -225 209 -69 -128 -14 60 88 66 83 91 -53 34 12 -38 161 -67 -213 -146 -3 -70 152 59 0
8001 0 7 -106 28 139 -45 12 33 -237 -194 -63 4 117 139 74 33 -49 34 25 1 -51 -19 115 -115 -6 57 -38 -120
8028 -120 -50 -57 -58 183 76 206 -66 225 110 243 -156 35 -62 -117 -32 -210 75 -8 82 -185 -8 37 -183 80
8052 80 61 91 69 -146 -10 -67 44 -116 -63 -99 159 -56 150 28 158 26 30 162 -21 92 -71 -48 -59 180
8076 180 -41 -59 121 -85 -92 -68 51 155 85 49 -44 60 -48 -3 -144 168 104 -137 -104 50 65 -220 126 -43
8100 -43 88 120 -75 13 93 209 120 -113 93 -161 9 114 -145 -108 52 -78 -14 -66 89 -13 100 39 101
8123 101 34 35 137 -73 47 10 76 15 64 -7 -92 -169 110 121 216 93 39 -29 91 77 3 -83 -54 -97 43 -59
$$ packed form
7951A27k17J40j33Q1j48J08O6j0j85P2M4J21j21J20K6k22Jm3J62J69m5j89o1J03
7975c4m7R3k01l6M34k78n9J14P4K8k2J7Qj44Q7k2n0J99k28j46O7J43o7K22r3n9
8001@Pj13J34J11j84N7K1k70M3J31O7J13K2o5m1q2Q3rk4n2L2J34k30J09O3r5q2
8028a20P0pjK41j07J30k72K91j15J33l99J91r7n5Q5j78K85q3R0k67J77M5k20K63
8052H0j9L0k2k15J36n7J11j60N3l6K58k15K06j22J30j32MJ32j83J13j63K3j1K39
8076A80k21j8J80k06pK4J19J04p0l6r3J04j08M5j41L12o4k41L3J54J5k85L46j69
8100d3J31L2j95Q8Q0J16q9k33K06k54J70J05k59L7J60j30O4n2J55j02J13o1O2
8123A01o7JJ02k10J20l7O6o1M9p1q5p7K79J1R5j23n4o8J20j4p4q6K9m3J40j02
$$ plain form
8149 -59 -11 -1 -9 0 -88 16 116 19 -273 113 -4 -99 -30 118 54 136 -176 -94 55 -23 30 -3 252 189 -3 -159
8175 -159 79 -115 -4 -211 -39 196 122 78 28 23 -104 -66 -43 75 30 64
$$ packed form
8149e9M8J0qRq8J04J00r7k92L86j17r5O9J48o4Q2l12Q2J49p8N3l3K55o3j92j56
8175a59K38j94J11k07J72K35p4m4n0nj27L8K3J18m5L4
8191F4
$$ Imaginary data points
##PAGE= N=2
##DATA TABLE= (X++(I..I)), XYDATA
$$ plain form
0 0 0 0 0 0 0 0 0 0 0 0 0 8 -8 8 -8 16 -16 16 -24 32 -32 40 -48 56 -64 80 -88 104 -120 136 -159 179 -203
33 -203 230 -259 291 -327 365 -409 455 -506 562 -622 687 -759 839 -926 1020 -1124 1238 -1363
51 -1363 1500 -1652 1823 -2014 2229 -2476 2758 -3087 3474 -3939 4512 -5231 6166 -7434 9261
66 9261 -12115 17212 -29001 108547 19640 -106473 146514 -82666 -19468 45472 -59855
77 -59855 -15771 13208 -41213 5538 -12655 14482 -4650 3950 42889 -26843 52128 -1189
89 -1189 3943 35006 -28164 29733 -22815 3011 -11217 -16853 1982 -30948 5560 -2969 -30841
102 -30841 31946 -11825 -23056 67133 -53463 31886 33869 -53174 61710 -29241 -199 15626
114 15626 -29147 11050 -15340 -12169 2565 -17526 -1332 1048 -13418 16628 -18096 27118
$$ packed form
0@%%%%%%%%%%%Qj6J6j6K4l2L2m0N6o4P2q8J04j20J44j68J92k24K56k95L38l82
33b03M33m89N50o18O92p74Q64r61J068j184J309j446J598j765J946k144K362k601
51a363K863l152L475l837M243m705N234n845O561p413Q451r743J1397j3600J6695
66I261k1376K9327m6213J37548q8907j26113K52987k29180O3198O4940j05327
77e9855M4084K8979n4421M6751j8193K7137j9132Q600L8939o9732P8971n3317
89a189N132L1063o3170N7897n2548K5826j4228n636J8835l2930L6508q529k7872
102c0841O2787m3771j1231R0189j20596Q5349J983q7043J14884r0951K9042J5825
114A5626m4773M0197k6390L171J4734k0091J6194K380j4466L0046l4724M5214
$$ plain form
126 27118 -12767 786 41065 -53083 52447 -9598 -30362 47960 -36076 -2364 18771 -27941
138 -27941 2558 6063 -17930 12518 -12438 15412 -7862 1085 26533 -31614 39029 -12072
150 -12072 -3235 25851 -23717 15567 -1622 -6934 2098 963 -7427 -195 2433 -851 -10145 20411
164 20411 -9844 -12255 46248 -47872 28977 18037 -43807 46204 -19361 -8575 18539 -15340
176 -15340 -219 1672 -7833 4826 -13871 9834 -2230 -18428 32283 -31396 15410 7810 -21879
189 -21879 26605 -19415 8922 -352 -7217 6290 -7511 -1213 888 -7473 2444 -2540 -5793 10295
203 10295 -17914 19299 -12740 -632 18540 -26792 26771 -13231 -503 13486 -16105 12005
215 12005 -2600 -6814 9529 -6591 -2438 10398 -14472 14402 -9025 5136 5982 -14398 27700
$$ packed form
126B7118l9885J3553M0279r4148J05530o2045k0764P8322q4036L3712K1135m6712
138b7941L0499L505k3993L0448k4956K7850k3274Q947K5448n8147P0643n1101
150a2072Q837K9086m9568L9284j7189n312R032j135q390P232K628l284r294L0556
164B0411l0255k411N8503r4120P6849j0940o1844R0011o5565J0786K7114l3879
176a5340J5121J891r505J2659j8697K3705j2064j6198N0711o3679M6806p600k9689
189b1879M8484m6020K8337r274o865J3507j3801O298K101q361R917m984l253J6088
203A0295k8209L7213l2039J2108J9172m5332N3563m0002J2728J3989k9591K8110
215A2005j4605m214J6343j6120M153J2836k4870K8874k3427J4161Q46k0380M2098
$$ plain form
228 27700 -26176 17226 7322 -22608 27937 -12162 -5509 16992 -12167 -746 12271 -14336
240 -14336 10133 -5745 3431 984 -9107 20870 -24885 18313 -510 -15033 21702 -14621
252 -14621 1961 5974 -6788 -864 5069 -7743 2442 -1654 -218 -3853 649 4739 -17351 22337
266 22337 -19007 1793 15400 -26145 20812 -8199 -6455 10405 -8437 210 3648 -6859 5461
279 5461 -5565 571 6354 -16223 20728 -16733 4066 10997 -20109 21387 -12282 2131 7513
292 7513 -9704 7535 156 -5131 8593 -4530 -1287 9492 -12085 12300 -7361 3643 2733
305 2733 -6410 12883 -13756 13500 -4863 -2443 10022 -9352 5555 1745 -4445 3768 923
318 923 -4914 7515 -8322 7852 -5613 -410 9150 -18084 20309 -13879 -135 13326 -18976
$$ packed form
228B7700n3876M3402r904k9930N0545m0099O653K2501k9159J1421J3017k6607
240a4336K4469j5878R176k447j0091K9977m5755M3198j8823j4523L6735l6323
252a4621J6582M013j2762N924N933j2812J0185m096J436l635M502M090k2090L9688
266B2337m1344K0800J3607m1545M6957k9011J744J6860j8842Q647L438j0507J2320
279E461j1026O136N783k2577L6951l7461K0799O931l1106M1496l3669J4413N382
292G513j7217J7239p379n287J3724j3123L243J0779k1577K4385j9661J1004r10
305B733r143J9293k6639K7256j8363K420J2465j9374J4907l810o190Q213k845
318I23n837J2429j5837J6174j3465N203R560k7234L8393l4188J3744J3461l2302
$$ plain form
331 -18976 12200 -735 -9923 9813 -3362 -7668 11469 -11222 3804 342 -4785 5132 -9386
344 -9386 11514 -13454 6926 1299 -11574 13499 -10306 1777 3614 -5119 1495 2150 -4795 5067
358 5067 -4295 2093 1923 -8198 13799 -14699 9814 490 -9684 14717 -11375 5897 1616
371 1616 -3277 3427 542 -1644 3722 -2077 1925 1558 -3563 8160 -9521 10393 -5376 -299
385 -299 8731 -12492 13803 -8132 1703 5992 -7862 6404 -363 -4524 6722 -3926 -2490 8902
399 8902 -12657 11040 -5460 -2550 8088 -11611 10103 -7662 2826 470 -4448 4672 -4797
412 -4797 775 1004 -2983 -237 2613 -7155 6824 -6408 2274 701 -6725 9982 -12835 9681
426 9681 -3948 -4636 9194 -9920 4677 721 -4342 3099 459 -4539 6748 -6493 4332 594
$$ packed form
331a8976L1176j2935r188J9736j3175m306J9137k2691J5026l462n127R917j4518
344i386K0900k4968K0380n627j2873K5073k3805J2083J837q733O614O55o945R862
358E067r362O388j70j0121K1997k8498K4513r324j0174K4401k6092J7272m281
371A616m893O704k885k186N366n799M002l67n121J1723j7681J9914j5769N077
385b99R030k1223K6295k1935R835M289j3854J4266o767m161J1246j0648J436J1392
399H902k1559K3697j6500K910J0638j9699K1714j7765J0488k356m918R120r469
412d797N572K29l987K746K850r768J3979j3232Q682j573p426J6707k2817K2516
426I681j3629o88J3830j9114J4597l956n063P441k640m998J1287j3241J0825l738
$$ plain form
440 594 -5152 9683 -10635 9703 -4249 -815 6764 -7741 8097 -3466 756 2578 -1493 651
454 651 3172 -3767 4817 -1675 -1026 6407 -9154 11397 -7720 2636 4892 -8890 10223 -6438
468 -6438 2206 1689 -2237 1626 314 -1843 2616 -2366 -3 2902 -7318 8803 -8537 3683
482 3683 898 -6590 8190 -8976 5785 -3181 -1496 3458 -4903 1866 553 -3805 2161 5
496 5 -5186 7352 -8761 5488 -1705 -4457 7896 -10221 8283 -4600 -527 3612 -4611 3379
510 3379 -947 -651 1448 -194 -1823 4821 -5895 5819 -2469 -993 5573 -7224 8932 -6650
524 -6650 4303 1303 -4344 6969 -4765 2317 1592 -1735 1251 2885 -4258 5288 -3115 1115 3426
539 3426 -6366 8761 -8269 5568 -286 -3863 6352 -6042 3967 -1408 -637 1031 -449 -1619
$$ packed form
440E94n746J4835k0318K0338j3952L434P579j4505J5838j1563M222J822m071K144
454F51K521o939Q584o492O49P433j5561K0551j9117J0356K256j3782J9113j6661
468f438Q644n17l926L863j312k157M459m982K363K905j0220J6121j7340J2220
482C683k785p488J4780j7166J4761q966J685M954q361O769j313m358N966k156
496En191J2538j6113J4249p193k752J2353j8117J8504j2883M073M139q223P990
510C379m326K96K099j642j629O644j0716J1714q288J476O566j2797J6156j5582
524f650J0953l000n647J1313j1734P082p25l327K986J634p143R546q403M230K311
539C426r792J5127j7030J3837n854l577J0215j2394J0009n375P71J668j480j170
$$ plain form
553 -1619 2753 -3958 2075 74 -4918 6980 -8866 5751 -3321 -2010 4874 -7750 6346 -4591
567 -4591 125 1403 -2599 174 987 -3139 1805 -521 -3095 4884 -7067 6379 -4710 331 3801
582 3801 -7018 7167 -5430 2734 240 -1786 2145 -1220 175 1176 -742 58 3270 -4928 6569
597 6569 -4610 2327 2101 -4508 7478 -6928 5823 -1625 -1135 4290 -3449 2215 386 -548 611
612 611 1604 -2880 4661 -4414 3740 -480 -3158 7023 -8169 6689 -3224 -962 3365 -4550 3357
627 3357 -2077 -111 204 -377 -1869 2733 -4257 2544 -1120 -2574 4488 -6837 6138 -5386 1336
642 1336 1561 -5173 4788 -4298 1206 -537 -609 -883 1152 -2209 1529 -1375 -452 2147 -5021 6314
658 6314 -6350 3478 408 -3792 5788 -5392 3971 -1148 -240 1599 -691 -88 1792 -1339 909
$$ packed form
553a619M372o711O033k001m992J1898j5846J4617r072J311O884j2624J4096j0937
567d591M716J278m002K773Q13m126M944k326k574P979j1951J3446j1089N041L470
582C801j0819J4185j2597Q164k494k026L931l365J395J001j918Q00L212q198J1497
597F569j1179O937k26o609J1986j4406J2751p448M90N425p739N664j829r34J159
612F11R93m484P541r075Q154m220k678J0181j5192J4858r913K262M327p915P907
627C357n434J966L15n81j492M602o990O801l664j454P062j1325J2975j1524O722
642A336K25o734R961r086N504j743p2k74K035l361L738k904R23K599p168J1335
658F314j2664R828l070m200R580j1180R363n119R08J839k290O03J880l131K248
$$ plain form
673 909 1922 -3739 5765 -5028 4607 -848 -1544 5471 -6151 6439 -2874 169 2145 -1531 732
688 732 783 -347 71 1368 -2338 3583 -4026 4102 -2444 -534 3355 -5892 5957 -5020 1948 154
704 154 -2563 2307 -2125 332 -303 -262 -1639 2377 -3835 3003 -2881 242 1366 -4544 5735 -6473
720 -6473 3760 -1045 -2521 3560 -3549 1528 -677 -241 -636 1100 -2222 2480 -2481 1419 653 -3478
736 -3478 5508 -5755 4532 -1892 -693 2914 -3617 3867 -2066 1226 255 425 -515 2311 -1494
751 -1494 1306 879 -2216 4196 -4383 5171 -3048 1293 2229 -3538 4906 -3662 2403 -252 -84 730
767 730 517 -668 1032 -596 -932 2736 -4385 4706 -3843 1422 964 -3353 4616 -4962 3391 -1918
783 -1918 -740 1060 -1595 -31 232 -714 -1183 2023 -3735 3152 -3300 1568 -468 -2148 3981 -5389
$$ packed form
673I09J013n661R504j0793R635n455o96P015j1622J2590r313L043J976l676K263
688G32N1j130M18J297l706N921p609Q128o546J910L889r247J1849j0977O968j794
704A54k717M870m432K457o35M1j377M016o212O838n884L123J124n910J0279j2208
720f473J0233m805j476O081p109N077k205M36l95J736l322M702m961L900p66m131
736c478Q986j1263J0287o424J199L607o531P484n933L292r71J70r40K826l805
751a494K800m27l095O412q579R554q219M341R36n767Q444q568O065k655J68Q14
767G30k13j185J700j628l36L668p121R091q549N265m58m317P969r578Q353n309
783a918J178J800k655J564K63r46m69L206n758O887o452M868k036j680O129r370
$$ plain form
799 -5389 4354 -2783 27 1154 -1927 1517 -1028 510 -678 1000 -1544 2843 -2889 2781 -631
814 -631 -1332 3836 -4578 4785 -3206 1888 639 -1789 3101 -2030 1628 -197 812 -742 2187 -1825
830 -1825 2117 -659 136 2210 -3685 5204 -4446 2769 122 -1837 3435 -2900 2521 -1163 656
845 656 -313 401 -1161 1457 -1527 12 1722 -3917 3937 -4096 2125 -1276 -999 1989 -3714 3028
861 3028 -3181 1253 -545 -510 -579 190 -841 -196 761 -2407 2987 -3770 3188 -2326 -108 1851 -3931
878 -3931 4125 -3440 2029 -676 -595 831 -468 120 364 324 -1568 2923 -3289 3056 -1675 609 1598
895 1598 -2309 3911 -3674 3366 -1404 25 1922 -1435 1240 -156 900 -779 2170 -2195 2615
910 2615 -1788 1201 544 -2267 3890 -4025 3660 -2015 461 1061 -1731 1908 -1870 1211 -1041 853
$$ packed form
799e389R743p137K810J127l081L444k545J538j188J678k544M387n732N670l412
814f31p01N168q414R363p991N094j249k428M890n131L658j825J009j554K929m012
830a825L942k776P95K074n895Q889r650P215k647j959N272o335N421l684J819
845F56r69P14j562K618k984J539J710n639P854q033O221l401K77K988n703O742
861C028o209M434j798L5o9P69j031O45R57l168N394o757O958n514K218J959n782
878c931Q056p565N469k705Q1J426j299N88K44m0j892M491o212O345m731K284R89
895A598l907O220p585P040m770J429J897l357K675j396J056j679K949m365M810
910B615m403K989o57k811O157p915P685n675K476O00k792L639l778L081k252J894
$$ plain form
926 853 -1429 1569 -2052 951 44 -1967 2646 -3894 3425 -3186 1170 252 -2532 2612 -2752 1211
942 1211 -1196 290 -1112 738 -1430 568 -418 -1248 2076 -3534 3605 -3147 1355 264 -1664 2540
958 2540 -2781 2478 -1669 991 112 -23 8 808 -319 -447 2271 -2698 3466 -2647 2108 -233 -632
975 -632 2509 -3198 3544 -2092 1665 185 -280 629 76 408 -396 1510 -1783 2756 -2632 2210 -953
992 -953 -490 2114 -3198 3548 -2939 1830 -731 -563 936 -1447 838 -492 606 -1791 1714 -2390
1008 -2390 1727 -1134 -576 1346 -2808 3338 -3723 2154 -1086 -886 927 -1770 1149 -1375 1028
1023 1028 -1574 968 -1562 1368 -1260 46 722 -2586 3347 -3352 2540 -1436 173 1012 -2023
1038 -2023 2436 -2008 1545 -750 972 -405 1224 -801 539 1013 -1728 2900 -2769 3139 -1667
$$ packed form
926H53k282K998l621L003r07k011M613o540P319o611M356r18k784N144n364L963
942A211k407J486j402J850k168J998r86q30L324n610P139o752M502j091j928M204
958B540n321N259m147K660q79j35L1Q00j127j28K718m969O164o113M755k341l99
975f32L141n707O742n636L757j480m65R09n53L32q04J906l293M539n388M842l163
992i53M63K604n312O746o487M769k561J68J499k383K285j330J098k397L505m104
1008b390M117k861N58J922m154O146p061N877l240K00J813k697K919k524K403
1023A028k602K542k530K930k628J306O76l308N933o699N892l976J609Q39l035
1038b023M459m444L553k295J722j377J629k025J340M74k741M628n669N908m806
$$ plain form
1053 -1667 829 1367 -1952 2741 -2186 1900 -869 792 -236 395 -57 56 510 -1005 2184 -2898
1069 -2898 3016 -1898 617 704 -1873 2145 -2922 2239 -2009 583 -133 -786 227 -458 245 -1274
1085 -1274 1361 -2411 2098 -2207 767 -314 -1411 2294 -3462 2735 -2196 623 -143 -716 827
1100 827 -1213 900 -937 1123 -1629 1864 -2006 1303 -109 -1079 2461 -2947 2952 -2120 1485
1115 1485 -48 -532 1561 -1241 1437 -738 1153 -1019 1571 -1037 1239 156 -190 1765 -2427
1130 -2427 3288 -2528 1843 -86 -756 1765 -1676 1776 -1352 1241 -863 764 -705 703 -519
1145 -519 -391 1272 -2509 2896 -2662 1722 -917 -457 1162 -2541 2222 -2534 1200 -905 -1 -574
1161 -574 46 -191 -828 892 -1936 1748 -2631 1931 -1372 -353 1237 -2619 2376 -2225 1406 -1050
$$ packed form
1053a667K496N38l319M693m927M086k769J661j028O31m52J13M54j515L189n082
1069b898N914m914K515Q7k577M018n067N161m248K592p16o53J013o85P03j519
1085a274K635l772M509m305K974j081j097L705n756O197m931K819p66n73J543
1100H27k040K113j837K060k752L493l870L309j412r70L540n408N899n072L605
1115A485j533m84K093k802K678k175J891k172K590k608K276j083l46J955m192
1130b427N715n816M371j929o70K521l441L452l128K593k104J627j469J408j222
1145e19J28J663l781N405n558M384k639M60J619l703M763m756L734k105R04n73
1161e74O20k37o37J720k828L684m379M562l303J019J590l856M995m601L631k456
$$ plain form
1177 -1050 424 11 -378 404 -529 714 -1281 1774 -2214 2180 -1018 235 1081 -1558 2486 -2321
1193 -2321 2350 -1054 503 710 -579 970 -435 1150 -1096 1634 -1356 1778 -742 596 726
1208 726 -1538 2713 -2636 2317 -1224 412 464 -829 1318 -1365 1197 -1014 1108 -1224 1247 -1239
1224 -1239 334 356 -1603 2121 -2520 2130 -2063 564 83 -1377 1610 -1956 1101 -1379 910 -1223
1240 -1223 694 -611 101 -151 -948 1597 -2462 2301 -2017 904 -15 -1288 1450 -1827 1819 -1613
1256 -1613 966 -446 300 -19 244 273 -778 1423 -1886 2360 -1683 1279 -104 -428 1841 -2074
1272 -2074 2389 -1397 1035 -146 304 94 -59 837 -784 1180 -1126 2006 -1599 1433 -331 -404
1288 -404 1818 -2064 2096 -1797 1371 -685 -18 529 -1032 764 -837 867 -1423 1249 -1465 925
$$ packed form
1177a050J474m13l89P82r33J243j995L055l988M394l198J253Q46k639M044m807
1193b321M671l404J557K07j289J549j405J585k246K730k990L134k520J338J30
1208G26k264M251n349M953l541J636N2j293K147k683K562k211K122k332K471k486
1224a239J573K2j959L724m641M650m193K627m81j460K987l566L057k480K289k133
1240a223J917j305P12k52p97K545m059M763m318K921r19j273K738l277L646l432
1256a613K579j412P46l19K63K9j051K201l309M246m043K962j383l24K269l915
1272b074M463l786K432j181M50k10j53Q96j621J964k306L132l605L032j764p3
1288d04K222l882M160l893L168k056O67N47j561J796j601J704k290K672k714K390
$$ plain form
1304 925 -603 -724 756 -1990 2070 -2528 1307 -907 -622 541 -1285 889 -1286 948 -1455 785
1320 785 -1007 630 -508 -129 764 -1860 2110 -2125 1406 -763 249 583 -1088 1492 -1445 1275
1336 1275 -824 913 -615 613 -380 72 933 -1278 2057 -1666 1947 -978 650 1008 -1195 1657
1352 1657 -1355 1448 -561 912 -256 429 292 -48 704 -1033 1661 -2016 1679 -1147 683 387
1368 387 -1169 1646 -1818 1767 -1165 403 -163 -323 225 -376 533 -1115 1382 -1778 1344 -1405
1384 -1405 420 153 -1150 1628 -1992 1716 -1437 436 -289 -453 383 -966 673 -1180 882 -1315
1400 -1315 1139 -1241 879 140 -1028 1431 -1880 1596 -1571 1174 -216 -182 1090 -951 1132 -756
1416 -756 1062 -800 1281 -749 526 374 -431 1183 -1451 2220 -1458 1244 -24 -326 913 -970
$$ packed form
1304I25j528j21J480k746M060m598L835k214K85J163j826K174k175K234k403K240
1320G85j792J637j138L79Q93k624L970m235L531k169J012L34j671K580k937K720
1336A275k099J737j528J228r93M52Q61k211L335l723L613k925J628L58k203K852
1352A657l012K803k009J473j168O85j37l40P52j737K694l677L695k826J830k96
1368C87j556K815l464L585k932J568n66j60N48o01R09j648K497l160L122k749
1384a405J825k67j303K778l620L708l153J873p25j64Q36j349J639j853K062k197
1400a315K454k380K120p39j168K459l311L476l167K745j390L4J272k041K083j888
1416g56J818j862K081k030J275j52q05J614k634L671l678K702j268l02J239j883
$$ plain form
1432 -970 1265 -932 1308 -784 414 -476 220 -23 -400 1201 -1597 1844 -1551 922 -662 -217
1448 -217 719 -1447 1572 -1571 992 -967 426 -495 -37 -95 -856 762 -1417 1342 -1679 1260 -816
1465 -816 -263 807 -1643 1429 -1664 888 -959 224 -113 -389 444 -652 754 -972 1366 -1546
1481 -1546 1089 -482 42 736 -1289 1841 -1545 1797 -595 238 261 -378 772 -478 959 -1090
1497 -1090 1201 -799 1045 -505 291 347 -987 1835 -1504 1443 -658 388 226 -373 929 -893
1513 -893 1227 -578 677 -695 931 -633 68 560 -1102 1241 -1557 1312 -1240 498 -33 -805
1529 -805 928 -1147 823 -1082 746 -940 301 -315 -237 230 -889 1069 -1625 1297 -1285 481
1545 481 180 -646 1002 -1443 1243 -1202 728 -417 170 -58 -267 437 -722 1318 -1426 1267 -817
$$ packed form
1432i70K235k197K240k092J198q90O96k43l77J601k798L441l395K473j584M45
1448b17R36k166L019l143K563j959J393r21M58n8p61J618k179K759l021K939k076
1465h16N53J070k450L072l093K552j847J183l37k76Q33j096J406j726K338k912
1481a546K635j571N24O94k025L130l386L342k392Q33K3o39J150j250J437k049
1497a090K291k000J844j550P96N6j334K822l339K947k101J046j62n99J302j822
1513h93K120j805J255j372J626j564P01M92j662K343k798K869k552J738n31p72
1529h05J733k075J970j905J828j686J241o16P8M67j119J958k694K922k582J766
1545D81l01q26J648k445K686k445J930j145N87k28k09P04j159K040k744K693k084
$$ plain form
1562 -817 788 21 -470 1061 -1316 1525 -1185 1006 -123 375 307 -169 744 -687 1042 -992 1330
1579 1330 -927 935 -25 -412 1107 -1054 1223 -1096 1042 -686 62 472 -558 581 -702 839
1595 839 -1058 940 -1113 362 -361 -407 794 -1423 1205 -1476 924 -707 -199 170 -731 737 -942
1612 -942 850 -1213 647 -763 326 -411 -226 681 -1292 1316 -1481 886 -592 24 177 -705 1067
1629 1067 -1294 924 -621 790 -580 280 -155 -400 891 -866 1366 -1180 1299 -601 360 505
1645 505 -748 1327 -894 1107 -735 698 -243 85 246 -162 593 -637 1173 -1166 1239 -400
1661 -400 226 431 -773 1060 -1201 1089 -897 556 -63 -186 10 -371 584 -1036 903 -1018 689
1678 689 -860 74 42 -935 877 -1601 942 -911 379 -386 -339 310 -872 590 -975 702 -967
$$ packed form
1562h17J605p67m91J531k377K841k710K191j129M98o8m76R13j431J729k034K322
1579A330k257J862r60l87J519k161K277k319K138j728P48M10j030J139j283J541
1595H39j897J998k053J475p23m6J201k217K628k681K400j631N08L69r01J468j679
1612i42J792k063J860j410J089p37J85R07j973K608k797K367j478O16J53q82J772
1629A067k361K218j545J411j370Q60m35k45J291j757K232k546K479j900R61J45
1645E05j253K075k221K001j842J433r41L28J61m08P55j230J810k339K405j639
1661d00O26K05j204J833k261K290j986J453o19j23J96l81R55j620J939j921J707
1678F89j549R34l2r77J812k478K543j853J290p65M7O49j182J462j565J677j669
$$ plain form
1695 -967 698 -921 169 312 -698 1017 -1265 1246 -1074 860 -112 -296 629 -838 630 -781
1711 -781 894 -877 767 -326 301 140 -197 1079 -1126 1439 -999 867 199 36 551 -499 1161
1728 1161 -605 1009 -611 595 -142 366 148 -447 1063 -1059 1215 -1098 576 -187 -22 625 -828
1745 -828 1080 -1075 599 -743 375 -340 0 113 -772 716 -1230 1087 -995 718 -479 -265
1761 -265 570 -1043 919 -1076 785 -944 215 -190 -156 451 -448 577 -969 1141 -1117 530 -226
1778 -226 -328 435 -989 1100 -1281 1056 -425 160 -5 -261 556 -668 957 -698 1028 -663 702
1795 702 -116 200 405 -631 1381 -1208 1011 -431 412 -90 -234 659 -449 899 -636 689 -689
1812 -689 638 -260 -50 473 -907 1053 -1144 1161 -903 398 -152 -700 744 -840 625 -858
$$ packed form
1695i67J665j619J090J43j010J715k282K511k320J934r72j84R25j467J468j411
1711g81J675j771J644j093O27j61l37J276k205K565k438J866o68j63N15j050J660
1728A161j766J614j620J206p37N08k18n95J510k122K274k313J674p63J65O47j453
1745h28J908k155J674j342J118p15L40J13q85J488j946K317k082J713j197K14
1761b65Q35j613J962j995J861j729J159m05L4O07q99J025j546K110k258J647p56
1778b26j02P63j424K089k381K337j481N85j65k56Q17j224J625j655J726j691J365
1795G02q18L16K05j036K012k589K219j442Q43n02j44Q93j108J348j535J325j378
1812f89J327q98K10N23j380J960k197K305k064J301n50n48J444j584J465j483
$$ plain form
1828 -858 744 -748 526 -172 -162 265 -793 836 -1341 1062 -943 181 92 -495 496 -913 1008
1845 1008 -950 793 -501 347 -70 -236 175 -773 1021 -984 955 -600 513 -96 -378 822 -948
1862 -948 1156 -790 715 -410 429 16 -315 702 -695 917 -471 1098 -501 680 148 -307
1878 -307 843 -844 1036 -957 874 -486 400 270 -216 477 -552 712 -697 773 -701 304
1894 304 126 -194 453 -883 1118 -1213 693 -395 -110 149 -555 484 -991 762 -1003 537 -575
1911 -575 381 -261 -421 490 -1094 875 -1086 797 -449 -217 130 -509 953 -844 737 -492 656
1928 656 -368 260 -26 -393 910 -667 1107 -1150 858 -363 332 197 -401 861 -624 918 -631
1945 -631 782 -335 243 319 -155 670 -718 1025 -853 882 -367 121 367 -536 700 -665 876
$$ packed form
1828h58J602j492J274o98J0M27j058J629k177K403k005J124q9n87R91j409J921
1845A008j958J743j294Q48m17j66M11r48J794k005J939j555J113o09k82J200j770
1862i48K104j946J505j125Q39m13l31J017j397J612j388J569j599J181n32m55
1878c07J150j687J880j993J831j360Q86j30m86O93j029J264j409J470j474J005
1894C04j78l20O47j336K001k331J906j088K85K59p04J039j475J753j765J540j112
1911e75R56o42j60R11j584J969j961J883j246K32L47o39J462j797J581j229J148
1928F56j024O28k86l67J303j577J774k257K008j221O95j35n98J262j485J542j549
1945f31J413j117N78P6m74Q25j388J743j878J735j249M88K46r03J236j365J541
$$ plain form
1962 876 -649 584 -233 -24 183 -493 689 -1040 857 -850 553 -433 12 -2 -672 808 -997
1979 -997 1060 -803 512 -509 176 104 -761 620 -877 699 -880 568 -475 42 105 -610 679
1996 679 -861 788 -909 680 -182 -100 412 -468 764 -774 741 -655 445 -445 213 314 -414
2013 -414 787 -838 1416 -574 721 -146 38 435 -440 883 -823 802 -545 502 -183 198 268
2030 268 -340 991 -659 897 -698 879 -382 -77 422 -866 638 -860 776 -678 487 -282
2046 -282 36 243 -659 494 -882 631 -751 632 -335 -248 292 -790 787 -923 700 -844 235
2063 235 -292 -341 328 -460 476 -768 907 -745 305 -344 34 466 -519 929 -839 768 -550 393
2081 393 8 -306 164 -477 647 -624 971 -406 438 -309 163 432 -459 789 -786 981 -249
$$ packed form
1962H76j525J233q17K09K07o76J182j729J897j707J403r86M45j4o70J480j805
1979i97K057j863J315j021O85p2q65J381j497J576j579J448j043N17O3p15J289
1996F79j540J649j697J589q62Q2N12q80J232j538J515j396J100q90O58J01p28
2013d14J201j625K254j990J295q67J84L97q75J323j706J625j347J047o85L81P0
2030B68o08J331j650J556j595J577j261L05M99j288J504j498J636j454J165p69
2046b82L18K07r02J153j376J513j382J383r67Q7N40j082J577j710J623j544J079
2063B35n27m9O69p88R36j244J675j652J050o49L78M32r85J448j768J607j318R43
2081C93l85l14M70o41J124j271J595j377Q44p47M72K69q91J248j575J767j230
$$ plain form
2098 -249 429 -99 -104 705 -542 677 -627 553 -650 481 -61 -285 22 -716 805 -653 817 -709
2116 -709 327 4 -307 312 -762 534 -992 607 -601 191 -199 -86 458 -533 548 -899 794
2133 794 -713 157 -229 -72 270 -645 634 -806 393 -501 191 -108 -55 362 -611 823 -679 601
2151 601 -487 429 39 -179 523 -654 812 -632 489 -484 325 75 -313 685 -399 822 -568
2168 -568 785 -407 592 -134 -149 539 -828 916 -753 714 -54 62 -47 -392 448 -573 634 -787
2186 -787 718 -515 419 -142 -248 429 -643 710 -965 670 -343 -22 72 -168 514 -571 773
2203 773 -553 485 -405 95 -209 -189 412 -939 723 -668 582 -392 68 33 -533 626 -654 644
2221 644 -590 522 -496 395 85 -435 284 -581 552 -549 627 -458 44 270 -345 526 -436 704
$$ packed form
2098b49O78n28nQ09j247J219j304J180j203J131n42k24L07p38J521j458J470j526
2116g09J036l23l11O19j074J296j526J599j208P92l90J13N44r91J081j447J693
2133G94j507Q70l86J57L42r15J279j440J199q94O92k99N3M17r73J434j502J280
2151F01j088R16l90k18P02j177J466j444J121r73Q09k50l88R98j084J221j390
2168e68J353j192R99p26j5O88j367J744j669J467p68J16j09l45Q40j021J207j421
2186g87J505j233R34n61j06O77j072J353j675J635j013L21R4k40O82j085J344
2203G73j326J038q90N00l04K0O01j351J662j391J250r74M60l5n66J159j280J298
2221F44j234J112j018Q91l10n20P19q65J133j101J176j085N02K26o15Q71r62J140
$$ plain form
2239 704 -590 558 -10 193 424 -110 298 -540 929 -599 681 -386 327 48 -177 593 -603 701
2257 701 -573 452 -173 90 -25 -362 524 -546 701 -510 389 -298 58 -43 -254 495 -917 568
2275 568 -666 371 -399 2 -29 -528 366 -587 303 -620 536 -532 91 242 -489 566 -838 460
2293 460 -821 489 -290 -70 397 -378 198 -620 670 -727 471 -297 34 60 -240 617 -344 882
2311 882 -562 575 -336 323 375 -200 544 -635 760 -555 517 -129 134 337 -403 691 -614 722
2329 722 -505 566 -320 98 344 -419 765 -567 500 -455 349 -305 -121 133 -538 522 -731 429
2347 429 -891 314 -402 -31 250 -527 654 -628 557 -496 331 -172 -148 172 -190 183 -673 752
2365 752 -485 268 -137 -82 291 -353 603 -813 631 -475 266 -19 -131 329 -470 584 -676 716
$$ packed form
2239G04j294J148n68K03K31n34M08q38J469j528J280j067P13k79k25P70j196J304
2257G01j274J025o25K63j15l37Q86j070J247j211Q99o87L56j01k11P49j412J485
2275E68j234J037p70M01l1m99Q94r53Q90r23J156j068O23J51p31J055j404J298
2293D60j281J310p79K20M67p75N76q18J290j397J198p68L31K6l00Q57r61J226
2311H82j444J137r11O59N2n75P44j179J395j315J072o46K63K03p40J094j305J336
2329G22j227J071q86M18K46p63J184j332J067r55Q04o54J84K54o71J060j253J160
2347D29j320J205p16L71K81p77J181j282J185j053Q27n03K4L20l62L73q56J425
2365G52j237P53m05N5L73o44R56j416J444j106P41k85j12M60p99J054j260J392
$$ plain form
2383 716 -299 434 -64 102 462 -323 839 -605 870 -429 352 -35 -32 334 -392 574 -632 899
2401 899 -612 556 -64 71 315 -414 451 -593 669 -671 332 -25 -163 317 -565 544 -474
2418 -474 673 -582 174 165 -91 164 -722 394 -656 579 -578 81 -228 -254 185 -681 454 -790
2436 -790 584 -558 328 -253 65 134 -410 399 -682 517 -512 341 5 -185 524 -618 712 -545
2454 -545 429 -441 292 -13 -113 434 -486 581 -451 728 -404 403 69 -141 458 -496 517 -607
2472 -607 639 -366 342 344 -97 418 -342 468 -625 651 -430 -21 -97 -87 202 -372 624 -756 631
2491 631 -428 236 20 -304 300 -501 494 -571 357 -336 345 -172 -180 305 -535 578 -456 298 -298
2510 -298 -37 -65 8 552 -692 508 -467 474 -403 279 -9 -158 259 -592 381 -663 446 -444 -246
$$ packed form
2383G16j015P33m98J66L60p85J162j444J475j299P81l87LL66p26R66j206J531
2401H99j511J168o20J35K44p29Q65j044J262j340J003l57j38M80q82J109j018
2418d74J147j255P56rk56K55q86J116j050J235j157O59l09k6M39q66J135j244
2436g90J374j142Q86n81L18O9n44Q09j081J199j029Q53l36j90P09j142J330j257
2454e45R74q70P33l05j00N47r20J067j032J179j132Q07l34k10N99r54J013j124
2472f07J246j005P08Km41N15p60Q10j093J276j081M09p6J0K89n74R96j380J387
2491F31j059O64k16l24O04q01R95j065R28o93O81n17qM85q40J113j034P54n96
2510b98K61k8P3N44j244J200r75R41q77O82k88j49M17q51R73j044J109q90J98
$$ plain form
2529 -246 161 -395 469 -442 401 -488 374 -120 326 196 -335 458 -390 608 -577 620 -219 3 119
2548 119 100 301 -607 773 -469 589 -285 -51 39 -333 380 -395 543 -447 401 -270 259 33 -404 634
2568 634 -717 563 -535 467 -264 260 -21 -479 601 -583 401 -533 548 -314 11 -13 -557 171
2586 171 -754 667 -656 344 -229 -38 193 -256 383 -376 429 -598 252 -136 229 54 -339 408 -481
2605 -481 819 -327 232 -12 -84 211 -371 573 -578 800 -197 373 -125 86 96 -304 461 -576 691
2624 691 -471 596 -175 47 206 -399 625 -447 446 -571 457 -309 -23 264 -470 465 -492 514
2642 514 -435 377 -303 -70 188 -415 493 -336 301 -400 368 -222 -142 156 -413 558 -764 639 -567
2661 -567 333 -125 -111 179 -521 451 -778 500 -447 347 -200 1 131 -208 470 -574 398 -392 228
$$ packed form
2529b46M07n56Q64r11Q43q89Q62m94M46j30n31P93q48R98j185J197q39K22J16
2548A19j9K01r08J380j242J058q74K34R0l72P13p75R38r90Q48o71N29k26m37J038
2568F34j351J280j098J002p31N24k81m58J080j184R84r34J081q62L25k4n44P28
2586A71r25J421j323J000n73J91K31m49O39p59Q05j027Q50l88L65j75l93P47q89
2605d81J300j146N59k44p2K95n82R44j151J378r97N70m98K11J0m00P65j037J267
2624F91j162J067p71K22J59o05J024j072Q93j017J028p66K86K87p34R35r57J006
2642E14r49Q12o80K33K58o03R08q29O37p01P68n90Q0K98n69R71j322J403j206
2661e67R00m58J4K90p00R72j229J278r47P94n47K01J30l39O78j044R72p90O20
$$ plain form
2680 228 -197 158 410 -212 658 -583 556 -417 380 -166 -307 408 -490 501 -364 294 -499 443 -38
2699 -38 -68 284 -376 578 -626 459 -406 159 41 -87 159 -516 320 -468 450 -343 177 16 -311 151
2719 151 -283 540 -771 384 -462 364 -149 -66 389 -650 464 -745 305 -566 88 -179 -340 334
2737 334 -345 296 -552 608 -362 279 -166 -83 435 -440 632 -715 656 -422 317 -154 -431 418 -264
2756 -264 488 -379 569 -423 328 -43 -73 391 -442 475 -526 337 -468 243 227 -92 480 -305 611 -482
2776 -482 530 -203 290 162 -14 282 -452 665 -497 431 -335 243 -106 -7 369 -384 473 -656 229
2795 229 -285 320 -47 -254 367 -656 569 -678 467 -477 159 -52 -240 360 -624 225 -403 225 -567
2814 -567 89 -84 -303 204 -457 405 -612 440 -174 207 223 -40 328 -367 705 -379 429 -147 156
$$ packed form
2680B28m25L55K52o22Q70j241J139r73P97n46j41P15q98R91q65O58p93R42m81
2699c8l0L52o60R54j204J085q65N65j18j28K46o75Q36p88R18p93N20j61l27M62
2719A51m34Q23j311J155q46Q26n13Q3M55j039J114j209J050q71O54k67j61O74
2737C34o79O41q48J160r70O41m45Q3N18q75J072j347J371j078P39m71k77Q49o82
2756b64P52q67R48r92P51l71l0M64q33R17j001Q63q05P11j6l19N72p85R16j093
2776d82J012p33M93j28j76K96p34J117j162R28p66N78l49R9L76p53Q57j129Q85
2795B29n14O05l67k07O21j023J225j247J145r44O36k11j88O00r84Q49o28O28p92
2814e67O56j73k19N07o61Q62j017J052o14L81J6k63L68o95J072j084Q08n76L03
$$ plain form
2833 156 26 -175 399 -395 605 -537 593 54 148 1 -215 467 -474 784 -369 494 -44 277 126
2852 126 -42 685 -513 575 -555 61 -279 85 235 -259 464 -532 484 -349 376 -405 14 211 -528
2871 -528 504 -399 382 -519 428 -294 -106 315 -364 375 -368 344 -482 454 -340 -145 245 -331 351 -566
2891 -566 322 -568 339 -2 -158 31 -186 440 -554 489 -254 317 -236 151 10 -152 549 -405 371 -536
2911 -536 487 54 376 394 -189 696 -671 452 -341 282 -18 96 362 -335 566 -408 476 -429 507
2930 507 -191 -89 67 -486 454 -375 499 -559 328 -71 -24 206 -313 544 -460 591 -498 412 -230
2949 -230 -56 115 -165 385 -738 379 -529 259 -4 -25 -29 -180 402 -741 410 -417 281 -219 -120 127
2969 127 -159 657 -533 586 -406 466 -24 -204 378 -230 668 -464 493 -527 525 -97 -27 502 -453
$$ packed form
2833A56j30k01N74p94J000j142J130n39R4j47k16O82r41J258j153Q63n38L21j51
2852A26j68P27j198J088j130O16l40L64J50m94P23r96J016q33P25p81M19J97p39
2871e28J032r03P81r01R47p22J88M21o79P39p43P12q26R36p94J95L90n76O82r17
2891e66Q88q90R07l41j56J89k17O26r94J043p43N71n53L87j41j62P01r54P76r07
2911e36J023m33L22J8n83Q85j367J123p93O23l00J14K66o97R01r74Q84r05R36
2930E07o98J02J56n53R40q29Q74j058Q87l99M7K30n19Q57j004J051j089R10o42
2949b30J74J71k80N50j123J117r08P88k63k1mj51N82j143J151q27O98n00R9K47
2969A27k86Q16j190J119r92Q72m90j80N82o08Q98j132R57j020J052o22P0N29r55
$$ plain form
2988 -453 584 -439 613 -130 533 -84 14 447 -323 468 -304 550 -459 243 295 -57 315 -384 655
3007 655 -407 387 -230 8 190 -109 357 -455 449 -695 429 -334 133 -86 -182 334 -460 533 -528
3026 -528 413 -385 221 -132 -208 219 -362 501 -586 440 -389 251 -44 -127 376 -370 480 -577 407 -309
3046 -309 358 35 -326 272 -480 623 -324 693 -221 173 -49 -280 295 -340 416 -694 607 -227 197
3065 197 293 -240 381 -496 541 -259 389 -13 236 236 -176 609 -379 644 -519 577 -213 264 -42 -291
3085 -291 511 -524 520 -538 347 -232 167 -4 -257 354 -455 436 -453 407 -376 4 -163 -326 281
3104 281 -472 427 -471 380 -514 -37 123 -367 6 -515 547 -450 484 -183 69 315 -354 349 -426 443
3124 443 -383 191 89 107 196 -299 651 -542 568 -399 310 -84 120 193 -229 611 -335 403 -116 277
$$ packed form
2988d53J037j023J052p43O63o17R8M33p70P91p72Q54j009P02N2l52L72o99J039
3007F55j062P94o17K38J82k99M66q12R04j144J124p63M67k19r6N16p94R93j061
3026e28R41p98O06l53p6M27n81Q63j087J026q29O40k95q3N03p46Q50j057R84p16
3046c09O67l23l61N98p52J103r47J017r14L94k22k31N75o35P56j110J301q34M24
3065A97R6n33O21q77J037q00O48m02K49%m12P85r88J023j163J096p90M77l06k49
3085b91Q02j035J044j058Q85n79L99j71k53O11q09Q91q89Q60p83L80j67j63O07
3104B81p53Q99q98Q51q94M77J60m90L73n21J062r97R34o67K52K46o69P03p75Q69
3124D43q26N74j02J8Q9m95R50j193J110r67P09l94K04P3m22Q40r46P38n19L93
$$ plain form
3144 277 -170 67 107 -348 538 -320 494 -169 408 0 185 262 -224 312 -462 319 -316 176 -166 68 101
3165 101 -307 321 -196 374 -477 333 -194 -182 349 -415 259 -248 355 -415 211 -102 -160 -64 -475 227 -536
3186 -536 370 -377 199 -82 -83 32 -340 200 -445 584 -361 174 -215 -118 49 -381 557 -395 753 -237
3206 -237 445 -143 -63 282 -298 510 -656 385 -269 216 9 61 249 -180 518 -460 382 -555 404 -100
3226 -100 -12 391 -287 305 -302 515 -256 526 -92 -170 357 -359 205 -512 196 -427 64 76 -18 125 -408
3247 -408 335 -395 308 -279 230 -279 -204 243 -313 308 -623 411 -301 142 -110 -301 166 -295 566 -298
3267 -298 101 -355 272 -61 -240 -86 -473 350 -240 365 -30 129 -130 -190 263 -274 279 -371 496 -353
3287 -353 216 -99 -92 237 -309 445 -297 264 -285 290 17 -82 420 -418 478 -194 535 -292 250 45 -56
$$ packed form
3144B77m47K37M0m55Q86q58Q14o63N77m08J85P7m86N36p74P81o35M92l42K34L3
3165A01m08O28n17N70q51Q10n27J2N31p64O74n07O03p70O26l13n8R6m11P02p63
3186e36R06p47N76k81jJ15l72N40o45J029r45N35l89R7J67m30R38r52J148r90
3206b37O82n88Q0L45n80Q08j166J041o54M85k07N2J88m29O98r78Q42r37R59n04
3226a00Q8M03o78N92o07Q17p71P82o18p8N27p16N64p17P08o23M91J2r4J43n33
3247d08P43p30P03n87N09n09P5M47n56O21r31J034p12M43k52j91M67m61Q61q64
3267b98L99m56O27l33j79J54l87Q23n90O05l95J59k59o0M53n37N53o50Q67q49
3287c53N69l15PL29n46P54p42N61n49N75k73r9N02q38Q96o72P29q27N42k05j01
$$ plain form
3308 -56 300 -381 580 -586 347 -70 140 -69 -280 282 -391 305 -423 127 -153 -14 200 -40 132 -186
3328 -186 368 -302 422 -345 186 -3 -318 154 -573 439 -333 257 -169 162 -39 -165 412 -402 380 -379
3348 -379 265 -338 280 54 -256 179 -230 364 -322 333 -162 179 115 -3 337 -214 375 -291 424 12
3368 12 3 57 -138 343 -241 343 -521 108 14 15 -16 -336 389 -512 440 -112 30 -256 26 206 10 521 -352
3391 -352 443 -302 168 -99 1 30 -345 320 -342 379 -333 421 -206 -242 128 -72 254 -472 240 -530 151
3412 151 -175 -273 181 -340 321 -354 384 -175 250 -234 -124 112 -118 275 -403 168 -295 294 157 107 73
3433 73 -26 442 -316 338 -163 205 83 171 179 -175 175 -277 414 -400 293 -180 26 122 -281 320 -162 299
3455 299 -96 125 -121 -109 63 -209 91 -508 430 -478 180 -13 6 154 -330 231 -381 217 -316 36 -252
$$ packed form
3308e6L56o81R61j166R33m17K10k09k11N62o73O96p28N50k80J39K14k40J72l18
3328a86N54o70P24p67N31j89l15M72p27J012p72N90m26L31k01j26N77q14P82p59
3348c79O44o03O18k26l10M35m09N94o86O55m95L41o4j18L40n51N89o66P15m12
3368A2rN4j95M81n84N84q64O29r4Jl1l20P25r01R52n52J42k86K82J80j96N11q73
3391c52P95p45M70k67J00K9l75O65o62P21p12P54o27l6L70k00L26p26P12p70O81
3412A51l26r8M54n21O61o75P38n59M25m84J10K36k30L93o78N71m63N89j37n0l4
3433G3r9M68p58O54n01L68j22Q8Ql54L50m52O91q14O93m73K06R6m03O01m82M61
3455B99l95K21k46J2J72k72L00n99R38r08O58j93J9J48m84N61o12N98n33L52k88
$$ plain form
3476 -252 -51 188 -255 225 -415 263 -89 64 37 -61 256 -419 191 -482 326 -163 183 -20 -113 261 -302
3497 -302 383 -399 281 -107 187 -182 65 262 -250 334 -347 223 -354 111 -52 108 152 -104 382 -170
3517 -170 429 -131 140 -175 -88 355 -291 516 -413 421 -193 50 200 -187 117 -156 253 -314 399 -240
3537 -240 63 74 -202 16 -339 421 -375 279 -279 170 45 -253 11 -246 268 -244 113 -82 28 -15 -51
3558 -51 211 -335 312 -333 120 -82 99 -21 -46 143 -402 428 -118 144 -223 110 -35 -64 -20 -241 173
3579 173 -11 249 -407 132 144 -234 158 -344 356 -300 215 -131 127 99 -13 297 -315 264 -136 222 -60
3600 -60 -9 -23 -90 217 -150 383 -382 225 -34 29 91 -230 206 -183 347 -281 109 -77 26 111 35 98 -380
3623 -380 192 -296 44 -168 -58 27 -224 210 -273 132 -142 65 -66 124 38 34 319 -297 223 -233 325
$$ packed form
3476b52K01K39m43M80o40O78l52J53k7r8L17o75O10o73Q08m89L46k03r3L74n63
3497c02O85p82O80l88K94l69K47J97n12N84o81N70n77M65j63J60M4k56M86n52
3517a70N99n60K71l15Q7M43o46Q07r29Q34o14K43J50l87L04k73M09n67P13o39
3537b40L03J1k76K18l55P60p96O54n58M49j25k98K64k57N14n12L57j95J10m3l6
3558e1K62n46O47o45M53k02J81j20k5J89n45Q30n46K62l67L33j45k9M4k21M14
3579A73j84K60o56N39J2l78L92n02P00o56N15l46K58k8j12L10o12N79m00L58k82
3600f0N1j4o7L07l67N33p65O07k59O3O2l21M36l89N30o28L90j86J03Q5p6O3m78
3623c80N72m88L40k12J10Q5k51M34m83M05k74K07j31J90q6mK85o16N20m56N58
$$ plain form
3644 325 -80 -123 -42 -235 271 -227 350 -431 212 37 139 69 -69 320 -117 373 -222 460 -100 14 -78
3665 -78 -140 -25 -289 45 -161 280 -65 -99 185 -151 308 -414 160 -98 370 -106 43 95 -219 229 -183
3686 -183 118 -36 67 -160 2 40 -415 48 -259 40 -235 40 -163 2 147 -64 314 -184 31 -274
3706 -274 206 -103 26 100 -341 104 -227 161 -139 86 60 -36 -82 60 192 -210 397 -4 -3 -38 120 238
3728 238 -101 135 -277 275 -2 4 -115 -24 108 -95 282 -297 253 -166 173 90 -37 38 -310 190 -469 416
3750 416 -170 162 -137 -98 117 78 402 -206 160 -243 129 -146 -77 101 -362 106 -442 260 -318 135 -18
3771 -18 -209 8 -281 183 -262 216 -210 386 -208 -41 -125 -159 120 -301 53 -237 -54 -166 -31 21 -185
3792 -185 278 -282 99 -304 -91 -238 6 238 -174 132 -176 263 -292 55 -25 31 229 -36 335 -326 226
$$ packed form
3644C25m05m3Q1j93N06m98N77p81O43j75J02p0j38L89m37M90n95O82n60J14r2
3665g8o2J15k64L34k06M41l45l4K84l36M59p22N74k58M68m76J49N2l14M48m12
3686a83L01j54J03k27J62L8m55M63l07K99k75K75k03J65J45k11L78m98K15l05
3706b74M80l09J29P4m41M45l31L88l00K25k6r6m6J42J32m02O07m01Jl5J58J18
3728B38l39K36m12N52k77Oj19R1J32k03L77n79N50m19L39q3j27P5l48N00o59Q85
3750D16n86L32k99L9K15l9L24o08L66m03L72k75O9J78m63M68n48P02n78M53j53
3771a8j91K17k89M64m45M78m26N96n94J67q4l4K79m21L54k90J83j12J35N2k06
3792a85M63n60L81m03K13j47K44K32m12L06l08M39n55L47q0N6J98k65L71o61N52
$$ plain form
3813 226 -494 282 88 -238 261 -292 -45 -297 194 -57 143 61 -16 -27 -211 128 -169 293 -262 111 29
3834 29 -148 76 -133 177 -233 188 -266 -40 -87 71 239 -274 301 -196 -122 -116 81 -237 -311 350 -224 118
3856 118 -395 10 -336 -65 -74 -52 433 -181 107 -261 80 -10 90 30 -215 157 -437 147 -86 132 -135 72
3878 72 116 -34 235 -188 287 -159 275 -175 7 120 -180 188 -145 282 -142 180 -121 -56 192 -170 164
3899 164 -352 272 -205 8 -58 150 100 -151 151 -82 183 -194 315 -7 -107 -74 -148 173 -71 50 -340
3920 -340 153 -95 52 -242 -46 9 -450 231 -343 116 -108 -59 -35 65 66 -220 183 -324 47 -168 51 80
3942 80 -165 40 -23 221 -146 189 -170 -185 179 -75 251 -254 285 -178 202 -172 -113 -68 -164 150 53 88 -147
3965 -147 232 -148 58 -42 98 126 -89 260 -201 223 -284 173 199 -97 101 -359 112 -127 -20 -97 -9
$$ packed form
3813B26p20P76j94l26M99n53K47k52M91k51K00q2p7j1j84L39k97M62n55L73q2
3834B9j77K24k09L10m10M21m54K26m7J58J68n13N75m97P4OJ97l18p4O61n74L42
3856A18n13M05l46K71rK2M85o14K88l68L41r0J00o0k45L72n94N84k33K18k67K07
3878G2M4j50K69m23M75m46M34m50J82J13l00L68l33M27m24L22l01O5K48l62L34
3899A64n16O24m77K13o6K08n0k51L02k33K65l77N09l22j00L3p4L21k44J21l90
3920c40M93k48J47k94J96N5m59O81n74M59k24M9K4J00Jk86M03n07L71k15K19K9
3942H0k45K05o3K44l67L35l59j5L64k54L26n05N39m63L80l74N9M5r6L14r7L5k35
3965a47L79l80K06j00J40K8k15L49m61M24n07M57K6k96J98m60M71k39J07p7Q8
$$ plain form
3986 -9 -46 -199 271 -186 244 -103 163 -49 108 84 -278 13 -115 7 -74 226 -230 48 54 -174 38 -199
4008 -199 231 -43 -133 39 -20 6 -157 17 -208 271 -249 258 -28 17 137 20 217 -357 379 -151 -5
4029 -5 -285 112 -14 -238 118 -185 404 -174 162 57 70 304 -145 277 -45 169 -90 73 31 -2 193 -234
4051 -234 335 -234 102 -211 33 -35 -153 -26 -153 98 -103 112 -322 124 -263 31 168 -49 143 -122
4071 -122 266 -183 110 -137 4 45 17 136 -283 95 34 112 24 -81 -1 -129 200 -212 303 -94 136 -265
4093 -265 -172 156 -132 142 -181 328 -136 132 -81 -87 99 -110 310 -33 34 -109 114 98 -13 85 -247 78
4115 78 -246 54 -203 124 -69 246 134 -199 40 -270 175 -42 308 -1 -341 107 -55 293 -196 148
4135 148 -63 140 -132 -55 103 -298 190 -121 112 -22 5 10 -56 148 -56 113 -215 127 -93 -61 -60 -198 215
$$ packed form
3986il7j53M70m57M30l47K66k12J57k4l62K91j28J22q1L00m56K78Ok28K12k37
4008a99M30k74r0J72n9K6j63J74k25M79n20N07k86M5J20j17J97n74P36n30J46
4029ek80L97j26k24L56l03N89n78L36j05J3K34m49M22l22K14k59J63m2l3J95m27
4051b34N69n69L36l13K44o8j18J27j27K51k01K15m34M46l87K94J37k17J92k65
4071a22L88m49K93k47J41M1k8J19m19L78o1P8q8j05Q0j28L29m12N15l97K30m01
4093b65R3L28k88K74l23N09m64K68k13oJ86k09M20l43O7j43K23j6j11R8l32L25
4115G8l24L00k57L27j93L15j12l33K39l10M45k17L50l09l40M48j62L48m89L44
4135A48k11K03k72P7J58m01M88l11K33j34K7No6K04k04J69l28L42k20L2Jj38M13
$$ plain form
4158 215 -55 258 -164 20 -337 182 -130 -144 -25 -252 221 -141 153 -226 -55 2 118 81 -226 280 -128
4179 -128 276 22 266 42 -133 311 -181 180 -51 158 -103 120 43 -117 298 -194 247 -275 278 -57
4199 -57 -21 188 -33 141 -271 153 -61 101 50 -40 -68 -203 94 -28 235 -71 81 -105 22 -93 -44 235
4221 235 -148 149 -61 5 -86 1 -61 -289 206 109 288 -104 299 -221 79 248 -158 -27 -263 78 -197 55
4243 55 -230 -23 30 -142 131 -206 71 -194 -102 4 -8 14 -127 72 -123 297 -90 220 -85 -30 116 30
4265 30 158 79 197 -151 85 -161 -87 84 -183 125 -190 190 -156 105 -236 171 217 5 282 -188 135
4286 135 -80 124 59 21 -158 -271 -120 -226 319 -86 -107 -2 -215 152 -69 195 -187 90 -12 145 -92
4307 -92 29 16 -230 96 -351 73 -202 200 -204 -24 16 -65 -9 -330 158 -185 4 -50 179 294 -142 170
$$ packed form
4158B15k70L13m22J84l57N19l12j4J19k27M73l62K94l79J71N7J16l7l07N06m08
4179a28M04k54K44k24j75M44m92L61k31K09k61K23p7j60M15m92M41n22N53l35
4199e7L6K09k21J74m12M24k14J62n1r0k8j35K97j22K63l06J52j86J27j15M9K79
4221B35l83K97k10O6r1Q7o2k28M95r7J79l92M03n20L00J69m06J31k36L41k75K52
4243E5k85K07N3j72K73l37K77k65R2J06j2K2j41J99j95M20l87L10l05N5J46q6
4265C0J28p9J18l48K36k46P4J71k67L08l15L80l46K61l41M07M6k12K77m70L23
4286A35k15K04o5l8j79j13J51j06N45m05k1J05k13L67k21K64l82K77j02J57k37
4307i2J21j3k46L26m47M24k75M02m04J80M0q1N6l21M88l43J89n4K29J15m36L12
$$ plain form
4329 170 -8 35 -155 83 47 34 198 -148 -12 -244 240 -72 218 138 -41 -56 -204 228 -122 27 -208 -56
4351 -56 -36 -160 248 -90 131 -239 120 -137 127 -65 -55 108 -205 144 -186 247 -108 94 76 -46 277
4372 277 -240 177 -92 198 5 4 47 -19 291 44 -141 -129 193 -35 64 -53 -96 8 -215 99 -60 111
4394 111 37 -20 8 -26 193 -200 329 -6 232 13 -4 27 87 157 -24 165 100 318 -99 251 68 -131 114
4417 114 -166 348 -29 216 20 235 -137 38 81 -143 167 -139 321 -85 272 -83 -191 73 -137 90
4437 90 -359 20 -69 0 41 -328 -31 -248 96 -193 25 82 127 14 -228 218 -63 254 -155 96 -90 9
4459 9 37 55 -73 -230 149 -29 142 -122 61 4 -104 120 55 68 -288 272 -211 79 10 -128 24 -141 349
4482 349 -98 77 115 89 28 -125 245 -217 249 9 231 42 98 201 43 198 -193 144 -309 47 -86
$$ packed form
4329A70j78M3j90K38l6j3J64l46J36k32M84l12K90q0j79j5j48M32l50J49k35J52
4351e6K0j24M08l38K21l70L59k57K64j92J0J63l13L49l30M33l55K02j8j22L23
4372B77n17M17k69K90j93jM3o6L10k47j85J2L22k28R9j17m3J04k23L14j59J71
4394A11p4n7K8l4K19l93N29l35K38k19j7L1O0P0j81J89o5K18m17L50j83j99K45
4417A14k80N14l77K45j96K15l72J75M3k24L10l06M60m06L57l55j08K64k10K27
4437I0m49L79q9O9M1l69K97k17L44k89K18N7M5j13k42M46k81L17m09K51j86R9
4459IK8J8j28j57L79j78J71k64J83n7j08K24o5J3l56N60m83K90o9j38J52j65M90
4482C49m47J75L8k6o1j53L70m62M66k40K22j89N6J03j58J55l91L37m53L56j33
$$ plain form
4503 -86 -29 412 -197 178 -196 113 -264 70 90 -42 142 -285 176 -177 52 -119 -9 -34 -65 72 -211 4
4525 4 -123 -53 -265 229 29 100 -14 -140 129 7 280 -45 -107 27 139 49 -206 184 -120 126 -38 79
4547 79 -116 -133 10 -162 124 -298 278 -42 -4 36 -47 101 -84 68 -114 258 -38 58 -233 -185 222 -94
4569 -94 -24 138 223 -229 177 -106 15 198 -59 266 -76 20 -199 -47 -120 79 219 -89 116 -28 256 -201
4591 -201 84 -138 50 245 -69 36 -260 94 29 186 27 -76 -99 -16 145 16 70 -21 71 -106 7 -189
4613 -189 -219 164 -233 36 -12 -92 -97 -134 -2 -66 1 -65 107 -176 -86 -21 -33 136 -156 -84 -31 87 -33 181 40
4638 40 -28 172 -106 138 -188 247 -87 155 255 -93 128 -53 34 -43 65 90 -81 -24 -71 209 50 7 -55
4661 -55 -2 -219 -167 -61 14 -1 -254 199 -186 43 28 -20 -127 -283 -125 -207 8 -155 32 -3 188 159 134 198
$$ packed form
4503h6N7M41o09L75l74L09l77L34K0j32J84m27M61l53K29j71J10k5l1J37k83K15
4525Dj27P0k12M94k00P1j14j26K69j22K73l25o2J34J12r0k55L90l04K46j64J17
4547G9j95j7J43j72K86m22N76l20L8M0q3J48j85J52j82L72k96R6k91M8M07l16
4569i4P0J62Q5m52M06k83J21J83k57L25l42R6k19J52p3J99J40l08K05j44K84m57
4591b01K85k22J88J95l14J05k96L54o5J57j59j03k3Q3J61j29N4r1R2j77J13j96
4613a89l0L83l97K69m8q0nl7J32o4O7o6J72k83R0O5j2J69k92P2N3J18j20K14j41
4638D0o8K00k78K44l26M35l34K42J00l48K21j81Q7p7J08K5j71N7m7K80j59m3o2
4661e5N3k17N2J06P5j5k53M53l85K29j5m8j07j56J58q2K15j63J87l5J91k9k5O4
$$ plain form
4685 198 59 265 -46 178 -78 11 -131 -145 -16 -6 30 -34 105 -43 36 8 -21 160 66 73 -39 15 72 35 -97
4710 -97 -142 150 -167 163 -239 32 38 -16 54 -113 -25 -157 43 44 322 -115 -55 103 41 46 24 5 -68 1 -89 -172
4736 -172 -200 -85 174 -244 15 -167 -48 56 164 1 -132 15 -249 95 -54 3 26 -251 -80 60 -51
4757 -51 60 -10 -157 -24 -69 -75 168 -20 -65 -152 62 -226 62 17 85 -20 -38 94 -249 46 31 135 4 123
4781 123 96 -22 86 55 3 -90 64 -14 292 206 -19 -104 61 115 -7 90 -262 97 16 -175 1 -164 -41
4804 -41 -19 -2 86 -195 -75 -83 85 159 170 56 174 20 139 125 -91 90 -168 138 -45 104 -98 -12 180
4827 180 -57 -48 -5 74 -302 -38 -140 29 -51 -154 56 -110 34 -165 107 58 30 -79 3 -86 -23 130 -71
4850 -71 41 -3 -42 194 75 -64 -31 133 -153 236 137 -12 160 -36 45 -5 190 -141 57 -71 -228 235
$$ packed form
4685A98j39K06l11K24k56Q9j42j4J29J0L6o4J39j48P9k8k9J81r4Pj12N4N7l7j32
4710i7m5K92l17L30m02K71On4P0j67Q8j32K00JK78m37O0J58o2Nk2j9p3O9r0q3
4736a72k8J15K59m18K59j82J19J04J08j63j33J47k64L44j49N7K3k77J71J40j11
4757e1J11p0j47J33m5oK43j88m5q7K14k88K88m5O8j05j8J32l43K95j5J04j31J19
4781A23k7j18J08l1n2r3J54p8L06q6k25q5J65N4j22R7l52L59q1j91J76j65J23
4804d1K2J7Q8k81J20qJ68P4J1j14J18j54J19j4k16J81k58L06j83J49k02Q6J92
4827A80k37RM3P9l76K64j02J69q0j03K10j66J44j99K72m9k8j09Q2q9O3J53k01
4850g1J12m4l9K36j19j39L3J64k86L89r9j49J72j96Q1n0J95l31J98j28j57M63
$$ plain form
4872 235 -24 293 -54 -14 -17 117 -115 96 130 -102 -15 -145 177 -33 101 20 87 -70 -47 34 -149 12 -75
4895 -75 95 30 -224 13 -20 94 -48 114 -295 128 -100 -94 34 -331 100 -9 175 158 84 -30 63 -46 -90
4918 -90 75 -21 -92 -79 54 -61 22 196 -37 16 -36 186 -42 69 -18 63 121 -168 -89 -179 235 -130 41 -2
4942 -2 122 132 53 112 -287 137 -73 99 75 64 38 -57 155 -122 195 -80 27 -31 53 111 74 -17 -137 123 -101
4967 -101 167 -185 -72 75 55 -238 92 68 -186 34 37 223 -34 48 125 -113 9 -89 57 -126 -19 62 -113
4990 -113 52 -104 -187 -17 41 -32 -86 120 56 50 -76 97 124 3 -70 37 -77 -138 -24 17 174 117 140 -17
5014 -17 -62 -63 -79 41 -51 99 25 124 72 3 -14 -114 16 28 7 102 9 -70 8 22 -3 94 -46 90 -70 -88 -156
5041 -156 -143 -26 -7 210 3 -26 -155 -221 144 -202 -33 40 -78 -142 100 -20 4 16 50 46 -3 123 -276 17
$$ packed form
4872B35k59L17l47M0lJ34k32K11L4k32Q7j30L22k10J34q1O7j57K3Q1j83J61q7
4895g5J70o5k54K37l3J14j42J62m09M23k28OJ28l65M31j09J84j7p4j14R3j09m4
4918i0J65r6p1J3J33j15Q3J74k33N3n2K22k28J11q7Q1N8k89P9r0M14l65J71m3
4942bJ24J0p9N9l99M24k10J72k4j1k6r5K12k77L17k75J07n8Q4N8l7r1j20K60k24
4967a01K68l52J13J47k0k93L30k4k54K20LJ86k57Q2P7k38J22r8J46j83J07Q1j75
4990a13J65j56q3J70N8p3n4K06o4oj26J73K7j21p3J07j14o1J14M1J57n7K3j57
5014a7m5jj6J20r2J50p4R9n2o9j7j00J30J2k1R5r3p9P8J4k5R7j40J36j60j8o8
5041a56J3J17J9K17k07k9j29o6L65l46J69P3j18o4K42j20K4J2L4mm9J26l99K93
$$ plain form
5065 17 -25 52 135 -13 64 -180 154 -213 37 -61 115 102 -266 -142 -154 107 -16 161 -46 8 115 -87 77
5088 77 -109 226 -165 126 -71 1 112 67 9 -265 286 -131 25 11 253 56 18 112 -140 118 -176 89
5110 89 151 -252 -23 212 72 -121 43 65 -55 -242 -131 -38 41 60 -206 50 -51 136 -1 27 28 -112 138
5133 138 -164 41 50 156 67 -9 5 -87 99 -151 -88 -187 -144 153 158 106 -41 30 -71 -64 -31 -38 -16 10 -132 87 99
5160 99 20 308 -147 56 -73 -98 44 -9 78 32 -131 -17 -4 -38 98 52 -109 125 -171 202 -132 288 92
5183 92 45 99 -32 19 -83 202 -138 18 -29 -145 -32 14 121 -201 -49 -75 138 -119 84 -1 91 112 -292
5206 -292 129 62 81 -80 37 136 -37 -12 -54 -19 -64 20 189 -115 7 -6 82 -4 -19 130 99 -129 89 -12
5230 -12 -38 54 -37 155 -53 34 -30 -185 159 -120 30 -33 -26 33 63 5 -5 -39 59 162 -33 93 -28 -163 -74
$$ packed form
5065A7m2P7Q3j48P7k44L34l67K50r8J76j3l68J24j2K61j23J77k07N4J07k02J64
5088G7j86L35l91K91j97P2J11m5n8k74N51m17J56j4K42j97l8R4k52K58k94K65
5110H9O2m03K29K35j40j93J64K2j20j87J11R3P9J9k66K56j01J87j37K8Jj40K50
5133A38l02K05RJ06q9p6J4r2J86k50O3r9M3K97Nn2j47P1j01PL3pK2K6j42K19J2
5160I9p9K88m55K03j29k5J42n3Q7m6j63J14J3l4J36m6j61K34k96L73l34M20j96
5183I2m7N4j31N1j02K85l40J56m7j16J13M6J07l22J52k6K13k57K03q5R2K1m04
5206b92M21o7J9j61J17R9j73K5m2L5m5Q4J69l04J22j3Q8q6j5J49l1k28K18j01
5230a2k6R2r1J92k08Q7o4j55L44k79J50o3PN9L0n8j0l4R8J03j95J26j21j35Q9
$$ plain form
5255 -74 97 91 -168 11 -16 68 -278 4 55 -51 -18 -217 -91 -48 134 -46 -78 19 -147 -57 -72 298 -190 -47
5279 -47 -218 44 17 -23 -95 -101 29 -23 177 -8 146 -159 -54 153 -122 171 -174 158 1 30 -75 -128 43
5302 43 -122 163 68 82 -189 60 84 54 45 0 44 -93 -55 -80 141 135 30 138 28 -58 -25 104 -114 83 -13
5327 -13 -131 4 -264 193 -231 -22 -151 91 58 119 176 -78 -51 -200 9 72 40 -7 0 40 82 104 -144 166
5351 166 -72 75 128 299 -90 -261 -143 -152 -137 -210 129 24 57 13 112 53 -70 98 -267 76 94 -52 48
5374 48 -22 305 -9 235 -179 -27 -16 46 257 -269 -25 6 -46 42 145 -71 106 95 -90 60 -296 198 -76
5397 -76 -73 30 -214 -14 -65 93 -174 126 -16 -123 -79 58 16 -140 -3 -80 56 -30 -27 58 -142 -13 -44 231
$$ packed form
5255g4J71ok59J79k7Q4l46K82N1j06L3j99J26M3J82j80l2R7j66R0j5L70m88J43
5279d7j71K62k7m0p2oJ30n2K00j85J54l05J05K07k75K93l45L32j57K9j05n3J71
5302D3j65K85r5J4k71K49K4l0rm5M4j37L8k5K21oj05J08j10q6L3J29k18J97r6
5327a3j18J35k68M57m24K09j29K42l3O1N7k54K7j49K09O3l2m7PM0M2K2k48L10
5351A66k38J47N3J71l89j71J18rJ5p3L39j05L3m4R9n9j23J68l65L43J8j46J00
5374D8p0L27l14K44m14J52J1O2K11n26K44L1n2Q8J03k16J77j1j85J50l56M94k74
5397g6LJ03k44K00n1J58k67L00j42j07M4J37m2j56J37p7J36q6LQ5k00J29l1K75
$$ [...]
8191A03
##END NTUPLES=NMR FID
##END=
