##TITLE=1H_EC-3236
 CDCl3, 8 sc, 
 21.10.2020
##JCAMPDX= 6.0         $$ Bruker NMR JCAMP-DX V2.0
##DATA TYPE= NMR FID
##DATA CLASS= NTUPLES
##ORIGIN= UXNMR, Bruker Analytische Messtechnik GmbH
##OWNER= root
$$ XWIN-NMR		Version 3.5
$$ Wed Oct 21 11:38:39 2020 Russian Standard Time (UT+4h)  she@DPX200
##.OBSERVE FREQUENCY= 200.1315066352
##.OBSERVE NUCLEUS= ^1H
##.DELAY= (6, 6)
##.ACQUISITION MODE= SIMULTANEOUS
##.ACQUISITION SCHEME= undefined
##.AVERAGES= 8
##.DIGITISER RES= 18
##SPECTROMETER/DATA SYSTEM= spect
##.PULSE SEQUENCE= zg30
##.SOLVENT NAME= CDCl3
##.SHIFT REFERENCE= (INTERNAL, CDCl3, 0, 15.7039)
##AUDIT TRAIL= $$ (NUMBER, WHEN, WHO, WHERE, WHAT)
$$ ##TITLE= Audit trail, XWIN-NMR		Version 3.5
$$ ##JCAMPDX= 5.01
$$ ##ORIGIN= Bruker BioSpin GmbH
$$ ##OWNER= she
$$ F:/spectra/data/she/nmr/H-F/1/audita.txt
$$ ##AUDIT TRAIL=  $$ (NUMBER, WHEN, WHO, WHERE, WHAT)
(   1,<2020-10-21 11:37:30.10 +0400>,<she>,<DPX200>,
      <created by zg, POWCHK disabled, PULCHK disabled
       configuration hash MD5:
       00 E9 B6 7A A2 85 ED C7 34 08 36 98 17 FE 4E 26
       data hash MD5: 16K
       F3 BD 47 30 C3 36 29 16 7A 9B BF 3D B7 87 75 40>)
$$ ##END=
$$ 
$$ hash MD5
$$ 09 29 50 77 1E 10 68 8F 3A AF 9D DF 01 D4 38 46
##$RELAX= 
##$RELAX= 
##$RELAX= 
##$RELAX= 
##$RELAX= 
##$RELAX= 
$$ Bruker specific parameters
$$ --------------------------
##$DU= <F:/spectra>
##$EXPNO= 1
##$NAME= <H-F>
##$PROCNO= 1
##$TYPE= <nmr>
##$USER= <she>
##$AMP= (0..31)
100 100 100 100 100 100 100 100 100 100 100 100 100 100 100 100 100 100 
100 100 100 100 100 100 100 100 100 100 100 100 100 100 
##$AQSEQ= 0
##$AQ_mod= 1
##$AUNM= <au_zg>
##$AUTOPOS= <>
##$BF1= 200.13
##$BF2= 200.13
##$BF3= 200.13
##$BF4= 200.13
##$BF5= 200.13
##$BF6= 200.13
##$BF7= 200.13
##$BF8= 200.13
##$BYTORDA= 1
##$CFDGTYP= 0
##$CFRGTYP= 5
##$CHEMSTR= <none>
##$CNST= (0..31)
1 1 145 1 1 1 1 1 1 1 1 1 1 1 1 1 1 1 1 1 1 1 1 1 1 1 1 1 1 1 1 1 
##$CPDPRG= <>
##$CPDPRG1= <>
##$CPDPRG2= <>
##$CPDPRG3= <>
##$CPDPRG4= <mlev>
##$CPDPRG5= <mlev>
##$CPDPRG6= <mlev>
##$CPDPRG7= <mlev>
##$CPDPRG8= <mlev>
##$CPDPRGB= <>
##$CPDPRGT= <>
##$D= (0..31)
0 1.2 0 0 0 0 0 0 0 0.06 0 0.03 0 0 0 0 0.0002 0 0 0 0 0 0 0 0 0 0 0 0 
0 0 0 
##$DATE= 1603265849
##$DBL= (0..7)
120 120 120 120 120 120 120 120 
##$DBP= (0..7)
150 150 150 150 150 150 150 150 
##$DBP07= 0
##$DBPNAM0= <>
##$DBPNAM1= <>
##$DBPNAM2= <>
##$DBPNAM3= <>
##$DBPNAM4= <>
##$DBPNAM5= <>
##$DBPNAM6= <>
##$DBPNAM7= <>
##$DBPOAL= (0..7)
0.5 0.5 0.5 0.5 0.5 0.5 0.5 0.5 
##$DBPOFFS= (0..7)
0 0 0 0 0 0 0 0 
##$DE= 6
##$DECBNUC= <off>
##$DECIM= 32
##$DECNUC= <off>
##$DECSTAT= 4
##$DIGMOD= 1
##$DIGTYP= 9
##$DL= (0..7)
0 120 120 120 120 120 120 120 
##$DP= (0..7)
150 150 150 150 150 150 150 150 
##$DP07= 0
##$DPNAME0= <>
##$DPNAME1= <>
##$DPNAME2= <>
##$DPNAME3= <>
##$DPNAME4= <>
##$DPNAME5= <>
##$DPNAME6= <>
##$DPNAME7= <>
##$DPOAL= (0..7)
0.5 0.5 0.5 0.5 0.5 0.5 0.5 0.5 
##$DPOFFS= (0..7)
0 0 0 0 0 0 0 0 
##$DQDMODE= 0
##$DR= 18
##$DS= 0
##$DSLIST= <SSSSSSSSSSSSSSS>
$$ [...]
##$SUBNAM2= <"">
##$SUBNAM3= <"">
##$SUBNAM4= <"">
##$SUBNAM5= <"">
##$SUBNAM6= <"">
##$SUBNAM7= <"">
##$SUBNAM8= <"">
##$SUBNAM9= <"">
##$SW= 16.880792210976
##$SWIBOX= (0..15)
0 0 2 0 0 0 0 0 0 0 0 0 0 0 0 0 
##$SW_h= 3378.37837837838
##$TD= 16384
##$TD0= 1
##$TE= 0
##$TE2= 300
##$TE3= 300
##$TEG= 300
##$TL= (0..7)
0 120 120 120 120 120 120 120 
##$TP= (0..7)
150 150 150 150 150 150 150 150 
##$TP07= 0
##$TPNAME0= <>
##$TPNAME1= <>
##$TPNAME2= <>
##$TPNAME3= <>
##$TPNAME4= <>
##$TPNAME5= <>
##$TPNAME6= <>
##$TPNAME7= <>
##$TPOAL= (0..7)
0.5 0.5 0.5 0.5 0.5 0.5 0.5 0.5 
##$TPOFFS= (0..7)
0 0 0 0 0 0 0 0 
##$TUNHIN= 0
##$TUNHOUT= 0
##$TUNXOUT= 0
##$USERA1= <user>
##$USERA2= <user>
##$USERA3= <user>
##$USERA4= <user>
##$USERA5= <user>
##$V9= 5
##$VALIST= <valist>
##$VCLIST= <CCCCCCCCCCCCCCC>
##$VD= 0
##$VDLIST= <DDDDDDDDDDDDDDD>
##$VPLIST= <PPPPPPPPPPPPPPP>
##$VTLIST= <TTTTTTTTTTTTTTT>
##$WBST= 1024
##$WBSW= 4
##$XGAIN= (0..3)
0 0 0 0 
##$XL= 0
##$YL= 0
##$YMAX_a= 227625
##$YMIN_a= -157059
##$ZGOPTNS= <>
##$ZL1= 120
##$ZL2= 120
##$ZL3= 120
##$ZL4= 120
##$ABSF1= 10
##$ABSF2= 0
##$ABSG= 5
##$ABSL= 3
##$ALPHA= 0
##$AQORDER= 0
##$ASSFAC= 0
##$ASSFACI= 0
##$ASSFACX= 0
##$ASSWID= 0
##$AUNMP= <proc_1d>
##$AZFE= 0.1
##$AZFW= 0.1
##$BCFW= 1
##$BC_mod= 2
##$BYTORDP= 1
##$COROFFS= 0
##$CY= 11.3945322036743
##$DATMOD= 1
##$DC= 2
##$DFILT= <>
##$DTYPP= 0
##$F1P= 16.9975609425685
##$F2P= -3.02152046262296
##$FCOR= 0.5
##$FTSIZE= 0
##$FT_mod= 4
##$GAMMA= 1
##$GB= 0.15
##$INTBC= 1
##$INTSCL= 1
##$ISEN= 128
##$LB= 0.24
##$LEV0= 0
##$LPBIN= 0
##$MAXI= 10000
##$MC2= 0
##$MEAN= 0
##$ME_mod= 0
##$MI= 1.114404
##$NCOEF= 0
##$NC_proc= 0
##$NLEV= 6
##$NOISF1= 3.799351
##$NOISF2= 2.8
##$NSP= 1
##$NTH_PI= 0
##$NZP= 0
##$OFFSET= 15.70392
##$PC= 1
##$PHC0= -10687.71
##$PHC1= 11.60089
##$PH_mod= 1
##$PKNL= yes
##$PPARMOD= 0
##$PSCAL= 0
##$PSIGN= 0
##$REVERSE= no
##$SF= 200.130013532006
##$SI= 16384
##$SIGF1= 3
##$SIGF2= 2
##$SINO= 400
##$SIOLD= 16384
##$SREGLST= <1H.CDCl3>
##$SSB= 0
##$STSI= 0
##$STSR= 0
##$SW_p= 3612.71676300578
##$SYMM= 0
##$S_DEV= 0
##$TDeff= 0
##$TDoff= 0
##$TI= <>
##$TILT= no
##$TM1= 0
##$TM2= 0
##$TOPLEV= 0
##$USERP1= <user>
##$USERP2= <user>
##$USERP3= <user>
##$USERP4= <user>
##$USERP5= <user>
##$WDW= 1
##$XDIM= 8192
##$YMAX_p= 0
##$YMIN_p= 0
$$ End of Bruker specific parameters
$$ ---------------------------------
##NTUPLES= NMR FID
##VAR_NAME=  TIME,          FID/REAL,        FID/IMAG
##SYMBOL=    X,             R,               I
##VAR_TYPE=  INDEPENDENT,   DEPENDENT,       DEPENDENT
##VAR_FORM=  AFFN,          ASDF,            ASDF
##VAR_DIM=   8192,          8192,            8192
##UNITS=     SECONDS,       ARBITRARY UNITS, ARBITRARY UNITS
##FACTOR=    0.000296,      1,               1
##FIRST=     0,             0,               0
##LAST=      2.424536,      0,               0
##MIN=       0,             -157059,         0
##MAX=       2.424536,      227625,          0
$$ Real data points
##PAGE= N=1
##DATA TABLE= (X++(R..R)), XYDATA
$$ [...]
1648c7k64O83j242J389p59o7P03j220J378j194P59p4k42M34l13K2L11m64J96L46
1668C45p17R56q87M67J73q83J292j171Q50l95K2N64r63N30n9O0k61M21m86O51
1688E09p59N57l3q01J255j391J166q02K53L50o44Q35o79K97P7k21j76L13m27M88
1708A67k73k88P71r95J043r26M64r1j99P10r17P75n18J28p2J76k32K72j53q7K78
1729C3n42Q98j089Q57k69j66N23q57J100q72L71mJ04kp8J14l01L17k57N64q11
1750c67Q86n04j17M82o67R61j037P04l2n41M90k95J78j48M30o91N37o48O78l81
1770h2L4M45p44Q60p03N68l22q0L70o36N01m01L95m03N69o96K66j73L8N82p49
1791c61P31q53P47n13J84O6l17O07n86K66l21N99n31L58l3j60K17l00M13n79P23
$$ y = [-37, -301, 382, -860, 529, -230, -297, 406, -814, 564, -630, 129, 55, -187, 247, -66, -44, 267, -197, -1, 345, -372, 584, -303, 164, 337, -546, 746, -425, 425, 30, 52, 616, -347, 183, 124, 184, -77, 344, -142, 509, -250, 307, 274, -527, 728, -663, 503, -299, -46, 304, -340, 495, -184, 113, 190, -31, -207, 106, -321, 167, -106, -394, 377, -618, 425, -501, -37, -128, -327, 383, -534, 241, -277, -149, -221, -45, -277, -5, -158, -245, 33, -509, 389, -700, 157, -112, -278, 245, -612, 488, -384, -13, -17, 87, 85, 7, 121, -180, 137, -120, 444, -367, 519, 15, -102, 380, -287, 674, -363, 341, 309, -232, 258, -37, 141, -7, 423, -268, 269, -379, 299, -82, -48, 397, -347, 513, -190, 378, 56, -24, 346, -290, 211, -190, 205, -198, 371, -325, -59, -232, -194, 388, -361, 370, -483, 264, -249, -65, 1, -316, 291, -295, -29, -350, 249, -282, 76, 43, -117, 100, -200, 213, -366, 357]
1812C57m50oK73m51N27o30P19m37K26k88J18J06j00K61n19P76p31N50l67J31J10
1833A75l29L82n51N96l95M14l9j71K3r8K38n66N34n09N68k77rK82o31N72n26N21
1855B04k41J18j68P7k69J20L64o59O41n49M83l93J75J90o00O79n72N11l00K10
1875B1j10j3K33k61L92n14O16p52O74l11P4R4l94O40r68R86n81K53j86L9K46l23
1897a45L98m69N84n92M91k35M1J64m75O16p03O94m98K97K8j74M33n64O29p22K88
1918H6O5K0k06K22o0l39P09p95Q36q60M77k31j38N50q58O44n07L65k76J91l2n5
1940a92J93j82K63o00N88k36J19n1Q7K11o60O62n80K53j46J55J96l24L32l04M14
1961A98m21N08m51L51J8m81M42n71P63n39M43k38J87j73k92O43n16K46l05K59
$$ y = [357, -93, -99, 174, -277, 250, -380, 339, -98, 128, -160, -42, 64, -36, 225, -294, 482, -249, 301, -66, 65, 175, -154, 228, -323, 273, -122, 292, 253, 82, 105, 7, 245, -321, 213, -296, 272, -5, -14, 268, -363, 209, -317, 204, -37, 81, -87, -10, -279, -159, 205, -454, 187, -362, 121, -272, -97, 93, -507, 172, -400, 111, -189, 21, -89, -102, 131, -130, 262, -252, 364, -388, 286, -25, 49, 143, -251, 389, -579, 407, -174, 79, -107, -68, 178, -145, 253, -216, 368, -224, 267, 32, 73, 237, -238, 378, -325, 369, -129, 168, 196, 22, 455, -109, 520, -202, 86, 151, 171, -35, 187, 127, -212, 497, -298, 538, -322, 155, -76, -214, 336, -522, 122, -385, -20, -296, -105, -137, -192, 1, -181, 82, -518, 70, -166, -47, -98, -11, 200, -460, 202, -378, -125, -271, -116, 80, -244, 88, -216, 198, -223, 285, -166, 185, 203, -278, 164, -407, 356, -183, 260, 22, 209, 36, -256, 387, -129, 117, -188, 71]
1981G1R5J15k66qJ67k60O04p04M80l00JK52m15N02n33L49j42J86m24L71r0k49
2003a98L33k28K62o70R34p35K23K51l37O39r51P82m44J00J6q8M0j50P7r1M25m12
2025b22M75o66M42J40m35N30o76P77m92J61K38l38K64j52q7k07N35o65O71l57
2045f4K54j23k03O73q93O83m37K37j60j70O26m40L43k59P2j02K24l52K71j42j02
2066f4L32o50Q43p46N14n8k14L20o36P52o01K86j58J03q1M9Lj83M74m45M04n33
2088b89M60m44M26L0n95P42p71M90k44P6J72j32J8rK56n83O14n50N67l11p3L73
2110B23l39K41o37P79l58J52O3k86N02l90K45m27N04n41N66n41J90L63n45N77
2130C41o95Q15n82M18q6k83K33l78M09l32L53k61L19j89p0J60j97L95n84M22l91
$$ y = [71, 166, 281, 15, 7, 174, -86, 518, -186, 294, -6, -5, 247, -168, 334, -199, 150, 8, 194, -230, 141, 51, -198, 135, -93, 169, -501, 433, -302, -79, 172, -165, 474, -477, 305, -139, -39, -23, -111, -71, -221, -144, -235, 190, -222, 253, -413, 29, 169, -266, 264, -412, 365, -127, 34, 272, -66, 198, 46, -41, -248, 287, -378, 293, -64, 190, 67, -136, 537, -356, 327, -110, 127, -33, -203, 423, -17, 326, 67, 139, 37, 261, -91, 180, 38, -64, 268, -382, 461, -285, 229, 171, -43, 277, -359, 393, -208, 78, -80, 23, -58, -9, -6, -189, 285, -160, 244, -289, 171, -273, 153, 183, -412, 330, -441, 49, -195, -119, 53, -79, -61, -70, 186, -397, 217, -333, 234, -77, -150, 223, -116, 125, -512, 267, -91, 61, 124, -162, 340, -50, 195, -232, 272, -269, 297, -244, -54, 309, -236, 341, -354, 461, -121, 297, 211, -72, 161, -217, 192, -140, 213, -48, 271, 82, 12, 172, -25, 370, -214, 208, -183]
2151a83J93m9K2L46o87N17l33L46l29J45Q8k40J28p3J58m27N63l35J31m8j78K76
2173C1m11N44k46M9q1J57k60j23O00m92M57l82L21l31L47j52k58N50o15M95m40
2194b40L48l28L39l6j25K22l86M06l82K37j57M3o6JM17m33M67n28M48k87J04K2
2216H6j54K82m34M67l16K60l45L16o1j16R3n2J27l42L13j88r4Q4k73N25k76L30
2238B32l97K03k44L03j78j39L35m18M85n02L31k74R8K06l85M68n71M54j37K02
2258G2k87K41J08m13L37m68O94m43J70J4r5K27j95K78m03L56l46K14r9Q3j37O1
2280c1L64m76M63m04K75k09o9ok5K63k17N25n38K91l03J04J62m27M01l86M17m25
2302b51M08k41J9M09n85L24m39N73l30O1j42J78N2k97K77k06K94m63M37k3j57
$$ y = [-183, 10, -39, -17, 329, -358, 159, -174, 172, -157, -12, 76, -164, -36, -109, 49, -378, 185, -150, -19, -67, -245, 31, -380, 164, -82, -33, -114, 43, -217, -340, 260, -232, 225, -157, 164, -167, 180, 28, -230, 320, -295, 200, -240, 108, -220, 119, 83, -42, 180, -206, 200, -182, 55, -102, -59, -125, -124, 293, -140, 327, -201, 247, -40, 64, 86, -68, 214, -220, 247, -69, 191, -154, 162, 101, -15, 78, 26, 153, -189, 124, -64, -158, -74, -347, 178, -98, 232, -165, 38, -206, 97, -81, -220, 115, -303, 182, -320, 11, -263, -165, 41, -344, 124, -447, 7, -130, 72, -215, 26, 134, -279, 58, -410, 284, -159, 11, 25, -70, 157, -38, 240, -163, 193, -153, 61, -38, 45, -92, -31, 333, -143, 320, -84, 191, -18, -87, -93, -118, 145, -72, 453, -85, 206, -97, 7, 169, -258, 143, -243, 174, -251, 157, -84, -65, 344, -241, 83, -356, 217, -113, -52, -194, -16, 36, -261, 16, -190, 104, -359, 78, 55, -102]
2323a02K81l68L60m35L47l24K81J60l11J72q8P4p6J46m75L81k6M3J39k13M96q55
2345c93M56l24K52J28lJ59l84K01k69M27k68J91N0j94J07k13K87l90M43m23L86
2366B26j07p5J47m13M19k85J11q2J77p4K36k68n3L24m89L87k81J66j50j34J61
2387e7j56N25o53M70k01O7p1qN2j59L10l97L00j65L01l28J34J79m88M45l67L83
2409A16m79J53K85l87M12k70L25k27N8k52K11q2J48J88m48K93k13L73l76L66p3
2430A21q2M4O2J3l56M20l22P1L5J64j82p3L74k79k8o7nK56k17L38n10M60j94j31
2454h8q8L84l19j42K28j14L80n56M36k54K17j05J06q5j92M38m04L12k69K17k78
2475a76J76k7k09J56r9J90k4j6j1l22N83j34J69m97J47J14j86J29j69K49k26L28
$$ y = [-102, 179, -189, 171, -264, 83, -241, 40, 200, -111, 61, -27, 47, -29, 117, -358, 23, -3, 40, 179, -34, 462, -393, 63, -261, -9, 119, 116, 275, -109, 92, -177, 250, -18, 173, 223, 29, 136, -77, 210, -180, 263, -160, 226, 119, 44, 191, -222, 197, -88, 23, -59, 118, 44, 280, 12, -41, 283, -206, 181, -100, 66, -84, -218, -57, -213, 312, -341, 129, -72, -5, -76, -84, -32, -191, 119, -278, 22, -143, 158, -170, -36, 143, -345, 100, -267, 116, -363, -210, 75, -312, 100, -170, 155, -72, -14, -266, -55, -137, 11, 199, -249, 44, -169, 204, -172, 194, 121, 39, 83, 145, 158, -198, 222, -100, -29, 6, 170, -12, -85, 289, 10, -18, -85, -90, 166, -51, 287, -223, 237, 43, -88, -176, 208, -111, -253, -25, -139, 241, -315, 121, -133, 84, -21, 85, 0, -192, 246, -158, 154, -115, 102, -176, 0, -27, -236, -80, -179, 11, -13, -29, -40, -362, 221, 87, 256, -241, -94, 20, -166, -37, -206, 43, -183, 145]
2497A45j02O8q8R0N0l06K99j96M5J24J8j79R8K49k64J43l17J65j85L7J55J59j14
2520I4j11K21m09M90k71N2j67J83K68n49L30m12K30k00J50P1o7K32j69Q4k80L20
2542I0m26L90q5j45L01l34K79l54M47n3m5j81M1K72m37M51k51p1M7J47K5k7J35
2565B16m17L45l78L69l41KJ34p2K05j83K97k21K95m87M21j33j63K18j62K2N5J17
2587A39k56R2J31%kk60L83l54J12O2J70j62j93J73k6J71j64K62l06l1L6m4K67
2610B00l50L18m35L95k24K8k1M1k7j47K74q6J13k51L23l52K24o2j51L55j57N5
2632F3l08K41j5j54M18n48K76n3J1r5J72o2L6J30k57M04k86m0L0p4K45j77Q9k44
2656a98L07k83L22l06N8L1J09j04j54N54n29K90o6L0J9k14J68j39J25n5J96l13
$$ y = [145, 43, 111, 23, 113, 163, -143, 156, -40, 5, 129, 147, -32, 66, 315, 51, 194, -123, 42, -143, -106, 49, 208, 94, -17, 204, -205, 285, 14, 66, -101, 82, 350, -199, 131, -281, -51, -251, -101, -30, -97, 135, -34, 50, -230, 90, -336, 54, -31, -176, 125, -209, 70, -284, 163, 110, 65, -116, -75, 197, -240, 211, -40, -111, -64, 83, 108, 81, 216, -201, 144, -234, 135, -206, -204, -70, -142, 63, -120, 177, -44, 251, -236, 185, 52, -111, 107, -55, -33, 22, 139, -117, -25, 106, 106, 104, -156, 227, -127, -15, 47, 217, 55, -138, 35, 9, 180, 16, 278, -28, -59, -23, -67, 200, -150, 168, -267, 128, -96, -68, -89, -48, -75, -222, 52, -34, 79, -172, 151, -201, 23, -39, -190, 165, 8, 63, -245, -4, -19, -173, 245, -303, -27, -80, -69, -164, 8, -54, -18, 112, -145, 259, -27, -67, -37, -111, 134, -43, 46, -198, 109, -174, 148, -158, -100, -69, 40, -64, -218, 336, -193, 97, 31, 61, 80, -134, 34, -105, 20, -35, 161, -152]
2678a52J30K35j81p2lJ94j77OJ08j12J9l6nj11J10j39J99Q6k67J45j90K51j69
2701a31L77k86P9k86J04R4l6J94j37J3R7M%q7Ln5J02j28K14j91K09j01j86L46
2725B12m78J57j7L32k64J95l63J48K7k10K57p8K50j44Q1J05k83M1j31M37l80K85
2747A79j20j03M7l2m1k09M29l08L40k18J83k81J80j0k53M30l40K62k86K48j5j82
2769a00n1R1l6j18J02j9m6P2m2O0j11J21r0K81j74k7K04l46K76k20L87k83M0j51
2793a80J33j21K41N0l05M57k28J60j76L6kj40l1L9J33j64K15j65J56k12K98j04
2815I0oj58j26L16k88K25j14q5M46m72K29j61m2L20j50n9n5N09o07K92k61J44
2837a3j07PK01l17L65n16N05l33K2J63p6K50k03J87m20K64r8m2P9J50K0k00J59
$$ y = [-152, -22, 213, 32, -40, -43, 151, -26, -20, 88, -24, -5, -41, -46, -157, -47, -186, 13, 99, -168, -23, -213, 38, -131, 246, -40, 39, -247, -143, -49, -85, 109, -28, -15, 82, 86, 86, -1, 2, -53, 49, -79, 135, -56, 153, 52, -134, 212, -266, -109, -126, 206, -58, 137, -226, -78, -51, -261, -4, -82, 168, 24, 105, 210, -73, -32, -163, 274, -106, 179, 59, -44, 3, -29, -70, -279, 150, -158, 182, -36, 147, -134, 46, 36, -217, 213, -127, 135, -151, 97, 82, -100, -151, -60, -96, -214, -112, -131, -177, -105, -147, -87, -198, -77, -167, 114, -60, -87, 117, -229, 47, -173, 214, -69, -29, -180, -47, -168, 73, 123, -182, 275, 47, 207, 31, 67, 65, -75, -106, -67, 66, -98, 117, -48, 108, -104, 194, 90, 84, -74, -200, 116, -172, 53, -61, -146, 300, -172, 57, -104, -146, 174, 24, -35, -90, 419, -188, 104, -157, -13, -120, -113, 88, -229, 136, -380, 125, -208, -186, -23, -99, 151, -52, 135, -285, -21, -119, -161, -82, 68, 88, -112, 47]
2860D7k68R4J46Q8j73m4J07j58J72j10K59l11J27K1j84L13k95K44N4k8l29L26
2882I8j98l2J72k5l8j65M94k45JJ48j03j89M1L7m5J46k44R8J08Q7j21p0J30k30
2906a45K17k23J59j71K78j88Q4M6o9j16R0R0j74J72j32L0J43j66J77k06N1O4m2
2929c1N5k30K61k12K22j19J5L7J38k01L0J02n1L4k01L43k56n2K90k53J65j76L09
2952B19k63J24Q9q5K5j07P3j80J60o1j18J26J54j5R7r5j65L00k02K7j11j12L46
2975B26j80K6k03K34k36J89O0j97M4M4m6j60L47j75P5k80J20R2k10L05j87m9l7
2998a98K46j97n8R0J13m5j92M40j61Q7j43j01J05k61L94k57J37m0JRpP9j61J12
3022hO0j77J61llm6P1j70L66l51K88j47k19K57o6J99k92K11l26L36o4O4n1n6K14
$$ y = [47, -221, -127, 19, 107, -66, -110, -3, -161, 11, -99, 160, -151, -24, -3, -187, 126, -169, 75, 129, 101, -228, 98, -100, -132, 40, 15, -23, -188, 306, 61, 62, 210, 107, -82, -41, -4, -49, 97, -147, -49, 59, 146, 25, -45, 85, -145, 72, -151, 8, -163, 115, -73, 11, 57, -12, -128, -38, 52, -122, 50, -82, -52, 91, -75, 102, -104, -53, 11, -31, 24, -206, 55, -157, 65, -54, -39, -2, 136, -65, -35, 67, 16, 50, -151, 192, -64, -116, 174, -79, 86, -90, 219, -44, 80, 169, 84, 109, 2, 75, -105, 55, -6, -124, 2, 156, 141, 238, 143, -22, 278, 76, 103, -8, -120, 226, 46, 72, -131, 103, -133, 56, 116, -81, -37, 7, -39, -199, 148, -27, 48, -232, -112, -20, -230, 75, -112, -161, -198, 48, -149, -207, -117, -4, -49, -241, 199, 38, 125, -18, -119, -14, -275, 119, -138, -1, -41, -40, -31, -38, 41, -120, -8, 52, -125, 36, 33, 30, -16, 55, -115, 251, -100, 188, 41, -178, 79, 13, 212, -80, 131, -195, 141, 77, 141, 90, 34, 248]
3047B48k40L65m59Q6mj47K41m1j04q9K43j18J29j26j66J66P4l7k18J11p0J55k7
3070b8m2Q1O2j82J27J11j70J43k7k17J69m7P6j62J81K5p3p5rk6J85J05l74L6R9
3095c2m8j69K35j26P2J23j83J11m4P4rN6j1j46K36k59R5O2r4J77l29L28q9J47
3119A77l16L93l26K04p6j18J60J36N7m19K88n7j94M8J83Q3m47M25k19K18m70K59
3141a1K08k98Q2k01K71k67K66On7K78m59M41l70J29k31J96P5Pn7R3m7n2J68m39
3165b69K42j91M19j82k61K92k9M5Q0q6k08M56j92l0l0j89J77q4j51K65j76L5J16
3188D9%j4K12j79n5L5q1qK0J18l97M04p6N0l2m9q2J72J95l52K64l28Q3n8K68j57
3214Br4J15j79J89k46K33j52J68j3j52L38k21J35j90k2M5J57l4P0k45J02J45l28
$$ y = [248, 8, 373, -86, 0, -4, -151, 90, 49, -55, -144, 99, -19, 110, -16, -182, -16, 58, 21, -197, -86, -156, -1, -28, -70, 11, 73, -109, 18, 129, -41, 102, 75, -142, 27, -20, 56, -106, 75, 100, 27, -48, -57, -83, 102, 207, -167, -131, -32, -80, -249, -14, -140, -68, 55, -128, -17, -61, 13, 4, 60, 49, -97, 139, -120, -25, 37, -57, 120, -209, 119, 30, 177, -139, 254, -72, 132, 56, -62, 98, 234, 291, -128, 160, 103, -91, -43, 140, 223, -224, 201, -18, 200, -270, -11, 197, -101, -19, -220, 51, -216, 50, 56, -1, 277, -182, 259, -111, 18, -213, -17, 58, 65, 8, 101, 54, 2, 170, -269, -27, -218, 201, 19, -242, 50, 21, 66, 146, 60, -148, 308, 116, 86, 56, -133, 44, -40, -191, 74, -102, -67, 49, 49, 35, 247, 68, 13, 48, -33, -41, -21, 97, -300, 104, 28, 78, 46, -3, -85, 87, 282, -70, 194, -134, -51, -109, 159, 2, -92, 23, -156, 33, -213, 20, -132, 36, 23, -129, 209, -12, 123, -67, -89, -44, 113, 79, 149, -96, 6, 151, -177]
3237a77J38Q4j24MJ96k61J59K4j07Q9j31M5j74L22L3j46K49l42K52k33J55m0j50
3260a35K33k84K36q7NN0J14j09J80j26j63J63j19oL9J88l72J85N1j03Q3j65J64
3283B2K14k53M2k51M24k29K2j48J32J78j52q6K5J71p3k7M9j98K66j3j54M3m3j49
3307a88O0J79J29l1l80J90k94L11M3Q3l13L75k11K31j96k0j3k0J42j42J44J1p2
3330A8o8m8J81r4OL6p1n9O1P5j8J0j4J82k84M26k73r5k7j06L29k06R5j28L3J6
3356b3K6J01r1m0R0qJ63k30o0J20mj39o5J50K01j86j38R3N3J7N3K6k95K33l03
3381b56L59j31j2J59l65L98k23L5j13J05P8l20L39Q3p9q6k6m4PK05j11J87k77
3404h8J2K7R9k25J78J9jQ5j49K6K7q3N3K01n2k67K91j67K25m22L28j77R7P0k46
$$ y = [-177, -39, 45, -79, -75, 121, -140, 19, 43, -64, 25, -106, -61, -235, 87, 120, -26, 223, -119, 133, -100, 55, 15, -135, 98, -186, 50, -37, -32, 18, 132, 23, 203, 77, -86, 77, -42, -48, -9, 179, -193, -8, 43, -60, 23, -142, 22, 236, -17, 25, -226, 198, -31, -9, -157, -25, 153, 1, -85, -60, 111, 38, 11, 60, -138, 128, 115, -39, 4, -39, -188, -128, 51, 180, 149, -231, -41, -335, -24, 19, 102, -211, 164, -47, 184, -12, -32, -45, -65, 77, -65, 79, 90, 18, -50, -98, 83, -11, -5, 31, -40, -99, -38, 37, 19, 29, 15, 197, -87, 339, 66, -29, -56, -162, 167, -39, 56, -72, -39, -23, 3, 104, 13, -27, 63, 55, 218, -12, -72, 48, 44, -95, -160, -10, 191, 5, -133, -40, 13, 30, 83, 109, -186, 47, -256, 103, -28, -40, 119, -246, 152, -71, -36, -149, -44, 34, -286, 53, 136, 57, -29, -55, -99, -92, 113, 2, 189, -88, -76, -49, 50, -175, 3, 22, 21, 106, -43, -17, 10, -73, -20, 181, 129, -138, 153, -14, 211, -211, 117, -60, 37, 107, -139]
3429a39m1Q8J74j02K80k45o6J08r3J18k50J46K2P3m0r7J40k70J08k32L76j63R9
3452fL7k35K19P2j05j71K17o8r0K15l46L97l57J68nQ1m5mo5N1J7l1Qm7K28m2o4
3479B9KP9j63K3J13j55R0j27J98j86J03Ll7K4l1Q0j15P3J05L3P7k72j95Q1K28
3504F0o3K9j02J81j35j88K56j26K01j58J16J5m8j07J1l2j35J36n3O7L1L7Q8o8
3528A3J54j57pLl2j1m8m5KK06r4r4K60j28j5j01R3K02k34m6J40J6m5j56K17N1
3554A44k47J97k25J15o8R4n7N0m3n2K11r8J27j23L2J8L9l9l74K49J24r3j37K86
3578A30j00J30q3j74J41k43J71N1k7n3J79j57K6r8J02O0j54J88k94J98O7k7J7
3601E0n6J36k37K55j28RK19k71R7j28RpJ55j60p8J90k40K24j04M4l8q1J1J93j79
$$ y = [-139, -180, -92, 82, -20, 260, 15, -51, 57, -36, 82, -168, -22, 0, 73, 33, -64, 76, -194, -86, -318, 58, -105, -6, 31, -204, 15, 87, -18, -189, 28, -40, -130, 85, -261, 136, -221, -53, -58, 23, -22, -26, -91, -40, -23, -54, -46, -93, 135, 93, 29, 31, 110, -53, -30, 83, -72, 18, -109, 89, -97, 6, 9, -28, -4, -35, 45, -70, 3, 108, 141, 218, -54, -249, -168, 60, -3, 26, -76, 105, -30, -218, 38, -88, 113, -45, 71, 86, 38, -69, -58, -90, -225, -89, -142, -75, -44, -7, 81, 13, 167, 10, 3, 6, -26, -37, -85, -130, -128, 78, -16, -110, 150, 22, 7, -94, -1, 201, -33, -79, 61, 77, 32, -124, 93, 144, -103, 94, -131, -16, -84, 10, -47, 3, -40, -92, 119, 21, 148, 25, 57, 75, 114, 75, -299, -50, 74, -19, -156, 130, 30, 160, 77, -97, 44, -199, -28, 23, -4, -57, 122, -35, -9, -107, -5, 55, -99, 89, -205, -7, 60, 33, 50, -6, 130, -107, 148, 20, 29, 248, -23, 74, -54, -45, -52, 103, -57, -135, 55, -185, 39, -65, -21, -59, -140, -129, 64, -115]
3626a15M7m4k1L19j40N9Qj93J75Jj69O1m6J27K02j38j81J03K85k08j49m8O0P5
3650G0J22k85j1j45J54O7N6J95j29j46j37Q9m0Q4J59Rj70p9J10R6lm8L3j00l8
3675h7j0J5n5L0J07j17J23QJ2J3N0O2l3Qo3r0Q2Q0rj05k0k9J72j52J62k74N9n
3703f6J32n2J01j06j06K72k24P8k5K3J45k27J35q1j1LR1q3J70j42j5m1m5J48r
3728F5M9M2o2l0j43K9j2J59m8J04j62j69O4q7L3M5J54m7jJ32j00n8q0r6L32o1
3754E2n8L4j42J99j28J12k3j82L5L8O3N6M9k5j26J5n3J34j6j99K79k93J79P7N9
3779A36k31J21O1r2r0J8K1R7r4NJ59k10J18pM6J14j49J25j50L6j13o0p6M15k20
3804b0n1L91l40J6P1O8lj23j28J19j7p0K42r0q9o0K16j00j71L46p1j67J65q3j30
$$ y = [-115, -68, -112, -133, 186, 46, 105, 113, -80, 95, 96, -73, -12, -58, 69, 271, 133, -48, 55, 340, 132, -17, -65, -5, 70, 192, -93, -104, -249, -95, -28, 28, 223, 94, -52, -189, -100, -140, -56, 103, 112, -58, -137, -27, 69, 66, 18, 51, -49, -87, -97, -82, -137, -107, 0, -117, 6, 14, 26, 39, 89, 151, 118, 126, 63, -27, 55, 135, 126, 21, 1, -28, 144, -8, 154, -120, -61, -66, 66, 14, 115, 9, -97, 175, -49, 29, 4, 27, 172, -55, 80, -1, -12, -9, 82, -1, 169, 27, 12, -29, -74, 74, 65, 114, 156, 94, 64, -79, -50, -62, 97, 49, 153, -9, -178, -114, -201, -168, -123, 31, -16, -17, 115, 15, -43, -123, -219, 113, 52, -6, 28, -114, 85, -43, 69, 46, -136, -101, -63, 0, 56, 105, 80, -46, -31, -84, 50, 34, -165, 114, -179, 0, 77, 136, -95, 26, 87, -5, -95, -77, -56, 41, -53, -48, 111, -99, 19, 12, 58, 172, 23, 148, -2, 34, -79, -139, -215, 200, -20, -71, 320, -20, -4, 67, 135, 132, 9, -119, 0, -17, -87, 155, 65, -24, -84, 132, 32, -139, 207, 136, -31, 134, 51, -79]
3829g9o8L16m49K21%l6N4n6K32k70oJ50j91K06K1J83r9m6m9R3j15J0l2J4O0j05
3855d1K2rJ89l88M47k63K85l16J34j28J31mJ10qj64j21l4L09j78J73p7j06J97
3878A60k67L05o4k20K51m20L84j78K35l44K00p7R9p0m1J12j40K83k06M8n0j19
3900a19J37k6J88j81J38j23q2J94k48K12o6K03k97R6k03L57m3j10k71J01K83l63
3922b23J78P7rQ5o0NL2p1K0j86k7L54j00K2r8m8r3L57l55N4J63n7J07j47M2j1
3948A1L4K8P8L6k37o6K12k19J11j24L22m07K27J76Mk80J38K1j95K51j40J4N2L1
3972G8p9l3QK6j9k8K11q5k87L02l0o7M5j32r4K14R6j27rM9M5j23j94K06J44j46
3998b9L1J26k34O2n4K91j32J48l76J10K63k81m8J33m9J77k06j01K72p9k55L75
$$ y = [-79, -147, 169, -280, -59, -59, -95, -41, -97, 135, -135, -141, 9, -182, 24, 45, 228, 129, 83, 34, 127, 12, 22, -10, 4, 64, -41, -19, -28, 161, -227, 220, -43, 242, -74, 60, -68, 63, 59, 169, 161, -3, -124, -158, 151, -27, 146, 69, -37, 160, -107, 198, 134, -86, 165, -255, 129, -49, 186, -158, 42, -35, 64, -6, -47, 65, -75, 208, 2, 50, 0, -119, 18, -8, 180, -1, 137, 14, -68, 126, -122, 90, 24, 227, -70, 26, -177, 180, 137, 27, -244, -143, 140, -223, -45, 32, 23, 108, 48, 53, 85, 14, 34, -152, -179, 175, 75, 97, -1, -49, -142, 215, -140, -86, 77, 20, 127, -20, 22, 11, 45, 73, 151, 187, -50, -116, 96, -123, -12, -136, 186, -221, 6, 182, 186, -94, 44, 65, -130, 121, -19, -5, 47, 78, -1, -34, -26, 0, -19, -47, 164, 79, -208, 94, 64, -3, 42, -90, -184, 30, 126, -1, -10, 39, 84, -39, -233, -27, 117, -29, 2, 128, -106, -44, -98, 193, 61, 209, -167, -57, 206, -75, -123, 10, -39, 138, -68, -169, 103, 24, -231, 144]
4020A44j98K78l29J65kj80J43k00K79NK4j25l6m0J31r7M1K9j01J16m3J13r3m5
4044b1R6k07K06j46N2n9j32L02o7j60J66p6J95j39j67J04N3j14J6J66Rk16L0p
4068a16N4o9P8l5j4J88j10%J7M7o9k0n8K35L3j72K7r6J07q9p0%J14p9J20J49j62
4095A0j75K1J15P1n9o1j9qj4J36P0j0p1k09L03j26j29K34j65Q4oK17m2o5k41K25
4121H6j40k10K54m0Nn5K3J50j04P6Lr7KJ96j95K49l4j75k9R0j14r1L99l95K65
4146A19k09N0j46L06k0m5R1p7P6j74OM6p7J0N8O7j25K32j91n0J01k3r8M5O3k12
4172a77K97k7o1j4M1L9N6q3q5M4rJ22k08K8Q3j41J60r7NR4m3n2L9j6j71J42lJ06
4200F9p7k26L24k87R8RQ2j06K28k23J99o9k4MJ0K70l53J86q8k0K2j37M2N6J74
$$ y = [144, -54, 224, -105, 60, 58, -122, 21, -179, 100, 105, 129, 4, -32, -72, 59, -38, 3, 32, -69, 47, 4, 117, 24, -21, 75, -132, 74, -72, -20, -79, -211, 91, 24, -136, 30, -46, 149, 10, -157, -53, 0, -114, -98, 68, 77, -139, -109, -116, -62, -131, -53, -88, -102, 86, -24, -24, -7, 40, -29, -49, -107, 128, 161, -11, 16, -80, 27, -62, -132, -132, -18, -97, 23, 172, 10, -165, -144, -29, 42, -17, -78, -97, -105, -119, 17, 87, 77, 6, -203, 100, -26, -155, 79, -86, -2, -8, 209, 167, 102, -139, 86, -54, -264, -10, -50, -45, -100, -77, 73, -31, 45, 48, -49, -47, 149, -46, 203, 169, -6, -35, 55, -59, -150, 249, -146, 119, -90, -40, -186, 120, 100, 55, 146, 69, 145, -29, -23, 23, -54, -44, 14, 81, -44, 188, -3, -53, 48, 25, -73, -28, 35, -177, 120, 93, 32, 18, 59, 98, 154, 71, -14, 30, 21, 143, -65, -37, 46, -95, 65, -32, -27, 67, 24, -28, 11, -5, -176, -34, -37, 69, -8, -234, 90, -197, -99, -90, -8, -114, 114, -109, 90, 21, -3, 1, 11, 281, -72, 114, 26, 6, 28, -109, -67, -11, 163]
4225A63k38J44oR7n5k45J31r6K59o3K5k24K21R0j97Q8oj86K02n8m0N5j96N8K57
4250A80j33K5j43O7K63j84j10p3J42n8lj40K98k29J18j43J60R1l54K52k4j29R
4273a18R7K6k9L2LN7j38Q6J41j9r9j30K50j63r6J54J95j50j94n1j8K30j77J15
4297DLO7K9m2L5j79K92k47K0R6Kn1q1K58l32K18Lj69M9k7J32r9K52j79J00jk53
4324a00j11J52J72L6p2M6J8j14K30k63r9M6o3J28j2R8k73K57k38J48nRj04K5J52
4349F3r6j18l4J45J25M9j56RO7j82J80k11K11lj15K33k05J64k59J62K28k83R6
4372G0J68j14m02K60q3m8L56k53K3O5J24k79p2K46j41j57J73J24%j94N6K36p5
4395H3n4l8J62j35n3p8N3M0J53j01r6o7Q8J76k6k40m7J00J23RK1k69L47K2k39
$$ y = [163, -75, 69, 63, 160, 105, -140, -9, -105, 154, 91, 116, -108, 113, 203, 6, 94, 88, -98, 104, 46, 6, 61, -135, -77, 180, 47, 72, -71, -4, 259, 75, -35, -108, 34, -24, -27, -167, 131, -98, 20, -123, 37, 128, -226, 26, 2, -127, -118, -21, 5, -24, 8, 11, 68, -70, 16, 157, 138, 39, -91, 159, -4, -100, 54, 249, 99, -95, -146, -164, 66, -111, 4, 7, 74, 103, 61, 96, -83, 209, -38, -18, 78, 80, 29, -52, 206, -126, 92, 95, -74, -25, -52, 80, -19, 233, 54, 154, 153, -100, -211, -59, 113, 149, 77, 123, 141, 27, 257, -6, -105, -59, -122, 6, -6, 92, -181, 76, -162, -14, -19, -10, -114, -89, 63, -33, -151, -185, -40, 85, 134, -22, -13, 54, -128, 52, -159, 52, 49, -66, 167, -38, 126, -133, 29, 257, -26, 70, 238, 124, -278, -18, -101, -149, 207, -46, -23, 42, 166, -113, -185, 61, -80, -237, -64, 60, 60, -134, -78, 158, 83, 29, -9, 153, 18, -35, -113, -60, -20, 133, 32, -64, -131, -43, 133, 107, -133, -180, -80, 43, 52, 73, -196, 151, 173, -66]
4420f6j9J59j46j5J00N1j37k1M2K05l35J13M4J0J5K0jO7n5%K2j8J49j94J65k33
4446g8j16L67l47L36j57%Oj43L85k31O8k3L9q9L3J17k74M9j26J40j23K10K09k40
4470A2j14J51q5j14O2L3J26j50P5J5m1J88j29k7L4j18M4j38J94J30j17Op8q8O9
4495f0K16r6j58q0K83q0l2j57J62Oj72K73j70J84n4j7j75J20N2j07J41j93J35
4518B1kj55Q6J39j11P5J7o3j31Q7J74pj03J08k41M3M5K1M0P6l4o3j01J37m7j24
4544a13J87j06J57j67P4J45j13k28J5K73k61J74j30L25k63K6R8k39J24J42k16
4565i6R4L3O7m4j10J11j92J39J20mm8j88J08K02j28k19K12L1l2r7J79j43j06k0
4589a31L52l78J66Qj25J64J10j14j35K06k54K08l1j60%N4J26k21J04RJ14k52L36
$$ y = [-66, -85, 74, -72, -87, 13, 64, -73, -94, -52, 153, -182, -69, -25, -15, 0, 20, 19, 86, 31, 31, 53, 35, 184, -10, 155, -78, -194, 173, -174, 162, 5, 5, 11, -132, 253, 22, 90, 67, 106, 17, 50, 167, -107, -58, -184, -44, -167, 43, 252, 12, -102, 49, -36, -150, -88, -55, 71, -79, -4, 11, -30, 158, 29, 2, 36, -82, -38, -176, 18, 148, 31, 37, -41, -129, -60, 156, 60, -98, -178, 105, 25, -7, -164, -2, 4, -168, 105, -65, 119, 65, 48, -127, -7, 45, -62, 79, -114, 21, 19, -136, -50, 89, -22, 53, 70, 7, -124, -37, 137, 130, 27, 135, -106, -63, -18, 3, 43, 119, 85, 22, -79, 58, 11, -113, 74, -32, 125, -42, 32, 177, 64, -164, -149, 124, -137, 37, -93, 232, -31, -5, 93, -146, -22, 120, -96, -2, 31, 98, 54, -56, 55, -137, 2, 122, 118, 70, -118, -10, 192, 64, -155, 57, 88, 56, -41, 138, -5, -111, -131, 221, -157, 9, 17, -108, 56, 166, 52, -83, 123, -131, 77, 46, -114, -114, -60, 66, -155, -51, -42, 72, -180, 156]
4612A56k30Q6K67n35J07QJ42K19k57M0J0l2p0J34M2Ok13J15R5rk4k5k01K54k00
4637a15J51O8j18j0n5M9NK6j51J9J80Q0l7j00J3J16j12N7n2N1L4m1l26J61J48
4662D1p8O5O0J24j86J10r3j83K52onk72M0K1L20j56j23R5K8kj54K41k50J16p1
4687f6J00K1j79M2K11j5j18o2J69L7k24J40n3p9p8J26N5L4J6Q8j70Pk2j46K24
4712E8r6k5N4j3l2K2j0J28o9l8J27j57p0N5Q3K4L0o1J1j5j41J81j10J14k46J61
4738c5L2m1O0r7J72q3O1j58J00J33k29j76J84K49j31j6r9l7R7N0j20J2Q2j8k1
4763b9J17j59K26k34r6K06NN7j12j6k3p4k2K43k41K62J1P1l09l9J91J03j37n8
4787e7O5K1j25q2K16L7J2j08j48L23k39r4J56J10N6l46K51l2R4k89J51j11Q0R0
$$ y = [156, -74, 12, 279, -256, -149, -141, 1, 220, -37, 3, 13, -19, -89, 45, 87, 93, -120, -5, 90, 81, 57, 32, -169, 85, -115, 36, 104, -14, -24, -79, -30, -25, 1, -150, -131, 49, 129, 92, -8, 5, 121, 9, 66, 14, 65, 99, 58, -268, -107, 41, -37, 28, 88, 212, 26, 136, 43, -140, 112, 106, 101, -171, -131, -110, 210, 54, -69, 26, 54, 52, -102, 139, -111, 5, -66, 34, 55, -124, -82, 129, 114, -4, -66, 103, 140, -84, 56, 3, -76, -154, -28, 27, 61, 77, 165, -5, 2, -20, -166, 58, -38, -63, -9, -22, -54, -32, -42, 86, 17, -21, 106, -51, -121, -66, 17, 41, 71, 10, 21, 6, -135, 46, -64, 50, -196, -35, -3, -44, 16, -81, 91, 8, 69, -89, 11, 144, -85, -261, -77, 172, 41, 25, -74, -111, -14, 36, -84, -72, 10, -8, -29, 88, -71, 155, -79, -175, 31, 36, 93, -19, -35, -58, -132, -154, 89, -152, 110, 121, 192, -117, -156, 35, 138, 1, -57, 8, 29, -96, -178, 38, 75, 87, -21, -169, 154, -85, -179, -23, 87, 143, -203, 48, 16, 110, -179, -28, -139, -59, 31]
4811C1p2q5M9KO7J14k10J75p4mR8k3j56j1K01j61j24Q9P0k00J30Q0p4N9K19k26
4837c6O4N7P2j12J17j79L5q6j18L10q9J56k12J19m5m5L2k1Q4j3q5j24J36M7j05
4862d1J53p5q9PJ10jj5m4no9M0J48n6r7R2j88P4k1PM7K23k29J06J6j72j53K86
4889E4k6j21M2J04r8Q4P0j18j36K9J78L1j94K21k03J05Lo2R7k72K24r1L9j6J89
4914A33r9k08j0K87Rq7J51MM6l67J78Q8j01j91K77j94J69J20k19J54o6k9k8j15
4938i8J21J16l8K3q0j39O3k4M1K9L38p6k53k15J28J45o7p3l4L54l17r1j8J02n0
4963a13J51j13m4R4LJ22j76K27k03k1J08r2m7o5J38R9j98K04J60l05J78o8j08
4986f9J69j31P4j74KP6RP6P5m1j99M9J32l5K0j5q2J90q2O8j03j36J3K45M9k22
$$ y = [31, -41, -126, -77, -75, -8, 106, -104, 71, -3, -7, 91, 68, -88, -99, 102, -59, -183, -94, -24, -224, -94, -14, -88, -29, 190, -36, 28, 85, 157, 45, 162, -17, 18, -68, -186, 124, 35, 191, -21, 98, 53, 8, 40, 19, 103, 90, 5, -119, 17, 64, -41, 112, 37, -52, -45, 65, 64, 49, 5, 0, -69, -29, 119, 63, -34, 58, -130, -56, -77, -70, -23, 200, -29, 77, 93, -79, -232, 54, 28, -93, -51, 53, -45, 39, 109, -9, -145, -116, 62, 93, -101, 120, -83, 22, 25, -37, 60, -212, 12, -79, -40, -56, 133, 34, -174, -184, 103, 112, 25, 176, 180, 226, -141, 37, 125, 24, -167, 110, -84, 85, 205, -14, 140, 74, 45, 17, -98, 23, 139, 101, 124, 44, -95, -32, -56, -15, 14, 352, 276, 23, -192, -64, 81, 14, -59, -93, 261, -56, -147, -165, -63, -113, 38, -75, -119, -25, -22, 100, -76, 151, -52, -73, 35, -57, -104, -169, -31, 68, -130, 74, 234, -71, 107, 39, -69, 100, -31, 43, -131, -129, -53, -44, 32, 107, 66, -133, -84, 48, 13, 33, 18, -64, 126, 44, 112, 9, -127, -114, 131, 180, -42]
5012d2J76j49j08L18o8P6l44J06PJ45J4L7l14K34j79Q6r2lJ69L8k29O4O6j78K15
5037D5J14r8K3k51K13k02R9j1J26q7L3N4n2k2M0j29J43j20J43M3j63J72k42J86
5061E7J0j68k7J5K25r9n5l9j54K80l9j42J27j03J67k7K3j06J16J30q4j52J65J16
5085B36k53J25m8r3R1l0O0n9j13n3J7L6L6N0j20K60kp0k26K3L02q1j09L8K6p3
5111c0J82q5o5l3j9o1J73n8j2J45j0k69J66MM1o0j9J17J7j04mj16K07R9l55L17
5137A68k53M2Q0j6L5j56q4J24N7j03J54J19l49O7J04J8o3J89j31L3j03K59j1j53
5161B7j1r6l9J13m1J4j89K10J17j7l9r6LJ44j7j9PQ3m1k24K07j59n2J68q8l8P7
5188DN5r6J66j72J19K8r4l5j58J78k9k4P0J57k59J29k4L8K9l7l7J24j71M4J82
$$ y = [-42, 134, -15, -123, 195, 127, 203, -141, -35, -28, 117, 131, 168, -146, 88, -91, -5, -97, -100, 69, 107, -122, -58, 8, -170, 45, 159, 61, 84, -167, 46, -156, -57, -68, 58, -29, 4, 58, 6, -16, 24, -105, 38, -82, 61, 104, -59, 113, -129, 57, 67, -101, -128, -113, 112, 13, -42, -81, -235, 45, 6, -136, -9, -112, 55, 28, 51, -55, 61, 191, 107, -45, 120, 236, -17, 108, 60, -33, 58, 28, 88, 29, -84, -137, -120, -84, -48, 2, -118, 142, 140, 70, -156, -133, 169, 88, -21, 17, 43, -30, 152, 67, 2, -31, -50, -111, 62, 4, -8, 137, 127, -142, 24, 28, 69, 9, -10, 107, 124, 20, 16, -100, 107, 206, -149, 168, -85, -43, 37, 21, 56, -100, -184, -60, -3, -106, 48, 167, -182, -115, -11, 7, -56, 133, 2, 35, -68, 191, 180, 27, 16, -80, -119, -6, -47, -33, -222, -12, 105, 88, 49, -47, -44, 100, 83, 64, 71, 154, 113, -111, 96, -63, -115, 53, -35, -73, 4, 59, -37, 129, -43, 76, 104, 10, -25, -183, -5, -34, -58, 12, 169, -90, 39, 15, 53, 82, 45, 8, 132, -39, 5, 187]
5213A87j91N7J8Jj8m5o1Q0L8ql0p8j04K21K3lj47p4R9j34K50j21O1j9l1J45Q0
5240A96k33K0p1J18j18K24n8j24N2J11k34J83J5j39Q8P6j31q3J01j06m9J33K43
5263B14j79J94q2j38r3q3J91k2j9n4r6J52j25J82j80K23k69K71m8k28J71R0j09
5286c7p4J68J13j18M5N5k05M8k8j8N8J14q7m1nN9k18L43l23J12J06K8%M6j1j58
5312b8K18j71O3J74k94j2J47l8r3o3MK6LJ23q9R7k04P4P3K71k27K3Jk58K21k1
5338B0p6R6J10k64K74j40q0J07M9r8m4m0R7Q6p4j15j18N1R9R8k27J11O2k16L59
5363A27N6k52K0R7k8j64K33L9l69K69l2j00o9L08j81k36L19R1j73k4J37mn6j12
5387a04L8J11j17n5Q0n3L26l12N7P8j39K43j37k56R3K05n0L5n7M7k99K04l6L05
$$ y = [187, -4, 53, 71, 72, 54, 9, -52, 28, 66, 58, 28, -50, -154, 67, 90, 87, -60, -134, -35, -169, 81, -40, 21, 2, -29, 116, 196, -37, -17, -88, 30, -88, 136, 78, -46, 6, 117, -117, 66, 81, -58, 30, 106, -25, -108, -7, -113, -162, -29, 214, 35, 229, 147, 9, -84, -167, 24, 2, -17, -71, -167, -15, -140, 42, -138, 85, -184, 87, 39, -189, -18, 72, -37, -111, 57, 170, 52, 97, 152, -53, -5, -33, -51, 7, 121, 34, -7, -12, 47, -171, 172, -151, -39, 67, 95, 95, 141, 130, -28, 190, 19, 82, 256, -38, -50, 97, 59, -34, -97, -93, -67, -64, 59, -30, 67, -137, -63, 10, 281, 54, 77, 78, -180, 41, 20, -56, 40, 150, -114, 160, 20, -60, 47, 96, -2, -46, -86, 11, 97, 23, -92, -210, -159, -60, 38, -189, -78, -16, -232, 127, 183, -69, -49, 48, 20, -144, 89, 128, -241, 28, -4, -104, -173, 135, -46, -282, 37, 128, -45, -69, 68, 64, 8, -104, -66, 45, -72, -127, -47, -100, 226, -86, -29, 49, -90, 153, 16, -240, -147, 58, 8, 43, -14, 33, -266, -62, -98, 207]
5411B07%k65J68m8o4J23k58J39K2J9J35j08j70K58p0k38M8J14j02L7P1J44k44
5434h2K02p9J01l61n2L94k45K9N3J00p1K05j25k20j9J04J02L2m5p7K31j23l0M3
5458F7k02O9P8J16j20j59L0l4O7P0RM3K3n5j6o8K33k76J32J37p7k48J02J36o4
5483gJ48j63K17k18J2p0J28J78j81MK5l05J95p3nM4L6Q1L2r6j10J12L3K4J73k47
5509c3J12L9Kj84J05k3J0J6j15J53o9n9J23J70j50j06pJ1M1p5J09P0r4j72J44
5534A8j59L63k44L2L4p3J83k86j8J56N6Q5n8k04J67p8n4K32j17O8j23j55N8J7
5558a00R1JJ89l33R8j5J14k24J75J88k73m6R1P1o6J34p1L3K49l00M3jJ04j05p4
5583b7m3R5mk9J62q2j08j48K67O1j75j9R4j4j33J54r7K66j79j16k68K25P9K7P2
$$ y = [207, 207, -58, 110, 62, -2, 121, -137, 2, 24, 43, 178, 70, -100, 158, 88, -150, -102, 12, -90, -53, 18, 162, -82, 120, 41, 142, -219, -271, 123, -122, -93, -40, 60, -11, 194, 69, -151, -170, -66, 36, 68, 23, -54, 177, 54, 24, 67, -135, -66, 12, 128, 8, -151, -121, -155, -88, -18, -9, 34, 57, 2, -14, -82, 151, -125, 7, 144, 67, -181, -79, 57, -7, 141, -22, 195, -23, -11, -81, 47, 225, 44, 48, 73, -232, -37, -110, -115, -71, -35, 46, 78, -18, -128, -16, 17, 41, 214, -33, 79, 118, 120, -64, 41, 18, 28, 44, -71, 82, 13, -46, 77, 247, 97, -9, -16, -5, 36, -39, 70, 140, 46, -126, 18, -141, 222, -22, 10, 44, -29, 154, -132, -150, 6, 62, 147, 89, -115, 52, -26, -80, 152, 35, 103, -20, -175, -117, -100, -9, -8, 181, -152, -54, -69, 45, -179, -4, 184, -89, -135, -44, 27, -39, 95, 24, 57, 306, 6, 49, 48, 152, 47, -27, -70, 25, 21, -8, 154, 72, -36, -184, 83, 144, -31, -50, 44, 30, -103, 51, -46, 220, 41, -75, -343, -118, -39, -12, 60]
5608F0m9j25L8j35Q3K09r8J09r2NJ73k05o2J32n0J22j19k0N6j19o6k9O9j65K41
5633c7O1k6R1m5q9J70k09N0J6J51m3k19J58k30k3L35n9O5j67J40j75L05j13j05
5657Bj57J57j03Q8K63k49P9M9p4j79L02j63M6M9j49J18k31K47k06R2Q1r4n4L7
5681d9P0J00p0K4q9Q0k6j6q5J33m9M8j43J08M2r9p8J1K75j27j32O5L7M8K5m3K25
5708B85j45j41p2M7mQ8m2m2Q8k79J93Q9J55k82oR6J3p2l9K06k69J67l1K8j15L8
5734d6K2m1J04P6K01l44PK3O2J3j60K53j42q8M4J17j5p4rQ8q2j41J69q2o0J91
5760H6j52p1J03o5L3K2rM1M0K8M8r3J56j41R4k94K50o1k53L76j67J07n0JR9j62
5786c4Q3k01p0L75k03K62k54N2lJ07n9L7n2k72L54k25J52K6j91K12j18K59k22
$$ y = [60, 11, -114, -76, -211, -128, 81, -17, 92, 0, 5, 178, -27, -89, 43, -7, 115, -4, -24, 32, -87, -153, -182, -113, -278, -37, 24, -2, 89, 44, -45, 125, -84, -34, -18, 133, 90, -129, 29, -201, -224, 111, 52, 117, -50, 90, -85, 220, 107, 2, -155, 2, -101, -13, 250, 1, 80, 129, 55, -124, 178, 15, 61, 110, -39, 79, -152, 95, -111, -19, 62, -32, -86, -49, 21, 121, 51, 75, -14, 66, 40, 24, -61, 72, 23, 71, -72, 36, 78, -21, -99, -88, 187, 60, -72, -7, 30, 78, 103, 60, 285, 140, -1, -73, -26, -30, 58, 16, -26, 62, -217, -24, 65, 220, -62, -68, 28, 41, -31, -70, 136, -133, 34, 3, 31, -84, -46, -24, -65, 39, 115, 316, -28, -21, 2, 64, 77, -83, 170, 28, -60, -16, 101, 86, 12, 3, 91, 9, -132, 37, -45, -105, 86, -66, -137, -34, -99, -66, -44, -53, -12, 28, 56, 104, 11, 167, 26, 120, -174, 76, 15, -238, 138, -29, 78, 28, 29, 128, -34, 49, -152, -222, 153, -50, 212, -42, 10, 7, 114, 55, 92, 40, -232, 122, -103, 49, 75, -116, 96, -22, 237, 15]
5809A5O2k1k08O7K37q4j78J25lJ37K9j24r4N2J33O5l03J38L9j8j09J55k65K70
5833A17k33K45k4P3j65j01O9j48J22j15l2Q2J54p8J53n5k62K65o5j50K70k07K13
5856A28k53J06p6Q4P3n2l3K0k17J77J02K9n8J14r1k06l7J92Q8p9r7l7K06j28Q2
5881C7j94K02j25N0J69k53m0O1J36j17k3J94mk71J31j3k9O3M3N4m5q1J29k71L60
5906A63j39m0l6JQO8k72K47O5n8J44j52j21j57J98O8O2k29J12pJ28J6k38O0j08
5931b17J46J74j24J51q8k19L02j77l8K7k7Q6J70k71J51r3n1K36j90J50j99K98
5953A97l35o2J48K00j52j1kl6j54P6K09m9j37K7l6m6K47N3k22m5l9qJ83j10j88
5978b92L69j84j51M07j27Q3J06j85j42M8J21j68L10l5k65Q1J37j53Q6j8j74J27
$$ y = [15, 77, 56, -152, -85, 152, 68, -110, 15, 12, 149, 178, 54, -40, 12, 145, 210, -93, 45, 84, 66, -43, 112, -153, 117, -116, 129, 105, 178, 13, -88, -19, -167, -45, -160, -192, -110, 44, -34, 119, 64, -198, 67, 2, -148, 122, -85, 128, -125, -19, -95, -11, 62, 10, -23, -3, -220, -43, 59, 88, 30, 144, 53, -153, -190, 2, 90, 11, -86, -123, 83, -45, 37, -157, 45, -80, -30, 139, -114, -154, -93, 43, -74, -97, 97, 93, -178, -47, -60, -89, -26, 17, 71, 26, -55, 74, -197, 163, 24, -16, -52, -51, -43, 25, -247, 0, 65, 7, 151, -1, -122, -279, -81, -13, 49, -180, -68, -75, 53, 69, -169, -109, -217, -71, 103, -21, 130, 42, -177, 125, -52, -90, -63, -90, -4, 166, -105, 46, -47, -98, 138, -52, 98, -101, 197, -138, -200, -52, 148, -4, -15, -17, -53, -207, -131, 78, 29, -108, -81, -117, -163, 84, 137, -85, -130, -169, -177, 6, -104, -292, 77, -107, -258, 149, 22, 105, 211, 26, -116, -68, 53, -115, 195, 160, -105, -24, 113, -40, 46, 28, -146, -19]
6000a9J11o2l4j15Q2K40j32p5n1L24k51j59K87K8j9r8L1j12Q1L7k08K34q5p2n0
6025h7n3K83j67P8m8J73l65K01K2n7j30R7r5J31R3p9K53m57K51Q7k06%j9J42J23
6050A71j49l2r6m2J02M6J57j8j75J9pp6K35p6j31J78j52N9N9J74l32m2J10j77
6074a95L07p1k16L08j22O9N9Kn9J93J44k71j28N5r7Q5J3j66J10k14J84j83K27
6097C4q8J23MK8J33l53m5K51o8j03J81j97K84j32r8R7k9m6L2J05n9j23J20k15
6121a64L30k11P5j21L1J29j99j1N5j0O3P0O1K0Nj46N9l5K7n3j0J31J77q5l6j39
6147A3q3j0J11N1Ol33K79q4J14j82K3R6J46q5O3j31pk0q3P3R4j56L79l60K05n9
6173F0j06M3o8R2k0J26k69J04l1L38k07O5k58K39k03K24p8j76M6q6L09l29J99
$$ y = [-19, 92, 30, -4, -119, -37, 203, 71, -4, -55, 269, 18, -141, 146, 174, 155, 57, 88, -24, 57, 94, -114, 120, 35, -37, -87, -140, 143, -24, 54, 6, 179, -186, 15, 37, -20, -150, -53, -148, -17, 76, -3, 250, -207, 44, 131, -75, -75, -94, 48, 171, 22, -10, -106, -148, -46, 0, 157, 139, -36, -17, -24, -100, 135, 59, -72, 106, -46, 13, 72, 246, -86, -128, -18, -195, 112, 41, -175, 133, 11, 80, 139, 141, 82, 275, 419, 148, 20, 75, -22, 63, 76, -90, 20, -194, -10, -193, 34, -54, 69, 73, 101, 234, -119, -164, 87, 19, -84, 97, -100, 184, 52, -46, 51, 22, -24, 8, 113, 54, -69, 51, -164, 166, -45, 30, -91, -60, 69, -130, -141, -86, -96, -33, 37, 98, 118, 123, -23, 36, 1, 28, -25, -35, 96, 273, 188, 152, 13, -70, -80, 31, 82, 88, -245, 34, -50, 64, -118, -95, 1, 147, 62, 125, -6, -13, -33, -116, -43, 51, -105, 274, -86, 119, 60, -46, -3, -71, 21, 1, 127, -142, -38, -69, 269, 62, 127, -131, 108, -95, 129, 51, -125, -79, -165, 144, -185, 14]
6196A4j18J86O6m7J11k44j81J59J53k75J64k4O7k80L58o3k06L98r6j96R6k7J89
6219B04k59K50j96l1n9k2J91q3J6N1Qj11J53j51r1J59J60j90P8k02R5P5j44J88
6243H9M7j43q8L1n0o2L86k28J23q2j09J29l0o2J82k93K93k59K91j62K8k5n4Q7
6267C9o6rJ45o9r2n4lK69m9m2m5Oj18J16pm6K08j43j28Q0r7J89k38K21j13K60
6293B14k40K6k58K47M9L5N3o6M4p5j11J44O8j81o6J90j29J25j02L0M6J07k07Q3
6317B6J10l42J66j91K75R1k81J57k14L91l91K89j15j94L56m1j09J6P9Q3m1qn7
6340E5j9j22K12j54J34q9m2L2J02k00O9J39o3l4jj8q7J02l4P4p6j1J18l43L55
6365I9K3k54Q6n4J9R1K72n10L46o7k13J92j06O2j08O6J63j4k25P8NL8K20r3kk0
$$ y = [14, -104, 82, 148, 101, 212, -32, -213, -54, 99, -176, -12, -36, 31, -249, 109, 46, -160, 238, 142, -54, 42, 15, 204, -55, 195, -1, -32, -91, -113, 78, -5, 11, 62, 70, -41, 112, -39, -130, 29, 189, -1, 77, -125, -30, 45, -99, 89, 136, -7, -95, -64, -114, -176, 210, -18, 105, 23, -86, 43, 13, -49, 133, -160, 133, -126, 165, 3, 31, 6, -48, 39, -27, -36, 109, 40, -52, -106, -109, 160, 111, 69, 24, 30, -88, 28, 21, -25, 183, 40, -88, -8, -105, 84, -154, 67, -46, 214, -26, 0, -258, -11, 38, 73, 126, 60, 104, 29, -82, 62, 130, -51, -117, 73, -56, 69, -33, -3, 43, 150, -57, 26, 136, -206, -40, -231, 44, 135, -146, 11, -203, 188, -203, 86, -29, -223, 133, 92, -17, -1, 78, 161, 120, 112, 55, 36, -86, 126, -28, 106, 17, -25, 7, 109, -91, -22, 117, 54, 20, 19, 1, -86, 16, -18, 56, -20, -31, 87, -256, 99, 122, -132, -46, -100, -81, 10, 282, -228, 118, 51, -162, 30, -76, -14, -122, -56, 107, 93, -132, -54, -49, -11, 209, 116, 114, 94]
6391I4J11k48j00K03l7j43o1L4K68k22j1N5l2J63p7K7nN4j23j9q1K48j90M1Q7
6416C6np9j19J15LK80j82p7R9J07j53m7K6O1p6k34J95J57j26J84n8M9k69K81l72
6441b04Q7R1J83m3j35j11Q3J07k2J52j72q8J89k38J53k1L0r5lk6J92J39m08K12
6465E2m7p6J32K4Om6Rk87J77L6j12J56j04Q3j59L45k45J21q7J46k14j53J39J13
6489Ir8m5K97k04J49k05M5K18l16J80J03q1kj28rJ23Oj01PJ11j75J78q8M1Q6P
6515A08J7k08K10l6J9j20qJ27j79M8m1L3p0J79j40j0k0J31K15j88q5K3K15k61
6539d1J2M6j69P4J49Q1l26L10m5p9O2J5j17l6K27k04J9J00j47O4O6J44j43j90
6563a28K2K02j17j42J06M4m3j56J07j1O2N9Q1j05J67O2k57N7K4J82j20l2j27Q3
$$ y = [94, 205, -43, -143, 60, 23, -120, -181, -147, 121, -101, -112, -57, -89, 74, -3, 24, 19, 73, -50, -69, -150, 98, -92, -51, 36, 31, -48, -167, -52, -49, 231, 49, -28, 71, 178, 25, -22, 4, 65, -11, -245, -50, 107, -19, 165, 107, 156, -113, 168, -204, -117, -26, 157, 114, -21, -132, -49, 58, 36, 188, 16, -72, 117, -121, 32, 11, 41, -54, -57, -83, 109, 248, -160, 52, 5, -71, 61, 85, 91, 45, 54, -233, -56, -20, -132, 24, -80, 3, -156, 189, -56, 65, -22, 124, -90, -243, -104, 9, -89, -134, 163, -41, 108, -97, -52, 166, -150, 30, 133, 52, 50, -78, -87, 36, 42, -59, -52, 59, -116, 62, -26, 15, 101, 108, 125, -83, 127, 91, 110, -10, -18, 109, -70, -22, -63, -30, -100, 79, -61, -71, -91, 40, 255, 67, -18, 5, 220, -41, -29, 17, -152, -78, 71, 152, -174, 136, 91, 12, 74, 89, -28, -64, 163, -41, -22, 78, -69, -5, 61, 205, 62, -128, -106, 96, -21, -163, -57, -13, -56, -212, -105, -116, -54, 5, 86, -19, 148, 210, -47, 10, 34, 216, 96, 64, -63, 20]
6587B0j9P2l9o8O0J29r8r1J10l2J6j81j71K36m1J02K0j07L8j0N9Mj4k5j20P2J56
6614G8k95L44j69q5J79j94K04k15K01Mj0j40K24k17K26k39K2K27j98J57O7k01
6636c0j56Q5J8Lq0J38j1n3J8jK02r8K2j5K3l77L36r1j7O9r1J16K05j85k2J86l55
6663a61K26J4Q3j07l9j66K68j12O6j22J29J2j45O2j33R2p2K4P8j92J63K4Q4K4
6687A00k35J43m3K05k97j41M50r9j15J7q8Q3n0J22n0J3L0j18N6J78j68j28K9R
6711i7J46j18N5L6n3J4J39L7k19q6K25j22R0j7Q7j70J3j1j49J4J0J50J08j35J84
6736A31k71J91o2M3N0j11J93K9l49K36r8Q2p9k33K75p9J74Mj22J47o0N9j18q4
6760e2J89R0j01k37L15l40lJ69O2n4k0L78m21K1Q5k29K34j3j73M4l5Q8j9L4Q5
$$ y = [20, 1, 73, 34, -34, 26, 155, 57, -34, 76, 44, 60, -121, -292, -56, -97, 5, 25, -82, -44, -54, 5, 9, -5, -30, -150, -78, 78, -217, 127, -42, -127, 52, -142, 62, -153, 48, 52, 42, -98, 126, -91, 135, -104, -82, 145, -53, 104, 171, -30, -186, -101, -83, -80, -160, -22, -33, -86, -68, -69, 133, 35, 57, 42, 65, -312, 24, -67, -84, -15, -106, 10, 215, 30, 8, 194, -161, 65, 79, 162, 55, 16, -150, 118, 6, 72, -50, 79, 91, -54, 8, -125, -33, -105, -81, -3, -195, -32, -8, 76, 100, -135, 8, -35, 170, -127, -268, 182, 83, -32, -15, -103, -20, -70, 52, 2, 15, 45, -73, -17, 161, -7, -135, -106, -97, 49, -69, -14, 22, -31, -17, 122, 159, -60, -146, 79, -43, 47, 30, 117, -53, -40, -51, -200, -186, -176, -26, 82, -53, 131, -140, 51, -11, 32, 82, -29, 164, 193, -156, 80, -18, 64, -15, -248, 27, -52, 122, 126, 4, 151, 91, 150, 32, -52, 137, 227, 126, -111, 204, -136, -139, 30, 92, 38, 18, 396, -25, -4, 81, -148, 86, 73, -100, -56, -91, -3, -22, 12, 97]
6785I7n2n2o5J42j03J11k16K45m8o1J32N0j32J8p0K11j58n0p7o1J32J36o1j47
6809g9J10k31J85MJ01J8k66J19J44j60n7J76j44J09nL5j3j76J63N8p0R8k93J48
6833b6J49j74M3j74K58k8q8J93j41m6P2J50j63n5J13j8q8j08L23k50J26n0J16
6856A34n4k61K53q2p3L8rprm1J16n3RK1K6j45K02o2N5J64k94M4j8m0lN1J51j58
6884d5J11o6j47J12j30O8J47J5O3o9k29J62J23N0j34j35O9N0J2mJ48l65J96J90
6908A92k95P0M0o2K13j99l8N1p6K74k02j70K92k84J25R1j79J63j11M6k16J19K17
6931F1j56j4J13j11j74M4J75J58k4m1J2r2j41J61J2k0K7R0k6q5O3k25P4L12m91
6956b98L17k5j82O1N4L6l5l0J99j52J3J04k02J89lm8k8L1n6K16k82l4M2K70k28
$$ y = [97, 45, -7, -72, 70, -33, 78, -138, 107, 59, -2, 130, 180, 48, 66, -4, 207, 49, -1, -78, -139, -7, 129, 68, -79, 31, -200, -15, -11, 90, 108, -158, -39, 105, -55, -112, 64, -80, 29, 24, 59, 46, -130, 33, 91, 21, 119, -174, -26, 123, -51, -8, -182, 76, 48, -40, 153, 12, -34, 38, 188, 25, -30, 83, 65, -23, -131, 192, -58, 68, 18, 134, 80, -181, 72, -10, -83, -45, -54, -61, -70, -111, 5, -48, -39, -18, 8, -137, 65, 3, 58, 222, -72, -28, -46, -86, -89, -38, 113, -45, 66, 0, -147, -35, -165, -97, 50, 65, 128, 59, -170, -8, 115, 165, 31, -104, -35, 15, 27, 23, 171, -194, 2, 192, -103, -33, 7, -55, 158, -41, -79, -28, -104, 170, -32, -202, 90, -194, -69, 22, -157, 6, -105, -59, -275, -156, 61, -95, -109, 4, -107, -281, -237, -62, 96, 72, 31, 43, -49, -190, -29, -17, -37, -10, 80, 54, -31, 32, -193, -119, 193, -298, 19, -6, -188, -127, -73, -37, -72, -102, 97, -55, -42, 62, -140, 49, 46, -2, -30, 1, -55, 161, -121, -155, -113, 157, -71]
6981g1J42k29J41j76J12Q6j04J36o2K37m8j57Q6k78K05J46k16Lj18K45J04j4k49
7004g9J27j69J34J2m4j36J5J38q1J00j11P7J0n4K1j74L94n3j30O3j07L3J4n9N9
7029@K61j32j45J22j87K03j51J8R7N9k52J1K64j97R3N3j99J48R4j20O1j68j00
7052a67K73j00j46K16k77K17l4K8m2J22j5o5j20J49J84q9L8o1m4J29j16j77m9
7075a46K86l14K52j12k9J42l6n4R6j58L8O8j3M3M5K8j56J78l0q5j32Q9k68L46
7099G8j38J18%o1j68J94R5R7k13o1o7J36J56k16K49j08n5R4J20k81J45j69p6J83
7123E2M4j39J88k07N6j6J48l95K93j07p6J40p5J43J9j99n0K52j33J74j21J58p7
7146G2j23O2J19k12J35K5O0j27Q8r8j20L32l47J61K3k04K50j77J29j31J99qj52
$$ y = [-71, 71, -158, -17, -193, -81, 5, -99, 37, -25, 212, 164, 7, 93, -185, 20, 166, -50, -47, -165, 80, 184, 170, -79, 48, -121, 13, 25, -19, -155, -140, -2, -83, 17, -94, -17, -7, -61, -40, -214, 180, 127, -3, 60, -47, -14, 0, -59, 0, 261, 129, -16, 106, -81, 122, -29, -11, 86, 145, -107, -96, 168, -29, 64, 117, -82, 66, 160, 40, 101, -67, -167, 106, 6, -140, 76, -201, 16, -18, 10, -32, 90, 75, 10, -110, 39, 223, 134, 172, 111, 67, 196, 80, -97, -146, 140, -174, 78, -34, -63, 79, 43, -11, 85, -73, -35, 33, 20, 63, 108, 136, -20, 158, 128, 43, -89, 0, -268, 78, -60, 58, 58, -3, -171, 23, 118, 215, 2, -59, -126, 10, 166, -50, 199, 91, 36, 130, 250, -31, 114, -55, -131, 52, 96, -43, 145, -62, -6, -22, 126, -269, 24, -83, -159, -19, -94, 49, 68, -131, -181, 71, -62, 112, -9, 149, 72, -51, 11, 130, -82, 53, 78, 138, 11, 99, 1, -119, 213, -134, 27, 50, -154, 96, -81, 48, -83, 116, 108, -44]
7169d4J84j69k7Q9j3j09P9O6R5l8L1j55o6m7L79l02J8J7k1Q6J09j01m3P8J00j61
7195C5O3j13P4q4j46J38M1j15n6o4L40L4j41m5M6L8n8pr7J14K5R4n3K02m24K95
7221A36k31J17o8j75K68J9k2o4r2K66j50J05j87J83j89J48o3L0J18j49j06j25
7243b31L52j56P5m2l6j21O4J00rj47N8Q1M0r1n1J19n8J63p9j01J72j57R5%j30
7268i0J10L6o3p0N6j8K6j01J75l5l5N0J6n9J25k17J4P0J9Q5k89Q3J74L0j42j35
7294a85J07K38j97M2k30K87k87K44N0j41oJ75n8j64N8j16K09Q9n7j12K17k29M3
7317b3r0J95j28J0%R9%k57K27R7P9k33j80J90N4j1p0M2J00j69K7J91k98mJ99n3
7343fl2R5P6j14l3RR6j67K45j80J19n2J33j98N7q6q5J26J5j0j34L22l32K48j82
$$ y = [-44, 140, -29, -56, 33, 20, -89, -10, 56, 151, 113, 144, -11, -77, -124, 255, -47, -29, -12, -33, 53, 162, 61, 18, 96, 196, 35, 98, -15, 59, -25, -171, -33, 8, -107, -163, -227, 113, 147, 6, -39, 7, 45, -13, -20, -117, -3, 22, 116, 63, 265, -159, 136, -95, 22, -46, -221, 47, 66, 44, -20, -112, 154, 4, 109, -78, 105, -84, 64, 1, 31, 149, 0, -106, -231, 121, -35, 40, -2, -38, -159, -95, 5, -4, -151, -93, -12, 28, -63, -114, 5, -53, 110, 31, -70, 102, -55, 40, 40, -90, 20, 56, -7, -77, -21, -39, -13, -114, 61, 26, -9, 41, 57, -2, 123, -94, -80, -10, 9, 94, -195, -112, 62, 92, -50, -185, -78, 160, -37, 5, -225, 62, -225, 19, 69, -72, -78, 97, 39, -125, -67, -183, 26, 115, 58, -54, 163, -66, -23, -113, 82, -46, -36, -36, 63, 63, -194, 33, 130, 209, -24, -204, -14, 40, 29, -41, 1, 101, -68, -41, 150, -148, -152, 47, -6, -38, 57, 133, 19, -14, -5, 91, -76, 169, -11, 108, 56, 189, -9, 48, -38, -123, 3, 18, 8, -126, 196, -136, 112, -70]
7368g0K3k83M82k55Q9J71k63pR1k5O2k70K2K15n9Q3Q5j91K26p1l2K0K5j55M4R8
7394E5k50J28j04L4J30M2K2J05l05K09j7j30j34K18q0Lo0K27j40J73k0k26K47
7417A27l68J01K58j33J63j1k87K0K20l4r1M0J12j52o0M6KL8P9J7k39J50j4O5m6
7442Cr4jn9J28o7J29P5k64K43M4l79L40j65N3K3J06j53m7J28M6Q3l63J85R5K19
7467C08k79j54J99p0J28j09K7j54M4O6jj76J58q8J33Rj44L9j0P1N7k74L03o9p3
7492e9j0J71k53L4J13M6j03j34Q4L0J41j49o9O7K66k44J77J2o3l7j9m5J06j16
7516e4p2N0R0R2k40L3J45j35J10j8n7K3k3J05j32J19o1O2j19L5j17P3m0K20r9
7541a0j22K12j42J64R3k44p0J73r6J78k42J03Mj20J17Q0l3n8j6J02k20R5j91K21
$$ y = [-70, -47, -330, 152, -103, -14, 157, -106, -113, -22, -47, 15, -255, -233, -18, -77, 6, 91, -100, 126, 55, 23, 43, 68, -87, -43, 55, -195, -67, -171, -137, -7, 35, 57, 162, -143, 66, 49, -81, -215, 3, -77, -74, -134, 93, -47, 126, 106, -120, 127, -241, -140, 118, -15, 148, 137, -150, -130, 90, 56, -35, 5, 117, -35, -95, -49, -47, -9, 70, 87, -152, -2, -16, 49, 3, -91, -92, -151, -23, -90, 39, 114, -150, 93, 137, -242, 98, -67, -14, 9, 115, -38, -85, 43, 89, 172, -191, -6, 89, 308, 29, -125, 74, 4, 132, 23, 50, -104, -60, 6, 5, -171, -13, -101, 32, 41, -103, -64, -74, -3, 54, -220, 83, 14, -59, -69, 102, -151, -117, -4, 42, -61, -195, -111, -81, 60, -89, -158, -91, 175, -69, 108, 120, 57, 20, 1, -44, 62, -54, -126, -76, 14, 106, -134, -101, 44, -91, 19, 1, -56, -33, -56, 49, -83, 36, -25, 37, -82, -47, -164, -91, -131, 89, -10, -132, 80, -62, 102, 195, -49, -119, 54, -42, 136, -106, -3, 1, -119, -2, 78, 45, -13, -29, 73, -147, -52, -243, -22]
7565b2k1j10J47o0O8K2j9nR5k46p7J46J16j0M7r4J44q9J34j62r2L4Q5p5J40r6
7591@k8J03j72J2L17j42m8j39p7L88j89OJ6M1m1j12M6k04K47M6j41Q9j67O5R2
7616Hk84L34j69J5J4J75j72K38k38N3N8N9n7j01o7M4K6n5K44M7j54j19Q6O6j7
7641C4r3R8j11PQ6m1J65j91O8Pj44R6l5M8Q0k2j47k4J38j09J45L2P1k32n2N1K2
7668e3N6R1j17QJ4rr5K5L4qR5J55q0j97P1k6R1j24P8k4Q0J08j28j07N9r7o7J09
7696e8o2K69j19n3j9J32r8k7o0k7ON1m3nR4O6j18O1k54K42kJ07r8K1j43J77L5
7723G5j18J44j47o4J8O1m0J00k12K42j31L72k57L8o3o6L9R8L5Oj3k40Q8l3J21
7748E3j16q7J0J33k9mK6R1j96K07j78R8M0K8K16k87J80j79k0L6k17J60j08P6J85
$$ y = [-22, -43, -153, -6, -66, 2, 24, 5, 0, 95, -151, -228, -82, 34, 24, 71, -23, 121, 32, 166, 4, -88, -54, 31, -44, 96, 0, -28, 75, -97, -85, 232, 90, 42, -97, -174, 214, 25, 31, 47, 88, 47, -65, -19, -223, 24, 70, -71, 18, -149, -84, 8, -276, 58, -111, -96, -82, 93, -79, 159, -79, -26, 32, 91, 34, -67, -134, -90, -64, -119, 125, 172, 18, -101, -15, 51, 34, -59, 39, -72, -65, 21, -20, 145, -46, 22, 29, -115, -19, -54, -6, 74, 52, -95, -119, 19, -90, 55, 87, 158, -74, -126, -75, -53, 3, 94, -23, -15, -1, -10, -105, -80, -46, -54, 41, 196, 116, -81, -10, -36, 55, -69, 9, -15, 65, 173, 45, -62, -3, -100, -167, -58, -120, 149, 30, -23, -42, 90, -8, -35, -95, -122, -116, -65, -108, -113, -19, 47, -71, -10, -264, -22, -24, 83, -15, 6, -137, 40, 75, -43, 101, -46, -110, -92, -31, -71, 29, -183, 59, -72, 300, 43, 81, 18, -48, -9, 89, 124, 130, 117, -123, -35, -68, 53, -63, -150, -140, -7, -36, -40, -14, 77, -119, 88, -90, 8, 48, 76, 292, 5, 185, 6, -14, 22, -195, -35, -143, -67, 118]
7773A18J05k35n5K8Q1J60k11K34j82j5r2K3J08m1n3J84k49J35j53P2j29J55J43
7796A31j06N4j2q1J79j86O8Q7j51p4kJ27J52j33lj43K11j37l6M8k3J1j1J19p2
7821A7J78j72%K4n1j5J12j88L11j02j47j3L9m5J38j94J59Rj8p3o5L2O2R2J27j81
7847C6J48k99P6J54N6k18K5M9P1N0k33j20L15k11p1R9R3n5P0j53R2n0J89j7m4
7872E2K9j08N3k21K43r1M4k01K18j69J4J15j08K19j64P4L0J1K9o4J80j77J27k29
7896i4J06j04l2kJ25N1m7o7M1J7j03J00N2M1j8m2k7Jj1l5J02j4p3N5J19r3J28
7923A76j73M6j96N7K34j27J11o0nl99M44j38N2o4j43K00q2J84q4o3J4M8J35k54
7947h7K03j63R8m9p6R9%r8J4N0J96k41N4R1k6J3K8o4m8L4pq0K6L9J04q5r2K19
$$ y = [118, 223, -12, -67, -39, 42, 202, -9, 225, 43, 28, -64, -41, 67, 26, -27, 157, -92, 43, -110, -38, -167, -12, 131, 25, 79, 67, -14, 165, -21, 47, 134, -17, -91, -93, 34, 186, 53, 50, -93, 118, -19, -55, -7, -30, -19, -30, 89, 17, 195, 23, 23, 47, -4, -19, 93, -95, 216, 114, -33, -46, -7, -52, 86, -108, 51, 60, 42, -31, -96, -64, -2, 90, 217, 36, 184, -115, -39, 115, 171, -47, -22, 27, 98, 148, -85, -205, 110, -101, -172, -73, 20, -35, 35, -118, -26, -76, 113, 96, 52, 81, -27, 26, -195, 48, -43, 1, -200, 18, -151, -137, -22, -130, 89, -75, -1, 29, 40, 69, 5, 185, 8, 135, -94, 12, -92, -124, -126, -1, 50, 3, -64, -23, -6, -109, -9, 43, 84, 66, 24, -3, -2, -13, -48, 54, 40, -33, 22, 141, 48, 176, 3, 49, -147, -90, 144, 17, 128, 68, 63, -336, 108, -30, 22, -42, -185, 15, -67, 117, 33, -30, -16, 32, 167, -87, 116, -47, 51, 2, -74, 25, 25, -73, -59, -9, 187, -54, 0, 91, 65, 78, 106, 42, -6, 28, 21, -59, -33, 6, 110, 25, -67, 152]
7975A52j91R8o1q6K58j35k32P8J17j61J01k08J83q0K68j48L4J73j51l1J60j04
7997C4k09K66n1K8j57J58p8j01O4J08Mp1n8J43j41Oj47J41jK14j54R7l7k01R2
8022e1K1p5k5R8o5J84o8n7P5j74J10J03j8k12P8J26Ml1o8N7K9Q1j29lKK06k80
8049h2L6P4M9j91P1R6q7j0J0M2J06q6N0j32rK2K63j43j16J04o6j74K48J5j43M1
8075a2j53L6J88j41J43O0l90K51M2p8N6Pj6J11j26j40M0m4J43k19L55j85p9J88
8099C7q5R6k10K09k14J64j20K04l34J55P2q9J47j13J3J5J7N0J30r2L4j28r5J8
8123a19J44j24J43m7n6K08j09%j37J41j48K26k45N6J16j62J42PN6l2J43k85J62
8146H0J0r0J2j03K03j95M4J8J59p1j06J4K23j41J70k31K2l5P2j4P8Oj30j56J94
$$ y = [152, -39, 59, -2, -88, 170, 35, -197, -119, -2, -163, -62, -270, -87, -167, 101, -47, -13, 160, 9, -22, 138, 34, -175, 91, 40, 68, -89, 69, -9, -110, -46, 62, 66, -5, -63, 80, -61, -55, -202, -61, -62, 152, -2, 95, 58, -143, -51, -30, -105, -130, -32, -97, 87, 19, -38, 37, -137, -27, 76, 58, -154, -76, 50, 54, 23, -45, 12, 41, 122, -7, -10, -8, 198, -82, -46, 28, 77, -114, -43, 53, -34, -44, -34, 8, 114, 28, 78, -54, -63, -41, 222, 79, -37, 67, 1, -173, 75, 90, -53, -12, -165, -129, 59, -82, 61, 121, -269, -18, 24, -54, 2, 9, -7, 104, -22, -162, -122, -166, -23, -242, 113, -72, -151, 37, -48, 48, -162, 47, -167, -3, -123, 81, -253, -98, -26, -115, 32, -81, -68, -53, -36, 14, 144, 52, 86, -42, -137, -119, 25, -99, 44, -3, -59, 149, 40, 40, -97, 44, -104, 122, -123, -67, 49, -113, 29, 36, 92, 60, 203, -82, 80, 90, 0, 12, -91, 112, -83, -39, -21, 138, 67, -39, -25, 198, 57, 227, -4, 18, -17, 55, 41, 119, 125, -5, -161, 33]
8171C3j50M1K52k45J47N0l12J23J50j48R6m6m8J48r4J43j20Pj57P0
$$ y = [33, -117, -76, 176, -69, 78, 128, -184, -61, 89, -59, 37, -9, -57, 91, -3, 140, 20, 27, -130, -60]
8191f0
$$ Imaginary data points
##PAGE= N=2
##DATA TABLE= (X++(I..I)), XYDATA
0@%%%%%%%%%Lj1J6j6J6k4L2m0N1n9P2q8J04j28J52j76K08k40K77l19L65m19M80
32B56n44O14o94P81q77R84j099J226j366J516j680J861k060K276k508K762l044
49a596L352l691M067m481M942n459O038o696P452q325R351j0577J2068j3930J6324
64H839j9529K4055l0948M2783o8305K08482r9067k23369L84684l19118R6035P2571
76G7113j79022J55788o4561l6264J29670j26649O3472Q506l1642K2517l7354M6351
88B7925n8517L0733P496m5808Q0188q2776M3580J5357l2722L4107n7172O1342
100B3733j2849o0915J01167r2929K8293O8987j33992J36420p5489l6136J49062
111I5352j73825Q6974K5918q7168R2349p3601L6973K4830q4352R1960l2970l4942
$$ y = [0, 0, 0, 0, 0, 0, 0, 0, 0, 0, 3, -8, 8, -8, 8, -16, 16, -24, 27, -32, 40, -48, 56, -72, 80, -96, 112, -128, 149, -170, 195, -224, 256, -288, 326, -368, 413, -464, 520, -579, 647, -719, 797, -883, 978, -1082, 1194, -1314, 1448, -1596, 1756, -1935, 2132, -2349, 2593, -2866, 3172, -3524, 3928, -4397, 4954, -5623, 6445, -7485, 8839, -10690, 13365, -17583, 25200, -43105, 165377, 66310, -157059, 227625, -91493, 4542, 77113, -101909, 53879, -10682, -46946, 82724, -43925, 19547, 28053, -3589, 18928, -18426, 27925, -30592, 141, 7637, -38171, 42017, -40759, 2821, 18178, -14544, 19563, -37609, 23733, 10884, -50031, 51136, -41793, -13500, 55487, -78505, 57915, -17574, -53710, 95352, -78473, 8501, 34419, -52749, 39600, -34001, 2972, 27802, -56550, 35410, 2440, -32502]
123c2502O4323n3613L1684j6366J3351K586m2746Q0808q0602M6971J6681r2126
135f1551J22171o3310l3411Q7183q0520L9242J4304o0949P5585n4584R562L3875
147B7597n3665M5341l4700L1577k0164j8511O6042q2371M4426K1322o8217P0967
159B9644k8703l3971O7495m4523K307J3538j0061J6194l1696M3334m0557J4021
171b978K9374o3384P0594m7949o014O6613q3806L6592L0924o3788N0344j8548
183b026r502L1706m8068M7124k4661n941K8267l6742L4461k8228J8793N984m0159
196b8992N0596k0840j9104L7445l1858J2516J0796k6592L2898l4975K5221P461
208A4572m4703N2405k6423m729J5769q411K229r044K1393j9319l165K7118k7869
$$ y = [-32502, 31821, -21792, 9892, -6474, 6877, 9463, -33283, 47525, -33077, 13894, 30575, -61551, 60620, -2690, -36101, 51082, -29438, 9804, 24108, -36841, 38744, -15840, -6278, 27597, -26068, 19273, -15427, 16150, -4014, -22525, 43517, -38854, 5572, 26894, -41323, 29644, 941, -33030, 34465, -10058, -7751, 5787, -4274, 11920, -19776, 23558, -16999, -2978, 26396, -36988, 33606, -14343, -20357, 46256, -37550, -958, 29966, -33822, 16522, -2026, -11528, 20178, -27890, 19234, -5427, -11368, 16899, -19843, 14618, -13610, 5183, 11167, -28992, 21604, 764, -18340, 19105, -12753, -237, 10559, -16033, 16865, -18110, 7111, 14572, -30131, 22274, -4149, -8878, 6891, -1520, 709, -8335, 13058, -6261, -9426, 17692, -10177]
221a0177P678J4254k7817L7289l1937M12M1640n9900M4176r223k2051L5143k9861
234a0374K0319j2659l369K7108l7080K0042J1191l8504M9142l4812n718M9562
246C4848o6735M4094J147m0862M9093k3236j3636K6926j1278j1540J9489j1407
258c097m005J3779q698p698J5882p902p043J9179k6325K3435o842j4294K7341
271A3712k8621K1939o643j1736K2882k1689J2961K760k1452L0697j9588n246L1328
284B1304m5617L8061n777l0919M6506l4689J3315N305j9048K5558j8678J079J6938
297A3338k3614J3145P770j9935J4749o207P807j1531M197J0532k1702K5134k1014
310g331P852J0506k4913K6481j3928r023K6163k1420j547J8787j9246J0841o090
$$ y = [-10177, -2499, 11755, -16062, 21227, -10710, -10298, 31342, -28558, 15618, 6395, -15656, 19487, -10374, 9945, -2714, -6083, 21025, -16055, 3987, 15178, -23326, 25816, -8996, -14714, 34848, -31887, 12207, 13354, -27508, 21585, -1651, -15287, 11639, 361, -11179, 8310, -3097, -7102, 6677, -2021, -9719, 6163, -1739, -8782, 10397, -15928, 7507, 665, -13629, 13712, -14909, 7030, 387, -11349, 11533, -10156, 2805, 5565, -15887, 14810, -4778, -10024, 21304, -24313, 13748, 7971, -22948, 23558, -11131, 2184, 7489, -11559, 13999, -4679, -3600, 13338, -10276, 2869, 10639, -9296, 5453, -754, 7053, -4478, -281, 10251, -11451, 13683, -7331, 521, 11027, -13886, 12595, -1333, -10356, 15807, -5613, -7160, 11627, -7619, 3222, -2868]
323b868L873O33j0922K3322k9566J9315K213k0482K7357k5180J3497R015k9098
336a8891K7304l538k1574K9400j7320l94R525q629J0832k0992K5816j1869j1377
349a1707K5725k6068J8481n871r583K1160k0844Q300J0541k4212K2125o538q751
362g242J7170k2113K4479j7257n97K0550l1039K7023r970r295J9395j6685Q505
375B924R31j0796J6702j2295O6J0890j5681J5749j2825O438J961j1575K0384k3384
389a0511J5108j491j0384J8264k1625J4413K323j9185K4870j6633k600K4142l4910
402a8219K6984m936j9546L4661l3119J6518M423j7587K0131j6316Q359K719j2755
415h683J3936o850k021Q873j3624J3715q955M04J0790k1173K1821j1562Q19N261
$$ y = [-2868, 1005, 1638, -9284, 14038, -15528, 3787, 6000, -14482, 12875, -12305, 1192, 10207, -18891, 8413, 4875, -16699, 12701, -4619, -5013, 4512, -4117, 6715, -14277, 11539, -330, -11707, 14018, -12050, 6431, 560, -9023, 12137, -8707, -407, 10134, -14078, 8047, 1509, -7242, 9928, -12185, 12294, -4963, -5560, 14990, -16049, 10974, 1004, -8291, 11104, -5581, 2924, 3855, -6941, 9761, -2534, -2468, 8422, -7259, 8490, -4335, 2103, 4064, -7511, 12873, -10511, 4597, 3106, -7278, 10986, -10639, 3774, 6097, -13088, 11782, -4851, -7451, 16691, -18219, 8765, 3829, -15717, 18944, -14175, 2343, 6766, -10821, 9310, -7006, 1353, 4072, -8683, 5253, -1597, -3618, 5255, -8369, 5346, -3609, -3205, 7585, -13588, 8233, -3329, -2510, 2751]
429B751j1405J8887j9913J0916N604j9295K1362r044p761J9321k0226J3594p71
442D020j5431K9072k8634J2906P291j9843K2747j8349R634m8j0196J8950j8557
455f438L648J4366j9749J2129k139o437J3792j8779J8282r885o077K0250k3126
468a0163J5357o252j098R192j7243J7434n651j0782J7796j2659J736Q306j4624
481h651J5477j2832O324N734j9963K3517j5076L416N965j2944J5284j1903M756
494h96M695j2853J4146m936o925J3996j4545J1398m162p074K0200k4878J6830
507D996q86j2720J9367j7006Q690N69p883J2615j0796Q85R145j2217J0652o631
521a220k173J2327j7525J5710q660j693J1247j5742J4211q286l78P521r509O625
$$ y = [2751, -8654, 10233, -9680, 1236, 6840, -12455, 8907, -137, -7898, 11423, -8803, 4791, 4020, -11411, 17661, -10973, 1933, 9224, -10619, 12128, -6221, 3413, 3365, -6831, 12119, -6438, -2790, 11576, -8173, 3956, 1817, -4620, 9172, -9607, 8675, -1210, -7287, 12963, -10163, 5194, -1058, -2156, 7036, -10207, 7227, 1576, -9206, 8590, -4069, -2333, 5973, -8651, 6826, -6006, 318, 6052, -13911, 9606, -5470, -2054, 3911, -9033, 6251, -5652, -896, 3799, -9054, 5092, 156, -6769, 7227, -7318, 4080, -82, -7156, 13044, -11834, 4996, 4110, -8610, 10757, -6249, 2441, 3010, -4873, 7742, -3054, -2169, 6976, -5241, 5411, -1220, -3393, 8934, -8591, 7119, -1541, -3234, 8013, -7729, 6482, -1804, -2182, 5339, -4170, 2455]
535B455j819l298P436q880N951J990j1403J5536j3080O319K839j2098J5514j3195
549e733P958k92q753J2482q829K224L673p897P759l659j882Q843j5339J4684m186
564A053q602J5869j5402J0821m711k483J0774j4548R175J740r081Q849l404k580
578b530N689p511R764q060j097J1139j4156J0876n540K02M143p542R726p989J384
593a502N732p392L294K220n243N431m834M056L7p589J4040j3216N579L736r133
608d784R277p700O183r03o888R241l577m093P398n788J763J249l416P157j1034
623e915R372j893o146R828r645P016k991j567N416o601K888K776o247N069n16
638H44m504P327p621O292l705j244O643r664R261n434k31M132n332M890k645j701
$$ y = [2455, 636, -2662, 4774, -4106, 1845, 3835, -7568, 7968, -5112, 1207, 4046, -8052, 7462, -5733, 2225, 1933, -6820, 5662, -3167, -943, 2730, -5167, 2592, -1067, -2949, 5894, -9445, 5239, 1053, -7549, 8320, -7082, 3739, -972, -3455, 7319, -7229, 1946, 3686, -5395, 3454, 50, -2530, 3159, -4352, 5412, -2648, -3745, 7394, -6762, 4114, -1426, -1224, 2919, -4623, 5103, -2886, -1502, 4230, -3162, 132, 2352, -2891, 2540, -2294, 1762, 1799, -5790, 8250, -4966, 613, 4349, -4784, 4493, -3207, 2976, 2073, -4815, 4426, 849, -3244, 4154, -1634, 129, 1378, -2038, 5119, -5915, 3457, 1564, -4582, 5246, -4399, 2617, -374, -1941, 3475, -3126, -238, 2538, -3709, 1360, 844, -3660, 3667, -3954, 2338, -1367, -2611, 4032, -5632, 3629, -1805, -2036, 2096, -3236, 1654, -991, -2692]
654b692N354m225o27N264p296O976m204J01M539p762Q452o234L032N91l834O469
670C904o144K690K294m643K946R57m194O516o987L678K525q345J0057p517L072
685H09Q32k801M415o255N344j012l474M341j699k558N186n564L697k98m020P796
701D739r428O795j179l674M815m731M470m415K116K361n373M030Q87n324N511
716A600k278q83L472p120J0045q199R57P102r933P539l519Q15J135l495N419l339
732f82k081O022m821N30L831n905O973o825M396J194p585J0738q390K694K282
747B371l876L523k976J895R23l861L815l84l866O277o271M344j665k014P070j0749
763e444Q902k918l355O433o175L544o70j918L514l133K88L661o107N626k862o68
$$ y = [-2692, 2662, -1563, -2190, 3074, -4222, 2754, -1450, -1349, 3190, -4572, 3880, -2354, 678, 1269, -2565, 3904, -2240, 450, 2744, -1899, 1047, 2004, -2190, 4326, -2661, 1017, 3542, -4803, 5254, -2263, 809, 1641, -1160, 3255, -3000, 2344, 1332, -2142, 2199, 500, -2058, 3128, -2436, 1261, 963, -3057, 4739, -4689, 2106, 927, -2747, 2068, -2663, 1807, -2608, -492, 1869, -3504, 526, 1413, -3911, 1600, -678, -1561, 1911, -5209, 4836, -3363, -2406, 4696, -5237, 2302, -1217, -402, 733, -2762, 2657, -682, -2763, 3259, -1562, -1032, 2799, -3106, 3867, -2958, 1438, 2632, -4953, 5785, -2605, 89, 2371, -1505, 2018, -958, 937, 1860, -2001, 1814, 1430, -2436, 3841, -2430, 1914, 249, -1765, 5305, -5444, 3458, 540, -2815, 3618, -2557, 987, 317, -1601, 1913, -1220, -932, 2729, -3378, 2248, -614, -1282]
779a282M254p790R218o853J436L837p017O902m237R92K029l737L256p21k735M839
795B391m900K872P65n404R006q757M754R61n505P636o932M334n49l192N255l768
811a033j47L349m037K906p45j889N113p631P172l206k008O166p515O363l927Q30
827b39K734n429N422j887k648M533l027n8K823m862O040n494K526K958p832Q654
843D214o051K377M35l272N679n795K625K308n573L820O89m262N017m256L072o66
859C61l736P901q336M752m02k583M216n219N088k815j226M338l804j4L286m143
875b336L331j228r28L738o366P060m995M44M356o258N606l898J773R90l502L965
891A752j192k800M532k842j14K528m255N390n371L141J248n151N784m129K693
$$ y = [-1282, 2972, -4818, 4400, -2453, -1017, 2820, -4197, 2705, -1532, -540, 1489, -2248, 1008, 287, -2448, 2391, -2509, 363, 1128, -4276, 4730, -4027, 727, 1688, -3817, 3819, -3113, 1221, 672, -2520, 2735, -1033, -1180, 2169, -1868, 1038, 293, -1596, 3517, -4114, 3058, -148, -2156, 4010, -3505, 2858, -1069, -239, 2495, -2934, 2488, 601, -2047, 2486, -541, -599, 2224, -2638, 3402, -2092, 434, 3392, -4440, 4214, -1837, 540, 975, -2297, 3382, -2413, 212, 2520, -3053, 767, 1456, -2806, 2211, -2045, 1027, 361, -3375, 4526, -3810, 942, 540, -2043, 2173, -3046, 2042, -773, -1999, 2339, -1465, -1479, 1807, -2336, 995, -233, -1161, 2577, -3789, 3271, -1724, -1280, 3076, -3182, 2424, -1474, 299, 1289, -2213, 1752, 560, -2240, 2292, -550, -664, 1864, -2391, 2999, -2372, 769, 2017, -3134, 2650, -1479, 1214]
906A214j147q60K836l268J617O00j607J522m31j465L488m994M537j734k196N239
922C351o438N618l194r6L007m360L228j472m09J549j422P5J836l530M197k882
938i42k97L501n344N307l590J317M36j924L216l619K254j62j082J309o48l05J585
955A012k683K368J3l724O175n311K541Q4j632K678l668L748j460j460K062n38
971B05o29Q90m46M30j79j074L191m777L962j152j016K107k878L519l697K407J8
988H81j743K080p29q97J191k57q05J164k043L255l231R35K071m068M082k907J952
1005I31j101q25K735k806P25Q18o12q29J833j894J582j839J509O53l227M121l683
1022a909K293o98m86J394j999K140j303R2K74O66j645J750j274O85R7r65K453
$$ y = [1214, 67, -793, 2043, -1225, 392, 992, -615, 907, 476, -989, 2499, -2495, 2042, 308, -1888, 3351, -3087, 2531, -663, -759, 2248, -2112, 1116, -356, -765, 784, -638, -563, 1273, -2257, 1940, -942, -1239, 2262, -3082, 2225, -1365, -48, 388, -1536, 1680, -1939, 315, 153, -929, 380, -268, -573, 1012, -1671, 697, 710, -3014, 3161, -2150, 391, 475, -1157, 1521, -2147, 1601, 141, -1319, 743, 205, -424, 466, 20, 450, 271, -803, 2388, -2389, 1573, 421, -595, 1512, -1366, 2153, -1544, 863, 881, -862, 1218, 489, -408, 783, 526, -279, 885, -1158, 2097, -1134, -199, 1872, -2196, 1886, -1021, 931, -170, -995, 1740, -1066, -341, 477, -135, -964, 869, -1025, 557, -1282, 227, 880, -2347, 1774, -1909, 384, -314, -800, 594, -1405, 735, -568, -476, -202, 464, -1181, 569, -705, -20, 77, -888, 1565]
1039A565l447L325j990K15J447k100K194j785Q34j6J78o06Q17o21K91J41q52J964
1057A554k742K938k006M93Q17j821K420k608J918q61k16N00on95N33k0o36J199
1075H61k078K987k882J244O39j973K466k655K403j503j64J145j004M0P34n04n10
1092g54P49j181K398l112K545m32k316L944l327J967j228O88O44j604J543n14
1108A0o69N94N82j776K366j898J373q60n76K673m035L631j398j80N01p25J458
1125A071j849J299K87j223K59J492k499K073q58K89R77l019M005l337J047J174
1141A188j999J946j822J282n23l98P27l08p09J515j385M66P11j891K920l507K926
1158A139j236j142K943l471K282j074L70N48j259Q67N27j635J455k92j249K790
$$ y = [1565, -1882, 1443, -547, -332, 1115, -985, 1209, -576, 258, 242, 420, -186, 631, 10, 301, 442, -410, 1554, -1188, 1750, -256, 237, 1054, -767, 1653, -955, 963, 102, -114, 386, 380, -215, 318, 298, -338, 861, -1217, 1770, -1112, 132, 771, -1202, 1264, -1391, 1012, -491, -655, 490, -514, -474, 260, -244, -754, -5, -1186, 1212, -1900, 645, 213, -2103, 1841, -1486, 481, -747, -59, 585, -1019, 524, 10, -659, -65, 517, -1259, 1107, -791, 582, -278, -854, 1819, -2216, 1415, 17, -163, 338, -387, 1071, -778, 521, 808, -415, -156, 1336, -1163, 910, 52, 341, 1318, -1701, 2304, -1033, 14, 1188, -811, 1135, -687, 595, 72, -326, 401, 93, -616, 899, -486, -20, 691, -1200, 1720, -1787, 1139, -97, -1239, 1704, -1767, 515, -559, -189, 359, -900, -33, 494, -1141, 314, 22, -1227, 1563]
1174A563l152K769j866j24K341l556L304k248N68Q88j476J658q40n32J074n56
1190a85k58J018k047K913k232Q79J072l117L871l074J900m09r25K049k232J093
1206C16J35o51L98L53j040J627k175K071p23j434L352l908K895j309l29J576k449
1223a295K518j396k01J171r79k91J146j309J390j313K04J851l553L669k261J74
1239d75J266k223K560k404J744k53j379J778o49j016J519j008L38P43j975L092
1255A658l616K104K75k125L205l052K060p69l40J528j639M58Q11j155O11N56j366
1272g96J865k223K181j005j011K677k980K693j648L59M24j183J536j026J44N77
1288E84o70k38J353j703J344j061M48J192k760L210k649J162M07j026J408j809
$$ y = [1563, -1589, 1180, -686, -810, 1531, -2025, 1279, -969, -401, 487, -989, 669, -171, -703, 371, -185, -443, 575, -1472, 1441, -791, 88, 1160, -1957, 1914, -1160, 740, 331, -594, 1455, -777, 316, 451, -200, 198, 551, -489, 1138, -1037, 1034, 311, -1123, 2229, -1679, 1216, -93, -422, 1154, -1295, 1223, -173, -374, 797, -182, -473, 673, -636, 754, -559, -355, 1496, -2057, 1612, -649, -475, 791, -1432, 1128, -1276, 468, 215, -1164, 614, -35, -1051, 468, -540, -202, 541, -1434, 1658, -1958, 146, 421, -1704, 1501, -1551, 509, -260, -600, 928, -711, -253, 558, -597, 14, 570, -796, 1069, -1154, 1027, 22, -989, 1688, -1292, 1401, -247, 112, 536, -647, 889, -137, 7, 584, -86, -324, 1029, -674, 670, -391, 57, 1249, -1511, 1699, -950, 212, 619, -407, 1001, -808]
1304h08J250l29m98M76M7p82J296j262N50L67j485K514k745J727n36n37J502k066
1322a319K096j421L26L28k51j1K18n02P09k51p42J731k318K121r75j59J064j504
1340h60J931j995R43J46n46N65j00l27J76L67o25J014j411J691j443M49P69j310
1358e66J700j797J657j054r3P97j012M54J91J52o46O70m90P77j170Q59J99j467
1376h39K062k018J215o65L97K10j130J518j185K59j30M59o70O97o13M53k58m75
1394g13J388j963J790p37J2L72p16J116j275Q37j81Qm46Q06n53P2L53o49Q95j245
1414h29J547j139M07L58p14P31q88R90p38K47M3J43l67M89j08l44Q09r62R57r18
1434b86O62O3o07Q67j076R82o35P07o86J99Q4j32K16n76R45j057P87q05P51k36
$$ y = [-808, 442, 113, -385, 91, 138, -644, 652, -610, -60, 307, -1178, 1336, -1409, 318, -218, -755, 747, -1319, 777, -644, -318, 10, -241, -252, -34, -536, 173, -78, -820, 911, -1407, 714, -261, -420, 644, -860, 1071, -924, 19, 165, -381, 184, 84, -243, -67, 300, -325, 689, -722, 969, -474, -25, 744, -566, 1134, -663, 994, -60, -153, 644, -368, 86, 277, 429, -217, 453, -37, 740, -430, 429, 628, -839, 1223, -795, 420, -245, 152, 362, -768, 750, -435, -176, -306, 153, -517, 180, -433, 20, -238, -713, 675, -1288, 502, -235, -223, 149, -567, 549, -726, 111, -70, -62, -508, 298, -255, -183, 170, -479, 416, -829, 718, -421, -14, 344, -370, 361, -527, 463, -275, -28, 15, 158, -209, 280, 172, -172, 637, -325, 632, -286, 376, 439, -168, 699, -377, 605, -30, 677, -9, 190, 274, 142, 358, -218, 727, -330, 457, -348, 403, 167]
1454A67n07J094j389J049j010O72j59j58J42l8J99l48N59r79J030r28M98k6l35
1473d67R25j463J499r39M92j40k78M33m55M02k99L97n65O80o67N45o6k82Q43j380
1493g85J603j356N11K28l45M88p96J001p23R5J41L22o85N82k26r2N27r59J199
1512G30j219J139l13p27J057j019Q98p61O09k42l7P6q8j07kN22r06Q87j025J050
1532E22r79L58P73j590J301n98M23m39J65K51n08J36K67j99m12Q89j132R82o27
1551d17K04M13r92J390j343R55n45J26K20n60O49k82O6K2L73q04Q33o92O16j53
1571G9n93R85j246J502r81K73N90q39P24p16O09j79l3l29O36n83N98m93j30O32
1591E06j175J700j180K24L80p78J083j387J118m63k31K56J10l16K32j26J16N1
$$ y = [167, -340, 754, -635, 414, -596, 76, -83, -241, -99, -137, 62, -286, 273, -706, 324, -604, -106, -132, -467, 458, -1005, 494, -445, 47, -93, -371, 62, -393, 9, -290, 107, -458, 222, -445, 100, 34, -248, 595, -785, 818, -538, -27, 201, -144, 344, -452, 549, -174, -79, 62, 384, -301, 281, 55, -37, 490, -469, 730, -489, 650, 337, -390, 667, -352, 546, -215, 394, 152, 115, 191, 103, -4, -6, 516, -390, 497, -528, 522, -457, -99, 674, -916, 385, -213, 210, -229, -64, 187, -321, -185, 82, -117, -529, 360, -772, 210, -417, -213, 200, -792, 598, -745, 210, -335, -209, 11, -549, 100, -182, -116, -94, 279, -525, 308, -384, 232, 79, -514, 471, -775, 727, -254, 19, 609, -230, 494, -222, 387, 208, 175, -154, 482, -101, 497, 4, -126, 506, -669, 1031, -149, 75, 455, -323, 760, -627, 491, 28, -203, 53, 163, -153, 79, -47, 69, 120]
1609A20o76J544j742R04o3p26J212j382J254o17P3J43l25J94K14k46l6N8n58J218
1629E63j278J117n77m89J421j742J485q83N73j62m03N93m37L64j40J45k35L71
1647B86o94R08q24L94L38j220J593j343Q77l40k74Q92r94Q30k87j37J54R3l31
1666g9N84o32M55j27l53J007j753J450n39j10L86p68J078j038N27J24n6k79L59
1685B36m51Q8K17l96Q07j230J169p04J52M64j061J114j031Q13m26p4K29n1J55
1704B0j63P7k84M23n41Q95p47M10j17o63J347j454J166p49K52M11m53L44j99J19
1724I4j83L30m78O60o91O59l53l90J004j164J085o96M76j48m24P32p51M95m94
1743b37M78l28L83l25M23m31k26Q68r31Q46q04M62k58o6M74q03P18m50K88k45
$$ y = [120, -556, 988, -754, 150, 87, -639, 573, -809, 445, -172, -99, 44, -281, -87, 127, -119, -155, -97, -655, 563, -715, 402, -175, -664, 757, -985, 500, -383, 190, 28, -375, 218, -219, 145, 5, 150, -85, 286, -408, 500, -324, 70, 408, -812, 781, -562, 315, -25, -299, 593, -401, 429, 142, 5, 159, 252, -79, 505, -127, 328, 201, -152, 855, -898, 552, 13, -97, 289, -479, 599, -439, 88, 212, 156, -123, 236, -215, -127, 90, -306, 501, -729, 440, -264, -112, 352, -709, 405, -626, 187, -239, -313, -84, -135, 20, -143, -66, -350, 73, -468, 427, -320, 90, -27, -690, 657, -797, 369, -380, -128, 283, -170, 174, -25, 94, -89, 241, -237, 423, -268, 391, 38, -352, 652, -512, 573, -123, 353, 205, -219, 513, -238, 257, -237, 241, -87, 296, -29, 394, -37, -263, 605, -326, 520, -284, 178, -80, -146, 328, -475, 243, -207, 81, -164]
1763a64J96l8L7j38j27L75q54J189o80L11j60j32M67q51Q81n86K69l84M65k95
1783b19K55K8m14N80n80N77m69P15m76m36O26m56N39p42O80k24l4J43l6P2k45
1804a16L96n90M08o8K84k14lL82p98Q19p37O54l79l6L18k21l8q9K57m13M54m31
1826a61M17j14j80K18o00O60m36L12j41M3J96n42N04k68K71m46N00l59Q8q4k02
1847c24N84p29P20p88M71j11q4K26j44L20l01J51k43J21o1L19j61j16M52o12Q99
1868E89r38O54k85k44M05l59M85n51M52m18J97j88L15o2p5L49n97Q05o62M11l53
1889g0j3K73m24P47n46L85m17K86q6o1Nk9P2k80N20o02N80n06K19J77n86P33p95
1912d18P44m43R6N3k66M02k59J62j49L76n83M68n03K72J67m72P04p45P25n64K89
$$ y = [-164, 32, -6, 31, -107, -234, 141, -713, 476, -204, 107, -53, -185, 282, -569, 312, -274, -5, -389, 76, -219, 36, 64, -350, 230, -350, 227, -242, 473, -3, -439, 187, -269, 270, -472, 208, -16, -50, 93, 57, 129, -116, 280, -310, 98, 30, 314, 100, 97, 479, -319, 500, -237, 417, 38, 2, 320, 99, 61, -28, 229, -184, 270, -161, 256, 142, -38, 180, -420, 240, -196, 116, -25, 18, 214, -328, 176, -92, 179, -267, 233, -126, -38, -122, -324, 260, -469, 251, -537, -66, -177, -261, -35, -179, 141, -160, -9, -252, -131, -192, 127, -34, -150, 302, -310, 589, -349, 305, 20, -224, 181, -178, 307, -244, 208, -210, -13, -201, 114, 52, -23, 326, -271, 534, -128, 283, -70, -83, 190, -234, 513, -33, 352, -65, 221, 135, 74, 79, 50, 122, -158, 362, -240, 340, -166, 53, 230, -356, 377, -418, 326, -117, -21, 32, -234, 168, -91, 71, -78, 298, -285, 183, -320, -48, 119, -353, 351, -394, 331, -233, 56]
1933E6lk59L14m07N17k67M16o31M94l93K52j69j00N35q71R90p39N03j63j45L28
1954B58m20M05l09m4K97J18n34L93K6k77L81m34O91p54N09j03k40L11n62M51n82
1975d19M96r3J18p6j25j4K60J06n90N33m18O47l49l15O31p39O10n99N42l13J08
1996AQ6k26J21l22M08l43N60o11M58k34k87O38q08Q68o25N87m09J14j85j58N92
2017B25m37M39l70M05m90K09j8N3K6m17Q37p67P88n32J24K25n11N93o47N96j53
2038A78k14J23J80q1jj8m53Q06q68P70m76J57K82p10P44o01M96l69J39j20K76
2059B40r0k43K14m10L39l87O82n50O0K38k69N01o03M73n36K42J7j46K25j24Q1
2080d6j31L13n41M56m30O82k67k49L34n15O43o47M56j49J32K01m73L37l90O25
$$ y = [56, 53, -206, 108, -299, 218, -49, 367, -264, 230, -163, 89, -80, -180, 355, -516, 474, -265, 238, 75, -70, 258, -162, 243, -66, -110, 187, 305, -229, 164, 190, -87, 294, -140, 551, -203, 306, 203, -37, 274, -288, 163, -419, 77, -16, 102, 26, -99, -113, 147, 253, -337, 196, -222, 425, 76, -239, 392, -347, 263, -336, 206, -107, 1, 87, -139, -18, -340, 68, -275, 285, -326, 132, -102, -389, 249, -559, 309, -316, 271, -138, -24, -209, -367, 225, -212, 227, -143, 262, -228, -19, -37, 16, 42, -375, 462, -305, 483, -49, 75, 300, -211, 382, -265, 331, 178, -36, 87, 267, 186, 185, 167, -286, 520, -348, 422, -54, 103, 385, -325, 419, -182, 314, -55, 84, -36, 240, 150, -93, 121, -289, 50, -337, 345, -205, -145, 93, -176, 325, -278, 195, -341, -99, -82, -228, -3, -127, -46, -177, 136, -405, 51, -379, 303, 36, -213, 121, -394, 249, -398, 58, -91, 41, 242, -231, 106, -284, 341]
2100C41l42K56l59L36j95L6J95m72N57o74N09k14q9K13l72M39j52K15l39L44l41
2121a08J69q0K1J31m12M55m63M31k54J25K75n66N03k71L08l89K54q9jN1k14J84
2143F0k78M07o64O16l23N7P6j82M82o59L85l48L56p7Q4P1k69L09l72L26k53L48
2165A52k34NJ08k94M46m80M38l26J41K7l6J92l99L46l10N49l05J99j62j23K57
2186A91l46M28n76O52l81J73j0j91K96m24J87j24M94m32K89k50L0K17n23N59m55
2207a96N76n25J52JL6k3k90M75l68L57k66J20J4Lo8l70N15m85M28j33K4Q3k66
2230b06K58m56M23j09L48l87K49l65q4L92k88M54n06K30j50L9K04j67K54l54N99
2251C78m89L61l29J57J0k71L25l63M52k02L18m59J96J56j74K66n24M37l89M39
$$ y = [341, -1, 255, -104, 232, 37, 73, 268, -204, 353, -321, 188, -26, -115, 98, -274, 165, 13, 228, -111, 233, -108, 61, -19, 2, 133, -279, 176, -287, 144, -110, 15, 290, -276, 227, -44, 264, -125, 129, 40, 39, 90, -124, 60, -218, 189, -475, 141, -182, -125, -49, -231, 251, -408, -23, -371, -15, -92, -8, 63, -206, 103, -269, 57, -196, 152, -82, -77, 31, -263, 183, -297, 141, -185, -44, -17, -53, 139, -260, 86, -224, 325, 20, 219, 57, -66, 191, -155, 273, -303, 349, -32, 141, 131, -60, 236, -188, -1, -125, 369, -63, 226, -24, 6, 223, -300, 259, -196, 380, -145, 7, 8, 44, 21, -269, 206, -162, 195, -71, 49, 63, 66, -2, -372, 143, -342, 86, -47, -23, 60, -206, 52, -404, 19, -90, 258, -129, 120, -245, -329, 63, -225, 229, -277, -47, -197, -158, 46, -121, 133, -221, 378, -111, 250, -79, 78, 88, -183, 142, -221, 231, 29, 347, -112, 84, 240, 66, 332, -192, 245, -144, 295]
2271B95l39J23R3j86J86k45M52m73K65k44P6J28j2L19p86O57n11K26j29l8K90
2292A47k69K56k26K73m18M97o63N09j87K6K10m36M50m66L23k13J03J53j80K63
2312A52l19J41m1L44l78K21K6k86M81m54L12m74N97n23J55J53j81L51n09N93k25
2333A36j10j33J81l2M7K54m46L63n69L80l0r9J49k25O21o02J36j95L08K2j7k21
2355h2Q7J32l56L59k84K99l61K00J35l97L12k92L88k57J94m9k04K48m0j9k05L82
2377A90k83M17m28K0J81p6K5k91N43n43K46J08k22K92p02O96k27J44k06K64j91
2398d3L5P1k88L66l18K79j90J34J14j26N9j72L13l62P1J70j91J42O4J2k02K22
2420A60l61N48m19K54q7q4q2m9K68l71K31l01L48jk0J33k39J65j52J29l10L89
$$ y = [295, -44, 79, 172, -14, 172, -73, 379, -94, 171, -73, 3, 131, 119, 438, -348, 309, -202, 24, -105, -143, 147, -122, 134, -92, 181, -237, 260, -403, 106, -81, -55, 155, -281, 169, -297, 26, -187, -84, 69, -111, 152, -167, -26, -67, 277, -101, 120, 146, -140, 341, -113, 199, -275, 322, -201, -46, 107, -74, 277, -232, 361, 136, 26, -107, 74, 42, 89, 343, -103, 260, -309, 71, 41, -58, 91, -134, 487, -115, 21, -174, 134, 156, 139, -82, 5, 137, -219, 140, -144, 155, -206, -6, 129, -268, 44, -248, 140, -117, 77, 28, -176, 72, 32, 13, -192, 190, -93, 324, -104, -84, 97, 21, 46, -245, 298, -245, 1, 109, -113, 179, -523, 173, -54, 90, -116, 148, -43, -8, 63, -225, 141, -177, 102, -88, 46, 160, 34, 93, -79, 234, -128, -57, 113, -78, 64, 128, 140, -62, 160, -201, 347, -72, 182, 95, 11, -71, -120, 148, -223, 8, -293, 55, 54, 34, 167, -72, 93, -59, 70, -240, 149]
2442A49k9l17L57k89M56m98J70N4k44K81k83K47k60L73k97K33k86J31L8nQ8k90
2464b21K60l17N87l35J42n2l41M88l93M89l44J84j42j4L11l91J57j52L27l83K87
2485A47l19K61k2j32L22l10K33k31K98l11J16K5j34L12k31J17j10J82l53m9J12
2506g7j5L64l45K19j90l3K1J30Nj63K41j11O9j87J89l63J02Jm8M00m47M95m20
2529a63M35k17j01L2j7j53K27j2k6k9n5OJ9p0R2L0j3J20K6j33j48K67l35L69k41
2554i0K49k48J29P7k89L83l19N18o01M13k88Q9j39J87N5k01K22q3L7k29K12m4
2576D0J37k28J10O6j82J90l52K64o9L5Kl02L14l1K36k07KMj79K38l34M25l63K55
2600G1k58K76n2j94J42N1P6j33j8j8R1m5j70K76k60K01j24L37j21J2l19J73K01
$$ y = [149, 120, -197, 160, -129, 327, -171, -1, 53, -191, 90, -193, 54, -206, 167, -130, 103, -183, -52, -14, -19, 69, -221, 39, -278, 309, -26, 116, 64, -277, 211, -182, 307, -37, 147, 5, -9, 302, -89, 68, -84, 243, -140, 147, -172, 89, 67, -65, 257, -53, 180, -51, 247, -64, 52, 77, -57, 255, 24, 141, 31, 213, -140, -189, -77, -92, 272, -73, 146, -44, -77, -56, 74, 79, -84, 157, 46, 115, -72, 117, -246, -144, -143, -191, 209, -238, 257, -163, 272, 55, -46, -14, -31, -184, 43, 31, 5, -24, -79, -73, -54, -124, -32, -2, -15, 105, 131, -2, -150, 117, -218, 151, -90, 159, -89, 40, 117, -172, 211, -108, 410, -191, 222, -66, 23, -116, 71, 126, -75, 147, 64, 101, -128, 84, 40, 177, -51, 59, 125, -57, 133, -219, 45, -24, 11, 13, -289, 25, -6, 230, 23, 25, 29, -150, 88, -246, 179, -184, 71, -187, 89, 37, -157, -15, 36, 112, -21, -39, -57, 34, -11, -181, 95, -165, 36, -88, 249, 128, 140, -179, -6, 195]
2623A95l11M28l65J31k67L72N1j67P8k20J7j13K42j05j6K07k17J11j55K70l03
2644a37K78N9l4j59pK34l61J87j06O0r7J89j56K01j6k55K67n9J61l34M3J21L9
2667A18j59r3K09j42J95j50k6j2l7J32j60L04r9o9k00K52mk56K87l62N19l60J82
2690F9k36K33k3L2m1k74L94l09K72j80J99l4j74L0K7J2J3K7j9j63K38j91J90j09
2714a7K08k03J99m0P2j26r0J39k65K13q3P6j39J75j37O8K21j64R8k61l6K9J74
2737A11j56MJ60l45L22k11K82j51j25R7j85J01N1O8k60J62J15j69J7K5K67l72
2759a92K05o0J46j79l0J69j22K34k27m1lJ25k4p8J23l20L33k21J79K4M7r0m2J31
2783H7j52K50k02P9j90o2J66o0N7N0N4o3L78m51K36k27j08N37n56L77k39K21k8
$$ y = [195, -116, 312, -53, 78, -189, 183, 234, 67, 145, -75, -58, -171, 71, -34, -50, 157, -60, 51, -104, 166, -137, 141, 200, 166, 7, 0, 234, -127, 60, -46, 14, -83, 106, -50, 151, 135, -120, 147, 88, 249, -85, -42, 79, 118, -41, -134, 75, -67, 128, -22, -48, -60, -97, 35, -125, 179, 80, 11, -189, 63, 59, -197, 90, -272, 247, -113, 69, -167, 66, 43, 75, 34, -240, 154, -155, 117, -63, 136, 102, -72, -42, -15, -3, 10, 37, 18, -145, 93, -98, 92, -17, 191, -12, 187, 147, 219, 93, 3, 142, -123, 90, 7, 83, -56, 119, -18, 50, 271, 107, 205, -56, -92, -63, 111, -45, -41, 119, -226, 96, -115, 167, 16, -109, -12, -197, -96, -45, 23, -237, -75, 40, -129, -112, -87, 180, -192, 13, -47, 99, -80, -110, 59, -63, 171, -56, -97, -100, 25, 1, -77, 46, -274, 59, -162, 17, 41, 88, -2, -44, 87, -65, 185, -17, 62, -128, -190, -24, -84, -27, 23, 77, 14, 392, -59, 177, -50, -158, 379, -177, 200, -39, 182, 154]
2806A54K0J20l66J34J10o4j93J37M6L3l4J7k8k89J99k46L94k16K51k25l4Q9j12
2829a03L36j66k7O7l3j04P9j0j62J85j97K33k72P8J82l57L17j28M63m91K6JJ1
2852g2o6K49R2l89M78l06J04j80J59o1j07K39k6J22l68J79k6K7j73K0J77q8J45
2875A29j13R7k02m4R7n0K51l16J76j29J56K06k47m4q6K50k20L04m04M40r2k64
2897a05J67j83O6j63K18j62L55k23O5Jj95m0J7J76k19K57j02k9J86q9qK4J6k35
2921b05J64K83k81K6L7J78k02j54N9N9K0L0K5j42P3J2o9oJ23k32J69J57k70M77
2945C31k88N8m6p0K04k41Q1m2J19j00Mj71J44j06K67n8j85J23K5O4j86J57j09
2968b5k2k1Q9Q6k08R3Mj46J24P6r3k06L87k07J72k37J40j14J43J70k22k2k17L12
$$ y = [154, 174, 294, -72, 62, 172, 108, -85, 52, 98, 131, 97, 114, 86, -203, -4, -250, 144, -72, 179, -46, -80, 9, -103, 233, 67, 40, 107, 74, -30, 49, 39, -123, 62, -135, 98, -174, -96, 86, -271, 46, -82, 381, -110, -84, -83, -72, -138, 111, 203, -186, 292, -14, 90, -90, 69, 8, -99, 140, 114, 236, -132, 47, 21, 48, -125, -105, 72, -16, 129, 16, 113, -89, -133, -36, -86, 165, -151, 25, -104, 52, 258, 11, -33, -119, 131, -89, 215, -189, 251, 159, -105, 62, -121, -55, -218, 0, -162, 193, -30, 35, 36, -159, -199, -182, -6, -225, 32, -70, -99, 87, -2, -10, 14, 30, -205, -41, 242, -39, -13, 24, 202, 0, -154, -95, -36, -16, 14, 39, -103, -30, -18, -87, -93, 30, -202, -33, 124, -146, 331, 43, 101, 55, -15, 189, -52, 29, -13, 106, 6, 10, -161, -17, -123, 144, 86, -99, 24, 49, 113, -73, 84, -25, -47, -68, 21, 107, -101, -8, -4, -150, -26, 50, -43, -249, 138, -69, 103, -134, 6, -108, 35, 205, -17, -39, -256, 56]
2992E6L8N1p9j4O9q4J58k44K11k66L9O2P4qj44j26R5J75O5j91O4p8K4l5J21Kn2
3019a7l9J66n1j34K63j38N0k03Q8q9J41J29j55jn1Q0j25N7j69K15Q7K9k52J26
3043GL7k24L26k25M3R0n4J49l68J54j04Q2J5J23j52J51j7l4P6j41L9k7M2o5J0
3068f7p1K3Q3j22K86O4k50K8j15K53l61K60K27k0j72J5j49r2J45k6M9o0J61j28
3092c9k2M6r5N9k4K02j62K38l30J76J09j37J1o5n8j91N90l02J62l55Q2K53l64
3115b16M14k88M7J49j34j11L3J21j15J72q2O8j08J11j94j6J34q1J16k13J50j82
3137b25K33J20j55K37l20K62k20J7J67l62L71l32K69l4m7o2M4j57O9K13k52J77
3159A3O2N1k66K08l7j52J50j84M57k60n3j11K61r5j00J3q2K16j18J19j30r5j0
$$ y = [56, 94, 145, 66, 52, 121, 37, 195, -49, 162, -104, -65, -3, 71, 63, -81, -207, -112, 63, 128, -63, 1, -77, -53, -88, 33, 35, -17, -56, 110, 59, -75, 188, 50, 100, -103, -15, -104, 37, 166, 11, 10, -41, 39, -86, -29, -198, 17, 104, 133, -119, 7, 44, -180, 146, -79, -36, 54, 0, 149, -219, -65, -169, -87, -72, 51, -101, 50, 33, -1, 75, -66, -27, -54, -12, -77, -67, -138, -115, -32, -154, 132, 196, -54, -26, -141, 112, -249, 11, 238, 218, 46, 61, -88, -180, -35, -61, -12, -72, 89, -39, -61, -15, -110, -51, -75, 127, -35, 203, -127, 49, 158, 21, 32, -33, -91, -282, 308, 6, 168, -187, -105, 148, -216, 198, -90, -43, 106, -28, -139, -106, 15, -100, 72, -10, 58, -50, 61, -133, -149, -15, -96, 20, -193, -43, -225, 8, 128, -27, 210, -110, 152, -68, -51, 116, -246, 125, -207, 62, 28, -19, -81, -37, -194, -125, 88, -164, 13, 75, 126, -140, 68, 31, -121, 29, -155, 302, 42, -11, -122, 139, 44, -56, -43, -125, 91, -27, 92, -38, -133, -143]
3182a43L43l23p3Q6J41J46j15M0j12j29J11j24K52j01K21m67L06j83J34P5j00
3203a5R7k91J09p8K14Jk23M1J53J33l14J79j84L47k15j63J77j74L17j31J4L7k6
3226EM0J5j52j16K57N4n9M5j28j3k4O3N0J0k26O5M6J78Nj16P4k33J95k35K86k08
3252a22J04N3n3J43j30O1k21K87k90K19j50KQ7n0J65k26K17m8R4l5k13J93n9M8
3276G6m8j68Q8J95j58OP3j57J45Kk11N3J13O2j87J53o6j68J27J25k06J05O7j2
3300Ij23k1J82p3K20k61O3j70J26K7o1K46k17J26j64J16L8O9j13k16K16n3J32
3323I8k95J57J11j01O7k64J33J06q7K41o6k37J20R8k25K10p7Q7k54J77K8j38R8
3346a3j06K26O7k12JQ5q2Q2j05N1J5j51J76k01N5O7O4r6j34J37j65K78J61j43
$$ y = [-143, 200, -123, -196, -110, 31, 177, 62, 102, -10, -139, -28, -152, 100, -1, 220, -247, 59, -124, 10, 85, -15, 82, -209, -100, -178, 36, 37, -186, -145, 8, 141, -173, 6, -178, 169, -46, -209, -32, -206, 111, -20, -6, 31, 5, 45, 60, -92, -208, 49, 103, 44, 89, -39, -52, -76, -13, 37, 47, -179, -114, -68, 110, 115, -1, 73, -160, 35, -200, 86, -122, -18, 35, -18, 125, -5, 56, -165, 122, -168, 51, -99, -97, -10, -60, 105, -121, 96, 48, 142, 107, -106, 87, 28, 76, 28, -140, -52, 143, -15, -9, 64, -93, 52, 54, -157, -104, 9, 71, -116, 37, -29, -197, -70, 55, -151, -46, 21, 9, -114, -135, 47, -26, 194, -67, -4, -174, -48, -21, -82, 164, -53, 73, -91, 25, 63, 132, 19, -197, 19, -34, 98, -197, -40, 71, -30, 37, -227, -94, 12, -75, 166, 100, -137, -17, 81, -144, 66, -11, 76, -178, -1, 27, -111, -13, -119, 107, 174, -38, -37, 48, -34, 48, -57, -6, 9, -142, 34, -167, -112, -45, 19, -77, -211, -74, -239, 39, 200, 57]
3370E7J16l25PJ48P3J1K3j41p1J21R2k15nL01k38J49O8j59M2j91J61j07L07k61
3394c7O1N1l0k11O3J53k73K19M9j62K69n0L9P9j66j09R4mK2K5j2j40R3J75j91
3419GJ92j68K0p2Q9r1n6J67j39K39j89K5J9j50R3K0j82Q1J71k77J08q1K61j28
3443d1J14P7j98j46J10K34l02K45j40j15J46K0N1%l1J14j22J85k58L5M0m4OJ48
3467A28j50r0J77P5j15J1J01j44K9j6P0j5o3O4J23j12k17K41n0j18K63l18K16
3490I0N9j61j12J65Q1j28P8K0K7k57L0j1R1P2k20L34j66N3j66K03O0j97o6M7O1
3515a3j24R1j5L08k13n1j17J4K53j47J03j00qqp5K59l32K93r4L3O9k46LoK50m8
3541G9O8%j14j66J30j1K73j03k27K09j85J60L0r5k9q0L8J38j73J5L11k59j7J69
$$ y = [57, 173, -152, -145, 3, 76, 87, 110, -31, -102, 19, 111, -104, -109, 192, -46, 103, 171, 12, 54, -137, 24, -83, 224, -37, 24, 75, 45, -166, -103, 50, -223, -4, 45, -117, 152, 102, 141, 220, 54, -55, 39, 35, 57, 82, 70, -70, 23, 198, 7, 199, 31, 51, -21, 68, -23, -79, 88, -51, 188, -1, 24, 43, -107, -14, 6, -176, -95, 76, -201, -93, -174, 87, -41, 73, 150, -48, -194, -84, 150, -152, 93, -47, -162, -16, 4, 55, 55, 24, 138, 16, 201, -57, -22, 18, -26, -20, 128, -22, -112, 65, 140, 25, 36, 137, -7, 22, 6, 76, 61, -2, 62, 185, 73, -144, 97, 47, -71, 192, -126, 90, 149, -12, -124, 41, 122, -6, 72, 92, 119, -138, -108, -119, -28, 44, -176, 158, -8, 45, -121, 82, 142, -55, -121, -74, -13, -137, -46, -61, 247, 34, -17, -134, -120, 133, -14, 89, -11, -19, -27, -102, 157, -175, 118, 24, 57, 126, -120, -117, -123, 127, 79, 147, 147, 33, -133, -3, -14, 259, 156, -71, 138, -47, 113, 143, 48, 19, -61, -23, 115, -58, -43, 268, 9, -8, 161]
3565A61J05n0m11K14j7N1N4k29O4n5J83r3J94j85j6k16J84R6j18P7mQj82K57k56
3590a84K56p0l8Mj18K70lo0q9o5K21k83K44nL0r2r5o8J20k4O3R5q8L1j63J70j03
3617d4K98M2m65L01p1O2k07N6Mj64kJ15K46j60O2r0n4O2j04K4J22j5N4m7J7j00
3643e8JO2o5pJ79j86R0j89J33R7o9LJ52k67J40j7O1j71J02K25j10l8l0j12K16
3668A42m6M0q0k27K8J78j30J16J65j63J66l02K07k36J64j02P8L7OJ60l56J62J06
3691A13o1l7M6m8JLj8q0J34j21K73j84j8J12Kj12p3K21p8k23J43lK4Q7j22l0q5
3718a34J47J12k29K14m1K0p7q8J07p2J54j32O9l2O0m6k3j00MJ25j13M4j91L79
3742A57k88k7J78k52L71j38j0P8j19p8J95p8k04K10j39L04j1j02r1J01j58N0K3
$$ y = [161, 266, 216, -195, 19, 2, 53, 107, -122, -58, -113, 70, -23, 171, -14, -30, -246, -62, 34, -84, -7, -11, -3, -185, 72, -184, 72, 2, -36, -32, -150, 120, 117, 57, -32, -97, 124, -159, 85, 80, 110, 18, -77, -145, -25, -49, 14, 109, 21, 52, -111, 59, -44, 254, 296, -169, 132, 61, 123, -84, -28, -24, -188, -190, -75, 171, 11, 73, -17, -71, -9, -113, -89, 33, 18, 72, 25, 42, -58, -57, 5, -60, -67, 112, -74, 16, -173, -40, 57, -12, -9, 143, -124, 16, -1, 60, -111, -9, 216, 106, 68, 38, -74, 142, 96, 136, 56, -171, -143, 35, -95, 21, 186, 23, 189, -113, 94, -142, 22, -80, -2, 35, 41, 201, -155, 7, 113, 52, 15, 61, 13, 14, 17, -1, -81, 53, -68, 205, 21, 3, 115, 117, 5, -68, 153, 75, -148, -5, -8, 16, 103, -19, -49, -134, 13, 125, -104, 110, 69, 89, 12, -76, 31, -41, 113, -19, 50, 18, 78, 32, 9, -91, -87, 38, -75, -31, -222, 157, -131, -158, 20, -232, 139, 1, -9, 69, -50, -128, 67, -11, -215, -5, -144, 160, 149, 47, -44, 57, -101, -51, -28]
3765b8N4K4o0q8J15j63K25j19m6P9J05j67J97j18r5J85M8p8n2K93l37K1Lj62K40
3790G6Q7J5l73O1K09m8j28K29k44K48l1j17P7j18J02l4J52l36O2J70j86J19k6
3813c4J04m0p5K50k44p9J53j7q0Q4j37J45jj78K34k30L36l62M3N1K26m4j27rL3
3838BJ30j70l1J15r6Q8j28K46l2o0j3j27K8rJJ34j34l9K36p7o9J52j63k6J35j33
3864d0O4Q3j22m0L6J46K1m45M45k67K94k07J37o7n6L4p1J50l05L79k72K58j94
3887c9O3q5R2J57l40j79L83K3j10M8j0P9j31J20n9Q2j52j49K93K4k14J7k60M12
3911F5j47K78j61nj65M5P7N3k4j7j64L65k76J12L01k90q8J44k28k0J62k9N2Q7
3935A27p5j09j5L0K9QJ33k61n5K47N0k14J74J10l4k97J81j8j31J97q8J04m5j50
$$ y = [-28, 26, 50, -10, -98, 17, -146, 79, -40, -86, -7, 98, -69, 128, 10, -85, 100, 148, 70, 18, 311, -26, -5, -2, -164, 76, 163, 178, -195, -134, 75, 27, -101, 128, -116, 132, 101, -16, 61, -57, 45, 11, 163, -173, -111, 59, -127, -8, -34, 70, 30, -45, 205, -39, -118, 35, 18, -62, 22, -115, 30, 29, -149, 85, -145, 191, -171, -128, -77, 149, 105, -22, -31, 2, 132, -38, -69, 46, -50, 38, -90, 156, 124, 64, 51, -76, -48, -57, -56, 78, -56, -95, 141, 64, -5, 147, -16, -42, 93, -40, 24, 107, -15, -55, -19, 127, 148, -297, 148, -119, 175, -32, 105, 38, -18, 16, -55, 95, -210, 169, -103, 155, -39, 24, -61, 31, 188, -152, -331, 52, 75, -35, 13, 3, 82, -49, 71, 12, 94, -58, -207, 86, 110, -104, -87, -347, 65, -82, 196, 35, 30, -135, -90, -13, 40, 16, -1, -165, 200, -76, 36, 337, 47, -41, 103, -125, -145, 17, -12, 40, 127, 52, -57, -72, -42, -13, -5, 128, -133, -188, 59, 109, -105, 69, 179, 145, -152, 29, 11, -120, 77, -11, 93, 48, -102]
3959a02L7NJ4q7L63j97O5j21n6j9J38JP8j20O9j82O1n9P0J64j63K54j86J18j49
3984dk7j9J08k0k49K80p1J60k62PK08j91K4J20j08J7J3K7m3J69j51L0p4RR4N8
4010A05q7k5K8j24K7p9J88j38J23oQ1L2l27J99j58J12P8m9j38P1J01L1n8n3j15
4035a81K22j13J6k8J11j06J92o9j08P1k9QJ18k4J57k97k6K03J6j03k05J24J01
4058E0j05k9m9P9R7n1K1O2Kjl8J71j47J01k21j01K05J24j77P9J06j55J8j2rk4
4084dJ36j51r2p1K27q5j19J07J12Q8j39J5nJ66j84J42j17K3Ol9k4R7k5j86J94
4109G2j53J03n4m5J1l1J11P0m6q9j32L41j48J46j76L34m07P5k7O0J65j80J41j58
4133a7L03k30m2J34k44M3R3K3Pj07k98K40J08J53j11m5P7m4J09o3j84Q8P6k09
$$ y = [-102, -65, -60, -46, -133, 230, 33, 98, -23, -79, -98, 40, 41, 119, -1, 68, -114, -53, -112, -42, 122, -41, 213, 27, 145, -4, -31, -50, 58, 38, -211, 69, -2, 158, -104, -97, 111, -80, -56, 64, -44, -27, -14, 13, -30, 139, -12, 18, -56, -47, 47, 105, 18, -7, 21, -103, -76, -155, 33, -105, 18, 12, 93, 125, -202, -3, -161, -49, 29, -20, -158, -87, 14, 45, -13, -66, -181, 41, -72, -56, -84, 27, -79, 113, 44, -64, 7, -22, -14, 104, 80, 237, -60, -86, 117, 133, 30, -175, -51, 50, -55, -84, -133, -54, 43, -8, 13, 75, 77, 76, 38, 209, 62, 163, -58, -159, 46, 170, -7, 72, 178, 23, 41, 29, 20, -4, 132, -19, -111, -182, 45, -40, -159, -52, 60, 148, 9, 24, 19, 185, 1, 143, 26, 49, 55, 16, -8, 89, 64, -122, 72, -81, 22, -32, -77, -66, -97, 14, 84, 38, -51, -183, 158, 10, 156, -20, 314, -93, -18, -45, 15, 180, 0, 141, -17, 286, 56, 14, 148, -96, -53, 40, 63, 70, -37, -335, -95, 13, 166, 55, 10, 87, 43, 152, 89, -95, -7, 69, -140]
4157a40o7J70j02j33K96N3pj42N3J0J92k06r2K13j34l0o3K98j67k22K16J19n7
4180E8m5j48K41k2r7j10KJ52j12m0P9j01J37J2q3L42m27J5J17R0j50L8l0J29J4
4205F1J40k00N5j28k8K14J09r6l8l9k3j07O2N8k0J28Ok1M4k02R4o3J06Lj11RO5
4232G8J49j29j23o0J36J9K0M6j00J58j80J8q1o0K55k54L06l34O4n0J90k18M8K12
4256A10k5n4k68K73r2J13j17L4l9qL4pj8K08k37q0J88P7k49J82r5J24q5k1L46
4281B94j71k56R4J35n8M0k39J92k00Q9K22k80K83j96q4J06J47n6q1K01l31K47
4303I8k45K0K04r9j51J19J23j32K14j27N0j15Km9K01l00J56K06j91l3Pj09N7k7
4327a21K16l13P0J4J91r0k6K43l57L87k06q0m7M2J42m1j24L2N8j57J62O4q0K10
$$ y = [-140, -207, -37, -139, -272, 24, 77, 70, -72, -19, -9, 183, -23, -115, 98, -36, -66, -129, 169, 2, -220, -4, 115, 58, 13, -135, 106, 84, -13, -123, -121, 31, -81, -121, -42, -143, -6, 6, -77, 265, -162, -147, -30, 60, -90, -52, -82, 47, 61, 201, 1, 56, -72, -100, 114, 223, 127, 89, 50, 27, -80, -18, 40, 20, 148, 154, 133, 177, -25, 69, 6, 112, 115, 4, 13, 78, 227, 98, -25, -85, 51, 70, 90, 136, 36, 194, 14, 32, -49, -109, 146, -108, 198, -136, -72, -122, 68, -150, -102, 110, 85, 31, -237, 36, -56, 57, -60, -26, -65, -73, -39, -46, -64, 144, -93, -173, 15, 92, -157, 25, -70, 54, -31, -52, 294, 123, -133, -39, 96, 38, 78, -161, 31, -169, -80, 142, -138, 145, -51, -135, -29, 118, 62, -19, 182, -149, 98, -147, -127, 77, -22, -173, -54, 69, -63, 151, 24, 74, -41, -39, -88, 113, -187, -31, 175, -16, -49, -42, -151, -94, -121, 95, -218, -148, -134, 57, -33, -59, 184, -173, 214, 8, -72, -119, -77, 65, 24, -100, -68, -10, -167, -5, 59, -21, 189]
4351A89o7q9k15J16j13K28q9m2j9J11j4P7m5J29k9j69K80k12q6J71j08O0r1J4
4375a3j62J80J16k78L44k52J59j05J09j41j6PO6K5R4l3j82Q8L5r4M0J4k0mL7n9
4401d5J32k51J01mJ03l9k8n4L05k9q6k16KJ60P2l25J67j4J41k36J47k75L02N2
4425H2k11J80j92K34m4k39J35J78k2lM5k4j7j77j2L7k2O6OK6K3j63o3Q6O3L0P5
4452G7N0j76L51l69N3K1Q5P2j98O7n4Nl9j5M2Mj67L38j16J26l4j29j52L59j81
4477B0j12K06n6l6j76J92J38l33K69l10J34QK39k61K43k13P6k09L24o3M3Ok17
4500h8J91L4j44j48K82j24M0j91K1J41j19J17j76J35J05j15mj6N2MJ6n2O7J25
4524A53j82J33m9n8j0O1m7K8q5kN4j92J51j06K90r6j99J96Q2K5j54l2n6J48Nr4
$$ y = [189, 122, 33, -182, -66, -179, 49, -40, -82, -101, 10, -4, 73, 28, 157, 128, -41, 239, 27, -59, 112, 4, 64, -27, -13, -175, 5, 121, -157, 187, -65, 94, -11, 98, -43, -59, -52, 14, 39, 133, 100, -82, 6, 41, -53, -13, 1, -19, -23, 14, -45, 87, -164, -63, -67, 36, -3, -31, -85, 220, 191, 105, -111, -109, 51, 123, -202, -35, -49, 92, -144, 3, -272, 30, 82, -129, 51, -141, 93, 49, -190, -55, 123, 101, 98, 143, 119, 102, -75, -87, -50, -72, -6, 0, 26, 49, -114, -177, -91, -28, 2, 77, 127, -49, 302, -67, -14, 7, 92, 164, -34, 33, -21, -16, -55, -70, -28, -24, -191, 147, 31, 157, 123, -6, -158, 201, 20, -92, 114, 58, 22, -154, 38, 176, -157, 112, -198, -64, -56, 183, -78, 165, -48, 28, -181, 143, 80, 123, 129, -88, 103, 137, -7, -155, 127, 3, 43, -148, -127, 14, -105, 12, -164, -29, 76, -39, -43, -59, -7, -3, 13, -39, 28, 153, -29, 104, 55, -3, -13, 48, 1, 29, -56, -58, -4, -196, -45, -151, 139, 43, -156, 40, 122, 147, -7, -39, -95, 53, 58, -36]
4550c6P8L9p7q0k87L31m0Q2L8k4R7j35Q0j70N2J37n7K4j52P3Q4p5j79n3K15j07
4576a42K2l4L15j93k07K64k0Q1M7Q0K1k09k8j3j67L09k72K36j58L04l16j8LJ93
4600I8k03L3P8p2J87k05K77k18J9K9J9M6k37J38K27j09n2k92K99k83R5J24K1J13
4624A32j46J4J69m3O5n1q8L1O1k22J65k8o6K3j65K97j61j8P7p7R3J10q5j06J31
4649A12N0j51j26M6J28j48JP2r2R0Q8j26j13Q6K23j75J28n3J10j35r9J19j40J14
4673IK4J51m93L51n3k0P2n9R3l26L13l3j00J04ln1O7K2j75K55q4N7N0k37O2N9
4699E5J15r6o8Nj67J03K2k0R4L3k30MJ67n2K00k7n5k05O4P2O1j80K6J09k14L20
4725A36j29M1q6R7j84P1k2k1R8K13j79m6J50j42N9M0Q4l78L25j73R8Q9p5r0k1
$$ y = [-36, 42, 81, 4, -76, -363, -32, -72, 10, 48, 24, 121, -14, 66, -104, -52, 85, 28, 52, -100, -27, 57, -18, -197, -250, -35, -142, -120, -154, 161, -32, -239, 25, 5, 86, 133, 213, 234, 25, -3, -16, -183, 126, -146, 90, -68, 236, -80, -98, -95, 98, -105, -72, 6, -66, 121, -84, 193, -25, -6, 23, 42, 88, -149, -11, 216, 107, 55, -237, 62, -221, -126, -2, 19, 132, -14, 0, 169, 126, 191, 140, 52, 83, 144, -78, 87, 59, -7, 16, -149, 148, -13, -31, 46, -31, 62, 172, 87, -19, 112, 162, 11, -115, -69, 59, -89, -88, -16, -108, -18, 70, -56, -169, -83, 140, -35, 93, 40, 150, 15, -84, 35, -105, 9, 33, 184, -309, 42, -11, -31, 41, -18, 75, -251, 62, 29, -71, 33, 30, -21, 46, 68, -107, 148, 64, 121, 171, -66, -4, 55, 170, 74, 6, 11, -156, -53, -31, -51, 43, 76, -154, -150, 17, -35, 165, 138, 83, -122, -58, 14, 75, -105, -79, 30, -184, 136, 7, 48, -38, 59, -125, -54, -76, -97, 1, 214, 35, -11, 139, -3, 56, 96, 180, -198, 127, -46, 52, 141, 66, -24, -45]
4750d5J17j91J55j43p2K34P2j89r7K26j70N6J82k25L32l60K13q1J5J00j69k0J30
4773G0j03J04M3j22J42j40k0J3J42oj10K45k66k7N4k6J70k97L21k05k1J59o4j07
4797e1J74j29R1j4j10K14n5J3o6q3K9K1o3q5L0j1M7O4M1N8k44J45j0o2o1N8N2
4824gm0M7L7k9k7K05k20J43k5O9n2k22o3J62Q0r0j95Q3L5N1M5m7J72j82J00O8
4850I8Pj19R3j07j61Q1m1L4P5M7k3r1j04K02j4J17p1pJ05k21O8rK9J69m21K37
4876b7rK6K7j86K12N8k44K41Lj24O3j05K01k14Q5n3L4oo4K15k48R8J33j09M3o
4902D4J46l71K01J0j15J59J42k41O2M8j06K45j04k02R8J05j74Q6R8M3O4k72j3
4925d7Q6J28p4r7j16K0K03q4m2J63j52r8P0K5J36k44N9J72j47R6j03j03K30j38
$$ y = [-45, 72, -119, 36, -107, -179, 55, 127, -62, -159, 67, -103, -47, 135, -90, 242, -118, 95, 14, 29, 129, -40, -60, 70, -33, 71, 114, -8, 134, -6, -26, -13, 129, 123, 13, 258, -8, -35, 19, -7, 163, -134, 187, -18, -39, 120, 56, -51, 123, -6, 85, 71, -39, 175, 120, 133, 67, -16, 13, 34, -29, -114, -84, -95, -48, 16, 57, 115, -129, 16, 6, -56, -117, -59, -7, -47, 0, 37, 8, -19, 186, -34, 109, 84, 153, 101, -121, -184, -22, 58, -32, -227, -144, -109, -58, -13, -60, 112, -70, 30, 98, 105, -14, 79, -28, -189, -108, -149, -115, -40, 7, -16, -107, -211, -9, -23, 94, 23, 16, 121, -100, -32, -41, -12, 157, -264, -27, -36, -10, 17, -169, 43, 101, -143, 98, 101, -23, 40, -65, 136, -78, 7, -46, -12, -18, -82, 133, -115, -17, 116, 7, 50, 44, 190, -181, 20, 30, -85, 74, 216, -25, 37, 85, -21, 224, 120, -82, 16, 121, -53, 33, 131, 174, 238, -34, -47, 39, 167, 93, -4, -120, -100, 103, 19, -23, 140, -12, -110, -40, -15, 121, -123, -64, 108, -39, 57, -46, -149, 81, -57]
4949e7l1J66o1j0l9k9J8L5J08j51L3J27m8N8j58O6J33j53K06n0j65o6J14m9N0
4974D7k0J82k28J02q3o1m5j0K41j26j53%J76j57K9j64L45k52J5O7l3J96j96N4
4998g4j22K47j06K78j62j1MK4n0pJ5p8pK22k73J58K6p7o8O4K32j57o0R9J7k97
5024a63J02j26J37L3P7o2L3L0o0N7P5j27m5R4j27J05j95J96J4j10m7K67K4j70
5048A2k32N1J33j4K07j47mm0j3K17j01j84J70j78J82j66L1J45k8q0R4%k06J69
5072A8j15J1K2K1P6Q5j37R1k34J16J28J1j90O3J68k32J02J83j45j05J29kj05J59
5096A18j77Q0m5pj17K8J95k67J97K6q1j9NR5j48J75j9j18L02j23j8k01K36k31
5120a14m3r7J94P4r1J68l4k13Nm6L50j08j47P0m3j6J59j94O9n3J77k33L22rj95
$$ y = [-57, -88, 78, 17, 7, -32, -61, -43, -8, 100, -51, -18, 109, 61, 119, -39, 27, 160, 7, 213, 163, -2, -68, 46, -3, 47, 27, 209, -19, 83, 0, -61, -106, -116, 125, -1, -154, -154, 22, -135, -106, -270, 75, -177, -162, -95, -128, 68, -128, -74, -196, 51, -55, 223, 61, 50, 54, 78, 28, 21, 36, -42, -49, 173, -100, 58, 84, 7, -61, 3, 235, 78, 18, 117, 134, -163, -61, -187, -50, -17, 60, -2, 31, 61, 1, 58, 133, 6, -39, 55, -72, 33, -162, 34, 48, -62, -109, 158, 182, 12, -220, -169, -36, -50, 157, 10, 6, -34, -47, 170, 69, -115, 55, -123, 59, -107, -76, 69, 41, -39, 55, 55, -151, 18, -97, -86, -64, -43, 33, 118, -19, 72, -162, -46, 82, 93, -97, -34, 134, -98, 4, 187, 42, -63, 66, 64, -41, 118, -59, 21, -24, -31, -148, -120, 75, -192, 5, 31, -50, -69, -64, 31, -117, 58, 39, -79, 223, 100, 82, -119, 117, -114, -157, -254, -60, 14, -77, 91, 57, -156, -151, -197, 153, 45, -102, -32, -75, -91, 68, -126, -57, -110, 67, -166, 156, 147, -48]
5145d8N0J05RL2k56L1L9M9J14j44k2j30Q9J99j07j02QKJ18n9o6Q7OJ2k23J87O4
5172D4J17p1p9P4O2j18j9M4j10K50j96J48n7J1k76M34k16M2M1l16L5K54n6O7R
5197A18Q1r0r9j12O4j00J05N8L2m8K10j35j55J47n2N6Q2j29n8J75k42K23n5r3
5221a7j44QJ37j70K67q8O2Q5j97J45k34N2j7K2nJ6L8j20Q2L20l15J28j31J44O5
5246A33j19J65k77L6m6J50J8O3n1J58k75n0Ok4R7j22L0J85k28Q5r8Q7J28j16M
5271f1J10j73J79L6j70N9L2N1r0J86l43q8M43k30J70j83P9j05K09j04J35j86l7
5294h1j9J57k2j46J67j41J25L0p6l7J23n4k23O1P2L2Q0j93J04J36j55J2P9p4n6
5319i9J12j31J46P2j83n6J51j62QK86k07r8J46K7k58L30k75K02o4j38J36O4mK4
$$ y = [-48, 2, 107, 116, 148, -108, -77, -38, 11, 125, -19, -41, -171, -82, 117, 10, -92, -84, -82, 36, -23, -89, -2, 4, 16, -207, -20, 44, 161, 90, 11, 85, 147, 29, 10, 54, -56, 194, -2, 146, 89, 100, -176, 258, 42, 84, 125, -191, -156, 98, 42, 109, 118, 199, 109, 10, -102, -38, -138, -33, 25, 57, 9, 219, 84, -71, 76, 24, 80, 162, 33, -25, 150, -92, 131, 76, -17, -161, -153, -16, -186, 81, -7, 55, 140, -57, 88, -146, -94, -111, -89, -94, -78, -40, -160, -78, 242, -73, 55, -76, 68, 133, 14, 179, -98, -62, -108, 42, 60, 123, 72, 230, -45, -95, -89, -113, -16, -138, -108, 77, -151, -66, -164, -77, 51, -65, -61, 49, -124, 55, 91, -79, -20, 12, 63, -27, 159, -184, -272, 171, -59, 111, -72, 7, -98, 111, 7, 142, -44, -81, -100, 57, 35, -111, 56, -85, 40, 70, -6, -43, 80, 26, -197, -136, -64, -32, 48, -145, -41, 95, -60, -48, 31, -43, -99, 13, -118, 28, 100, -83, -139, 12, -150, -142, 144, -63, -161, -15, 12, -246, 84, -191, 11, -53, -191, -55, 9, 5, 29]
5343B9K7k6N0r0M7k4l8j90J24J11j24J24j63J07K03k71K45J6j89PM8L4l19L98
5367A36j54K8j48MJ08J12M3k88K38n6J1l6M9P5j55M4n0K48k54J8Q6p9J54k04j09
5392a79K05J34n7k22J56o6j8K3J64j22J59k17J14k53K03j04j6o2J78R4p2j71P9
5415e0j6%O4r6J77m2j41J04l3L4O1k28qj9K23p8K5M3r7OL2O4J42j37P0k71L69
5442A98k91J16q1R0j95L78j94J43j90N4k2J00l36L03K4k61J36j57L19j49K5j37
5464a27%J4K55j95K1O7j4N2j02P0J28p4p3p0K5N9N9L2k19K50k36P3K4k05J60M7
5490B1p1M8q7o2P2J56K7k57J34l8l7K09l23K73l7N4j18j03J78p3n9P5q3j5J83
5515F7J40j12j37kJ33P0jj52n1K14k80J16J3l8l9m8J51M4j09O9n8K1o5j08K36
$$ y = [29, 56, 30, 80, -10, 37, 13, -25, -215, -91, 20, -104, 20, -143, -36, 167, -104, 141, 157, -32, -25, 23, 57, -262, 136, -18, 10, -138, -134, -26, 86, 129, -159, 79, 23, 34, -2, 47, 122, -33, 11, -39, 209, -45, -27, 59, -20, 134, -70, -179, 26, 160, 103, -119, 37, -29, -47, -24, 140, 18, 177, -40, 74, -179, 24, -80, -96, -158, 20, 114, 42, -129, -50, -66, -66, -2, -98, 79, 37, -104, 0, -33, 1, 62, -166, -174, -193, 30, -48, -23, 20, -77, -71, -39, 25, 167, 30, 100, -171, 198, -93, 23, -58, 32, -163, 215, 21, 164, -26, 28, 6, 106, -230, 73, 97, -164, -28, -185, 134, -15, 10, -127, -127, -113, 142, -53, -32, 35, 21, 73, -29, 41, 169, 95, 22, -48, -23, 36, 95, 127, -92, 158, -78, -5, 19, -186, -26, 21, -50, -2, -89, -151, -79, 77, 104, -153, -19, -57, -94, 115, -208, 65, 28, 82, -36, -139, 39, -34, -93, -18, -101, -116, 67, 207, 95, -42, -44, 89, 159, 158, 6, -45, 169, -111, 5, 18, -20, -59, -107, 44, 88, -21, 48, -10, 11, -54, -162, 74]
5540G4k51K10Np3N4j13J17n0q2J39j58R1J42q0j96K37Q0l16L08j73L7O8J9q9k85
5565b85K39J52O2j0j78J92j80j51K89q9J84k73k5Q0j63P4l4K65k41Q9N5j55J62
5588E9k21K72j59J50O9j62K05k21jj6J12L3k12R8j9J88l28K40j70K84j38j69L2
5611g4J94q7K7L1k08P7J23J16j63K04k35k7r3J50M6m0l4j8J45j86P9k4j12M1Q4
5636A6q2j97M05k9k07p4J12K01k94L31k17O6K8n8J12j69O1l2K01j78k77M54j75
5659bL3J87q3M8j42N4J52l08K8J75m5m2J21k44o4P3l1K82r1j89o6J36J45j99K30
5684A58K8j13o5l9J16pl9k82M20k44J4J07j75m3L87k20P8n8o7k6K42N6j58K1j3
5709G8J18l43J29R4j5j84J28r0J90j8j11j21J69pl7n2K40j22k86K15J01M5j74
$$ y = [74, -177, 33, 38, -35, 19, -94, 23, -27, -109, 30, -128, -37, 105, 25, -171, 66, 146, -170, 138, -35, 2, 70, 89, 0, -285, -46, 106, 168, 158, -20, 172, -8, -159, 130, 41, 225, -48, -73, 7, -156, -82, -116, 149, -92, -3, 52, -103, 59, -162, 110, -49, 101, 170, 8, 213, -8, -9, -25, 87, 120, -92, 6, -13, 175, -153, 87, -83, 201, 63, -106, -74, 120, 33, 60, 91, -117, -40, 83, 199, 36, 240, 5, -22, -115, 35, 81, 41, 7, -11, 134, -52, 27, 3, -109, -68, 16, -66, -263, 142, 113, -94, -168, -56, 145, -149, 182, -35, 31, 59, 1, 113, -56, 5, -27, 174, -4, -281, 173, -2, 31, 218, 135, 183, 41, 95, 247, -61, -33, 142, 97, 55, 176, -68, -132, -59, -90, 192, 101, -88, -154, -18, 127, -72, 158, 186, 73, 8, -31, 85, 78, 39, -243, 177, -67, -53, 54, -121, -164, 223, 3, 81, 23, -44, -70, 172, 228, 70, 91, 78, 196, -147, -18, 76, 61, -123, 5, -85, 105, 87, -24, -145, 24, 17, -20, -72, 168, 46, -240, -25, 76, 121, -53]
5732e3m0j6Q3J08j15q5n4J51L9L8o3j16K57k60J40j56K97k44LK21j9j14K7K0J05
5757A54k73k3K43j09j10J01M1L4R3j56K4n7Lj16J03m6K12j49J86j99J18m4j28
5780i8l3qK59l00J71j4j59J12K06k66L00j00o8L6n7k5N2L5L9j40P0K3j07l2J01
5805cO8pJ12j97K10j43K4j4J3q4K7J55j37k34M6K10J36k12j51J99K1J7O0j98J9
5830f3R2Kl8J1j5Q7J04j63M3l1j86J49j90K44rj86J70n1j09o7L28k44m1K34o5
5855FO5N6l05K20o8n2J07j02J66p9m0K56l20J88j92K64k71J30J09j34lnNj0M8
5880C9k84K18q8J5p2L05m17K13J51j26K4J11j37j06J28j00o3L19k22M6K51k91
5902h6L30k65m8o2K43k34L4J44n8om5L5k14Q7R8Q0j9j38L91k63j14Pp4MK98j84
$$ y = [-53, -93, -109, -26, 82, -33, -118, -172, -21, 18, 56, -7, -123, 134, -126, 14, -142, 155, -89, -86, 135, 116, 2, 29, 49, 154, -119, -142, 101, -8, -118, -17, 24, 58, 151, -5, 19, -38, -35, -151, -48, -94, 118, -31, 155, -44, 74, 30, -98, -131, -139, 120, -180, -9, -23, -182, -70, 136, -130, 170, 70, 2, 38, -19, -44, 8, 43, 82, -58, 12, 35, -72, -104, -3, 65, 58, 170, -27, 183, 40, 64, 50, 63, -21, 6, 161, 24, -210, -164, 46, 182, -30, -181, 18, 39, 56, 116, -82, -63, 29, 31, -7, 4, -11, 76, 180, 17, 60, 29, -157, -8, -198, 46, 37, -149, 21, -30, -139, -206, 122, -122, -163, 71, 6, 71, 127, -178, 42, -26, -78, 29, -73, 93, 14, -26, 230, -90, 98, -94, 170, -101, 29, 138, 4, 1, -4, 1, -9, 39, -245, -27, -115, -100, -172, 133, -284, -71, 80, -46, -22, 89, -48, -154, -26, -126, -189, 130, -92, -46, 205, -86, 244, -21, -69, -131, 112, -122, -88, 56, -2, -8, -53, -18, -232, -145, -47, 33, 14, -124, 267, 4, -110, -103, -177, -173, 125, -59]
5928e9P0o9j13J16J25L9j33J78p1k38L1R5M9P2j86Q1rM8J28j65J44o4n4J3j18
5953i0K16k57K81k42L19k27j43qK20r8q7J60k7Q6n0r0K74j72J6L5k06j08J90M6
5977C8j79K34j12j39L46j64L0j10R6J34r0K29k76k3J16j39P5k62K07r7p0J79p2
6000d9J03o4q7J96k05L27N4j70O1k52JJ32m9M7O0j71J37k4J28q8j34L5n3O2N4
$$ y = [-59, 11, -58, -171, -55, 70, 109, -24, 154, 83, -155, -124, -29, 20, 92, -94, -13, -22, 26, 154, -11, 133, 69, 15, 28, -90, 126, -131, 150, -92, 227, 0, -143, -151, 69, -29, -116, 44, 17, 103, 53, -37, 237, 65, 81, 116, -90, -198, -8, 38, -141, 93, -19, -158, 188, 24, 54, -56, 40, 174, 84, 313, 37, 14, 130, -9, 66, -196, 11, -86, -156, 23, -49, 54, -10, -97, 99, -106, 221, 275, 105, 166, -86, -85, 47, -2, 45, 105, -66, 71, 47, 175, 87, -47, -12, -65, -3, 51]
$$ [...]
8191b7
##END NTUPLES=NMR FID
##END=
