##TITLE=1H_EC-3236(24)
 CDCl3, 8 sc, 
 22.10.2020
##JCAMPDX= 6.0         $$ Bruker NMR JCAMP-DX V2.0
##DATA TYPE= NMR FID
##DATA CLASS= NTUPLES
##ORIGIN= UXNMR, Bruker Analytische Messtechnik GmbH
##OWNER= root
$$ XWIN-NMR		Version 3.5
$$ Thu Oct 22 11:15:37 2020 Russian Standard Time (UT+4h)  she@DPX200
##.OBSERVE FREQUENCY= 200.1315066352
##.OBSERVE NUCLEUS= ^1H
##.DELAY= (6, 6)
##.ACQUISITION MODE= SIMULTANEOUS
##.ACQUISITION SCHEME= undefined
##.AVERAGES= 8
##.DIGITISER RES= 18
##SPECTROMETER/DATA SYSTEM= spect
##.PULSE SEQUENCE= zg30
##.SOLVENT NAME= CDCl3
##.SHIFT REFERENCE= (INTERNAL, CDCl3, 0, 15.7039)
##AUDIT TRAIL= $$ (NUMBER, WHEN, WHO, WHERE, WHAT)
$$ ##TITLE= Audit trail, XWIN-NMR		Version 3.5
$$ ##JCAMPDX= 5.01
$$ ##ORIGIN= Bruker BioSpin GmbH
$$ ##OWNER= she
$$ F:/spectra/data/she/nmr/H-F/1/audita.txt
$$ ##AUDIT TRAIL=  $$ (NUMBER, WHEN, WHO, WHERE, WHAT)
(   1,<2020-10-22 11:14:24.10 +0400>,<she>,<DPX200>,
      <created by zg, POWCHK disabled, PULCHK disabled
       configuration hash MD5:
       00 E9 B6 7A A2 85 ED C7 34 08 36 98 17 FE 4E 26
       data hash MD5: 16K
       3B C8 7B 9D FD FA 7F 90 BA 6D F0 40 00 30 6D 81>)
$$ ##END=
$$ 
$$ hash MD5
$$ 7C FD 87 74 B2 49 30 D1 17 C9 D6 8C D4 F3 E8 34
##$RELAX= 
##$RELAX= 
##$RELAX= 
##$RELAX= 
##$RELAX= 
##$RELAX= 
$$ Bruker specific parameters
$$ --------------------------
##$DU= <F:/spectra>
##$EXPNO= 1
##$NAME= <H-F>
##$PROCNO= 1
##$TYPE= <nmr>
##$USER= <she>
##$AMP= (0..31)
100 100 100 100 100 100 100 100 100 100 100 100 100 100 100 100 100 100 
100 100 100 100 100 100 100 100 100 100 100 100 100 100 
##$AQSEQ= 0
##$AQ_mod= 1
##$AUNM= <au_zg>
##$AUTOPOS= <>
##$BF1= 200.13
##$BF2= 200.13
##$BF3= 200.13
##$BF4= 200.13
##$BF5= 200.13
##$BF6= 200.13
##$BF7= 200.13
##$BF8= 200.13
##$BYTORDA= 1
##$CFDGTYP= 0
##$CFRGTYP= 5
##$CHEMSTR= <none>
##$CNST= (0..31)
1 1 145 1 1 1 1 1 1 1 1 1 1 1 1 1 1 1 1 1 1 1 1 1 1 1 1 1 1 1 1 1 
##$CPDPRG= <>
##$CPDPRG1= <>
##$CPDPRG2= <>
##$CPDPRG3= <>
##$CPDPRG4= <mlev>
##$CPDPRG5= <mlev>
##$CPDPRG6= <mlev>
##$CPDPRG7= <mlev>
##$CPDPRG8= <mlev>
##$CPDPRGB= <>
##$CPDPRGT= <>
##$D= (0..31)
0 1.2 0 0 0 0 0 0 0 0.06 0 0.03 0 0 0 0 0.0002 0 0 0 0 0 0 0 0 0 0 0 0 
0 0 0 
##$DATE= 1603350863
##$DBL= (0..7)
120 120 120 120 120 120 120 120 
##$DBP= (0..7)
150 150 150 150 150 150 150 150 
##$DBP07= 0
##$DBPNAM0= <>
##$DBPNAM1= <>
##$DBPNAM2= <>
##$DBPNAM3= <>
##$DBPNAM4= <>
##$DBPNAM5= <>
##$DBPNAM6= <>
##$DBPNAM7= <>
##$DBPOAL= (0..7)
0.5 0.5 0.5 0.5 0.5 0.5 0.5 0.5 
##$DBPOFFS= (0..7)
0 0 0 0 0 0 0 0 
##$DE= 6
##$DECBNUC= <off>
##$DECIM= 32
##$DECNUC= <off>
##$DECSTAT= 4
##$DIGMOD= 1
##$DIGTYP= 9
##$DL= (0..7)
0 120 120 120 120 120 120 120 
##$DP= (0..7)
150 150 150 150 150 150 150 150 
##$DP07= 0
##$DPNAME0= <>
##$DPNAME1= <>
##$DPNAME2= <>
##$DPNAME3= <>
##$DPNAME4= <>
##$DPNAME5= <>
##$DPNAME6= <>
##$DPNAME7= <>
##$DPOAL= (0..7)
0.5 0.5 0.5 0.5 0.5 0.5 0.5 0.5 
##$DPOFFS= (0..7)
0 0 0 0 0 0 0 0 
##$DQDMODE= 0
##$DR= 18
##$DS= 0
##$DSLIST= <SSSSSSSSSSSSSSS>
$$ [...]
##$SUBNAM2= <"">
##$SUBNAM3= <"">
##$SUBNAM4= <"">
##$SUBNAM5= <"">
##$SUBNAM6= <"">
##$SUBNAM7= <"">
##$SUBNAM8= <"">
##$SUBNAM9= <"">
##$SW= 16.880792210976
##$SWIBOX= (0..15)
0 0 2 0 0 0 0 0 0 0 0 0 0 0 0 0 
##$SW_h= 3378.37837837838
##$TD= 16384
##$TD0= 1
##$TE= 0
##$TE2= 300
##$TE3= 300
##$TEG= 300
##$TL= (0..7)
0 120 120 120 120 120 120 120 
##$TP= (0..7)
150 150 150 150 150 150 150 150 
##$TP07= 0
##$TPNAME0= <>
##$TPNAME1= <>
##$TPNAME2= <>
##$TPNAME3= <>
##$TPNAME4= <>
##$TPNAME5= <>
##$TPNAME6= <>
##$TPNAME7= <>
##$TPOAL= (0..7)
0.5 0.5 0.5 0.5 0.5 0.5 0.5 0.5 
##$TPOFFS= (0..7)
0 0 0 0 0 0 0 0 
##$TUNHIN= 0
##$TUNHOUT= 0
##$TUNXOUT= 0
##$USERA1= <user>
##$USERA2= <user>
##$USERA3= <user>
##$USERA4= <user>
##$USERA5= <user>
##$V9= 5
##$VALIST= <valist>
##$VCLIST= <CCCCCCCCCCCCCCC>
##$VD= 0
##$VDLIST= <DDDDDDDDDDDDDDD>
##$VPLIST= <PPPPPPPPPPPPPPP>
##$VTLIST= <TTTTTTTTTTTTTTT>
##$WBST= 1024
##$WBSW= 4
##$XGAIN= (0..3)
0 0 0 0 
##$XL= 0
##$YL= 0
##$YMAX_a= 583607
##$YMIN_a= -490515
##$ZGOPTNS= <>
##$ZL1= 120
##$ZL2= 120
##$ZL3= 120
##$ZL4= 120
##$ABSF1= 10
##$ABSF2= 0
##$ABSG= 5
##$ABSL= 3
##$ALPHA= 0
##$AQORDER= 0
##$ASSFAC= 0
##$ASSFACI= 0
##$ASSFACX= 0
##$ASSWID= 0
##$AUNMP= <proc_1d>
##$AZFE= 0.1
##$AZFW= 0.1
##$BCFW= 1
##$BC_mod= 2
##$BYTORDP= 1
##$COROFFS= 0
##$CY= 11.3945322036743
##$DATMOD= 1
##$DC= 2
##$DFILT= <>
##$DTYPP= 0
##$F1P= 16.9975609425685
##$F2P= -3.02152046262296
##$FCOR= 0.5
##$FTSIZE= 0
##$FT_mod= 4
##$GAMMA= 1
##$GB= 0.15
##$INTBC= 1
##$INTSCL= 1
##$ISEN= 128
##$LB= 0.24
##$LEV0= 0
##$LPBIN= 0
##$MAXI= 10000
##$MC2= 0
##$MEAN= 0
##$ME_mod= 0
##$MI= 1.114404
##$NCOEF= 0
##$NC_proc= 0
##$NLEV= 6
##$NOISF1= 3.799351
##$NOISF2= 2.8
##$NSP= 1
##$NTH_PI= 0
##$NZP= 0
##$OFFSET= 15.70392
##$PC= 1
##$PHC0= -10689.83
##$PHC1= 15.00089
##$PH_mod= 1
##$PKNL= yes
##$PPARMOD= 0
##$PSCAL= 0
##$PSIGN= 0
##$REVERSE= no
##$SF= 200.130013532006
##$SI= 16384
##$SIGF1= 3
##$SIGF2= 2
##$SINO= 400
##$SIOLD= 16384
##$SREGLST= <1H.CDCl3>
##$SSB= 0
##$STSI= 0
##$STSR= 0
##$SW_p= 3612.71676300578
##$SYMM= 0
##$S_DEV= 0
##$TDeff= 0
##$TDoff= 0
##$TI= <>
##$TILT= no
##$TM1= 0
##$TM2= 0
##$TOPLEV= 0
##$USERP1= <user>
##$USERP2= <user>
##$USERP3= <user>
##$USERP4= <user>
##$USERP5= <user>
##$WDW= 1
##$XDIM= 8192
##$YMAX_p= 0
##$YMIN_p= 0
$$ End of Bruker specific parameters
$$ ---------------------------------
##NTUPLES= NMR FID
##VAR_NAME=  TIME,          FID/REAL,        FID/IMAG
##SYMBOL=    X,             R,               I
##VAR_TYPE=  INDEPENDENT,   DEPENDENT,       DEPENDENT
##VAR_FORM=  AFFN,          ASDF,            ASDF
##VAR_DIM=   8192,          8192,            8192
##UNITS=     SECONDS,       ARBITRARY UNITS, ARBITRARY UNITS
##FACTOR=    0.000296,      1,               1
##FIRST=     0,             0,               0
##LAST=      2.424536,      0,               0
##MIN=       0,             -490515,         0
##MAX=       2.424536,      583607,          0
$$ Real data points
##PAGE= N=1
##DATA TABLE= (X++(R..R)), XYDATA
$$ [...]
1912b110L902l058K651j413q86K728l759K600J37k371K057k8j191J108j575K846
1928A638l035K11L622n296L765j170L59j8k058M287l910O87K780k383j23Q39K32
1945D27K94k244K635J83l807M971l449R49N16j263K791m365L359M5k502K426j183
1962b17j03Q49r37O85l24n27J951l004K559m86j481K370k110K139k474J475J041
1979A406k701J987m58j71l87N08M69r33q91K569j588q86K040j847J954k096J906
1996H81p97j763L195k048L32m00J067J32j180L36J012j081K09P93j239J321j519
2013g49J850j523l04K069k358J728r63L87n21j52J042q98K09M6J76p31J211j109
2031e90M55m6M37q8j682K798j919N65P7L1m9q38K146j588k61Q08Q64j879P98O56
$$ y = [-2110, 1792, -1266, 1385, -28, -914, 1814, -1945, 655, 792, -1579, 478, 450, -741, 367, -1208, 1638, -1397, -1186, 2436, -2860, 905, -265, 94, 76, -1982, 2305, -1605, -918, 1862, -521, -644, 195, 427, 721, -1523, 1112, 1295, -2512, 2459, -990, -41, 475, -788, 2003, -2362, 997, 1042, -1460, 966, -217, -320, 529, -408, 277, -47, -574, 1377, -1627, 932, 446, -1035, 1335, -775, 1364, -1110, 365, 1406, -1295, 692, 234, 63, -324, 184, 653, -280, -1171, 1398, -190, -1076, 964, -883, 1071, -1025, 881, 84, -1679, 1516, -532, -200, -600, 467, 599, -581, -245, 767, -314, -105, 688, -551, 770, -749, 1101, -422, -726, 1343, -1015, 713, -250, 137, -384, -536, 506, -392, -183, -137, 39, -692, 519, -590, -135, -181, 256, 168, -1514, 1284, -635, -70, 7, 38, -11, -849, 1297, -291, -552, 256, 1120, -759, 39, 695]
2051F95q58J04j31J717k725J388M68q32N3o6Q60j491J342P7q67o15J737o98r28
2070g70J586j233P94q09J293j099n47J879j158l74K15J109j495M76O23o49l24
2087d83J09J327k550K062l46n09j79M66P80k012J417K89o17n82J428p17n03P77
2105A57j15L02j447K538j817o2J239q03M45j075J783j509L46N63m84j60K94O39
2123H34j331O40N5N47k004J960k29j320J660j395J763k181J370L24j742J781o88
2140D4j34j76J60K44J14j210J984j620JJ687k509K390k045J203L57k015K794k051
2158g82M82O87q89L42Q8o84J474j536P64O01k234K849j800O33K02p01J923k685
2176a266K119l79j096R48m3Q6m11L3Q74j192k77K183k567J364l44K54K16k158
$$ y = [695, -163, -59, -190, 1527, -1198, 190, 658, -174, -121, -187, 673, -818, 524, 601, -266, -881, 856, 158, -770, 816, -417, 377, -432, 861, -238, -785, 1094, -64, -438, -223, 886, -609, -133, 490, -159, -483, -374, 953, -1597, 465, 119, -390, -569, -103, 677, -1335, 82, 371, -246, -828, 600, -117, -620, 157, 42, 344, -1103, 1435, -382, -444, 795, -8, 437, -638, 1145, -364, -18, 545, 61, -99, 195, 834, -497, 143, 198, 745, -1259, 701, 472, -848, 812, -583, 1180, -1001, 369, 693, -1049, 732, 44, -90, -266, -106, 138, 252, -958, 1026, -594, -593, 1094, -1415, 975, -1070, 133, 490, -1525, 1269, -782, -300, 387, -502, -160, -72, -756, 718, -818, -54, 547, -1687, 1162, -638, -5, 197, -504, 1419, -1266, 853, 474, -622, 326, 283, 369, -42, -9, 865, -327, -604, 1579, -988, 376, 32, 286, 502, -1656]
2194a656L515k860P84J078j656J277j200J385n05j060J642m13j628K364j707O58
2210A8M47j390K544l492L021q06j888L233k690J410m71j58J348k248J060J261
2226A199k773K045M8j871K336k042K407k223oL181m073K592p36l22N49r33J723
2243A101j592m27K161j753k48J634j739J502j507J420M6k248L577k834J066L3
2259A92p79J468k303K462q74j186J935q29o58J228j358J499j222n7K083l776L773
2276A598j425j093J900k194L051k810R31J634k695J679j8j122J424j268R25L71
2292H88k502L749l351Q72J741k927L326l185K180j19k248K618j661J23J013j105
2308e88N86j19n49J846k709K175k26j882K781k515K022j447L12J526k840K260
$$ y = [-1656, 1859, -1001, -217, 861, -795, 482, -718, 667, 162, -898, 744, 331, -1297, 1067, -640, 18, 465, -925, 1619, -1873, 1148, 342, -1546, 1687, -1003, 407, -64, -222, 1126, -1122, -62, 1199, -1574, 471, 519, -1352, 984, -1058, 1349, -874, -880, 2301, -1772, 820, 84, -238, 311, -622, 1101, -491, -918, 1243, -510, -758, 876, -863, 639, -868, 552, 598, -1650, 1927, -907, 159, 192, -587, 881, -1422, 1040, 166, -1020, 915, 86, -572, 656, -702, 797, -425, -482, 1601, -2175, 1598, 173, -920, 980, -1214, 1837, -973, -42, 1592, -1103, 576, 558, -564, 860, -408, 517, 888, -1614, 2135, -1216, -344, 1397, -1530, 1796, -1389, 791, 672, -1576, 1042, -619, -496, 517, -588, -2, -121, -670, 1176, -1533, 642, 416, -1466, 1315, -1200, 822, -625, -313, 1213, -1627, 633]
2324F33p07m82O79q70J330p02j130K574k037L22J443k102K454k586J726j12k150
2341a717L874l387J300N75j440K057k078J052O64j906K232j004j573L066k835
2356a120J801n32q43K758m234L495j061j202K108j914J360q43k36J524k102P54
2372b87J717k968K126p21q2P06k339L799k987N20J687k274J775j424J331n71q98
2389h90J834j328l19J664j600O55N5n87J722k661K340p16j552L091l013J871q19
2406b53K11R99k195K061m25j671K241q64o96J359j555K287k614R77J993l730L065
2423A190j391K56K49j283K405k191L91J546j773N39M83r22J106j519J433L5k195
2440a641L382k757J446j69j024J929k383J936p62n41J385r28p9N52o98Q45q20
$$ y = [633, -74, -556, 123, -747, 583, -119, -1249, 1325, -712, -390, 1053, -1049, 1405, -1181, 545, 433, -1717, 2157, -1230, 70, 645, -795, 1262, -816, 236, 900, -1006, 1226, 222, -1351, 1715, -1120, 681, 149, -694, 2064, -2170, 1325, 264, -938, 1170, -744, 616, -227, -463, 1061, -1041, -287, 1430, -1538, 588, -133, -215, 491, -1848, 1951, -1036, -516, 1171, -1103, 672, -752, 579, 8, -890, 944, -384, -703, 961, -639, 16, 71, -516, 1206, -1455, 885, 169, -1383, 1708, -1305, 566, -253, -42, 957, -1238, 823, 398, -1273, 968, 104, -592, 767, -788, 1499, -1115, -138, 1855, -1875, 1190, -201, 55, 304, -979, 1426, -765, -374, 1172, -601, -62, 421, -501, 605, -914, 519, 554, -1641, 1741, -1016, 430, 261, -763, 1166, -1217, 719, -43, -584, 801, -127, -206, 346, -352, 493, -327]
2457c27m2J558k395K355j371l30J129j377J950k214J322L72j774J475l64j46p
2474a86p8O82o58n53J908k070O65Q33j196J507k320K416q99j166K342j655M79
2491E1J50m42P95j029O78M96j717J276Oj030J594j686J691j104L5J274k236J953
2509G55p33k73K88O2M93r08J65R03r83r1J376j574J003o00N27m92r81K594k466
2528i35J005K59n47J88m54R91o76l29P94k02p37J359j089J72P1l16J070k024J953
2547E53n17o32J177r01N96q59R67k30p92P54N07j206N68M64p36L74l62J101j494
2566f68P40N95j289J003m92N26q40L81P56j071J38Q16l75n34Q03n95O34r62R06
2585D72m05q22J718j351M75k77K49L55q51R91p03jK01K15q55P33m23L31j72m48
$$ y = [-327, -369, 1189, -1206, 1149, -222, -552, 577, -800, 1150, -1064, 258, 630, -1144, 331, -33, -179, -186, -264, 418, -240, -793, 1115, -955, -290, 543, -653, 854, -1466, 950, 51, -1115, 1227, -428, 51, 201, -241, 554, -475, 203, 699, -1018, 258, 264, -766, 828, -858, 833, -271, -236, 1038, -1198, 755, 22, -251, 37, 99, 592, -316, -151, 752, -231, -322, 1054, -520, 483, -117, 410, -82, -1063, 1531, -935, 70, 329, -218, -30, -484, 507, -169, -498, 296, 94, -643, 716, -373, -201, -130, -446, 624, -1400, 553, 36, -596, 581, -320, 276, -583, 384, 154, -638, 116, 623, -583, -15, 449, -287, 87, -275, 826, -668, 72, 667, -622, 381, -111, 415, -425, -44, 712, -359, -221, 595, 220, -314, 489, -106, 528, -434, 472, 67, -755, 963, -388, 87, -190, 59, 414, -437, 554, -149, -150, 51, 266, -589, 144, -279, 52, -120, -568]
2605e68J190j458J129l88r0K7o4N25r17P38j69J45n51Q64m74k26L93m1N95j292
2625f32J017m40j73M72j12P1n67R59q68K91q0N09n35j93O54o27N06p99R93o77
2645b31L32J69o65M90l72P46q31N72J33p17M34j13K53p34R28m47J66l91O19l64
2665b3q35J714j278K61P4M14m08l92J039m24l19K15L00r92J022k80J68o74NJ164
2685G51j736J255k72l02L15k29O08o19L75j5k11m13J177j106J44O44r44P77r17
2704g18J440j102k12J069p78K38n3M68p07K02M24j90o33P40j07m86Q81o66N00
2723C10q16R76j21r83J229j057P00m34L81J94p13O57k95k79L37J83q49R14m54
2742a20O74o98k58J395k022J566o11j8K73p41J265j105J38P28o08k23P77q06O46
$$ y = [-568, 622, -836, 293, -95, -185, -158, -222, 303, -614, 124, -45, 100, -451, 413, -61, -287, 106, 65, 660, -632, 385, -55, -228, 244, 132, 203, -364, 595, -273, 18, -62, 447, -88, -281, 373, -254, 252, -547, 446, -231, 101, 270, -395, 95, -277, 469, -362, 210, 343, -374, 60, -53, 200, -534, 394, -53, 113, -278, 341, -23, -858, 856, -422, -161, -87, 327, -81, -473, 566, 142, -177, 38, 338, -654, 368, 88, 256, -418, -413, 751, -985, 270, -2, -304, 11, -218, 390, -229, 146, 131, -80, -493, 684, -422, -278, 366, -578, 199, -718, 722, -380, -592, 477, -301, -63, -116, 352, -355, -153, 271, 81, -552, 188, 81, -405, 476, -190, 310, -506, 470, 349, -634, 595, -462, 238, -196, 185, 379, -334, 323, 28, -251, 86, 269, -580, 334, -120, 554, -144, -402, 993, -1029, 537, -74, -92, 181, -560, 705, -400, -262, 466, -142, -365, 412, -394, 252]
2761B52n45N1R71j811J945j312K09N41q97J233j409P33K41n60K00L65o51O86m70
2780b28p6P43j142J501j233O64J87j025J239j085J110r68J41P60p51L28P1j84
2798E2p7l8K30J93j087J514q43k41R97j305J349j376R60K32j472J796r16j15J24
2817b3j80L34l11l6J120j579Q00N39j511J586j546R67k6q11J573j789Q46K26o55
2836d76N93k30j14M17o12Q44k95r26J825j793Q63k3l18O71j278J604j042J5P59
2855D84n64Q1m01N49J71m81L10K66r26J296j059K63K33p27J283j627J455l23q08
2874e25J177r98O67l55q7M57o78K91N59j100P93Q1p57J259j524J560j127k95J488
2893H86j731J269o05J24K13p15Q11j61n89P73l60j82P50j251J458j172L97O98
$$ y = [252, -293, -242, 729, -1082, 863, -449, -240, 301, -596, 637, -772, -39, 202, -358, -158, 207, -444, 242, -228, -304, 439, -703, 798, -435, 229, 416, -609, 630, -455, 655, -313, -172, 588, -163, 165, 236, 52, -25, -63, 167, 360, -727, 787, -56, -297, 700, -605, 744, -632, 328, 560, -912, 884, -32, -147, -23, -203, 131, -180, -216, 904, -675, 125, 664, -847, 739, -807, 160, 134, -677, 896, -893, -47, 179, -476, 117, -113, -227, 190, -422, 422, 127, -799, 1026, -767, 96, 73, -245, 426, -852, 752, -290, -275, 484, -80, 1, -400, 149, 320, -161, 149, 415, -511, 785, -274, -11, 222, -505, 778, -849, 606, 283, -525, 652, -346, 321, -34, -121, 336, -342, -51, 508, -592, 201, 282, -475, 784, -740, 820, -307, -602, 886, -845, 424, -181, -57, 156, -559, 252, 91, -498, 275, -85, -267, 483, -768, 690, -482, -85, 613]
2911F13j550J678j267P44r7o40J150q64K34L41n22K19J39m68O99p91N88j87n82
2930e63J317j487J312q89K84N34j231J364j083K21N85o48L83R2m33M92n79M31
2948A02N03j610J830j191L33N31j049J505j678J005Qo64Q26m37j82J98m03P73
2966D00l03o05J456j549Q06J66r51J301j589J276m66j39R38j347N48J39k94K73
2984F0j64J2K83p23R31l89n52J155j289J027p16M18J22r40J406j037K35J39lO5
3004D0n68M85L15p19O13J06r51J219r84O13k05l76J213j532J115l43k32N39n65
3023b17K32J13j57M52n49j83R20j314J044k26o51J101j133J415j027K15N40r37
3041c62O58m61J51K56m29L28L5m91P13m25k97O88r01J157j180P50j70n94Q71o65
$$ y = [613, -937, 741, -526, 218, 121, -519, 631, -233, 1, 342, -180, 39, 178, -290, 409, -382, 206, 19, -563, 754, -733, 579, -310, -26, 508, -723, 641, -442, -221, 364, -284, 99, 191, -242, 250, -329, 102, 605, -1005, 825, -366, -33, 498, -551, 954, -724, 281, 289, -375, 451, 14, -168, 30, -373, 400, 97, -508, 948, -601, 205, 371, -580, 721, -868, 408, -58, -197, 741, -606, -58, 81, -213, 60, -104, -92, 191, -532, 399, 10, -542, 613, -676, 351, -365, 53, 175, -765, 641, -396, -161, -22, -25, 40, -528, -43, 272, -447, 166, 272, -679, 540, -444, 169, -36, -412, 801, -731, 384, 41, -191, 348, -217, 15, 128, -29, 423, -126, -309, 611, -703, 341, 115, -536, 565, -568, 847, -180, 35, 575, -362, 296, -165, -14, 242, -187, 141, 176, -315, 398, -27, -324, 364, -537, 620, -560, 190, 20, -574, 297, -368]
3061c68O48m42J18K09l62L0L39l94K19q2k23O55q38Q20k98k99P61j253J039m09
3081a30M08l08m53R40m99P0J4K7j30L22n94O29m80J58N26j028J105p96M88m12
3101a43J40K77p37N83P4j32j41L75m31K40l56M29j94l35R23r88N87k46J12K23
3121B60o99P83m36J75J12k61j18L56j74l54N82l20M38p82Q81m42l53P05n44M27
3141B36o19N54k31k19L06N2j31k45P26n15J6j08L29j91oM70r15Q28p70P73n71
3162b31M1M92n99L54l14N15k33J34l11J86k12J79J70l31N06n62M47j36j98J8j76
3183b61L20k68L45j40J01k47J45J52q6J23m02P53q25M51p4L5K1n91Q84n77J58
3204A7j18K0J68j72Om4N7j12M86o79M78j85j63L27k59L65n44M64k50J03N2k58
$$ y = [-368, 280, -162, -44, 165, -197, -167, 172, -222, -3, -85, -308, 347, -491, 329, 31, -268, 493, -760, 279, -130, 278, -30, -483, 457, -42, 28, 42, 69, -61, 261, -333, 296, -184, -26, 500, -528, 577, -219, 269, -143, -3, 274, -463, 120, 194, 62, -79, 296, -135, 105, -251, 178, -16, -351, 572, -416, 171, -75, 37, 260, -439, 344, -92, 83, 195, -66, -184, 172, -2, -356, 226, -94, 344, -438, 443, 1, -352, 353, -191, 236, -383, 171, -60, -279, 27, 79, -52, -297, 429, -86, -70, -178, 151, -40, -46, 424, -491, 337, -433, 340, -231, -190, 302, -297, 57, -257, 258, 25, 159, -152, 34, -178, 1, 171, -160, 346, -216, 231, 95, -103, -85, -261, 59, -209, 136, -4, 97, -150, -5, 147, 61, 184, -218, 535, -290, 161, 87, 122, 143, -448, 436, -141, 17, -101, -81, 87, -85, -79, -123, -66, -178, 308, -371, 107, -78, -241, 86, -173, 192, -352, 112, -138, -35, 17, -241]
3226b41K43q6L38n41M91k97J71l70J8P75r30O49l42L21m85K89L28m88J47q9L97
3247B98o58N97j21m0j75J24K46n52M70l72J44j30K53J20n35O87m71J97j70K73
3267A85lr9j5N4Oj15J33m88O16k13j83K25n62O97o26O04j9m91L49k32j8rK27j79
3291a56L47n14P05o89J29N03p70M91k96M85k33l08N27l05R6m8K7J0L5k99M79m01
3313a85M11j26k72N41p01O07k99R7J99n75N54j97o0j5J14n7l7R6p4L4j41L92o39
3336c33N38l30K11M1l70P10q13O95m76OK46l29L22k29j10K45J99n03N30n79N20
3357A91j7n54Q19j009P10j72j36L67m19N07k63j16J22r1l25P14o11M25k4l47O08
3378C79r19R38o37J66M11o37L62k46L27l99K49J5K07m83M18N9k49J77l16M97o63
$$ y = [-241, 2, -84, 254, -287, 204, -93, 78, -292, -274, 501, -429, 220, -122, 199, -286, 3, 331, -157, -10, -99, 298, -360, 237, 116, 76, -99, 25, 271, -281, 189, -183, -39, -169, 84, 204, -331, 356, -115, 82, -88, 185, 182, 83, 68, 122, 128, 13, 146, -342, 274, 61, -122, 103, -459, 238, -388, 216, 197, -294, 55, -177, -195, -204, 23, -156, 191, -323, 382, -307, -178, 325, -445, 46, -250, 235, 2, -306, 221, -84, 12, -36, -9, 1, 36, -263, 216, -185, 226, 100, -172, 369, -332, 275, -24, 73, 272, -303, 251, 54, -6, -21, 93, 36, -1, 95, 21, 55, -86, 306, -333, 205, -125, 86, 127, -243, 467, -346, 349, -127, -121, 125, -204, 118, -111, -221, 24, 223, -280, 250, -329, 191, 174, -380, 439, -570, 140, -32, -168, 199, -220, 287, 24, -92, 30, -61, -386, 328, -283, 142, 118, -229, 379, -540, 398, -239, -73, 338, -299, 63, -183, 144, -255, -6, 9, 216, -267, 151, 210, -39, 138, -178, 319, -344]
3399c44N15o1m06P39p84N84l86L8K47l28L65p7k28J38K93l14L21n80P21p08K88
3420C3L82r22P71k69KK47m53M11n60K46K84k87J20K44o64N22k73P1N01r37J092
3441E61q59L52k1n22O36l93L88k60k9K61j39j67J26k19J86k5J0M46p27N59p5k38
3463a49N72n01L23m14L19o8k88L07j18m8M2P5l5Lj23N73o74J14J34l46P44p34
3485b92M54k34m6M08p33N46P4m85M98m44J12L73k99Q8K27m98O73q65O81k85j18
3506a65M41o39N83l89n3K05O6o8L2m6P9j40L6L03o07M71k92N5J14m20P12l96J18
3529@J12k79K81j62P5J7k24J47J33k90M45m20P9K5j46O16q39P01k05j94K69l09
3551a68K04k88N39l0m31K69J17l60K82l17Q8K57m26O92n34j3J73n21P54m06R2
$$ y = [-344, 171, 110, -296, 443, -341, 243, -143, -105, 142, -186, 179, 102, -126, 12, 305, -9, 312, -268, 453, -255, 33, 415, -507, 264, -5, -3, 244, -209, 202, -358, -112, 172, -115, 5, 249, -415, 107, -166, -95, 406, -531, 561, -298, 54, 33, -489, 147, -246, 142, -118, -147, 114, -25, -192, -66, -285, -99, -124, -114, 332, -395, 164, 89, -149, 423, -78, 245, -169, 150, 82, -206, 101, -17, -65, -23, 52, 17, 20, -103, 470, -204, -90, 44, -302, 442, -292, 162, -72, -118, 290, -443, 103, 177, -308, 190, -254, -142, 231, -68, 20, 247, -251, 422, -443, 238, -47, -165, 276, -363, 220, -169, -222, -17, 49, -19, 13, -33, 46, -94, -58, 245, -362, 109, -183, -128, -14, -434, 278, -118, 0, 112, -167, 114, -48, 27, 44, -180, -33, 100, -190, 255, -165, -86, -61, -207, 409, -430, 271, 66, -128, 141, -168, 36, -252, 287, 257, -174, 95, 212, -148, 134, -183, -95, 162, -264, 428, -106, -119, 54, -467, 287, -119, -27]
3572b7J48j71K52l35L8L47l06j19K43l42O15n21J88O9m15N50n72M34j41j2J95
3593A18k03K03j94N6n8N8o3J14j58K77j61j96L29n09L95r2J88J54n65O91n05L61
3615B40l32rO1R3j44K91k90K3J81n28N39k90N4K06j04K15m92M06j87q0L56j50
3637E9R3k11J24N2k15lL51o22N71j97j04K93m44M39k66J80j04J5J56l12K14k57
3659a88L47j87L5q2M6L6j58L68n19M59l93K18Mk62M85j85J92k54J53k07J82j25
3681c5J51j04o1J86l99M53m51M37k77K0L28m26N95m25j7J83r7j26J60J61k57R2
3703I1n3lm27M31J64k00Q8j68R1LJ31r2K7m8j51K17j44P6J01n0j59J59k17J51
3727A8Q1l89L78l54M18j56j68L28l13Q1Q6o1q8J56q8K7R6l12L06l11L60l22K68
$$ y = [-27, 121, -50, 202, -133, -95, 252, -54, -173, 70, -272, 343, -178, 10, 79, -336, 214, -358, 76, -65, -77, 118, -85, 118, -76, -20, -78, -20, -83, 31, -127, 150, -11, -207, 122, -387, 8, -84, 104, 258, -307, 384, -121, 240, -92, -101, -40, 53, -91, 200, -90, -67, 114, -414, 125, -165, -111, 95, -9, 206, -286, 120, -67, -147, 209, 59, 152, -59, 65, 117, -98, -101, 250, -372, 199, 2, -102, 191, -253, 186, -80, 100, -4, 11, 167, -145, 69, -188, 159, -28, 7, -75, -29, 7, -151, 217, -302, 157, -236, -18, -14, -276, 209, 24, 216, -38, 115, -92, 90, -35, 116, 12, -49, 137, -262, 191, -260, 177, -100, -80, 248, -178, 417, -8, -25, 158, 61, -65, 95, 256, -1, 91, 38, 35, -392, 39, 203, 3, 91, -77, 14, 17, 148, 56, 83, 35, -116, 101, -43, 33, 134, 84, -75, 84, -133, 18, 99, -290, 88, -266, 152, -4, -172, 156, -157, -76, 10, -51, -139, 17, -71, -44, 52, -260, 46, -265, 95, -227, 41]
3750D1P0k42J90k30K89q0j74K51J0k34M5J30m4K92l85K04j07J42l64J48L17n80
3772c11O36m10J68k46J06K40k03J49k52K73l46K83qj65M7Q0J0j18K36k60N5J04
3794F8m2R9m29L14n5K74m18K76n7J05m5k12L54m76L03k12K52j83J01J05k06K40
3816A56k92J22k36M9K23J46k57J23O9l49L77l83L7K27n6J87k83N06o48K97r1K21
3838A45o1j31r1K5J03p2L83m98K39l2kJ00k69L00l13K07R8k01Q6J22p2j17K00
3861A49j63J62j71Q7o7P6%k23M73m51L30j64M5K13l89L65n05K70o7P0L5r4J68
3884A49j75j31k1L83l54L13l16L55m1m01N08n35M81l08M4J43k52J58N9J2o6J23
3906A28m16L89j05J2k7k12L34k80K55j32Q6L06m71J9Q2M7j12L47k79K07n0j78
$$ y = [41, 111, -131, 59, -171, 118, 38, -136, 115, 125, -109, -64, 66, 22, 314, -71, 133, 26, 168, -196, -48, 269, -311, 325, -85, 83, -163, -57, 183, -20, 129, -123, 150, -196, 87, 79, -86, -39, 41, 51, -67, 169, -91, -36, 68, 26, 125, -304, 10, -45, 229, -189, 87, 30, 135, 90, -122, 232, -244, 59, -153, 99, -84, 17, 122, -84, 156, -136, -14, -250, -201, 22, 168, -89, 34, 103, -246, 131, -252, -215, 12, -44, 143, -140, 366, -282, 15, -76, 145, 84, -47, -138, -113, -10, -82, 301, -197, 42, 10, 8, 108, -161, 139, -174, 33, 131, -70, 16, 138, 66, -51, 149, -14, 148, -23, 64, -3, 73, 73, -150, 323, -128, 202, 38, 83, 296, -93, 272, -233, 37, -30, 40, 75, -19, 149, -26, -157, -178, 205, -149, 164, -152, 203, 162, -239, 269, -266, 215, -93, -49, 94, -158, 0, 59, 71, 5, 128, -288, 101, -4, 8, -19, -231, 103, -177, 78, -54, 32, 338, -133, -114, -32, 15, -97, 250, -29, 178, 128, -50]
3928e0J6j79L50m41M78k47J77J40m90L92l23K94k36K7n3K06j63J52k10J86R0m12
3950b96N95m60J57o5PK13l67M55k59j48K61j86J26q1j6R9J7k33M95m82J20K28
3972A80j92K38n33M39l13J22M10l99L2Q6J35k19J61k34K84k79J53jm28N61m47
3993b44N01k32k11K45l02N32m04J40l8J04o7j30J18p2J38j87J64k13L54k08Km4
4015e4J9%p1K91k48K38k6q9n1N1j44j2j2L1L1oR9j36P3K11m45M96l95K02J1j57
4041i3J95M0j34J0K5k38K21p2K03k84n3K31l56O51p20M68k79l3M06l28L81l12
4063g1J59j37R2k62M20m46J87n8k02L72k35M11j38k56L37n71O41m32K83j21M6
4084A9P1k60J08l2J35j38K54j34K11l57K67K80n46L12j53O6l04K3M24k05K2Jq
$$ y = [-50, -34, -213, 137, -304, 174, -73, 104, 244, -246, 146, -177, 117, -119, -92, -145, 61, -102, 50, -160, 26, 116, -296, 299, -161, -4, -69, -62, 151, -216, 239, -20, -168, 93, -93, 33, -48, -64, 35, 52, -181, 314, -168, -48, 180, -12, 226, -307, 132, -181, -59, 351, -48, -16, 70, 205, -14, 147, -87, 197, -82, 71, 70, -358, 203, -244, 257, 25, -186, 59, -243, 289, -115, 25, -13, 91, 24, -106, 12, -60, 78, -109, 55, -158, 196, -12, -10, -54, -35, -35, -106, 185, -63, 175, 149, 60, 9, 60, -84, -96, -108, -77, -46, -52, 47, -89, -16, 195, -250, 246, -149, 53, 64, -93, 102, 142, 8, 18, 43, -195, 26, -46, 157, -127, -180, 51, -305, 346, -374, 94, -185, -218, 188, -140, 241, -71, 88, -49, 43, -219, 201, -245, -58, -116, -318, 54, -181, 230, 92, -164, 173, -398, 243, -189, 94, -27, 19, 90, -170, -62, -94, 41, -97, 157, 23, 234, -123, 144, 424, -122, 190, 37, 103, -201, -178, 246, 41, 63, 64, 56]
4107E6j09J32o1R2j76K48l7k78L46k23J88k83J5L09k55J39k70L9M5K41k03K20
4129A75j19j04n3L4K94l09J44j39JP2j82L24j88O6q8j12O4j1K61l69O03j82j18
4152F4n9J66m21J33J43q5K29l13L70m74L08K00k92L08k18j00N1N5r1O1k10K07
4174C2N5k18M51n65M61l54j95M24l17M16l56M03k57J07m8j19j68K49l5k2Nr8K58
4197A09k06J61j25k5K10j81J65k22o2L17l35K15k94K10K45q6l26K08p1jP1j94
4219b17M24l59N29m58J34l6j4K88j35j49p1J65m6O7k30J63j45K51j33m4K98o00
4241c18N70k27l4K16l40M11m11K20j82J83m9J11m3j13R3j39K35j47PJ92l67L02
4263A70l91K94Pj39j8kJ63j07m5n2J04j18L17k78j60K43Q3Q3l32J79j74K30J4
$$ y = [56, -53, 79, 18, 110, -66, 182, 145, -133, 213, -10, 178, -105, -90, 219, -36, 103, -167, -128, -83, 158, -45, 175, 56, -48, -101, -67, 227, -82, 62, -77, -76, -4, -186, 138, -50, 16, -72, -184, -120, -131, 130, -239, 364, 182, 64, 5, 171, -250, -117, 26, -59, 170, -143, 227, -247, 61, 261, -31, 277, 59, -41, 10, 65, -26, 35, -175, 32, 87, -131, 320, -245, 216, -138, -333, 91, -226, 190, -166, 237, -20, 87, 39, -80, -248, 1, -34, -56, -51, -149, 109, -97, 64, -61, -86, 124, -57, 108, -114, -176, 141, -194, 21, -273, -63, 182, 96, -230, -22, -93, -94, -23, -217, 207, -152, 377, -81, 53, 17, 3, 291, 156, 7, -64, 101, 55, 122, -108, 55, -90, 161, 28, -16, 282, -318, 252, 25, -9, 207, -133, 278, -133, 87, -95, 88, 39, 150, 107, -6, 87, -52, 183, 36, 43, 235, -132, 170, -221, 73, 80, -59, -77, -79, 84, -23, -68, -120, -16, -134, 183, -95, -255, -12, 71, 154, -178, 1, -173, 57, 71]
4286G1j16K34k21n9n8K58j46p0J43J59k34j5J66l37L98k04l3J32j00K56j50j8
4308E6r4J59j15k0K8j42Q4P1Lj06J53k12O2L2nJ61k32J94k78K72j16j21pJ2P1
4333i0j04L40j40QnJ01j48p7P8j22L16j14k34R5j62L75k60L00r4j82J75l7j42
4356a23J45J1R9k30K7K35k89M27l80M7J8j71J15J59%q4P2O1k44L2M2O9j6M0j58
4381i6L13l77K07%qm4j19L35k78R1L2J00K10n82L88j37j11P8K87l01oj33J00J35
4405H4k26K03j57J63N0k51J00n4K14mk6j97J46Nj88M2j41J34P6O6J74j29N4k68
4429a30K89j96j30L39q1l7J81j74O8j29k65L94k56L64m7k78J00k01K43M0m1N4
4451A07j1j59QK08l7Oj79J51j18J23r7N9k26M6K85l92J78RL1J29k59N9J20j2J1
$$ y = [71, -45, 189, -32, -91, -149, 109, -37, -107, 36, 195, -39, -54, 112, -225, 173, -31, -64, 68, -32, 224, 74, 56, -38, 121, 6, -14, 14, -128, -44, 27, 30, -76, 77, -135, -73, -41, -46, 115, -117, 77, -201, 71, -45, -166, -173, -161, -90, -194, 146, 6, 14, 9, 110, -38, -115, -37, -159, 157, 43, -191, -96, -258, 117, -143, 157, 63, -119, 56, 19, -123, 22, 33, 132, -98, -71, 164, -125, 302, -78, -31, -13, -184, -69, 90, 90, 6, 78, 139, -105, -73, -31, 38, 22, 62, -96, 217, -160, 47, 47, 39, -5, -124, 211, -67, 24, 56, 156, 366, -216, 172, 35, -76, 2, 289, -12, -18, -151, -51, 84, -142, 61, -96, 67, 117, -134, -34, -88, 126, 122, 96, -101, 45, 50, -138, -96, -237, -103, -27, 39, 213, 84, 138, -130, 159, -37, -167, 172, 91, 54, 235, 61, 129, 0, -265, 129, -127, 237, 190, -88, 12, -189, 54, 94, 53, 107, 96, -63, -55, 153, 116, 122, -57, 94, -24, 99, 2, 61, -165, -119, 166, -226, -48, -39, -8, 121, -138, -79, 41, 29, 40]
4476D0K54l46J33n5j2J41k49K06n3K41k29n3O0j42K24m06K18q8K37j88J45j51
4498g3n8J89l05L86k45J7j41J54L39k90K2lK17j42j64L15k65J7R8m5q3K73j96
4521A7P3j02l1q3j15M12j99R7j03j22O0K96j96p4P7j85L35k42K8L6j1J81j78R8
4545F9k34K49k99K8J09j2K08j41R0j12J40j37j41J64J3P9j51J40q1K2m1nP3k34
4569b04L35k43K39k33K60k08j26J81JL9j83J43j37J45j0O9M6k35L11k02R5k6J3
4592G0o0l4J38j87O6M4J23j89P0j90O3J41k22K07k76K98Mj27J18k10J82m7J00
4615H2k66j2J94j73K10j40L3J80j07j32M12l04N0L3J51p8l24K36r6p3J11p9M8
4638d4L4j24O9J06k80K92k66J46ko5J48l53M38q6J01PP8o3l55N8J14J39J08nl28
$$ y = [40, 294, -52, 81, 26, 14, 155, -94, 112, 59, 300, 71, 18, 78, -64, 160, -246, -28, -116, 121, -67, 78, -73, -131, 58, -247, 139, -106, -89, -230, -76, 263, -27, -5, -8, 209, 67, -97, 218, -47, -30, 68, 23, -60, 213, 17, 90, -12, -43, -126, -241, 171, -28, 69, -34, -156, -96, 200, 4, -70, 7, -178, 157, -85, -57, -21, -32, 149, -29, 69, -165, 84, -215, -187, -78, -90, 118, -23, 67, -45, 95, -42, -183, -19, -6, 73, -78, 62, -19, 3, -38, -43, 30, -204, 131, -112, 127, -106, 154, -54, -180, 1, 2, 41, -142, 1, -136, 9, -1, 68, 114, -121, 190, -12, 83, 57, 70, 10, -24, 114, -73, -7, 37, 160, -29, 41, -149, -86, 55, -167, 40, -236, 62, 66, -61, 57, -153, 29, -18, 82, -184, -196, -2, -175, 35, -105, -72, 108, 1, -131, 281, -23, 27, 60, 211, 133, -191, 45, -51, -124, -13, -92, -44, -10, -134, -65, 41, -239, 53, -213, -67, -69, -134, 14, -339, 99, 13, 114, 121, 199, 136, -219, -161, -47, 92, 200, 195, -133]
4663a33J19P4j84K18n5J4k50J97J48m72K88O8K2k6j00O7N8j53J81q3j18K82k47
4686h5J30q4m3R4p8K50k70J33j29J73l0n6J52k26j7PK78j79N6m8O8K2j07m7l2
4711f8K65l65J86k3j67J80k9P8j37qR0M4nr0j02J86n7l6O7j48J38J33K2q2p4J37
4737A35l06J41P6j74k8J93mp2J61r8J06j68m5R3N6k2n1K03j00n6p0J12jq6R7P
4763I9p8j54J60j28J16j03J35K2j74K86j5j76j3J09n3j50L13p3j51j74J0R1J12
4786A1j05J12j54K47j33j3P3K9j21J58j17K27k83k9K1R8J7j52J73j87J32o3l0
4809h9n7J32p3K14j85n0J87p2K06k17M5plQ8k11M4P4J04j57P1n3J13j10q3j29
4834b18J55Q2q4K55j05j6r5N8L3r4J21q1L7j0n4j86J52J4r2R2J16J52k03O8j05
$$ y = [-133, -14, 60, -124, 94, 39, 53, -197, 0, 148, -324, -36, 32, 54, 28, -72, -5, 53, -100, 81, -2, -120, 162, -85, 45, -39, -82, 12, -66, 184, -86, 47, -82, 91, 61, 5, 157, -69, -86, -79, 199, 20, 76, 28, 96, 118, 11, -36, -68, 197, -168, 18, -5, -172, 8, -21, 57, -80, -88, 2, 46, 41, -49, -151, 35, -22, -58, 9, -139, -1, 132, 154, 72, -2, 135, -171, -30, 46, -128, -156, 37, 33, -39, 122, 24, 130, -38, -83, 10, 66, 44, -7, 196, 96, 40, -30, 82, 81, -5, 92, 99, 21, -133, 27, -101, 15, -88, 47, 69, -105, 181, 166, -10, -23, 86, 33, -117, 196, 123, -28, -202, -192, -101, 11, -94, 18, -136, 111, -22, -35, 38, 67, -54, 104, -13, 214, -69, -98, -77, 21, 38, -114, 59, -128, 4, -59, -89, -146, -14, -87, 127, -58, -108, 79, 7, 213, -4, 41, 34, 31, 119, -92, -48, 26, 130, -27, 44, -9, 104, -6, -89, -218, -63, 19, -65, 190, 85, 69, -26, 32, 65, -29, 92, 11, 48, 38, -16, -202, -50, -36, -128, -36, 80, 232, 29, 97, -8]
4859hJ0M2Kj01J19q6j15K49n1j76Q1K0n4j57K29k05J01K57l09J98lp6K29n5j50
4884iJ81j35k6Qk40K85l8P5j3L6j10l6J02o5L5r2j10J58l9J19j11J38k46N9O1
4909a3k6Q4j33N4p9J71r9r8l1MK68j39k3J15K8j39J16Jq0k5rJ36k85J29J13p4
4935c4J05q0J08j07J87k67K23o6j97J07pr9KJ61j43j7n1m7Q6J31k5j0J52k1j73
4960h2J9p5J19l7k2j21K37J06l9j71j8J2n0K25j60k3j7R1n8n6p2J01K24j57n8
4985h2j37L93k42L4Q1j16K05q3k38K25j5j54K06m2p0R8j54J86k03K45k91K08j1
5008D3j43J85k21L2P3J21k47J49j16J80J01k60J49j18K3J3N4o2j65K31J2R5j81
5031e2Q6J2l6o8l6J92j83Q6L3Q8J0k40L20l24K87k82J54j26K3R2k3Q0j14J52k81
$$ y = [-8, 2, 44, 46, -55, 64, -22, -137, 112, 61, -115, -34, -14, -68, -225, 4, -201, -100, 157, -152, 46, 43, -33, 196, 141, -9, 172, 37, 11, 19, -221, 64, 26, 101, 88, 124, 14, -22, 80, 15, 50, -42, -152, 6, -33, 86, -25, 113, -133, -74, -13, -39, 45, -88, -34, -113, 58, -41, -139, -170, -166, 102, -37, -60, 55, 83, -56, 60, 61, -19, -44, -53, 83, -202, -73, 40, -34, 71, -9, 99, -8, 179, -88, 135, 69, -128, -21, -28, -127, -125, 36, -107, -124, -175, -222, -136, -5, -30, -40, 112, 91, -82, -63, -138, -19, -56, -78, -199, 38, 144, 105, -66, -84, -72, -122, 103, -57, -80, -97, -6, -64, -120, -192, -91, 133, -24, -82, -219, 174, -68, -34, 47, -69, 136, 53, -185, 40, 25, -129, 77, 35, -35, 63, -91, 95, -108, 137, -154, 54, 43, -100, 85, -136, -104, -31, 90, -157, -8, -124, 56, 157, -103, 46, -72, -49, -36, 18, -44, -209, 22, 34, 129, -52, 34, 46, 10, -58, -94, 98, -85, 1, 34, 122, 132, -108, 212, -112, 175, -107, 47, -79, -56, 36, 13, 93, -21, 131, -150]
5056a50L62k97J56n0o6J15j39L05l27Q2n8O4O7j3O1k02J85q1j77J27L7N3L8J22
5080B14m31J93j55K92j71J12J08k16L34l83P4l8J41L0j60J28q5K31k31n5P7j44
5102a35K55j78K08j53J38l16J98K7J15j31j34K41l07K04r0K54j44k4N0l13M07
5123A72j03m3j06K49n1J4rj93Q5k0Q8J5p6k03K06n0Mj2n4K36k86L50k52m4K9j3
5149f7L57j97o7j42J57L9O9q0j50J55j95J53L3j28J1k0K01p2J72j50M7k20J46
5172E2M8j40Q2j0q7J40k68J03n2K07j06%Jj5l1K5j8q1K25j51J07O4l0j40K44k23
5198e4R1j24J2J84o4k19J95k2K10kj64J14j72P6Q4J7j94O5k4j03K0J11J91j29
5222I9j17n4J36m6j13j23J06j0K52j59l1K3K35n1o6n9j1r2r2L73j56Q3j21q4J94
$$ y = [-150, 212, -85, 71, 21, -45, 70, -69, 236, -91, -9, -67, -3, 64, 51, 112, -90, 95, 14, -163, -36, 1, 54, 92, 214, -217, -24, -179, 113, -58, 54, 162, -54, 280, -103, -29, -67, 74, 104, -56, 72, -13, 218, -13, -68, 9, -135, 120, -58, 150, -3, 135, -181, 17, 44, 159, 28, -106, 135, -172, 32, -58, 196, 52, 28, 78, -235, 172, 69, 26, -80, 169, 118, 132, 123, -70, 15, -5, 83, 98, 22, -181, 25, -25, -21, -33, -87, 149, -137, 213, -39, -83, -54, -67, 290, 93, 26, -116, 41, 80, 149, 69, -81, 74, -121, 32, 65, -63, -52, -72, 129, 57, 229, 79, 126, -94, 52, 100, -40, 42, 32, -55, 85, -183, -80, -132, 75, -31, -31, -30, -45, -76, -51, -69, -150, 75, -76, 31, 95, 65, -75, 169, -54, 37, -87, -75, 109, 45, -174, 21, -1, 209, 207, 43, 157, -15, 61, 145, 162, -32, 33, 9, -94, -74, 37, 228, 99, -18, -72, 64, 18, -95, -218, -112, -122, 130, -29, -60, -37, 198, 147, 81, 22, 11, -81, -173, 200, 44, 127, 6, -78, 116]
5247A16k50KJ67o4P6p0o0rJ15j62L47J1j27O3j09L4j96J12n4K09l19J74Q5j48
5271e7P3J4J23L4j44J24j57J5j8l5M6J17j48j17J39LQ6j28L7P0P4k79MK64o0n1
5297B9n4J4m0o7K23j56R4j22L45k19rJ36k18J79m7k19K18j06M3r2m0K04q5p5M4
5322b0J21p8k01K87j55K28k45J31k1m7p3l0K30j45l1L4J03k78L30j55j02J62O8
5345A13Q3m01K43J42o6Q8k25n0l6K45k66J80n0j13R8J58j10k14K81J85l58J57
5367H4j33Ln6MQ1l2M8p8mQ0l8N3O8l29L26j27j19K02j84O0l8K39O8j20j04j75
5393b21J38M2Q1n0N8J08j12m9j67J83j73J50k8n1Q7K3M3J04l66K86j02r2J43L7
5417G2l33L45J04qk14N6j12p5j20L27q1k8K54k01j50K07j13K34j29q1J65p5j92
$$ y = [116, -134, -132, 35, -29, 47, -23, -83, -92, 23, -139, 208, 219, 92, 155, 46, 80, -116, -4, -58, 151, -168, 6, 91, -57, 16, 30, 153, 187, 43, 167, 10, 25, 7, -28, 18, 135, -13, -130, 9, 12, 98, -30, 7, 77, 151, -128, -124, 140, 80, 29, -25, -11, -51, -118, 105, -51, 43, -79, 266, 47, 38, 174, -44, 135, 88, -131, 87, -19, 24, -68, -108, 96, 11, -64, -20, 101, 23, -178, 109, -46, 182, -63, 68, 47, 0, -73, -103, 127, -18, -49, -15, 88, -190, 140, -15, -117, 45, 113, 196, -205, 38, 180, 114, 202, -23, -73, -109, 136, -130, 50, 0, -113, -15, 143, 33, -181, 100, 285, -73, 84, -49, -46, -102, -98, -17, -49, -1, -79, -83, -3, -41, 12, 80, -249, 77, -50, -169, 33, -151, -91, -129, 110, 178, 58, -46, -221, -83, -41, 40, -10, 48, 156, 44, -5, -172, 11, -162, -12, -40, -91, -4, 19, 62, 166, -200, 86, -16, -108, 35, 72, -261, 84, 188, 180, -34, 22, -90, -165, -285, 42, -39, -67, 187, -14, -164, 43, -70, 164, 35, -46, 119, 44, -148]
5440a48J13q1J57M4L6p5j67J18n7J79M0j36o7Q6jp6l8j3O0K1k95M73k34M0j84
5465b05K59n9J40l75J70J90L1j68j7P8k05L33m19J72qo9J02o4J89l1j82N5J49
5488F6k43P2J43o8j3r7K90m0Rp6m7m7Oj82K34J08j67L4J36k66K74k33J49j0Q8
5513A20J7L7J1k49J17j12J09p1l9J7J11r5p0J86j14o2K30J2k09N4K3l1J28k6n
5538H9N8j9l7j07j00N0J78j74p3J98j3j04LP8K3j14q9%O8O1j53J53j5k00K65j51
5564a25L84j66j05n4J38Q0j53l0o8J54j07N8k8N3J41j19q9L8j60N7M0%j58K39
5588B0q1J95j15J16J28k11j54j09R6M9L45j40K2j36k3o3K2J87l49K09j70J52K0
5611A0k4Q3M4k82J25Q6J01m07L01nM5l5j4j79O3J34j00o7K8Q5k2l6j1J43L7Lk99
$$ y = [-148, -35, -116, 41, 85, 121, 46, -121, -3, -60, 119, 159, 23, -44, 42, 41, -35, -73, -86, -26, -5, -300, 173, -61, -21, -205, 54, -5, 135, -240, -70, 120, 151, -17, -34, 44, -161, 172, -247, -75, -83, -152, -50, -114, 75, 44, -138, -83, 66, -177, -105, 38, -30, -43, -140, 150, 110, 119, 43, -4, -51, -45, -227, 7, 115, -52, -18, 118, -148, 126, -107, 42, 32, 120, 137, 174, 185, -64, 53, -59, 50, -21, -60, -43, 68, -27, -97, 89, -25, -87, 143, 155, -54, 0, 23, -8, 120, 94, 89, 147, 128, 91, -16, -116, -66, 112, -62, -135, 63, 50, -54, -51, 27, 50, -64, -153, -153, -85, -24, -177, -24, -39, -239, 26, -125, 259, 93, -12, -66, 72, 152, -1, -31, -99, 55, -52, 6, -22, 31, 172, 53, -36, 2, -158, -101, -61, -61, -219, 20, -61, 134, 19, 135, 263, 52, -102, -211, -115, -66, 279, 139, 161, 25, 2, -61, -39, 148, -201, 8, -162, -10, 10, -14, 69, 113, -169, -44, 42, 143, -264, 37, 32, 77, 42, 28, -151, -88, 46, -54, -121, -93, -8, -30, -66, -77, 66, 103, 106, -193]
5638a93L21L3j61p7j3K3L8J39r2l4M9j14J47k12L5Q8q8M94l37k49L56j66J7J30
5662A34q0k26L14r1O0m5L3j24J5J11o0j64l1J24M1J9l8JL38k79r9j26J36o8K4
5687h1j00K02J1J53k28m4J15N3R2p9j4l18J28J74j16J13j23k16L35n4j1RR7j51
5711e3j39J50N3J3l9l2j3J77j88J60k08J38L8L9j17kk1J21J82q3k0k50J33j7j81
5736a59L46m05J50q7L3K11l2k01K40n5J6Mq8J5nj89J06J78l9k31R8J33j90K62
5760A11j65P5K4M9k35pJ48Lj14K77k80K30k25R6P9j80K56j43j30J32n8O2K48j85
5784F8j02J6N8K3k35Q5K47k02j87K37k5J14j54K90k48o8j3Q3R2o5p2m8KJ31p2
5809d5l3K25j88P6j2J6j55J58J19j71P6j19K35l94J73k41K14J11j64J09r1j2J93
$$ y = [-193, 128, 161, 0, -77, -90, -67, -29, 110, 18, -16, 33, -81, 66, -146, -111, -23, -111, 383, 46, -203, 153, -13, 4, 134, 54, -172, 142, 51, 111, 66, 99, -25, -10, 101, 41, -123, -154, -30, 11, 30, -8, -7, 331, 52, -47, -173, -37, -105, -81, -181, 21, 32, 185, -43, -87, 28, 81, 173, 94, 80, -238, -110, 64, -52, 61, -62, -278, 57, 3, -8, 1, 98, -53, -192, -42, 11, 24, -15, -47, -60, 117, -71, 89, -119, 19, 57, 96, -21, -23, -44, 77, 259, 176, 156, -94, 39, 22, -159, 187, -218, -68, -155, -122, 89, 57, -144, 96, 41, 57, 61, -27, -12, -17, -206, -100, 78, 39, -192, -94, 39, -151, 111, -54, 21, 45, 94, -141, -148, 0, 3, -111, 166, -114, 116, -109, -13, 66, -114, 142, -1, -131, 1, -57, 5, 253, 68, -34, -18, 40, 63, -172, -87, 160, -42, -229, 8, -17, 97, -57, 233, -15, -83, -96, -13, 79, 14, -58, -106, -104, 27, -45, -78, 147, -41, 35, 23, 39, -116, 42, 161, -10, 66, -53, 182, -212, -39, -280, -66, 45, -119, -10, -101, -113, 80]
5832H0O7j76o2K84k24J44l07j01N6K14J59K5j27k02K24R9r1J6l4n6L6j00J17o5
5856b4J85k26J67Mj10M5j45l0J10J61k9k35M8nj3L2K7N0M4j36j2R7J53l23n0J81
5882c4k5o0K49k51O8K41l01J64j56J67q0J47r2q5jR3j18J40k10K32l0p0n5K59
5906A92l22J33R3n4r7l7J76R6o5k60J09r7J22J04J4j08P3k4l4n3J5l2J80j06q5
5931f7K3M7J30k10K3J23J9k26J07p6K43j54J17j30O6L0p1P2j62O6J06O5J8k92
5955a33J02J55o1k28J17j63J92j19N1J38j17J4p6K17l5R4j59l7L8m6K40m6j78
5978d0L1M3j9m6J4m0J0o4J50j12n6J24k9J00j37K15rO2k34J17Mk36L2o4J70kR8
6005H2o3j9q8J72n3K0m1K3nj25j1J15N7r9j90J46j0K14j9k17J33k19L12j09m3
$$ y = [80, 147, -29, -91, 193, -31, 113, -194, -295, -239, -25, 134, 159, 32, -170, 54, 153, 62, 78, 44, -12, 24, -76, 41, -24, 161, -65, 102, 106, -4, 41, -104, -134, -24, 137, 108, -127, -79, -84, -97, -65, -38, 12, 56, -80, -92, 5, 158, -165, -215, -34, -59, -119, 130, -121, -53, 188, -113, 51, -105, 62, -18, 129, 37, -48, -49, 44, -74, 66, -144, 88, 58, -12, -67, 192, -130, 3, 96, 42, -55, -92, 84, 180, 115, -145, -36, -133, -11, 93, 107, -1, 72, 48, 14, -39, -24, -56, 124, 18, -67, -44, 3, 133, -77, -54, 69, 88, -138, -31, -107, 136, -18, 99, -31, 35, 65, -6, 66, -96, -30, 76, 141, 159, -133, -31, 124, 63, -165, -48, -211, -19, -138, -87, 51, -66, -52, -128, 89, 54, 148, -11, -48, -10, -56, 184, 138, -40, -9, 34, 15, -31, -17, -57, -47, -111, 39, -73, -129, -5, -34, 66, -71, 144, 135, 197, -37, 80, 84, -152, -120, -184, -14, -16, 82, 19, 0, -88, 84, 31, 51, 10, 33, 28, -97, -108, 7, 64, -35, -225, -79, -89, 125, 106, -111, 22, -197, 115, 6, -37]
6030c7L16l26P9P5j43J11p3j50J27Mn6K1Q3j06j1P9M0K5k69L99k57R6m4N3P2k29
6056a21K65q2r1P4r1l5P2J41m2j79L4r5L25l94K49p7j9JL3p5M1R6J57j82k01K47
6082E1j6J95k0k59p8J20LL2j06%R4o4p7J14p0l5J86P4k43o2K01j10L2O3L0k40
6108a85K30P1k07J40j95j4N0k0r9J81NJ02j47J34q1J24j04J06l8j50k21M83k28
6131f3L4p6Q7J4p8K31j91J97j94l1KJ55j34l4K06l0o7p6J20Mm8q4J85k6k39J68
6157C2P5k34j5J36j2J74J4k28K34k82o6K21O1r9L4o1K09j29n2j87K13k1R9J0k19
6182i3J45j07J33j11J09M9j27J3J10j72J27o3Q5k25J63j44K26j13p7P2r3R0Qq5
6206h0K08j21l9M7r1M1m1Q7q8K35k34K29j18K6j32Q1J21p6j91J75J04l18q9J32
$$ y = [-37, 279, -47, 32, 107, -36, 75, 2, -148, -21, -17, -73, -52, 31, -75, -86, -7, 33, 58, -211, 188, -69, 27, -17, 36, 108, -121, 144, 62, -29, 45, -46, -81, -9, 132, 90, -89, -55, -150, 175, -219, 30, -47, -66, -65, -32, -107, -66, 30, 187, 5, -196, 51, 35, 230, 210, -49, -127, -7, -4, 28, -78, -78, 16, -48, -125, -11, -81, -116, 70, 144, -99, -161, 40, -70, -38, 25, 55, -185, 45, 116, -91, 49, -146, -160, -110, -130, -229, -48, -43, 59, -88, 46, -35, 89, -15, 91, 53, -97, -318, 165, -63, -29, -105, -18, -4, -82, 149, -42, 155, -39, -70, -68, 87, -47, -81, 125, 95, 28, -48, 72, 76, 28, -56, 129, 103, -136, 32, 107, -127, -142, -6, -18, 156, 170, -58, 176, -106, -172, 49, 110, 11, 45, -16, 193, 64, 12, -175, 38, 17, 116, 126, -93, 52, -55, 78, -33, 76, 125, -2, 11, 121, -51, 76, 13, 98, -127, 36, -108, 118, 5, -72, 0, -93, -3, 5, -80, 128, 7, -32, 15, -76, -35, -76, 11, -77, 158, -76, 153, 35, 61, -71, 10, 131, 55, -136, 39, 143, -175, -264, -132]
6230a32K66j29J35k62L34l16J29o9O6K4k16K49k67J32L0K43mk34j52R6J03j00
6252g4o8Q3J97j46l4K11j98J18r0N0qop2q9J30o6P9R8j74q6K03m6q2pK45k77J49
6279D0K08k52J50j04J29j3o7p3m8J08p6q0P1P0l1R9q7LJ96k92O4J0M8k59j7P8
6305a25J67J8n9p1q6J66o6P9m7q1J55J3q1j9k57K60J15j28J15J09L0j58J4M8O3
6330A74k36J24p1J9n3n9J3l2j0K32j22Q4q1J6r0K19l47K66j16J67j15l3PJ4NO9
6356D4O5j89J03J5j65NK51j52j38Q8J83j47J94p9k36LL3K06R1k72J00Kn0J12j26
6381e9P5L8n0L6k8P3kj02J06kj29K1L5j59K04N2k6j41j44J79n0J02O1k17J93j19
6407e3RJ89j61kL3r8P9N2nj07j15L34m8j94j18J22J25j71R7J68J00j12n9k20L3
$$ y = [-132, 134, 5, 140, -122, 212, -104, 25, -44, 22, 46, -170, 79, -188, -56, -26, 217, 213, -21, -173, -77, 26, -74, -142, -59, 138, -8, -42, 169, -29, 89, -1, 49, 41, 35, -37, -126, 4, -62, 17, 115, -59, -145, 58, 12, -70, -77, 168, -109, 40, 248, -4, 146, 42, 171, 158, 91, 18, -30, 78, 2, -78, -7, 63, 32, 131, 44, 47, 243, -49, 15, 25, 73, -186, -203, -125, 42, 60, 1, -70, -156, 10, -56, 23, -24, -105, 50, 63, -18, -37, -294, -34, 81, -47, 68, 177, 207, 49, 63, 111, 174, -62, 62, -9, 10, -43, -102, -89, -121, -131, 101, -21, 63, -18, -2, -92, 127, -220, 46, -70, 97, -18, -51, -44, -30, -25, 44, 109, -80, 23, 38, -127, -122, 129, -23, -161, -73, 110, -37, 157, 78, -158, -155, -122, 84, 175, -97, 3, 5, -45, 67, -59, 16, 54, 4, 40, 12, 85, 83, -19, 87, 85, -44, -23, 12, -147, 57, 109, 83, -58, -202, -23, -73, 29, 90, -127, 66, -53, -44, 145, -16, -18, 15, -83, -4, 48, 43, -64, -179, 155, 107, -87, -205, -83, 42, -129, -32, 136, 236, 124, 65, -155, -122]
6432a22L0R8j96J59J26Pj01j19J38j8j20J89J31k55LQ0r6J93P5k90K04k29K29
6455A16j04r1O3N1r6rj02K80k92N3J58N0j12LK72k93m4J66p4Qn3m3K1Q5J08K1
6481A42M3j33l8O8k44m6pL20k00K4N8j34P4J06j96L18j96J87m8j96O3J34k21J98
6505G6n4K6n0N9k7Q5j85J15j28r8K03m9J88k42K66j67m2J6J25m2J1j65M4L4k42
6530b43K31O7j82MJ55o3J83J53j31j89LM8o9M0j37J42o5J06j2J77l22J18Q6j49
6554d9K15l86J49L4K42j78N5P2j65o4K06k31J03J72l16K35M4j08n5P1n4K18l47
6577a37N0PL1Q0L9j3j89K52j64qK29j21k20K62k85K58j5p6k6j81J48k2O1m5M6
6602c9J85j41j58J73J1j55K94j19j6m2R0j87J63J7k06O4R5L2p9J3r7O6NJ75j70
$$ y = [-122, -92, 6, -190, -31, 95, 102, 1, -118, 20, 2, -118, 71, 202, -53, -50, 30, -66, 127, 202, -88, 116, -113, 116, 12, -79, -16, 35, -61, -70, -172, 108, -184, -131, 27, 77, -35, -32, 240, -53, -97, 69, -5, 3, -50, -93, -72, 13, 121, 142, 185, 52, 14, 82, -162, -208, -215, 105, -95, -71, -13, -147, -73, 33, -163, 155, -41, 146, 98, -98, -35, 99, -122, 76, 22, 48, -2, 57, 30, 115, -70, 45, -83, -181, 22, -27, 161, -81, 185, 18, -24, -8, 117, 75, 86, -79, -35, -1, -243, -12, 55, -127, -123, 32, -31, 152, 305, 174, -15, -12, 36, -33, 7, -130, 12, -53, 53, 41, 218, -104, 14, 100, -49, 166, -220, -71, -37, 205, 27, 82, 154, -11, -75, 131, -100, 3, 175, -141, 94, 138, 30, -25, 46, -8, 210, -137, -87, -80, -49, 31, 70, 57, -132, 120, -44, -52, 177, 56, -164, 98, -187, 71, 56, -20, -46, -227, -79, -101, -40, -85, -39, 146, 5, -153, 20, 31, -124, 170, 51, 35, -7, 83, -104, 59, 76, -130, -66, 29, 61, -18, -5, -102, -36, -31, 144, -26]
6627b6l0L0J0J98l25O2J89j45R3j90K51P3j91m2J76k45L37j86j87J31Q1k06M8
6650i4J53j99O0m4J13j30K41J00j40j8j05O7j51L25j02n7q9J14j90K05o8o8K61
6673A84k2j6j25o4K1%J08j86pQ4J10q8j04MP0P2q4L6n4Q1o7J20r7J74j51o1K10
6700A48j9j56j01J08J98Qk18J13k26Q1J70j12j26J52J04j92K1M2J77n9j84kK17
6723A44q5M4J59k70J4J03j49O2k0J27l08L03j53l1m3J28k8o4K37j62J07k08Q8
6746eJ9M6j53J74j44J46k12J16P4o4J2J05l7l6j66R7l5p0O5J01Qr8LJ07j15K13
6772A51j81P0j99P1P0r5n0J69M5J44j17L0m5k0j79K82m9j43K01n2j29j1Q5J04
6796A52k30J45l4l1P5q2j1q0k6Q8l4PM2K5o4m2k6K14jl9r3kO1p7K07j88K2m6j43
$$ y = [-26, -56, -26, -16, 182, -143, -81, 108, -37, 56, -134, 117, 190, -1, -43, 133, -112, 225, 39, -148, -17, 64, -142, -94, 59, -140, -80, -124, -11, -141, 100, 200, 60, 42, -63, 4, -147, 178, 76, 19, -70, 44, -146, 59, -9, -77, 184, 162, 146, 21, -43, -22, -22, 86, -100, -107, -23, 87, -1, -105, -101, -31, 41, -43, -7, -61, 20, -47, 73, -24, 150, -1, -62, 148, 129, -27, -128, -20, 178, 186, -32, 81, -145, -64, 106, -6, -132, 20, 124, -68, -47, -5, 172, 113, -71, -73, 144, 59, 103, 262, -8, 6, 109, -40, 22, 2, 129, -179, 124, -29, -60, -103, 25, -3, -67, 170, 8, 115, -93, -5, 14, 60, -93, 81, -63, 83, -129, -13, 61, -3, 9, 114, 77, 41, -125, -28, -63, -133, -68, 33, 41, -57, -54, 53, -62, 151, -30, 40, -159, -88, -18, -113, -163, 6, 51, 195, 78, 108, 63, 43, -136, 146, 97, -46, 155, 103, -26, -37, 48, 152, -78, 67, 33, 2, 77, -5, -16, -96, -122, -34, -68, -61, -19, 6, -58, -100, -126, 88, 87, 48, -45, -47, 14, -63, 144, -44, -22, -68, -211]
6825b11L26j29LO8o4l5J55q1j29J82l1j03j67K82Pk13K01l3l9mj18P7M0r7J46
6850C3j2j60K29rk56K58L5J86k24p5O2j36Oj20K77j50R5J4j39J29k60K77k65K06
6874Aj09P8J23k5N9j20J08l05J45LN3J76j68j19J66Q3k53m2j80L46j85K36R9q6
6898H4j0j45m5L45j94k46K98k08K38m4k5k11L61j16M3j40r1J37j56J83j61R9J3
6921IJ5j87L84q4k37J81o6O7p7K41r2j58R4k2j93K99k77L22j86r4J1L0J32j19
6945gN0N8j69OO3K8n0k7J45j97J10Lj61J46K5o4%oJ18N5l16K8L13k21J09l7K0
6972B2l9R2j6j5p0Q4j78K85j32q9J80p3p3J14j53J21n8J41J2m18K92K2j3j32l2
6997a26OK61j27PJ4J9pj17J75k95J53p2r1J88J43O0k82j25J60J17k66M60j77j20
$$ y = [-211, 115, -14, -11, 57, -7, -42, 113, 32, -97, 85, 54, -49, -216, 66, 73, -140, 61, 28, -11, -15, -133, -56, -16, -113, 33, 21, -139, 90, 81, -175, 83, 118, 304, 80, 5, 67, -69, -63, -183, 94, -56, 39, 53, -86, 43, -217, 60, -205, 1, -108, -30, 93, 68, 127, 7, 115, -190, -45, -42, 11, 187, 19, -100, 66, 149, -104, -146, -326, 20, -165, 71, 170, 84, 74, -71, -116, 229, 35, -211, 87, -121, 117, 73, 48, -163, 198, 82, 125, -15, -106, 31, -125, 58, -103, -4, 9, 24, -163, 221, 137, -100, 81, 15, 82, 5, 246, 154, -4, 90, 68, -125, 174, -103, 219, 33, -61, -50, -20, 112, -7, 43, 101, -68, -62, 1, 29, -21, -48, 97, -100, 10, 13, -148, -2, 23, -41, -41, -47, 71, 126, -190, -162, 151, -70, 39, 2, 22, -17, 75, 59, 44, -26, 58, -120, 165, 33, -56, 124, 51, -22, 92, -61, 60, 2, 143, 155, -263, 29, 51, 38, -94, -126, -120, 141, 14, 21, 35, 54, 47, -70, 105, -190, -37, -109, -200, -12, 131, 191, -91, -216, -56, 61, -205, 255, 78, -42]
7021d2J42Q9l67K55j65J33Q8l11K97m21M67j57K06k95j1J97n8n6k1n4Q1J25j17
7044EQ1opM6j81Rj13j61L91lr1j3rK39k28J39j41M1j70J98r6J75K2j44m7P7J25
7071A38j98j3n6L84j84j07K43j61p8r9j66J54J18N1j80K20p8l9pj1J03J40k76
7094a02Q6l3l0pK6K26k75j12N33m68J21pQ5k7N5q2R6p7J3O2j30nQ7R2O4p4k81
7121a64J31j40K0K90j22r3j20K03O3j77J6j2O9J96k50J36J37j15j03Nj27O2J06
7144A1J36K2Q7k87nM2Q8j32K1LJ54k48lK34L1m8j46J38j82K67O2j89J11k92q5
7169b10K77k63J47J5M4M2j99K05l07L17o7K3k14K35r9O9L5n2J42j30mKJ33k04
7193f3J74j01K9j22m5j8J29m3J41o8j1j06j9l0J86r9J21j00l7O6l6M3L2l7o3J29
$$ y = [-42, 100, 189, -178, 77, -88, 45, 133, -178, 119, -302, 165, 8, 214, -81, -92, 105, 47, -9, -30, -84, -3, 122, 5, 86, 80, 73, 119, -62, -53, -166, -327, 64, 61, -30, -43, -52, 187, -41, 98, -43, -2, -172, 26, -70, 105, 127, -17, -64, 13, 138, -60, -73, -129, 255, 71, -36, 207, 46, -32, -131, -297, -143, -25, 26, -154, 66, -12, -51, -58, -69, 34, 174, -102, -16, -49, -79, -86, -60, 166, -109, -221, 312, -156, -35, -42, 43, 16, 71, -11, 85, 8, 21, 83, -47, -52, 35, 127, 191, 117, -164, -33, -173, -153, 137, 15, -78, -198, 5, 68, -109, -93, -105, -36, 160, -90, 46, 183, 68, -35, -30, -157, -95, 11, 147, 169, 256, -31, -36, 6, 94, -38, -17, -14, 140, -108, -111, 123, 154, 106, -40, 98, -84, 183, 245, 56, 167, -125, -210, 67, -196, -49, -34, 10, 52, -147, 58, -249, 68, 1, 24, -190, 45, -54, 15, 50, -2, 140, 10, 6, 8, 141, -63, 111, 10, 39, -83, -128, -146, -17, -60, 81, 13, 2, -104, -123, -153, 33, -66, 55, -45, -82, -16, -52, -9, 23, -14, -77, 52]
7219E2j70R6L3n0J25r5j10J06J1q8K46k16J81l69J92J94k48K02l7q8m5J32nj10
7243f1j74K98k08J57m6J08j7L5rK9j82J24q1l9N8P2J6j41o0p6J04P6j18L2J69
7268F6lj90o5M06l53J2P8m2J60k5q0R7J34k49M2L3j28r3J91J33o3j12O1J19j19
7293A0M1K6j22o7Q9j1N6J86k80M1K9k8J39o2l0j90L43k10L2P5l00L93k25J67j15
7318a3J30k39J73P8n2o2J1m6M6Q3j14M1jj07l0J64K0Q1k30M19l30o2M7K3k4J6
7344B2j10L6M17j92j65p5m1J84n4p1J04q8J27p1J9nj21P4K23j76O8q6P1O3p9r2
7370a8j71K11R2m7k07J22J72k15J21k0q6K1K36k68q0J86p9Pp1L4k0L0J62r4J18
7395A36k16J0J80r9o4K7qMk62K21MJ33j53O1M6q5l3J88j17J03Pj94J84j13J6p3
$$ y = [52, -118, -22, 11, -39, 86, -9, -119, -13, -2, -90, 156, -60, 121, -248, -56, 138, -110, 92, 55, -33, -78, 54, 49, -61, -235, 63, -145, 12, -34, 74, 57, 92, 83, 112, -70, 54, -27, -66, -8, 64, 80, -61, -121, -197, -93, -17, -135, -103, 66, 63, -127, -192, 214, -139, -127, -49, -91, 69, 44, -36, 61, 195, -54, -12, 21, -107, -200, -9, 124, 61, -51, 10, 129, 10, 51, 77, -45, -112, -23, -34, 22, 208, -72, -31, -2, -30, 109, 47, 17, -173, 170, -40, -8, 67, -233, 160, -65, 102, -13, 117, -122, 51, 129, 77, 15, 26, -20, 26, 109, -5, 36, 35, -72, -102, 62, 82, 163, -67, 352, 22, -40, 7, 30, 6, 22, -88, -52, 365, 173, 8, -67, -108, 76, 22, -49, 55, -33, 94, 23, 42, 37, -84, -10, 213, 37, 105, 19, 90, 153, 74, -18, -189, 22, 114, 67, -140, -18, 154, -61, 60, 40, -46, -25, 211, -57, -137, 49, -30, -23, -94, -60, -80, -50, 112, 18, 136, -80, -70, 110, 11, -53, -26, -34, -30, -292, -71, -67, 66, -87, -26, 20, -65, -98, 90, -27, 76, 83, -111, 73, -40, -24, -97]
7421i7k1k7P5J57j35L44k99j19J43p8J37P2j18j49J57J16k26K2p5l5K16J09k00
7444c1l2j16J35K33j04j3r6N3j41J65j82J45m8J08J32j76q4J83j84K1Q4o7L7j31
7468a09P4k6r0J59J11k14Q7N3r3J7q1J22m9J26j99J45j94R7L6J7K3j4LRJ10K8
7494A48j47N9m1K05j23R0j99mj13Q9J20Pj44O6M9M1l17K57k05J26P9j63K20j22
7518b2o1Q8P1j8J17l34J31L5J29q1KK2Q3Qj71J71k22l0m6K49R1k83J65j06J29
7543A17N7o0k58J51R5n5k01J82L0P2j44m0O3Q6q5J93k59l5j79K07K92m49J15K59
7567A54l4j79K94l42J72p5J48k11J28L7J4N4j42r5k7J5JmJ50k1l6L8r9P2J57o3
7593A06j71J98k10o0J38K6J29j99o6RK31r4K9p2m6K72j38j74Q9k8J9J02j01K0
$$ y = [-97, -118, -145, -70, 87, -48, 296, -3, -122, 21, -57, 80, 152, 34, -115, 42, 158, -68, -46, -121, -156, 60, 169, -31, -63, -179, -44, 189, 85, 72, -24, 29, -112, 53, -129, 16, -32, 76, 208, 32, -52, 131, -53, -32, 52, -15, 22, -109, -35, -61, -151, 8, 119, -95, -8, 45, -48, -31, -112, 10, -39, 87, -112, 33, -161, -64, -28, -11, 12, -2, 1, 10, 120, 148, 1, 60, 19, 224, 101, 191, -8, -12, -125, -36, 84, 91, -53, 13, 62, 103, -214, 43, -162, -36, 43, -120, 100, -22, -83, 5, 76, 58, 175, -159, -28, 7, 136, 55, 57, 79, 162, 170, -1, 170, -52, -82, -128, 121, 212, -71, 94, -12, 117, 174, 114, -144, 7, 102, 47, -154, 28, 58, 130, -14, -54, 9, 95, 10, 203, -56, -91, -270, -63, 229, -220, -105, 154, 120, -59, 235, -107, 65, -10, 138, -73, 55, 92, 106, 160, 18, -77, -104, -89, -88, -92, 58, 37, 1, 39, -60, 12, 169, 106, -65, 133, -77, -137, 1, 27, 156, -43, -109, -100, 131, 37, 66, -6, -52, 220, 82, -92, -3, -31, -12, 90, -11, 9]
7617Ipo5R9L7N8k59K23j92J16O7p7j30N1Q1l3O4q9P2j46J56J57j85J17q8j34K4
7643g4K92k14p6J09Op9J35r4M9j37K51r5l1j91J98O4L9k6l14K47K1O1k76J32k02
7668b05M07k95J96j49J33j10Pj57K20k40J58PQ8j97J29j38K71k20J75N0j10K15
7690B35j60j38O8j33n9R0L07k87M0j48J75K5j88J23J00Ol15K34O0r0k5O2R3j6
7714E9j99K19m4J27k84O2j13K09Q9Jj40P5K8q2l5j16R0m2Q0K34k27j74L26j46
7738cK08j84J65k38j0N7J48m3k8k4K2p0J8O1j47J06o1J21o4j46L61k60M1j6P3
7763H7r4r4J18j86K04J55j78n2j4L9l4J43j42J24k27J18O0m0K44j75j51j21K10
7786fJ13l4N7r2j20J62n5l4m0q3J1P7k3l2N7J78j60p3J36j53J47j3J18p6J8j29
$$ y = [9, 2, -63, 36, 73, 131, -128, 95, -97, 19, 86, 9, -121, -70, 11, -22, 42, -47, 25, -121, 35, 192, 7, 124, 36, -98, -74, 218, 4, -72, 37, 43, -36, 99, 5, 54, -83, 168, 73, 42, -149, 49, 113, 152, 126, -188, 59, 80, 141, -135, -3, -205, 202, -93, 103, -46, 87, -23, -16, -173, 47, -193, -35, -28, 60, -137, -8, -146, 125, -95, 80, 130, 20, 235, 75, -63, 5, -128, -187, -97, 210, -77, -37, -185, -10, 15, -173, -50, 50, 56, -259, -25, 35, -55, -80, -18, 75, 59, -140, 79, 35, 162, -122, -60, -173, 36, 125, 126, -14, 61, 89, 7, -28, -144, -54, -96, -16, 218, -9, -183, 143, -3, 205, 21, 186, -52, -62, -5, 143, 100, 72, 48, 70, 0, 18, 79, -68, 38, -23, 98, 34, -112, 249, -11, 30, 14, 87, -7, -101, 17, -169, 35, 190, 12, -40, -54, -15, -49, 94, -48, 76, -151, -33, 27, -13, 231, 56, -95, -216, -6, 107, 73, 130, 38, -82, 80, 25, -9, -49, -132, -121, -44, -67, -99, -42, 136, -24, -97, 39, -114, 33, 20, 138, 62, 80, -49]
7812d9N7q2K90j16K1k71K30j56J01j10l9Q9m2J20j73M5K28N5j62J22l89J01OP8
7836d6j17R4J2J29j95K62r0p4l8R9R4p2J52k67p6J55O2l56M13j48L2J24l3k3n4
7861C9k60J49R4L1J3mJ27j83p3J96j98J2j32qJ28N3j67K78j10J56M7n4k7j52J3
7886c2j01L7K5J60M1r5jJ59m2k07j87J99J93j75p9J28q2J44m9J2j4j15P9j01K85
7911A82j60O7m5j90M7m3J85k13lO9J09j05J78n8J01q9l8P6m2J03j48J38j07m7
7935c3P4j40N5K3Q4N4j15j47MJ12R7j17J79j16m8J50j66N1J01N3j15j0j91K39
7959G8P4r0N9k56Q2J33J60j88R0J5k28J50k52K19n5K5l3J23J0k44J27L8n3n4J87
7984A17n4L8j40R7j53J38K1k0o1k0o0k5O1j8K20l28O8J64j6K8O3k4j3m7N0o4n4
$$ y = [-49, 8, -74, 216, 100, 121, -150, 80, -76, 25, -85, -124, -35, -77, 43, -130, -85, 143, 198, 36, 158, -231, -130, -124, -46, -163, -69, -57, 72, -123, 139, 49, -25, -63, 36, 130, 58, 210, -57, -133, 22, 84, -272, 141, -7, 25, 149, 116, 93, 39, -221, -72, 22, 53, 66, 62, 189, 6, -67, 129, -69, -57, -189, -197, -69, -16, -183, 95, -15, 141, 188, 134, 107, -45, -32, -133, -96, -71, 89, 130, 35, 34, 193, 151, -56, -243, -44, 149, -26, -105, 23, -59, 85, 36, 48, 34, -81, -2, -103, 182, 22, 89, 44, -146, -99, -142, 43, -170, -173, -104, 5, -100, 78, 20, 121, 32, -6, 70, 28, 131, -17, 121, 14, -33, 41, -99, -44, -21, 63, 117, 2, -145, -141, -29, 68, -49, 130, 14, -34, 116, -50, 1, 102, 155, 40, 30, -161, 78, 152, 62, 121, -135, -53, 80, 240, 52, 142, 157, -71, 79, -173, 46, -9, 16, -17, 106, 116, -128, -1, 37, -16, -70, 117, 63, 101, -39, 58, -95, 43, 64, 44, -17, -37, -97, -122, -61, -79, 141, -187, -119, 45, 29, 57, 120, 96, 83, 36, 86, 22, -32]
8011c2j12K01K1nPK6j10j72Q9M8j7K17l5l18K43j52R9l8J66k71j1J12O7l8P9O
8037G0P3j2j04k3L0k06n5J36j72K75j49M51k67j09q7J75k02J73n2J32k46J11J69
8060A11o0o9M8rJ50j19l9j44K36lj97J51J2J2j94J3P3lN3q1NJ07j69Q5o8J62j99
8087a36K75m6j8j93L4QJ83j10Q9N6m3j98O0K32r7j25l4q4J09P3j02K3%l2l8J90
8113G6p1jj40K12M1j86j31K9J17J34o0Rp7J13P6q8k84K90j51N9O4K4j23J14j44
8138i8K67j57n8J20o5j35K4k6J19J93l22M56n25K33O8l1r7j50J37J87p0m8j40
8161a18lJ53J45j30k33L52k38O2j86K35j85kN5K54j61j87J72Q3j14j06K08k04
8183a48J21l2r7J10J03j29J3J00
$$ y = [-32, -144, 57, 78, 73, 80, 106, -4, -176, -87, -39, -56, 161, 126, -192, 51, -101, -2, -40, 126, -145, -156, -44, 23, -15, 64, 70, 143, 131, 27, 4, 34, -172, -227, -91, -263, 12, -137, 314, 47, -62, -149, 26, -176, -3, -55, 77, -169, -58, 111, 51, -18, 30, 21, 171, 52, 13, -131, 105, 102, -95, 56, 68, 80, -114, -101, -28, -31, 22, -59, -54, 53, -116, -31, -99, 63, -136, 139, 93, 75, -118, -84, -76, 107, -3, 86, 142, 99, -99, -39, 193, 96, -29, -63, -147, -38, 35, -67, -44, -44, -76, -114, 76, 5, 4, -136, 76, 117, -69, -200, -171, -54, 80, 20, 29, -48, 65, 141, 53, -231, 59, -92, -33, 31, 55, -68, 46, -98, 169, 12, -46, 74, 9, -126, -102, -128, -9, 184, -138, 318, -207, 26, 94, 63, -34, -184, -47, 140, 70, 22, -118, -121, 32, 177, 47, -186, 166, -72, -10, -196, 39, -146, -148, -93, 161, 0, -187, -15, 68, -46, -152, 56, -148, -27, -59, -156, -46, 57, -72, -59, 41]
8191D1
$$ Imaginary data points
##PAGE= N=2
##DATA TABLE= (X++(I..I)), XYDATA
0@%%%%%%%Qj6J6k4L2m0M8n6Q0j04J27j51J78k18K64l12L68m32N04n86O77p81Q95
30D77j024J166j322J500j693J905k140K397k680K989l326L696m101M540n018N544
46B910o120O748p432Q183r013R926j0937J2065j3323J4741j6352J8195k0333K2845
60A2103k5845K9498l4059L9934m7809N8947p5948J05225j68649N18110k42344
71A69163o59678R60113o02081K35852K6937l16134M96393m47444O8242M51497
81C82860o67936K98358J72884l11425J82521r1926O068R0794j38911M2567Q8021
92E3875r1037o2849J63990j24910P4750j907j95279L24695j26461j79993K77127
103A12001j96795Q6845N4008j72291K33514k70693J49059K35943n02582K76737
$$ y = [0, 0, 0, 0, 0, 0, 0, 0, 8, -8, 8, -16, 16, -24, 24, -32, 48, -56, 71, -80, 98, -120, 144, -168, 200, -232, 272, -314, 363, -418, 477, -547, 619, -703, 797, -896, 1009, -1131, 1266, -1414, 1575, -1751, 1945, -2156, 2384, -2634, 2910, -3210, 3538, -3894, 4289, -4724, 5202, -5735, 6330, -6993, 7748, -8604, 9591, -10742, 12103, -13742, 15756, -18303, 21631, -26178, 32769, -43179, 62046, -106603, 411507, 169163, -490515, 469598, -132483, 103369, 130306, -185828, 310565, -136879, -68637, 382860, -285076, 13282, 186166, -125259, 57262, -34664, -28596, 62198, -76713, -34146, 53875, -37162, -100011, 63979, -60931, 13819, 11912, -183367, 141328, 14867, -165126, 112001, -84794, 2051, 56059, -116232, 117282, -153411, -4352, 231591, -270991, 5746]
113E746J11142j81124P6554j19526K05033j00985j21201K62529j98820J347J40385
124H1080j09558O3607q4921P6961N0359j45596J16828k6067J9963n6433m487J55137
136A36873j75634L1462M7018j3066M6709j58439J35517Q496j41331J86479j46079
147d1995o341J25268j54957J63553j53670l1316K52121k50232O3492N3765q7350
158f7662J28175j24937K8236P9145j10835Q4249j6969m9741Q4222n8720M516M4714
170B4393l1526k8389O9057j5916r6990J55627o5212p5662R9717l5680N8723j23719
182f5577L1570J70958k22772O7795J13586j76678J12283L103m9533L1530p0614
193e4349J50962r1302q9796J61900o2048k6690P641L1658j6877m0686Q5747p0236
$$ y = [5746, 116888, -64236, 12318, -107208, 97825, -3160, -124361, 138168, -60652, -59305, 81080, -28478, 35129, -49792, 27169, 77528, -68068, 48760, 22693, 42656, -13777, -18264, 136873, -38761, -7299, 39719, 26653, 73362, -85077, 50440, 58936, -82395, 104084, -41995, -48336, 76932, -78025, 85528, -68142, -99458, 152663, -97569, -34077, 19688, -67662, 60513, -64424, -36188, 42957, -67878, 16371, -598, -50339, 33883, -24837, -20321, 24393, -7133, -35522, 33535, 17619, -79371, 76256, 11044, -64618, 35099, -581, 58142, -65577, -34007, 136951, -85821, -18026, 95560, -81118, 31165, 34268, -15265, 16265, -54349, 96613, 5311, -84485, 77415, 15367, -11323, -3682, 27976, 11099, -29587, 56160, -14076]
205a4076j4734P7399o1358J0020j2105K5977K1618j20890J41238m0851j04828
216i2590J75153j30864L413R3169p9634K5640m4006P1945K0526j43459J16633
227A5926L6059j19064P8235R469m6301J5578L4673m606o8453O0774L2074m6461
239b097l7677O5560K9422j10586Q0904N500o0410O3832l7108J0348k126j9681
251a4119P4036r9765K0451R9382j35502P0123K281m9873Q5712r5117N1683K406
263A1698m6290Q8605r8928K2626P7830r6943L9677R617l6244N5105m8897J5742
275f402Q032k4349M9627m5599n184L3927K544l1614M158K8761k3233J9843k7417
288a6906P569L7522m8852K2333J0211l6180N3717l2544j4802M7036n5753N9055
$$ y = [-14076, -28810, 48589, -12769, -2749, -14854, 11123, 32741, -88149, 53089, 12238, -92590, 82563, -48301, -44888, 48281, -31353, -5713, -49719, 22226, 42752, -100707, 15926, 51985, -67079, 11156, 20625, -25676, -10098, 24575, 19969, -48484, 12290, 44364, -2097, -39774, 25786, 55208, -55378, 25526, 31026, -29384, 34448, -2660, 7688, 5562, -14119, 59917, -39848, -19397, 79985, -55517, 14606, 16887, -32986, 52726, -42391, 9292, 11698, -34592, 54013, -44915, -22289, 55541, -41402, -1725, 7892, -28352, 26753, -22144, -6402, 1630, -22719, 26908, -18691, -23875, 10052, 12596, -19018, -14860, 13901, -9332, 10511, -16906, -9337, 28185, -20667, 1666, 11877, -24303, 29414, -3130, -17932, 29104, -26649, 32406]
300C2406k5759m9574Q9319m1395j5476J2094L293K2272m0861Q092L5339l8667
312h917M713L3351l9901l178M0397j1120m7879L7940K0886l8000J076L081L1813
325B4262m6111R130L8566o7242M7914J2460n6690L1989J4369j2576j0758o097
337b0784M3701l4763j4438N7101n4551J2564L8105l2703j6858K9680K8417n8185
349b2714O956M6311j8625l3216K7037K4824n0921J7700M0653n4514l553N8715
361C8653l4970k5458K1543K7887k6405l7864P0968l0934k9108M6591k0584j1424
373a1105J1115J9557k8893j2160M7853j7328l6843L5747O028k1530J505J1253
385E199j744k6176M5690k3678l4765N3024j2755j4527j2612K8220N843m1289L3830
$$ y = [32406, 6647, -42927, 46392, 4997, -10479, 1615, 4908, 27180, -13681, -5589, 29750, -8917, -4204, 29147, -10754, -13932, 26465, 15345, -32534, 5406, 26292, -11708, -10632, -7551, 24262, -21849, -12719, 25847, -41395, 6519, 18979, -37711, -5722, 8647, -3929, -14687, -20784, 22917, -11846, -26284, 30817, -23734, -11170, 26935, -5768, -22626, 7054, 35471, -22714, -15758, 30553, 11928, -21288, 5749, 30573, -20348, -2648, 38005, -16509, -20062, 38653, 3683, -21775, -232, 27655, 1250, -36614, 34354, 3420, -25688, 20903, 319, -11105, 10, 19567, -9326, -21486, 26367, 9039, -27804, 7943, 13971, -7559, -6054, 5199, 3455, -22721, 22969, -709, -35474, 17550, 4795, -9732, -22344, 5876, 11719, -29570, 4260]
398D260n50k5024K7023j769j5584M644J1012J2279l8954K6521J9439l8660K7917
411A2554j3172J2592l512j3410K6120k9978K4583o9l1051K9462n113n827J613
424D792j8413L0465j5446j0334J8849l3567M0505j7008j8294K5680k7122L4918
436A5025k1595j1477K5158k0190K3947j6990j5361M0477k5349l368J7661j5982
448h044J6310k1979K2237j690l0186M5092k8863j604J2493J948k331l3574N1955
461B1764r435l9860L7228r618j06N979j5099K2475l0478L0524J5581p0812O4651
474B2794p476k2640K2875k7700L5089k8313J0508K1918n8119M7512R535m8765
486b2782K8270Q27J380k0641K428M6069p0737K6497L3775n0279K4950r111J6638
$$ y = [4260, 3710, -21314, 5709, 3940, -11644, -7000, 4012, 16291, -22663, 3858, 23297, -15363, 12554, -618, 11974, 8462, -4948, 21172, -8806, 15777, 15708, -15343, 14119, 9006, 3179, 4792, -13621, 16844, 1398, -8936, 9913, -23654, 16851, -157, -18451, 7229, -19893, 15025, -6570, -18047, 7111, -13079, 10868, -6122, -21483, 18994, -6355, -9723, 7938, -8044, 8266, -13713, 8524, 6834, -23352, 21740, -7123, -8727, 3766, 5714, 3383, -30191, 21764, 12329, -27531, 9697, 79, -27, 5952, -9147, 13328, -17150, 13374, 28955, -41857, 22794, 15318, -7322, 15553, -12147, 22942, -5371, 5137, 27055, -31064, 16448, 25983, -22782, 5488, 6315, 7695, -12946, -10518, 35551, -35186, -8689, 25086, -25193, -243, -9354, 7284]
499G284k5723l74N6584p1342Q158N4085l7191k421j03J6056K480k9932M5985l5752
513a2206r244N5821m4096N645k813J8306K13l5170M8081l2475l357L7548l6185
526i932Q244M209K870M048l0929M7959k1758l5932O6294l7647J32M239m186K9069
540B6680n0729M3563p765m0965N9336k5201j1205N305n569L6195m5463N973L0360
553B0515m5063M3512k3341j3976L1810l5568L8935k9229n237L1665l7607L3960
565A0376j6820j3596L3268k7891J3661J374j1746K2141l0288K8200K003l1848
577b1166L5906k5488K1427m382j9946L0543l0054L0197j0006k3932L5561k4831
589f171J5109K233k7975L0903j6496J2362k012l5994N9981l6260p166L2126l6868
$$ y = [7284, -18439, -18813, 37771, -33571, -25413, 28672, -8519, -10940, -11043, 5013, 7493, -22439, 23546, -12206, -21450, 34371, -9725, -4080, -6893, 11413, 11626, -23544, 24537, -7938, -11295, 26253, -9932, -1688, 2521, 5391, 9439, -21490, 26469, 4711, -31221, 35073, -2574, -2442, 1797, -2389, 26680, -24049, 19514, 11749, -29216, 30120, 4919, -6286, -981, -6550, 29645, -15818, -9845, 20515, -24548, 18964, -4377, -18353, 13457, -22111, 16824, -12405, -17642, 14023, -23584, 10376, -6444, -20040, 13228, -14663, -1002, 372, -11374, 10767, -19521, 8679, 10682, -21166, 14740, -10748, 10679, 6297, -13649, 16894, -13160, 17037, 7031, -16901, 18660, -6171, 8938, 11171, -16804, 14099, -2397, 9965, 7953, -28041, 31940, -4320, -11486, 20640, -16228]
602a6228L1602k7874K0282J0008n3616O1826k0247k7456M0113k6321J2835j2037
614g113J559L4085o3803M0455J4262m6538M3597l0001J4856k109j1500L6327n6746
627c2669L3971J9769m7277L4362j1948j513J1467j8806L1012l8518J3527M1202
639C4579o5619L5227O689j5427R107j8259M0519m0492K130M3794m9016J4167J4082
652A1481j0758R41j4088L6191k6852k0644N6129m2423N364J1911j4215K3254l6780
665b0489L6150j4244k5496N4603m3505M449J8815j8542K0124k7118J8325R073
677A2145l8678N0442k9725j3056M1348l7280K4364k0780J0304K2526n3294M9453
689A7769j2223k4435L6022k6528J3859l119j1768L0979l8527J9297J6581l8904
$$ y = [-16228, 15374, -12500, 7782, 17790, -35826, 26000, 5753, -21703, 18410, -7911, 4924, -7113, -5554, 28531, -35272, 5183, 19445, -27093, 16504, -13497, 1359, -750, -12250, 24077, -32669, 1302, 21071, -26206, 8156, -3792, -5305, 6162, -12644, 18368, -20150, -6623, 34579, -31040, 4187, 10876, -4551, 4556, -13703, 26816, -13676, -11546, 32248, -16768, -2601, 11481, 723, 1664, -12424, 23767, -3085, -23729, 32400, -10023, -4659, 7252, -6963, 16291, -20489, 15661, 1417, -24079, 30524, -12981, -8532, 10283, -8259, 11865, -15253, 3072, 12145, -26533, 23909, -5816, -18872, 22476, -14804, 9560, -11220, -916, 21610, -31684, 17769, 5546, -18889, 17133, -9395, 4464, 1345, -10423, 20556, -17971, 1326, 17907, -20997]
701b0997L3984j8650P001O811k4761L2063k3927J0393M033k0121K6768j7887L214
714b076Q110j6217J9272j2982K107R854k4627L3291j9423q631K5860k6497K3310
727A1351j8613L799J7101l0819L0600j5940p771K5359k5155J2172m13q390J9720
740A3001k9336K2816K009k8670M0636k9967M644J5966j9496J9130k5003K1917
752G647N731l4917L2788l984j7169J5850n487L742j0692P865J4282l5580K6022
765F098M854k0450R222k452J5525k7654J2955J7137l4297K3365J379j5122R787
778C47l018R690j4670k858L1258l4587P611K1284k6666J5794n961O324o735n010
792g197K5277k8367N133J8219j4704k632N152O917j0637m233K1596k0424k374
$$ y = [-20997, 12987, -5663, 1338, 8149, -16612, 15451, -8476, 1917, 5950, -14171, 12597, -5290, -2076, 6034, -10183, 9089, -3893, -1786, 8068, -16559, 16732, -2691, -11322, 14538, -11959, 11351, -7262, -3463, 13638, -17181, 13419, -2521, -10292, 15067, -10088, 2084, 1671, -6719, 13001, -16335, 6481, 8490, -20180, 20456, -9511, -4867, 11099, -8397, 10733, -14270, 7647, 13378, -21539, 11249, 7265, -9904, 5946, 459, 4201, -6491, 1374, 15656, -19924, 6098, 10952, -9498, -276, -2728, 12797, -14857, -1902, 15235, -19062, 4303, 5682, -9440, 347, -2671, 7019, -7651, -10509, 20749, -13838, -6227, 15057, -11609, 4185, -1776, 4548, -2187, -7197, 18080, -10287, -5154, 13065, -1639, -4271, 881, 7798, -2839, -7072, 14524, -5900, -8274]
805h274K3554k1786N196q10R144m953j9339L5573k1090q661K3088j5204L359q39
819a042L061K714j6763K0202j133k3346K6070r332l814M919p284J5059j8811J1223
833A723K586j4963J6598p134k196K531m05L030n494K424M227q539R380m225m112
848d569J0106q798P746r274P794L452j5481J7847r239K65M811p474P566m021j163
863d32O024r468N860L606j0993J1098r672M219M965j0714O832m120P788q781r98
878d786J0271q970J242J923J602n009m74J0207p328r024J8394p922q255J1919
892C790m452L175j1503J3072K598j9288J7261j198r296O252L418o660k11O232
906C190N10q628L107R481j1749L752M707n157k864J0863l514j3112J6568l213
$$ y = [-8274, 15280, -6506, -1310, -2120, 7024, 2071, -17268, 18305, -2785, -11446, 11642, -3562, -203, -1042, 2019, 4733, -12030, 8172, 7039, -16307, 9763, 431, -3383, 1536, -5748, 9311, -9500, 1723, 4309, -10654, 5944, -1190, -3386, -855, -1260, 1770, -3724, -1300, 2927, -5612, 3768, -457, -4569, 5537, -3261, 4485, -4789, 3005, 6457, -9024, 8823, -416, -151, 4660, -2814, 4752, 731, -432, 5592, -3876, 1984, 5590, -5403, 5695, -3977, 242, 5207, -5507, 1325, -2795, 4993, -3788, -4786, 5485, -3485, -2243, -320, 1282, -3727, -4201, 6006, -1322, -10346, 8048, 126, -8129, 3790, -662, 2513, -8990, 4082, 6680, -12608, 4653, 3455, -5841, 411, 3829, -2831, -3042, 3190, 3700, -4928, -1821, 7660, -4089, -337, 4370, -787, -3651, 7212, 3698, -9414, 7154, 3941]
920C941n360m04O631Mj3346J5500L53j6128Q967J0594j5607J177R013k603q491
935e759L683J3152j9265K454J2984o838p907P257N765j4841J0367K190q602J659
949c701N234J813j0429M447P615r494J709R649j5119P799N968q826L767n301J1970
964G101r698j951J3197j3167J890P666l042n388K915M737k625n687R112l161o673
979d774R565k134k220n131J0630l435n706Q340q641P037l050M17J254p210R684
994D626l211m384O993q068L760O958j4245J0390m622n0P189j3946J4150j0030
1008d490J345R485j3656Q142j433k043N131n781K580J4k743Q902j0600L750M530
1023C133q048R829r061O737m939j182J4628j9372P939M849o115M093n079N809
$$ y = [3941, -1419, -1823, 4808, 4812, -8534, 6966, 7319, -8809, 158, 10752, -4855, -3678, 5335, 2732, -5759, -2076, 11076, -8189, -5735, 7249, 411, -7496, -239, 5526, -9315, 1052, 3242, -5360, -3701, 1533, 3346, -7083, -2636, 4979, -4515, -2806, 6843, -8276, -477, 5491, -3335, 432, -4869, 7101, -2597, -4548, 8649, -4518, -2628, 5038, 1996, -3392, -477, 4260, 1635, -4052, 5060, 1899, -4774, 4791, 2657, 437, -4694, 5936, 2501, -3205, 5135, -3506, 3531, 481, 898, 2152, -5058, 4626, 1415, -2969, 4024, -4044, -284, 6674, -7571, 2819, -1803, -1853, 5336, -8610, 5540, -4490, -3145, 6340, -7316, 826, -607, -2650, 2481, -3300, -720, -706, -3449, 5453, -5147, -1397, 3133, -4915, 4914, -4147, 2590, -2349, -3531, 11097, -8275, -336, 4513, -1602, 2491, -2588, 3221]
1037C221k358o528J6424j2445p072J9141j2274L225k866K592L094j2493J8262
1050I923j1953m168J2137o275Q34l199N338j980o595J3338p950q151J6838j0153
1064b016J632k58j444Q787j8175K0355o416j5572K2099r542J4j770N70R219j5930
1079h447R329P798k1158J6459Q37r780O185o461J4865j6182L381J4132k1866J4930
1093D022j609m764M092n453R364q052l18J0432j5089P770O279j2718R118o867
1107c793P678l669o262J5955j8792J0174L751r693O664o987J0495n768p247J5344
1121G850j0822o52R730j0840Q056o780M247N753j6846J8384r759q93Q934j2886
1135f524J3120r403J973O573j1082J0533o739p01J0681j5791J0122R62j0009J4528
$$ y = [3221, 863, -5665, 10759, -1686, -8758, 10383, -1891, 1334, -1532, 1060, 4154, -8339, 9923, -2030, -6198, 5939, -336, 498, -2701, 2637, 657, -5938, 7400, -550, -8701, 8137, -2016, -384, -642, -2086, 6701, -11474, 8881, 2465, -13107, 8992, -550, -536, -2306, -1736, 7483, -8447, 882, 8680, -12478, 3981, 4818, -4962, 1223, -5238, 9627, -6555, -3174, 10958, -10908, 4022, 2413, -2351, 1741, -3712, 5652, -2400, -2718, 7714, -7375, 395, 6674, -6044, 3074, -3793, 3885, 216, -6046, 9909, -8883, 1291, 5042, -4651, 2013, -4974, 5521, -247, -7494, 7850, -2972, -3624, 6106, -4734, 3322, -3458, 789, 6542, -10304, 8080, -1679, -2572, 6362, -6524, 6596, -2807, -834, 5739, -5343, 5190, -1549, -2250, 8431, -7360, 2762, 3724, -6285, 8243]
1149H243j5040J0768k697q822J9629k1079R763M051j1411J2540j0932N324L584
1162C921j0948J2165p829r98J0653j5169J1692l910l013P757j1963J4382j1166
1175d426J226J0323j5091J0752k701j071J954o381J2457r310m797J7329j4454
1188d190K587M856n368Q025j4376J6310n745j1755K1697j5844L655K464l191P299
1202F424j3419J1385J045j4404J7535q793m297J1396j2208J1483j0842M031R484
1215H820k1372K0587q001o192J1739r940P536p111K605P844j6448J1955K933j4194
1229i239J2931o146L344j980n283J6332j9927J0798N219j4910J3035o608N090
1242B656l478m666J4057j2763J575R843j2546Q147j961k067N883j1042J4657j0251
$$ y = [8243, -6797, 3971, 1274, -7548, 12081, -8998, 765, 4816, -6595, 5945, -4987, 337, 3921, -7027, 5138, -2691, -3689, 6964, -8205, 3487, -423, -3436, 4321, -7642, 6740, -4426, -3200, 7123, -7968, 2784, 83, -988, 966, -5415, 7042, -2268, -7065, 10264, -4190, -1603, 3253, -2115, 5910, -8466, 7844, 2099, -9656, 12041, -3803, -148, 2316, -875, 6424, -6995, 4390, 5435, -8969, 8566, -227, -4524, 6872, -5336, 6147, -4695, -664, 8820, -12552, 8035, 34, -6158, 5581, -4359, 3177, -3934, -1329, 6515, -9933, 2022, 4955, -9239, 3692, -2454, 890, -1090, -6373, 9959, -9968, 830, 6049, -8861, 4174, -2434, 2656, -822, -5488, 8569, -4194, -2619, 7224, -5322, 2825, 864, -1203, 4680, -6362, 8295, -1956]
1256a956j271J1586j4222J0646o086J401M653j0665J1744o686k206R989j2350
1269e423P077J195p928J1555j2946Q993M11j0982J6970j5630O984L978j1310J2079
1283E023r109M313K640r438J1274o446k121R261j1654R316l030m664J0336j2184
1297f483J0835n622k016R627j2774J0071k985l485O408n676M916l143k487R634
1311F820j0437L121N923r474P938o395N657j987o693J4684j3715L478N301o730
1325b509M500n157N847j440o906J0735n571m399R896q723M542j741j71M515j1157
1340g739J3215n964m387R215p693M139k255J355J857p059R029j959q513J1134
1354D375m510j937L606l788P443j1051P853L382j2935J1768l265j439L60j20M639
$$ y = [-1956, -3227, 8359, -5863, 4783, -1303, 98, 4751, -5914, 5830, -856, -3062, 6927, -5423, 1654, 2849, -5079, 6476, -6470, 2523, 2934, -8048, 8922, -6708, 276, 4254, -7056, 5023, -4086, 227, 2867, -6571, 4703, -1743, -3864, 5397, -6257, 3059, 29, -4635, 5701, -6483, 4352, -1270, -3286, 6341, -6433, 3638, 653, -2832, 3576, -2100, 2816, -327, -2814, 6820, -3617, -496, 5427, -4047, 3891, -2504, 3153, 1166, -5527, 9157, -4558, -1080, 4221, -2509, 1991, -3166, 2681, 1241, -5665, 5070, -501, -4900, 4996, -3727, 815, -926, -1097, 3418, -7739, 5476, -488, -4875, 4340, -3353, 786, -1469, -114, 1743, -5316, 3713, 1754, -6759, 4375, -135, -2072, 1534, -2254, 5189, -5862, 1991, 5373, -7562, 4206, 941, -498, -138, -258, 4381]
1369D381p347K869N458q770L633L346m682K657l084N326n209K5O840r906O565
1384B102j425q74J154l538N912n303Q14M680o949K519L753n452L002k517K910
1399G88k95n399R362q001K116L596m526L470m158M620j420k906M591k259q97K779
1415A461k577J856q00j578M765n560M243k290m69M648o635N457k848n9K357k457
1431d86K234k783J201K518l400L04K701l320L168k670M85J288k879N192n855K679
1447C77J118k738K462j900J093j567J490L84k424O26L040l609L66K777k402j48
1463a055r53N561n983k92N443m341J123q1J695k748J69M141l254k375M265O99
1479B014m580L241l17j36j166K258o11l147M562j621n80p28K862k557q50M363
$$ y = [4381, -2966, -97, 5361, -3409, 224, 3570, -1112, 1545, -1539, 3787, -1422, -1397, 5443, -4463, 2102, 677, -197, 957, -2581, 3331, -1972, -1158, 3522, -3427, -908, 2845, -2607, 395, -2122, 788, 493, -4906, 4456, -3545, -1429, 2167, -2359, 1111, -3047, 1573, 153, -2753, 1838, -421, -1318, 1461, -1116, 740, -60, -1638, 3127, -2433, 1810, -480, -949, 3699, -2936, 2521, -327, -386, 1971, -486, 1748, -1035, 166, 2684, -716, -412, 2289, -1031, 2137, -533, -48, 1240, -1639, 3553, -2302, 377, 1495, -1243, 1219, -681, 412, -1155, 335, 719, -1705, -1079, 1961, -1648, -1282, 1495, -907, -1055, -2008, 3553, -2430, -2722, 2721, -1620, -497, -578, 1117, -1631, -1462, 2679, -575, -2950, 1315, 2014, -2566, 675, 358, 222, -944, 1314, 703, -2444, 2118, 497, -83, -811, 2051, -506, -1356, 3007]
1495C007l795l98J932J148l500J372K152k403p30L049q3n674N311P30l195o98
1511a775K769O69m584M314p71k224N35L266k168k948M474j142j154l52K185j573
1527d79n49J873n67j344R69J751l526L262j678k14R36r69K388m594L785j47k310
1544a413K473j249p14P86Q16q1j680l57M331m964J788R74j677K741l983M353l154
1561a010n48L801l559J788r71N33J535k728O09K273l567K449n85p0J233m117O024
1578C090l959k24K257k425K862l011K507j058j739L473j572j137J767q65R47o44
1594B69q52K949m961N248k127k863N516n054L679k780P93K582n627N249j112l826
1610b917M468j496r77J261k066M500o249K872M527q967O741k246K50O28k907O307
$$ y = [3007, -788, -1186, 746, 1894, -1606, -234, 1918, -485, -1215, 1834, 1751, -3923, 1388, 2118, -1077, -1775, 994, 1663, -2921, 1393, 622, -1602, -1067, 2199, 31, -2917, 1557, 415, -739, -1091, 1094, -479, -1028, 845, 278, -1066, -97, 1654, -1872, 1390, -288, -502, 434, -535, 1853, -2741, 1044, 897, -1413, 1060, -189, -903, -117, 699, 618, -1062, -1419, 2912, -2052, -264, 710, -967, 1774, -2209, 2144, -1010, -1558, 2243, -1316, 472, -499, 34, 1569, -1159, -550, 1723, -1844, 605, 20, -50, 1183, -2934, 3090, -869, -1093, 1164, -1261, 1601, -1410, 1097, 39, -1700, 1773, 201, -936, 831, -34, 913, 269, -583, 2366, -2595, 2653, 526, -2337, 3179, -1875, 1804, -976, -183, 2399, -3228, 2021, 909, -2917, 1551, 55, -922, 339, -1727, 2773, -3476, -604, 3923, -5044, 1697, -549, -299, 329, -2578, 3729]
1626C729o532J860M285o137K323J817k217J653k980M289j852l811P967p132K735
1641cJ456k685K766m249N844l653k030N971m060J01J716j169J168k645K792O82
1657B002n676P754m272r14L397l804M856o345M687M74n863O765l953J03J873k694
1673a610K983k764K51M691q234N839J11m728O641p118N481j960k523O646q220
1688d514N423Q06m466M310k820J783O41m268O245m112p24M824o411N866l576N09
1704d84L543o788P117m172r4K864l954M060l138L34L667m942K716N96k974M279
1720B630m930M344j244l539P084p341M442p60k189M339n860M934j598k728N223
1735B807m236Q36K363m348M742m002J705K627p751R193n264o37M518n869O108
$$ y = [3729, -2803, -943, 3342, -2795, -472, 1345, -872, 781, -2199, 2090, 238, -3573, 4394, -2738, -3, 1453, -1232, 1534, -2715, 3129, -524, -2554, 3417, -643, -542, 1174, 5, 1173, -1472, 1320, 2002, -3674, 4080, -192, -1106, 2291, -1513, 3343, -3002, 1685, 2159, -3704, 3061, -892, -789, 1084, -1610, 1373, -1391, -1140, 3551, -4683, 1156, 1267, -3461, 3180, -3938, 1543, -417, -2940, 3706, -4514, 909, 1715, -2751, 1559, -1261, 522, 1163, -3105, 3140, -972, -1696, 3128, -3283, 2583, -993, -484, 3059, -3729, 3388, -784, -878, 1986, -1968, 2092, -1046, -712, 2955, -1987, 729, 1325, -1649, 2630, -2300, 2044, 800, -2739, 4345, -2996, 1446, 686, -1503, 2836, -3024, 1910, 312, -2416, 2807, -1429, -593, 1770, -2578, 2164, -1838, -133, 2494, -5257, 3936, -1328, -1965, 2553, -3316, 2792]
1750B792n183K624K644p437O711r05m054N079l661K849j114l269Q050q873M329
1765E82K569o623O180m517L658j708k637O465o135J550L013m043K201q77P1J478
1781A227m285O277m361q03N589o621M517k704J546J162n263P306m899o09M358
1796B437m339K246n81m12K824n832N415m12n394P642n716K568l74k219O038p994
1812d103N677j64m707N968l514R10Q78k938M805l982J9N017p399N998k041j758
1828a334M071n747O400m352o89M872n501L433p08j225K261l142K497j35l572N835
1844B964m541P81J937l602M971n301L354N44l836M861l923K092k37j742L212l044
1860a510J272J693l972L872j597p33L020m959N458l266m97M204o266N550k427
$$ y = [2792, -2391, 233, 2877, -4560, 2151, 1246, -2808, 2271, -1390, 1459, 345, -2924, 5126, -3747, 582, 3151, -3472, 2708, -1809, 1849, 141, -2496, 3969, -2166, -616, 2397, -1646, 555, -322, -251, 1227, -3058, 3219, -1142, -1945, 3644, -2977, 1540, -1164, 382, 1544, -3719, 3587, -1312, -1921, 2437, -1902, 344, -237, -649, 2175, -3657, 1758, 1346, -4048, 3594, -2122, 446, 72, -2147, 3891, -4103, 1574, 1410, -3297, 2671, -843, 67, 945, -1993, 2812, -1170, -1151, 3866, -3533, 2465, 424, -1334, 2737, -3010, 3390, -962, -1651, 3221, -2280, 1153, 445, -780, 1481, -1661, 836, 701, -2871, 2964, -1577, -796, 1141, -2461, 2510, -2791, 563, 1107, -2729, 2132, -1791, 301, 64, -1678, 1534, -1510, -238, 1455, -2517, 1355, -242, -975, 2045, -2914, 2544, -722, -1219, 2985, -3281, 2269, -158]
1875a58m81K561m123M543k224j831M327l518P30J716l080L736m121K617J578n815
1891c543O691m030P52R26j773L172m445K497J766l843K339J02j656K209k643K784
1907A305j808j188M979o142L517l41j086J893l420M014k659O7K444l227J081J417
1923H46j829J342j162J106L67l120N007l904L07L022l279K498k792L123j137k451
1939b056M392k414r88J778j44j70j018K64K854m767L403k8k984L397k574K462
1955A407k559L48L102m088K297k51q90J102l35j19J83j155K143j550l35K485l569
1972a784K801j114K99j8j462L090l148J384P40j401N00J76L10p20q42K106k79
1989F38k428L057j857P69j72n70J666l144L194p48j228R80J50L58j363N39P61
$$ y = [-158, -639, 1922, -2201, 2342, 118, -1713, 2614, -904, -174, 1542, -1538, 2198, -1923, 694, 2272, -3543, 3148, -882, -130, 796, -977, 2195, -2250, 247, 2013, -1830, 509, 611, -1045, 1164, -1479, 1305, -503, -1691, 3288, -2854, 663, 322, -764, 1129, -2291, 1723, -936, -869, 1575, -1652, -571, 846, -983, 359, -803, 303, 670, -2450, 2557, -1347, -1040, 1982, -1297, 1201, -1591, 1532, 395, -2056, 2336, -78, -1066, 712, 568, 398, -620, -356, 2498, -2269, 1134, 1106, -1878, 1519, -1055, 1407, -1152, -804, 2298, -1790, 507, 256, -634, 468, 133, 14, 197, -958, 1185, -365, -700, 1785, -1784, 1017, -97, 202, 184, -1278, 1812, -1336, 48, 788, -613, -113, 63, 373, -347, -1189, 917, 638, -1790, 1267, -590, 179, 7, -563, 1103, -2041, 1153, 405, -823, 157, 307, 665, -698, -159, 602]
2006F02n55p31J766j567O88j53r8P16k098K742k016L97P96j151R24j239J451o00
2024a26j57J58l6k38R35n92p58J329n52Q35k078K395l55j608J792j059O81j129
2042e63J552n46j273J365L85j041n68J995j602R0k55J550j647n45K426j971O84
2059C6l83J017j227K65J182j543L10O18M81k117J842n62l20L50m6M96j811K271
2077H59q92q54N66R08q56n73J593j343N69p43J740j827M62J480j891N97N7J089
2095I41j667O50R68j069k7N61O33j573J344m62K6m78Q85J69k134K574j417K05
2113A29l36P76j08j176J503p70k23M9R50j339L45M06J3n82p4J629k560J925p72
2132b15J56q5p10K105k478J367K09j037M66J67J65j38n62P20K99k087K976k026
$$ y = [602, 47, -684, 1082, -485, 203, 50, -48, 668, -1430, 1312, -704, -307, 489, -662, 262, -977, 474, -126, -283, -125, -161, -399, 536, -56, -814, 515, -37, 798, -1280, 1115, 760, -848, 944, -115, 566, -563, 989, 443, -830, 535, 920, -121, -689, 1306, -296, -206, -461, 1089, -558, -1103, 1323, -648, 36, -347, 670, -557, -292, 890, -653, -343, 275, 756, -1361, 481, -81, -401, -51, -97, 399, -1412, 859, -33, -887, -321, 587, -269, -842, 751, -592, -23, -766, 974, -853, -391, 1089, -802, -205, -148, 941, -726, -76, 892, -177, -204, 357, 990, -583, 761, 299, 325, -153, 732, 901, -1233, 1341, -76, 129, -207, 569, 461, -715, 788, 18, -205, -156, 794, -545, -200, 206, 219, -363, -437, 1192, -1368, 557, -215, -59, -144, -854, 1251, -1227, 140, 349, -688, -222, -55, 110, -28, -590, 130, 429, -1658, 1318, -708]
2150g08Q84K28j384K176k714K112l00j277J977j153k1N98o99N83j12p89K157k869
2168a311J963K02j699K310k233J889j433O2J577k227J283k26M0l08K41M65n71
2185B4q28J828j142n35J709j879J668j973J986k27k620L433k251P70j79R1P34
2202F09j640J376M13j878J476J94j549K178k274J936j268l22K677m004L146j006
2218F4j117J922j713J638j358k14K103k412P17J918k993K200q13J66N68k618M069
2235B127l197K59K007k174J555j123J146n84j098K175q50j658K536j219m0K22
2251H4r37K314l246K707n81j592K496k278J912j714Q52J078k450J943K2j419J182
2268C73m10P2O36j858L106k942J114J802l746L300k073J034J15k007L344k567
$$ y = [-708, 176, 404, -980, 1196, -1518, 594, 294, -983, 994, -159, -180, 418, -281, 302, 190, -599, 1558, -1311, 652, 854, -845, 1465, -768, 1121, -312, -250, 1327, -900, 383, 157, 197, -111, 130, 595, 24, -804, 1024, -118, -653, 1056, -823, 845, -1128, 858, 631, -1989, 1444, -807, -37, -216, -125, 609, -1031, 345, 758, -1120, 356, 550, -999, 1179, -1095, 841, -427, -749, 1928, -2076, 1070, 64, -1053, 869, -844, 794, -564, -778, 1325, -1087, -370, 1548, -1445, 755, -58, 108, 676, -1942, 2127, -1070, -811, 1196, -978, 577, -546, 600, 16, -1082, 1093, 243, -1415, 1121, -98, -138, 84, -853, 1461, -1785, 922, 341, -1251, 1245, -1033, 879, -835, 17, 1095, -1355, 588, 610, -809, 373, -37, 35, 671, -1187, 1919, -1023, 91, 1893, -1853, 1447, -626, 408, 523, -1484, 1860, -707]
2284g07J63J457j798J024J59r14J671k515K231l48k574M246l463J761m67j004
2300a078K687l363K325k03j674K137j183l0Q13j243J487j161k38K408l264K329
2316G49r21j21J221k236K871k776J068J236k081J309m50M47J25j307J648n15j589
2333a322L155k499J152j45j087K618l697L249j049j605K830k511J581p43k53J710
2349A384j991O21J068k875L010j050j112K178k717K918k483M94K181l833L356
2364A149j418j05O35j162J801j238q63K826k472J51J836k122J952k226K201j03
2380H42k924M130l073J032L52p16J129j580J219Q3j581J537k09q24J303j352J469
2397H37j206N8J728l356L273j556k21J210j540K043j975J052P52k288J500O56
$$ y = [-707, -544, 913, -885, 139, 298, -616, 1055, -1460, 771, 423, -2151, 2095, -1368, 393, -74, -1078, 1609, -1754, 571, 368, -1306, 831, -352, -382, 431, -812, 675, -486, -724, 1684, -1580, 749, -172, -293, 928, -1308, 1563, -1213, -145, 1091, -990, 319, -131, 316, 441, -866, 782, 267, -1322, 1833, -666, 486, 341, -746, 1872, -1825, 1424, 375, -1230, 1600, -911, 670, -73, -326, 1384, -607, 14, 1082, -1793, 1217, 167, -945, 1233, -1484, 1434, -1049, -555, 1626, -2207, 1149, -269, -374, 261, -901, 900, -338, -1201, 1625, -847, -696, 1140, -982, 970, -1256, 945, 842, -2082, 2048, -1025, 7, 359, -357, 772, -808, 411, 494, -1087, 450, 241, -583, 720, -632, 837, -369, -311, 1417, -1939, 1334, -222, -443, 767, -773, 1270, -705, 347, 1099, -1189, 311, 967]
2413I67j933J719r15M75k4j416L249l566J351J207k240K056j937J580o06j100
2429a133K437j702k25J405j258N37l10k11J809l028K263l63j405K251k334K294
2445A027j519M71P68j860J836n70o47Q95p31K36O60j303J575j376L27J296k308
2462a223K269j554P43j65r84K170k277P73P71p90K72o1J61K93j087J291l90j247
2480a035K243j799R27p14J88J423k714K304o79o14J127j007O30k26m00J095j081
2497c32R7J496k173J631p65k61Q77j420J987k012J031M47j297R33m23K37k10k19
2515c76Q77n93q18J838j253LO91p99J037j858J997o94j105J865j428O96n76N19
2533B3J53p67P38L22j191Q59L00q96R64r35J194j073K96J067k020J748o97r5K56
$$ y = [967, -966, 753, -162, 313, 289, -1127, 2122, -1444, -93, 1114, -1126, 930, -1007, 573, -33, -1133, 1304, -398, -623, 782, -476, 61, -249, -460, 1349, -1679, 584, 221, -1184, 1067, -1267, 1027, -492, -21, 747, -1113, 723, 153, -494, 401, -330, -94, 566, -737, 838, -538, -211, 1085, -1223, 1046, -508, 235, 70, -914, 1256, -1021, -248, 523, -267, 5, -56, 105, 398, -689, 602, 212, -1035, 1208, -591, 336, -378, -190, 1233, -1481, 823, 144, -470, 657, -350, 280, 54, -346, 749, -332, -235, 1261, -912, 719, -46, -307, 570, -850, 1137, -875, 156, 603, -694, 239, -184, 53, -157, -376, 501, -92, -910, 928, -325, -322, 369, -430, 607, -1251, 746, 52, -1053, 812, -616, 80, -496, 23, 176, -591, 147, 469, -722, 137, 437, -459, 505, -430, 764, -309, -13, 1054, -966, 782, 85, -10, 246]
2552B46k52M67q36M43N91q31j35J151j017N00m66O51k98r76K068j769O02j32p
2571@J75p07J206r81J83N48j21r50Q88l26K3Mk04R42j551J361m17m83N75n17N70
2592B18q63Q18o3n12L18L57o21J22N28o89N20m40Q97j230L13R44j002O12m06N46
2612C67p21J96N29m46r8M03L87j124Q86l94N10r35O22K10r89J017n30N44q14O23
2632B43P8o96N29j02J89q56R44m94J14j03K00K13o65Q41r98N41j2K64n02K26P62
2653G16j324N09L1K26m79N28p0m22K07J38L12j178J337l48o90Q34l91K30q08J011
2673C69k58l86L23O40j058MP26o87P63q10J061j065j16J186j244O65m21N30m64
2692b42K40L08n78m1N87j62p78J201r87M69m98O16K67j261J445p94K68P1K94n12
$$ y = [246, -6, 461, -375, 68, 659, -172, -307, 844, -173, 327, -139, 512, 214, -762, 1306, -463, 139, 7, 0, 175, -532, 674, -307, -124, 424, 303, -647, 241, -85, -62, -58, -262, 680, -871, 490, 73, -410, 165, -352, 218, -645, 173, 110, -402, -84, 273, -348, -226, 302, -387, 133, -307, 590, -640, -327, 617, -385, 227, -179, 367, -354, -158, 371, -75, -173, 230, 617, -507, 379, -15, 495, -440, 182, 392, -597, 420, -110, 434, -380, 243, 321, -375, 154, 52, 241, -615, 329, -165, -51, -154, 46, 259, -406, 435, -563, -22, -34, 230, -272, -46, 716, -608, -99, -68, 158, -321, 207, 137, -285, -78, 60, 372, -806, 531, 183, -507, 327, -64, 166, -642, 369, 111, -275, 48, 688, -370, -366, 360, -327, 436, -374, 687, -378, -494, 692, -552, 113, -308, 222, -242, -2, 306, -272, -313, 274, 112, -666, 535, -452, 17, -481, 135, 402, -859, 586, -208, 60, 131, 425, -87]
2712h7l73R97n33j15p7J076j165N85l08qJ19k62R51j424J084k30l74J91j54P00
2732E93j014K15M57m27N0L59m04K74j13k62O05j160J634j383K68Q48r98R58j093
2751e93O67q8m69Q46m89n24R44l43l44P71r71J456j348L68O32j367J395j077O95
2770A61k54k56J104r08K53L09m60M8J53m29R46j108J013l67o33J493j687R29l21
2789a4R8M59j053J108p21K2K38J3m5M5k45K76o00M17N53j557J521r16L58r0k49
2810c82J069j694J157J75r89Q31k67j89J56m52Q33k84q32J833j794J152k36p89
2828g02J357j620J681q44m19J405j338N83J46n25M82k89J37L96j020J577q39o52
2846d84J258j169Q56j016R40K16j185J397q13J2m9J57K60m51J31M36j063L94O72
$$ y = [-87, -460, 537, 4, -111, -188, 888, -277, 308, 0, -8, 111, -151, 800, -624, 460, 230, -144, 47, -107, 593, -421, -206, 251, -176, -126, 233, -171, 103, -10, -272, 333, -827, 807, -576, -308, 540, -458, 500, -593, 74, -14, -483, 363, -126, -650, 294, -49, -393, 378, -593, 863, -485, -117, 515, -852, 543, -534, 161, -93, -349, 755, -153, 100, 409, -51, -3, 150, -279, 667, -441, 572, 205, -428, 1065, -622, 307, -14, 84, 543, -510, 598, -123, -101, 137, 150, 105, 150, -95, 181, -419, -2, 551, -1006, 515, -401, -43, -133, -382, 687, -1007, 150, 325, -664, 167, -100, -289, -133, -585, 248, -36, -868, 965, -829, 323, 87, -702, 655, -965, 716, -128, -547, 858, -480, 103, 249, -276, 206, -83, 54, 450, -570, 1007, 168, -484, 774, -395, 461, -555, 385, 601, -584, 813, 0, 12, -37, 120, 380, -71, 60, 496, -567, -173, 499]
2865D99j198J228j119R44n44l37J508j870J215m29k09O17o64P94n98r8O03p21
2883c79R1R65j428J329q91J14Q33j664K099j628N36O65j087P63p91L80N47r31
2901d77N74K49q83J181p73J99L44j102J668j815J004L5o87J091j050Q52m62k13
2919b65N98m22K1N23p15M05l39o3O90j044J266r24lQ86j217J397j297O15k8o16
2939e32J050n44j01M14n84L76O2m23J027j433R23K15j294J642j242Q76m54l43
2957c65J090j247Q15j50j94R5o0r5N13r73J107o50m68J342j566J166n55k32R12
2976D85j364J525j005lO96m27rJ06j42K38l75L32M17j257J554j043k3N21o31R81
2996E76j474J359l39n84R17m43K09j59J54k7m76J29P55j114O23J48o67J145j364
$$ y = [499, -699, 529, -590, 354, -190, -527, 981, -889, 326, -103, -312, 305, -359, 435, -163, -261, 342, -379, -288, 677, -751, 578, -313, -199, 634, -1030, 1069, -559, -23, 642, -445, 318, -473, -93, 454, -477, 97, 346, -537, 644, -129, 70, 414, -688, 980, -835, 169, 204, -483, 608, -442, 410, -52, -265, 333, -89, -68, 455, -260, 145, -194, -257, 433, -611, 655, -269, -272, 614, -603, 794, -503, 112, 84, -532, 518, -26, -127, 287, -297, 79, 141, -282, 745, -688, 235, 450, -844, 798, -444, 432, -22, -365, 725, -522, 293, 143, -51, 44, -16, -111, 402, -571, 536, -114, -582, 760, -806, 360, -195, -427, 485, -879, 646, -359, -362, 334, -93, -102, 4, -138, 100, -275, 57, 474, -783, 771, -272, -295, 226, -405, 576, -898, 461, 122, -462, 455, 12, 221, 62, 216, 189, -287, -158, 597, -517, 106, 254, -413, 732, -632]
3015f32J336j098L98P03j211J023m67j37N94p62O82j75n32O47o94N4Q49j224J298
3034F52j079O24Q8r17J345j331O54m5j50J03p7M9L26o76M97K37o63Q75j012P46
3054B46l3o70J031j139P25j98q2L08m94O92m00M7k8L7k53L97n09M92k68k7O36
3075E10j101J276r49N00j3n98J004r04O07l11k26L21K12n67K93kk3J65p89J157
3095E62j191O63K79p11P67p03O91p70L34J93k30J9k9N2j6K66n63O36p77Q67n02
3116a63k69R11j016P93n01L18k1j97M60m85J63M7J30l10L45j62J24k84J22K35
3136B40r03R36n65K35J0n4K42n22P30k43j9l37N18l73l0L69j06Jk59N16p19N57
3158B24q7j45L14p18Q41p21L50k4L2N0j28K57m10N50m91J79l53L55o0l41P82n25
$$ y = [-632, 704, -394, 4, 707, -504, 519, 52, -85, 509, -253, 429, 254, -278, 369, -325, -271, 578, -646, 652, -427, 197, 285, -632, 713, -618, 36, -9, -159, -56, -133, -84, 242, -434, 63, 300, -363, 512, -500, 246, 213, -457, 574, -565, 160, -38, -120, 188, -306, 386, -14, 33, 5, 42, -211, 186, -323, 169, -99, -126, 510, -591, 685, -264, 236, 223, -375, 629, -275, 332, 21, -205, 116, 328, -239, 54, 52, 29, 194, -595, 562, -629, 34, 313, -398, 369, -334, 357, -413, -79, 114, -116, -97, -126, -74, -90, 176, -387, 249, -528, 339, -163, -432, 479, -537, 256, -245, 73, 52, -145, 315, -170, -7, 40, 170, -140, 205, 43, 167, -117, 5, 240, -663, 273, -292, -57, -47, -101, 141, -381, 349, 106, 87, -250, 268, -105, -135, 234, 128, 129, -130, 386, -333, 224, 137, -8, 306, -412, 429, -292, 58, 34, 66, 116, -12, 245, -165, 385, -106, 73, -280, 75, 15, -326, 456, -69]
3180f9R5l09O12k69k07K80Q9j84k71O80m96J47j82M73n15N6K25m64M45l62K93
3201F7o0j8J90n09N52m60L05k70K68j70J56k42L6K42n41O13m66K71J2QK08m95
3223c03M48n9J50l80K67k77J23O6nJ82n52P05l90j03K63J0J70k87N10o90K57q6
3245A9R8j73K02M6l88J54j10N52o27K49Q7k49K55l55N52n46K42R2k82R8Q3M3j95
3268a53O05o36R6m3K99n54J96M58q93Q85m15M75l94q6N49o06M07j71K30l44Q3
3289a2j3M6k10K36J49p30P42l42K77m0k79M78o56N64k21m7K40k14R5O6k44J74
3311E9K24o09O27m07J54P3l04N14n08M84n12M47l7l56J46j48M19k76O9m12K76
3332g7j87L70j32k8J51l03M62o88N29j62j52L72n41P72n04J26L3j70j56M40k94
$$ y = [-69, 26, -283, 329, 60, -147, 133, 222, 38, -233, 447, -49, 98, -84, 389, -126, -70, 155, -309, 136, -226, 67, 7, -11, 179, -330, 222, -238, 67, -203, 65, -105, 51, -191, -155, 87, -454, 159, -307, -36, -24, -16, 192, -303, 145, 86, 236, -144, 123, -154, -31, 35, 30, 212, -340, 365, -25, -128, 135, 145, 315, 28, 538, -152, 105, 19, 117, -56, 146, 192, -196, -42, -152, 400, -227, 22, 109, -140, 115, -240, 312, -234, 8, 100, -182, -84, -1, 42, -153, 452, -184, -88, -131, 168, -386, -190, 268, -625, 260, -155, 320, -74, -160, 389, -217, 190, 19, 249, -95, -12, -25, 21, -189, 47, 196, -534, 208, -134, 143, 103, -176, 302, -354, 210, -11, -58, 182, -32, 63, 129, -115, 59, 283, -326, 301, -106, 48, 121, -183, 331, -177, 307, -205, 242, 205, -151, -5, -153, 266, -10, 59, -353, -77, -264, 106, -26, -54, 97, -206, 256, -432, 97, -65, -217, 155, -386, 386, -118, 8, 41, -129, -285, 155, -139]
3353a39J7J33k23N31p12N40k81k45O86q01Q38o91K98J02k9j1K43m89K23l1k48
3374b89Q34p25M33m01K90K61q45P58m02K07j94q3K70k43K20p9k00K94J37m23N49
3395C69n97N21k36l10N78o55O99m38Q9k9k15O57p43M49n2j60k31L23j57K47P6
3416A85l92M20n06O81p81N50K52q38Q11m11L19k58k44M46k97l15P39k94j73K09
3436A03l68N57q55M08K23k63N07r04P23r5j22K61m46M53j86j08K99n6j36L16m10
3457i9L58q8k37L41n31O27m36k3K71m11M36o23N20J00l28K43k43L11k20p2J92
3478H8J16l14N70p22K88R7k12M34o74O48k48j72J84k02J04k6o3K35k06k77O31
3499B79o45P75n61J02N53r90R14o51R6K54l67N23n26K14Q1j63J36K4k76M63l03
$$ y = [-139, -122, 11, -212, 319, -393, 147, -134, -379, 307, -494, 344, -347, -49, 53, 24, 13, 256, -233, -10, -41, -289, 545, -180, 253, -148, 142, 403, -442, 316, -86, 121, -73, -156, 114, -129, 91, 12, -188, 106, 243, -180, 369, -228, 293, 57, -253, 325, -330, 369, -69, 20, -9, -224, 433, -310, 139, 87, -73, -304, 19, -138, 109, 185, -207, 213, -293, 388, -393, 157, 409, -429, 382, -29, 290, 32, -212, 234, -63, -378, 361, 67, -106, 103, -265, 292, -563, -155, 68, -195, 312, -592, 131, 36, -86, 175, -271, 182, -4, -112, 187, 131, -5, 311, -99, 259, 171, -66, 275, -256, 371, -65, -88, 183, -228, 208, -415, 105, 205, -123, 120, -123, 188, -32, -104, 88, 204, -110, 460, -262, 26, 123, -89, 345, -329, 319, 71, -101, 83, -119, -15, -41, -104, 131, -75, -352, 279, -366, 409, -152, -50, 503, -487, 427, -224, -128, 126, -241, 282, -244, -30, 51, -112, 24, 48, -228, 235, -68]
3520f8j3M17n40N89o10N05l8k14K77o24N16l98L32q1J0JO7k00J30K37m14O44p23
3543a98M60k72j40M60n93O17m88J99j39J26K62k47p8J08j31J30J84o95O71m92
3563b56J88J52n25Q27o40N02j14k80L91l49K97l45R9K58r7k76K35j54J05J86l22
3584a18N12o80O85n89k4N08m80L00m92L05J86k10J73m7r9J24Nq5K4n36P12l41
3606a67K74J12l76O10n36K07Ll08K68k33R8J70k38J9J82l46M10l47J25L21l62
3627a14N52o99P09m46n8K29k84K88j82Q2l9m3J31l9k09N9J25k24L94o92O15k89
3649a34P0ml58P55m65J64q1j00J76j07O4r8K7R1K35o48O08l00J36Rj37L36n00
3672b61M65r5k43K41k53J08j28K70M1J88n15L29j77K9K07l62M72m39L19k37lK65
$$ y = [-68, -81, 336, -204, 385, -225, 280, 242, 28, 305, -319, 197, -201, 131, 50, 60, 61, 128, -72, 58, 295, -119, 525, -198, 262, -10, -150, 310, -283, 334, -154, 45, -94, 32, 294, 47, -31, 77, -54, 76, 260, -435, 236, -256, -68, 84, -441, 386, -254, 248, 134, -146, 245, -104, 193, -152, -53, 205, 108, -168, 67, -87, 18, 204, -118, 394, -286, 399, -190, -214, 294, -186, 114, -378, -73, 113, -97, 76, 29, -70, 54, 59, -26, -2, -538, 174, -167, 107, 219, -157, 453, -83, 124, 127, -181, 87, -146, -48, 122, -116, -97, 85, -261, 149, -198, -73, 248, -114, 438, -261, 448, 2, -56, 173, -111, 177, -5, 77, 38, -5, 126, 87, -122, -63, 62, -162, 232, -460, 155, -134, -64, -68, -426, 329, -136, 28, -53, -153, 23, -84, -20, -118, -91, 0, 235, -413, 195, -105, 31, 40, -97, 239, -261, 204, 109, -134, 107, -146, -38, -166, 104, 145, 333, -182, 147, -30, -1, 206, -156, 316, -123, 196, -41, -44, 221]
3694B21l63M32k93J28j59O5j18K28j25m3J42k79M67m75K90k13J50L6j04J84m23
3715b52L62j99N6l3P0J74l27K39j32P6r2K14k22j11L39k80L66l68K69l22J42n0
3737h1Q2J01j75J00j31K11j48L06m03K62Q2m55L34k60O79l95Q7j32l1L9k91L15
3759I6k77K43p5J55l35Q0k2J09J49l04M87k95J2o1pJ13j59K69k33Q9j94K74k97
3782a83K5P8M3K44k67J86j68J34M7k00J52j32K55m08L54j87j15J82j74M8J27K58
3804B99l57K87k01m9J04k77M18n18N16m55L40J5m9K65m15J78lm4k43N78l37k8
3826B4QN8M4l33K80n5J37o3k01K60k98K28k10J28J67j63j15K17nk68K75l75M13
3849A53l82K92q0%R1k51L79k91J74j63J98j55n8m7l0L61k30M6j13J31j7M0J98
$$ y = [221, -142, 290, -3, 125, -34, 31, -87, 141, 16, -27, 115, -164, 303, -172, 118, -95, 55, 91, -13, 171, -252, 110, -89, -33, -66, 4, 178, -149, 90, -42, 34, -58, 156, -66, -177, 162, -118, 248, -120, 149, -173, -31, -81, 1, 102, -73, 27, -104, 107, -41, 265, -138, 124, 206, -249, 85, -175, 504, 109, 196, 64, 33, 72, -219, 96, -181, 62, -13, 142, -193, -113, -135, -26, 123, -181, 306, 11, 23, -38, -45, 68, -91, 178, -55, 34, -160, 114, -183, -158, -80, -37, 207, -60, 126, -42, 92, 139, -61, 91, -41, 214, -194, 160, -27, -142, 40, -134, -86, 41, 299, -58, 229, 28, -21, 83, -194, 224, -294, 222, -233, 107, 122, 73, 338, -77, 101, 98, 54, -189, 389, 52, 24, 32, 90, 134, -199, 81, 26, 163, 100, -101, 159, -139, 89, -121, 7, 174, 11, -104, 113, 108, -160, 115, -260, 153, -229, 63, -17, -17, 74, -177, 202, -89, 85, -78, 120, -35, -93, -140, -170, 191, -39, 7, -106, 25, 8, 48, 246]
3872B46k03nl84M65o4j11J28j58P7l0Q5j91J28r4K95p0j40O9r1L63l73J71J05
3895B18l26K12k80K73m17J92o5L02j79K28k45M5J11k43L47j48J19p7j92L77l85
3916a33K13j38J2K5J14J5m6K4M9j84k85N25k95J45L7k31K67k59L44l22J50q4l9
3939i6J43j98J64o7J60m15K62L6k8q5R0J02m58M67l20L38j59rK81n82L98k96J78
3962i4N8k4J22M8k12J64r2j34M44o15M39j90L3K10l47L55k38J76j6j51n7rR7N
3986b8K89l61K90l86M38l23O4J48l8J0r6MO2j56L27k80O1j39Kj10K76j38J87k35
4010a32J81J63k85K34m09M32j98J25r7k8J36l25K76m4j17J98K5l20L46r3M8O5
4032A81l72M31k78K16J01o29O15l91M4N5n7K55j92Q6p2k38J80K54l94L95l24K17
$$ y = [246, 43, 38, -346, 119, 55, -56, 72, -86, -9, -39, 46, -145, -17, -111, 184, 114, -26, 43, -48, 315, -58, 113, 218, -108, 104, -176, 97, -320, -128, -193, 109, -70, 158, -87, -42, 69, -174, 173, 25, 144, 67, -125, 252, -133, 80, -58, -46, -21, 93, 108, 62, 86, 135, -49, -334, 191, -104, 41, 78, -153, 114, -145, 199, -123, 27, -57, -96, 47, -151, 13, -54, 106, -309, -47, -11, -39, -124, -34, 68, -390, 77, -243, 95, -64, -73, 208, -374, 24, -272, -94, -36, -60, 62, 110, -102, 62, -30, -164, 280, -335, 104, -86, -53, 157, -190, 165, -73, 103, 87, -64, -121, -130, -33, -28, 261, -100, 190, -196, 242, -81, -17, 131, 93, 103, 7, 11, 73, -83, 244, -36, 25, -114, -112, -222, 54, -84, 103, -132, 49, 212, -73, 161, -248, 184, -14, 111, 14, -14, 122, -203, 73, 29, -88, 110, 135, -185, 161, 68, 116, 181, -191, 240, -38, 178, 279, -350, 265, -126, -82, -27, -84, 171, -21, 65, -7, -245, -65, 189, -205, 190, -134, 83]
4054H3j28j17K28l05L09J18k49j06P7J47Jl9j1J70k71L21k92J91j27k03N01m67
4076a69M09m33L85Jm9m0k92L29rl11K32k9j49J11m7J5J54j55P9k73M29j25j68
4099a05K49k12J14j15Q7J16k78J77R9j31J11k66K86L2l32K13L3k41K98m70N93
4120B58k53P6m0k04L19m01K42r2J97j78K74l08L80k65k63M92l90L51n07L84j92
4141a20L0K56l19M54l96K41k78K28j17P3M5j38N8l8J57k59J77l03K49L7l71K98
4163c6j74L06j68k8J00J00J38j27q9j16O2K7P9qo6J82l33L97n20L19ok01J49j32
4187a45K50m2n4r5J76j53K16j57m3J48j27N2j78K66l3k43L17j37p1j03J26J15
4209H5j62K9J3j46K95M7k60L90m30K78j53J07k9j76K16j78K66l38J92mQ6o2L6
$$ y = [83, -45, -162, 66, -239, 70, 188, -61, -167, -90, 57, 58, 19, 8, 178, -93, 228, -64, 127, 0, -203, 298, -169, 240, -193, 192, 193, 144, 104, -188, 141, 132, -179, 53, 24, -125, -14, -61, -46, 108, -47, 32, -241, 188, 63, -105, 144, -68, 46, -69, 18, 134, -144, 33, 132, 1, 112, -154, 132, 164, -168, 45, 78, -163, 135, -335, 258, 5, 81, 41, -163, 156, -245, -3, -95, 102, -76, 198, -110, 270, 5, -258, 234, -156, 195, -312, 72, -120, -90, 166, -153, 301, -95, 146, -132, 96, -21, 52, 97, -41, 17, -21, 136, -123, 54, -249, 0, 37, -334, -36, -210, 96, -72, -100, 0, 100, 238, 111, 22, -94, -32, -5, 74, 66, 0, 182, -151, 246, -274, 45, 39, -162, -13, -145, 105, 63, 9, -86, 90, -63, 153, -4, -47, 101, -26, 26, -152, 114, 81, -162, 155, 18, -53, -156, -30, 85, -77, -48, -35, -181, 114, 161, -99, 291, -139, 139, -14, 93, 64, -112, 104, -74, 192, -146, 46, 42, 128, 66, 102]
4232A02K2jPk91J54j97J51K91j93Q9j68q7K1K38j25j45J06o5J68k33K12k90K14
4255b0L1m5L5l3J98m14L90j18j22qj82K31nJ49k08L19k00l8k1K64k80J14K39o04
4279c28M22j46j49M09l62J73R2R2k20J13Pn2j59P2J46j63L6R1Q8o6m3J99k72J72
4303A52k72K10m2lp4%PK05j64K1mr4J56j58n5J20p4Q8k56M15k87L2k6L7J24q5
4329b7J54k37J85m2p4J09j65K49j76K07m33L98l25J63N8L9p2j92L28k94J67J04
4351A24p2k06J8RJ40on0L3r6q3L37l29K27n5Qk3P7q3L3l4j6K14k93J44L3j83N8
4378g4n6R2m3L08l27J50n2M47n19Q4KJ76k62l5K77l05J66N7J09o8k69J69k56K19
4402a0J66j23J3m9O0Q1J4n59M89R7j59j60L26k44q4J30j82L39k37J08q2k52M48
$$ y = [102, 124, 123, 130, -161, -7, -204, -53, 238, 45, 134, -34, -121, -100, 138, 13, -132, -26, -91, 77, -156, 56, -234, -20, 11, -34, 1, -32, 166, -248, 142, 24, -98, -106, -288, -57, -62, 87, -121, 198, -2, -40, -61, 203, -77, 37, 276, -328, 94, -52, -201, 208, -154, 19, 111, 203, -17, 96, 103, 51, -108, -36, 110, -53, -17, 74, 162, 96, 53, 252, -20, 152, -120, 90, 48, 45, -29, -29, -22, 183, 19, 40, 36, -58, 98, -60, -115, 5, -69, 19, -237, 178, -109, -77, -103, -66, 58, -27, 127, -110, 75, 33, -41, 68, -97, 152, -24, 183, -250, 148, -177, -14, 44, 83, 11, -181, 147, -147, 20, 124, 52, -154, -136, -127, 13, 7, -43, -10, -106, -189, 148, -181, 46, -9, -1, -24, 53, -30, 3, -31, -47, 167, -126, 18, 51, -132, -74, -130, -38, -81, 227, -100, 50, -2, 445, -74, 10, 12, 188, -74, -109, 168, -137, 29, 86, 195, 127, -142, 27, -229, -10, 156, 33, 46, -3, 57, 138, 152, -407, 82, 179, 20, -140, 186, -58, -142, -12, -194, 145, -92, 16, -66, -318, 130]
4425A30k25R0k4M0nn6L13k51j66K0M59l08J26l69L24p3q8J40j58K18m50L32Q5
4448A04q7rJ68j63o4J72n6J13j93K72l90M0J27o6L0j43Q8j74O4L12k52J79l05
4471b33K32j26J53o9J19Q0k85Q7q4L47l29J18n0PL05n06M40n36N79l52L62j69
4493I0k94M64j76N5l78L46k09O1L9K6R3m21O53o39L36j4j76K16l6N6k5o6q7J63
4517G7j20J74j54L4r1k28M64k16O6M4j43J97j09Q3j34K7J7J22p6m6Q7j98K27j73
4541f9l6J10k9J55l12K24r9K02j64J2l5n%k3J51J3Qj61K42k45q6J77Jj50O9K88
4567B38l46R0J19k91L22j22J75l78L69j44n9n1J86k75J09R3n9R8k98M68j00k24
4589h0J2q2J32J82k7j49k2k9J00J1J0L1k75K41j66K12k41O8Np8L66k76k10J46
$$ y = [130, -95, -5, -29, 11, 6, -50, 263, 12, -154, -134, 325, 17, 143, -226, 98, 25, -63, 77, -81, 137, -313, 19, 104, 17, 8, 176, 13, -51, 121, 65, 178, -15, 257, -133, -93, 34, -32, -2, -145, -57, -231, -167, 145, -107, 72, -233, -1, -127, 26, -43, 76, 156, -129, -42, -126, 221, -108, 10, -40, -33, 272, -234, 206, -330, 249, -103, 259, 90, -204, 260, 84, 139, -239, 107, -102, -41, -2, 24, 117, -304, 349, -290, 46, 32, -144, 72, 36, 92, 67, 1, -86, 77, -43, 131, -23, 11, -80, -308, 156, -60, 6, 50, -93, 104, -5, 78, -56, -29, -12, 110, 34, -12, 75, -123, 104, -69, -105, 5, -24, 131, -181, 43, -56, 146, -18, -6, -41, -46, -46, -69, 82, 95, 103, -58, 184, -61, -147, 30, 31, -119, -50, 238, -108, -18, 101, -190, 132, 10, 185, -193, 176, 32, -27, -78, 108, -167, -58, 35, -24, 74, -224, 244, 144, -80, -68, -150, -18, 164, 137, -12, -34, -63, 37, 48, 58, 89, -186, 55, -111, 101, -140, -72, -67, -145, 221, -55, -265, -119]
4613a19J16j04r7L03k99K43l00K93q3J50k47J62Ol5N7j16K35m17J91J71l92L09
4635B7j25K0nJ42k04J28j81L00J24l12J29l03L04n0o5R3k6p7L5j3J11lj30J49
4659F8q2L4O2j07K17k42M44l44o8Lk8K00k13J57j03J3J37j79K08N7k87J12k4l3
4683Bj02P6K0J8j38L49l13K16k69J89j21M6M1j01m4k1R1n8kJ30o1J31o3J1j09
4708h2L46k15r5J47j13J47l14J89L0j31K79q6l1J28j56p3Q5j05M4k3R9j21P3o1
4732c9j59J23P4J99j09j95K9P3O3j4k38J43L3j37J01j33L82k13M3J11k29RL2R
4756d2J22k72J95j51Lm5J66j76L82l5j12K40n97L74k05K48k82J52J84r7l6o2J67
4779A21j48P7j70J62k3j61L91m70J60J6K7J29j16Jj06J08l10L46K0N1k7j36J71
$$ y = [-119, -3, -107, -204, 99, -200, 43, -257, 36, -47, 103, -144, 18, 24, -11, 46, -70, 165, -252, -61, 110, -282, 27, -98, -78, -83, 59, -145, -17, -198, 102, 226, -86, 43, -260, 44, -6, -71, 22, -4, -81, -46, -59, 52, 49, -81, 68, -14, 20, 82, -25, 192, -50, 394, 50, -18, -15, -43, 157, -56, 101, -2, 11, 148, -31, 177, 234, -53, 59, 35, 2, -100, -24, -4, 14, -124, 225, -88, 128, -141, 48, -73, -27, 14, -87, -131, -152, -61, -119, -121, 9, -52, 79, 16, 27, -82, 264, 49, -46, 101, -12, 135, -179, 10, 40, -91, 188, 102, 71, 199, 43, -30, 55, -50, -6, -29, 70, -51, 22, -39, -198, -75, -1, 198, 89, -106, -77, -4, 59, 45, -193, -50, -17, -154, -53, -186, 196, -17, 26, 137, -92, -83, -51, -42, 80, -192, 3, -148, -145, -190, -24, -200, 182, 147, 35, 275, -322, 52, -153, 95, -187, -35, 149, 52, 16, -46, 121, -27, 50, -120, 42, 19, -142, 249, -221, -61, -45, -18, 111, -5, -4, -110, -2, -312, 34, 54, 105, 78, -58, 113]
4802A13k02J35L8k6k73K33p%O6l17L19j30J03j00Q1j34J79j40J54k78J08j3K20
4825A29j05j1j1J4k2P4j83j7L8K05j28m9L22k56J4o7j23K76k36J93J53k22j81
4848a93K55j21K12r8K8p6O5j10P9n0P4K0j80J72j73pj8j49L77N2k14J55r0J80
4872A90l97L24k21j11K18J10o2j0M7k32M32m03J32L9m9j95J08L5j55K77l9N2j67
4895g7J28J35j84J43k56K04P0k26J78k03J50Mn2j71M32k22k2o2jL3Q8J4m9m8m7
4920d1L6j25N3j49J55J27j26j13J01N4J83k67K11l1q6k76J97J7L8J05K8k84P7
4943a16K61k68K19nj18M5j37Q3P6O9j93L75m53J47K1o2R9k30K41r6R3j76L52m9
4967A78r7M7l4Rp3n0O8L9k1j00j08N2J98j76K24k99J58j02L1O0j6J22j54l9K45
$$ y = [113, -89, 46, 84, 58, -215, 18, 11, 11, 77, -240, 79, -51, 52, -48, 33, -101, 78, -62, 92, -186, -78, -91, 129, 24, 13, 2, 16, -6, 68, -115, -132, -94, 111, -17, -66, 256, 0, 14, -53, -176, 100, -136, 57, 210, -12, -193, 62, -59, 153, 55, 83, 7, 72, -38, 41, -9, 65, 85, -95, 77, -96, -103, -121, -270, 107, 159, -55, 100, 10, 190, -207, 117, -104, -215, 3, 113, 51, 41, 88, -144, 288, -115, 17, 56, 7, -188, -80, -45, -200, 77, 38, 90, -77, 51, 186, 2, 145, -111, 93, 163, -63, 115, -88, 62, 66, 14, -157, 275, 53, 31, -31, -32, 1, 89, 103, 54, 6, -41, -5, -130, -77, -226, -71, 56, -70, -183, -82, -28, 155, -112, 99, 68, -18, -294, -97, -80, -42, 63, 91, -193, -116, 145, -123, 96, 91, -27, 18, -119, -36, 40, 109, -84, 291, -162, -15, 6, -56, 43, -187, 54, -42, 51, -125, 227, 178, 81, 128, 94, 103, 30, -20, 48, 87, 66, -34, -142, -90, 108, -68, 156, -143, 15, -87, -56, 4, -12, 110, -44, -83, 162]
4992A62k82K55j07r9m5N2Qq7Rm9K27j71L41k52j5J5j93J94nQ5j58Q6NJ3j05J25
5018IN8j31L07k67J12k00J10r7O5N4K0Q5Mj19j29J32k05L39j54M7J50k06L3J08
5042A25o6l1J44k7%kl53L37r9o8l4O4J47k35J35l39K87q7q2J13k4K37j92Oj8K92
5068B30k33n1o8K70k09l3K42k77L5L1k2J2K55l4k05j24J22J57j78J43p9m0J24
5091F8k49K92q5R4l53K71j55Q9j9j17J54L1n6L00l51J67j20p9PL38k49OQ9j0j1
5116E2j62%r3K39j08M4Km2P2j80O5o0L89k91J6J00m7K4j20R8J70j44j54J65j11
5141g6kO4Q7j64k2Qp8J22N6k1ML6OR5j31k54M56k84J57r4R4K6k92L55j11N7m5
5168D9r5K78j20k16K02p1m7J37j11n0L8K1o6n9K31j60m1J59k83L04j8k53mK15
$$ y = [162, -120, 135, 28, -71, -116, -64, -56, -143, -134, -183, 44, -127, 214, -38, -53, -38, -231, -37, -42, 43, -115, -29, -24, -11, -116, 9, 67, -64, 243, -24, 88, -112, -2, -99, -34, 20, 40, 125, 129, 10, -119, 13, -192, 147, -7, 40, 190, -16, 17, 125, 59, 28, 172, 145, 145, 143, -210, 127, 28, -40, -74, -10, 137, -98, 37, -302, -15, -102, -184, -71, -95, 142, -50, -44, -62, 230, -3, -54, -122, 148, -61, -94, 148, -129, -94, -63, -85, -73, 182, 148, -57, -181, -59, 98, -80, 63, -16, -56, 68, -181, 111, 26, 120, -233, 38, -117, -28, -47, -164, -10, 21, -35, 265, -86, 81, -39, -118, -111, 227, -22, -16, 73, 63, 52, -110, -110, -203, 36, -72, -28, -26, -68, 4, -176, -111, -171, 218, -73, -57, 43, -4, 20, -100, -2, 168, 24, -130, 35, -76, -78, -14, 73, -91, -113, -105, -183, -61, -5, -26, -22, 14, 20, 115, -16, -270, 186, -98, 59, -35, 59, 85, -207, 148, 37, 94, 49, -46, 232, 112, -104, 98, 27, -20, 117, 6, -44, -6, 15, -51, -110, 121, -39, -80, 79, -204, 100, 82, -171, -175, 40]
$$ [...]
8191h7
##END NTUPLES=NMR FID
##END=
