##TITLE=1H_EC-3236(23)
 CDCl3, 8 sc, 
 21.10.2020
##JCAMPDX= 6.0         $$ Bruker NMR JCAMP-DX V2.0
##DATA TYPE= NMR FID
##DATA CLASS= NTUPLES
##ORIGIN= UXNMR, Bruker Analytische Messtechnik GmbH
##OWNER= root
$$ XWIN-NMR		Version 3.5
$$ Wed Oct 21 10:25:41 2020 Russian Standard Time (UT+4h)  she@DPX200
##.OBSERVE FREQUENCY= 200.1315066352
##.OBSERVE NUCLEUS= ^1H
##.DELAY= (6, 6)
##.ACQUISITION MODE= SIMULTANEOUS
##.ACQUISITION SCHEME= undefined
##.AVERAGES= 8
##.DIGITISER RES= 18
##SPECTROMETER/DATA SYSTEM= spect
##.PULSE SEQUENCE= zg30
##.SOLVENT NAME= CDCl3
##.SHIFT REFERENCE= (INTERNAL, CDCl3, 0, 15.7039)
##AUDIT TRAIL= $$ (NUMBER, WHEN, WHO, WHERE, WHAT)
$$ ##TITLE= Audit trail, XWIN-NMR		Version 3.5
$$ ##JCAMPDX= 5.01
$$ ##ORIGIN= Bruker BioSpin GmbH
$$ ##OWNER= she
$$ F:/spectra/data/she/nmr/H-F/1/audita.txt
$$ ##AUDIT TRAIL=  $$ (NUMBER, WHEN, WHO, WHERE, WHAT)
(   1,<2020-10-21 10:24:21.40 +0400>,<she>,<DPX200>,
      <created by zg, POWCHK disabled, PULCHK disabled
       configuration hash MD5:
       00 E9 B6 7A A2 85 ED C7 34 08 36 98 17 FE 4E 26
       data hash MD5: 16K
       85 E2 32 1B 91 BC A2 D6 2D 6D 00 91 16 DC 18 40>)
$$ ##END=
$$ 
$$ hash MD5
$$ AC 21 21 18 D0 88 D1 46 92 A1 9D 1C E0 ED AF F0
##$RELAX= 
##$RELAX= 
##$RELAX= 
##$RELAX= 
##$RELAX= 
##$RELAX= 
$$ Bruker specific parameters
$$ --------------------------
##$DU= <F:/spectra>
##$EXPNO= 1
##$NAME= <H-F>
##$PROCNO= 1
##$TYPE= <nmr>
##$USER= <she>
##$AMP= (0..31)
100 100 100 100 100 100 100 100 100 100 100 100 100 100 100 100 100 100 
100 100 100 100 100 100 100 100 100 100 100 100 100 100 
##$AQSEQ= 0
##$AQ_mod= 1
##$AUNM= <au_zg>
##$AUTOPOS= <>
##$BF1= 200.13
##$BF2= 200.13
##$BF3= 200.13
##$BF4= 200.13
##$BF5= 200.13
##$BF6= 200.13
##$BF7= 200.13
##$BF8= 200.13
##$BYTORDA= 1
##$CFDGTYP= 0
##$CFRGTYP= 5
##$CHEMSTR= <none>
##$CNST= (0..31)
1 1 145 1 1 1 1 1 1 1 1 1 1 1 1 1 1 1 1 1 1 1 1 1 1 1 1 1 1 1 1 1 
##$CPDPRG= <>
##$CPDPRG1= <>
##$CPDPRG2= <>
##$CPDPRG3= <>
##$CPDPRG4= <mlev>
##$CPDPRG5= <mlev>
##$CPDPRG6= <mlev>
##$CPDPRG7= <mlev>
##$CPDPRG8= <mlev>
##$CPDPRGB= <>
##$CPDPRGT= <>
##$D= (0..31)
0 1.2 0 0 0 0 0 0 0 0.06 0 0.03 0 0 0 0 0.0002 0 0 0 0 0 0 0 0 0 0 0 0 
0 0 0 
##$DATE= 1603261460
##$DBL= (0..7)
120 120 120 120 120 120 120 120 
##$DBP= (0..7)
150 150 150 150 150 150 150 150 
##$DBP07= 0
##$DBPNAM0= <>
##$DBPNAM1= <>
##$DBPNAM2= <>
##$DBPNAM3= <>
##$DBPNAM4= <>
##$DBPNAM5= <>
##$DBPNAM6= <>
##$DBPNAM7= <>
##$DBPOAL= (0..7)
0.5 0.5 0.5 0.5 0.5 0.5 0.5 0.5 
##$DBPOFFS= (0..7)
0 0 0 0 0 0 0 0 
##$DE= 6
##$DECBNUC= <off>
##$DECIM= 32
##$DECNUC= <off>
##$DECSTAT= 4
##$DIGMOD= 1
##$DIGTYP= 9
##$DL= (0..7)
0 120 120 120 120 120 120 120 
##$DP= (0..7)
150 150 150 150 150 150 150 150 
##$DP07= 0
##$DPNAME0= <>
##$DPNAME1= <>
##$DPNAME2= <>
##$DPNAME3= <>
##$DPNAME4= <>
##$DPNAME5= <>
##$DPNAME6= <>
##$DPNAME7= <>
##$DPOAL= (0..7)
0.5 0.5 0.5 0.5 0.5 0.5 0.5 0.5 
##$DPOFFS= (0..7)
0 0 0 0 0 0 0 0 
##$DQDMODE= 0
##$DR= 18
##$DS= 0
##$DSLIST= <SSSSSSSSSSSSSSS>
$$ [...]
##$SUBNAM2= <"">
##$SUBNAM3= <"">
##$SUBNAM4= <"">
##$SUBNAM5= <"">
##$SUBNAM6= <"">
##$SUBNAM7= <"">
##$SUBNAM8= <"">
##$SUBNAM9= <"">
##$SW= 16.880792210976
##$SWIBOX= (0..15)
0 0 2 0 0 0 0 0 0 0 0 0 0 0 0 0 
##$SW_h= 3378.37837837838
##$TD= 16384
##$TD0= 1
##$TE= 0
##$TE2= 300
##$TE3= 300
##$TEG= 300
##$TL= (0..7)
0 120 120 120 120 120 120 120 
##$TP= (0..7)
150 150 150 150 150 150 150 150 
##$TP07= 0
##$TPNAME0= <>
##$TPNAME1= <>
##$TPNAME2= <>
##$TPNAME3= <>
##$TPNAME4= <>
##$TPNAME5= <>
##$TPNAME6= <>
##$TPNAME7= <>
##$TPOAL= (0..7)
0.5 0.5 0.5 0.5 0.5 0.5 0.5 0.5 
##$TPOFFS= (0..7)
0 0 0 0 0 0 0 0 
##$TUNHIN= 0
##$TUNHOUT= 0
##$TUNXOUT= 0
##$USERA1= <user>
##$USERA2= <user>
##$USERA3= <user>
##$USERA4= <user>
##$USERA5= <user>
##$V9= 5
##$VALIST= <valist>
##$VCLIST= <CCCCCCCCCCCCCCC>
##$VD= 0
##$VDLIST= <DDDDDDDDDDDDDDD>
##$VPLIST= <PPPPPPPPPPPPPPP>
##$VTLIST= <TTTTTTTTTTTTTTT>
##$WBST= 1024
##$WBSW= 4
##$XGAIN= (0..3)
0 0 0 0 
##$XL= 0
##$YL= 0
##$YMAX_a= 538823
##$YMIN_a= -424785
##$ZGOPTNS= <>
##$ZL1= 120
##$ZL2= 120
##$ZL3= 120
##$ZL4= 120
##$ABSF1= 10
##$ABSF2= 0
##$ABSG= 5
##$ABSL= 3
##$ALPHA= 0
##$AQORDER= 0
##$ASSFAC= 0
##$ASSFACI= 0
##$ASSFACX= 0
##$ASSWID= 0
##$AUNMP= <proc_1d>
##$AZFE= 0.1
##$AZFW= 0.1
##$BCFW= 1
##$BC_mod= 2
##$BYTORDP= 1
##$COROFFS= 0
##$CY= 11.3945322036743
##$DATMOD= 1
##$DC= 2
##$DFILT= <>
##$DTYPP= 0
##$F1P= 16.9975609425685
##$F2P= -3.02152046262296
##$FCOR= 0.5
##$FTSIZE= 0
##$FT_mod= 4
##$GAMMA= 1
##$GB= 0.15
##$INTBC= 1
##$INTSCL= 1
##$ISEN= 128
##$LB= 0.24
##$LEV0= 0
##$LPBIN= 0
##$MAXI= 10000
##$MC2= 0
##$MEAN= 0
##$ME_mod= 0
##$MI= 1.114404
##$NCOEF= 0
##$NC_proc= 0
##$NLEV= 6
##$NOISF1= 3.799351
##$NOISF2= 2.8
##$NSP= 1
##$NTH_PI= 0
##$NZP= 0
##$OFFSET= 15.70392
##$PC= 1
##$PHC0= -10689.67
##$PHC1= 12.60089
##$PH_mod= 1
##$PKNL= yes
##$PPARMOD= 0
##$PSCAL= 0
##$PSIGN= 0
##$REVERSE= no
##$SF= 200.130013532006
##$SI= 16384
##$SIGF1= 3
##$SIGF2= 2
##$SINO= 400
##$SIOLD= 16384
##$SREGLST= <1H.CDCl3>
##$SSB= 0
##$STSI= 0
##$STSR= 0
##$SW_p= 3612.71676300578
##$SYMM= 0
##$S_DEV= 0
##$TDeff= 0
##$TDoff= 0
##$TI= <>
##$TILT= no
##$TM1= 0
##$TM2= 0
##$TOPLEV= 0
##$USERP1= <user>
##$USERP2= <user>
##$USERP3= <user>
##$USERP4= <user>
##$USERP5= <user>
##$WDW= 1
##$XDIM= 8192
##$YMAX_p= 0
##$YMIN_p= 0
$$ End of Bruker specific parameters
$$ ---------------------------------
##NTUPLES= NMR FID
##VAR_NAME=  TIME,          FID/REAL,        FID/IMAG
##SYMBOL=    X,             R,               I
##VAR_TYPE=  INDEPENDENT,   DEPENDENT,       DEPENDENT
##VAR_FORM=  AFFN,          ASDF,            ASDF
##VAR_DIM=   8192,          8192,            8192
##UNITS=     SECONDS,       ARBITRARY UNITS, ARBITRARY UNITS
##FACTOR=    0.000296,      1,               1
##FIRST=     0,             0,               0
##LAST=      2.424536,      0,               0
##MIN=       0,             -424785,         0
##MAX=       2.424536,      538823,          0
$$ Real data points
##PAGE= N=1
##DATA TABLE= (X++(R..R)), XYDATA
$$ [...]
2046B13J815k558K528k323K549k120K76J626k699K861k664K288j961J063M7j022
$$ 213 2028 -530 1998 -325 2224 104 380 2006 -693 2168 -496 1792 -169 894 941 -81
2062h1Q41o48R39k069K209j817J414j851J411K96k255L213l390K890k469J653
$$ -81 760 112 1051 -1018 1191 -626 788 -1063 348 644 -1611 1602 -1788 1102 -1367 286
2078B86m81j687K592j884Q55r26J435j483R75r58J106o34o28K306l771L977k861
$$ 286 -195 -1882 710 -1174 -319 -1245 190 -1293 -318 -1276 -170 -804 -1432 874 -2897 1080 -1781
2095a781J446L59j881L185l282K389p76K58p8J57j31O34n46J20J395l174M187
$$ -1781 -335 24 -1857 1328 -1954 435 -341 -83 -161 -4 -135 499 -47 73 1468 -1706 2481
2112B481l553J859k55q74K403l752L894k347N25L20n6L2m79P97o57O13j293K445
$$ 2481 -1072 787 532 -342 2061 -1691 2203 -144 381 701 645 677 198 995 338 951 -342 2103
2130B103k937K189r28n57J737l026L783l489K331q29r57J672j766J440j259P58
$$ 2103 -834 1355 427 -130 1607 -1419 2364 -1125 1206 377 -580 1092 -674 766 -493 265
2146B65k13l2j235K184k031P89R20k452K851l362L766k847k62K737l172K290j768
$$ 265 52 20 -1215 969 -1062 -273 647 -1805 1046 -2316 1450 -1397 -1659 1078 -2094 196 -1572
2163a572J573q16j57N75L80j574J713j03j873L233l506L461l162J811J074l386
$$ -1572 1 -815 -972 -397 -17 -1591 122 19 -1854 1379 -2127 1334 -1828 -17 1057 -2329
2179b329M019l238J952p89L5N72n45L73M64o52l9J611k795L074k461J676j56j415
$$ -2329 1690 -1548 404 -385 -350 222 -323 50 514 -138 -177 1434 -1361 1713 -748 928 772 -643
2197f43K937l646L362j978O37M42q35J323j819J132j58O4j261J867j620J072p05
$$ -643 2294 -1352 2010 32 669 1111 276 1599 -220 912 754 818 -443 1424 -196 876 171
2214A71n4J272l166M259l803J789m41p40K106l237K727j351J66J53Q9r29J023
$$ 171 117 1389 -1777 2482 -1321 468 27 -713 1393 -1844 883 -468 -302 -149 -60 -989 34
2231C4r60M83O05k476L654l754K953j445o27K263k867L225k680J158J46p86N69
$$ 34 -926 -443 162 -2314 1340 -2414 539 -906 -1533 730 -2137 1088 -1592 -434 -288 -1074 -505
2248e05K38n48K50P20j483K299k756K978j831p4K148k893K809k573K369j082q7
$$ -505 -267 -815 -565 155 -1328 971 -1785 1193 -638 -712 1436 -1457 1352 -1221 1148 66 -21
2265b1J125j129O83m63Q53j121J238j106J560j968J100N69j757K545k858L019
$$ -21 1104 -25 658 195 1048 -73 1165 59 1619 -349 751 1320 -437 2108 -750 2269
2281B269k671J023Q32k155K174j647J174j115M69k73J01m89J032j041l24J931
$$ 2269 -402 621 1453 -702 1472 -175 999 -116 353 80 181 -308 724 -317 -641 1290
2297A290l131L044k458J488l06j528K871l415K490j089K28rJ07r7j24j70J18R93
$$ 1290 -1841 1203 -1255 233 -73 -1601 1270 -2145 345 -744 -516 -525 -418 -515 -639 -809 -691 302
2315C02k576L198k581J432k65p84K114l185L280j986Q96Nk21L17n58J039j092
$$ 302 -2274 924 -1657 -225 -490 -1274 840 -2345 935 -1051 -155 -150 -371 -54 -612 427 -665
2332f65J155j125J903k251J727j40j032J426j729K333k479K136r53m13J107r77
$$ -665 490 -635 1268 -983 744 604 -428 998 -731 1602 -877 1259 306 -107 1000 23
2348B3J385j999K065j272O23p24O84m97k22J003j402J861k458K429j653L65R31
$$ 23 1408 -591 1474 202 825 101 785 288 66 1069 -333 1528 -930 1499 -154 211 1142
2365A142j821J866j923J603j072K07K4m3j85Q1N67j609K119k213K078j731P77
$$ 1142 -679 1187 -736 867 -205 2 26 -17 -202 -121 446 -1163 956 -1257 821 -910 -133
2382a33L86j896K119j814J532j328J235q15j47O73p46R70j457J830j725J207o14
$$ -133 253 -1643 476 -1338 194 -1134 101 -714 -861 -188 -934 36 -1421 409 -1316 -109 -723
2399g23M50K14j052J803j867J832j702J457q11L4J127j187J201j530J852j476
$$ -723 -273 -59 -1111 692 -1175 657 -1045 412 -399 -365 762 -425 776 -754 1098 -378
2415c78R81j73j80L45p11J302j927J875j273J045q40M40M75j575K326k062J425
$$ -378 603 430 250 595 -116 1186 -741 1134 -139 906 66 506 981 -594 1732 -330 1095
2432A095j134J123o72n3O31j283J250j342J622j728J052k35k29K55r32J313j854
$$ 1095 -39 1084 412 359 990 -293 957 -385 1237 -491 561 326 97 352 -580 733 -1121
2449a121J647j011O22q82L20P69j733J937j763J351j401J031p6r10J345j088J012
$$ -1121 526 -485 137 -745 -425 344 -1389 548 -1215 136 -1265 -234 -310 -1220 125 -963 49
2466D9j429J632j471Q70j24%M30j296K234k464J869p79N0M42m76R31j301J277
$$ 49 -1380 252 -1219 -349 -473 -473 -43 -1339 895 -1569 300 -479 -429 13 -463 468 -833 444
2484D44p08Q01j224J426o34j01Q49j431J813k067K329j418J57P03r01R91j483
$$ 444 -264 537 -687 739 105 4 853 -578 1235 -832 1497 79 236 939 38 1029 -454
2501d54J711j092O20o40N27l28R7M36j125J449j897J916j678R80k8j018J550j787
$$ -454 1257 165 785 145 672 344 441 877 -248 1201 -696 1220 -458 522 494 -524 1026 -761
2519g61J556j526Q89k34l36M35l92L33p88J205j319J124j411J309n11o76J731
$$ -761 795 -731 158 -76 -412 23 -369 -36 -824 381 -938 186 -1225 84 -427 -1103 628
2536F28k148K124k020J564o55o11J010o25M35n85J255j269R51q90J079p80l2J320
$$ 628 -1520 604 -1416 148 -507 -1118 -108 -733 -298 -883 372 -897 54 -836 243 -537 -569 751
2554G51j972K217j905J522p44k06J252j654J661j052P45n10O97n91J89J5j69M49
$$ 751 -1221 996 -909 613 -131 -337 915 -739 922 -130 615 105 802 211 400 415 246 695
2572F95j004J809k390K087j018K35M85j542K363k212J242m64Q8mn1J73m48J56
$$ 695 -309 1500 -890 1197 179 414 899 -643 1720 -492 750 286 374 370 319 492 44 200
2590B00p2Q93k101K129j237K25K67j025J828k618K440j392J08N65p56L37n51Q39
$$ 200 128 1021 -1080 1049 -188 37 304 -721 1107 -1511 929 -463 -355 210 -546 -209 -760 79
2608G9o36M81o87R13j192Q52L7j123J605j634K024k127J258N8r75J271j196J354
$$ 79 -557 -76 -763 150 -1042 -190 -153 -1276 329 -1305 719 -1408 -150 -92 -1067 204 -992 362
2626C62j320Q65o3j27k24P26l03l01J215j609J594j438J483q05o18K032k110J800
$$ 362 -958 -93 -156 -283 -507 219 -84 -385 830 -779 815 -623 860 55 -563 1469 -641 1159
2644A159j222P67n53k1M35k61n6K08J00o86J341j540J382r18L8J043j985K145
$$ 1159 -63 704 151 130 565 304 248 456 556 -130 1211 -329 1053 135 173 1216 -769 1376
2662A376j939J042j60l72O76q35O60n34K77o99J231j518J312r33L20M67j772K186
$$ 1376 -563 479 319 -53 623 -212 448 -86 191 -508 723 -795 517 -416 -96 371 -1401 785
2680G85j854J166p99L18K78r50J563j749J014k39K79n45L61L0j15K67n98J177
$$ 785 -1069 97 -702 -384 -106 -1056 507 -1242 -228 -467 -188 -733 -372 -342 -457 -190 -788 389
2698C89j640J931j556O24M39j025J597j765J558j027L34N3M42l31m2J85k67P49
$$ 389 -1251 680 -876 -252 187 -838 759 -1006 552 -475 -141 -88 354 23 -19 166 -101 648
2716F48j207J998j948J056K34p89J101j732K095j684O28N11q00M89l16N11r58
$$ 648 -559 1439 -509 547 781 -8 1093 -639 1456 -228 400 911 111 600 284 795 -163
2733a63J019r44P99j277J256k66r34J449j761J731j514J243o09m44R44r60N95
$$ -163 856 -88 711 -566 690 424 -510 939 -822 909 -605 638 29 -415 529 -431 164
2750A64q50J381j508O92n02L52j94j52R38j319J445j520R58p19N87N38j737J806
$$ 164 -686 695 -813 -121 -623 -271 -465 -617 321 -998 447 -1073 -115 -834 -247 291 -1446 360
2768C60j260R13p56P17k60k40M86j46K11r84J596j535J162o12K15M37r76J615
$$ 360 -900 13 -743 -26 -286 -526 -40 -186 25 -959 637 -898 264 -348 -133 304 -672 943
2786I43j859J621r88M66n5K2K89n01N81q19J286j198J125r52K29P84j361J492
$$ 943 -916 705 -283 183 128 150 439 -62 519 -300 986 -212 913 -39 190 974 -387 1105
2804A105j699J639r39K70pk06N53r42J083j232J015q54P26n03l58J038j161R87
$$ 1105 -594 1045 106 376 369 163 716 -226 857 -375 640 -214 512 9 -349 689 -472 515
2822E15q88J066j324N13J42l37M61j166J734j811J575r55M51l82k02P44j050J013
$$ 515 -373 693 -631 -118 24 -313 148 -1018 716 -1095 480 -475 -24 -406 -608 136 -914 99
2840I9j033J099j057R52m81o2M89r22J172j207J229o42J05L98l37M24q15J290
$$ 99 -934 165 -892 60 -421 -483 6 -916 256 -951 278 -364 -259 139 -198 226 -589 701
2858G01j423R18n79O78l73K07P33j303J314r48Q50j038P77k2l96O08p31J021j254
$$ 701 -722 196 -383 295 -78 129 862 -441 873 -75 775 -263 514 492 96 704 -27 994 -260
2877b60J313j034M19L25q62J018j026J061r72O68q24O74m11j13Q32j361J234j391
$$ -260 1053 19 438 763 -99 919 -107 954 -18 650 -174 500 89 -24 808 -553 681 -710
2895g10J366j176N24N19j182J132q18M67r35J070o57J85j81p3O05j259J756j801
$$ -710 656 -520 4 523 -659 473 -345 122 -813 257 -400 -215 -396 -469 136 -1123 633 -1168
2913a168J060m54J86K66q06J473j596J207r14P04o51M22K75n63Q82j044J149j185
$$ -1168 -108 -562 -376 -110 -916 557 -1039 168 -746 -42 -693 -271 4 -559 323 -721 428 -757
2931g57J135p23M27K30o30J167j537J453j269J206o65J90N03r13J071p96M41n63
$$ -757 378 -345 82 312 -318 849 -688 765 -504 702 37 227 730 -183 888 92 533 -30
2949c0J016q45K38K93o40R01j395J624j662R64o0m26Q11j004J059j223R47o37
$$ -30 986 141 379 672 32 933 -462 1162 -500 464 404 -22 789 -215 844 -379 568 -69
2967f9N65p19K92K99n87P74j451J707j599J052l38l68P43j264J394j256Q37n90
$$ -69 496 -223 69 368 -219 555 -896 811 -788 264 -74 -442 301 -963 431 -825 12 -578
2985e78K85J4j80K52p08J052j063J048r42J036r73K86O53j324J352j034J219j044
$$ -578 -293 -279 -459 -207 -915 137 -926 122 -820 216 -757 -471 182 -1142 210 -824 395 -649
3003f49N62n5k56O28m65O42r86Q85o33Q47o48J70L06o40J160j512J574j163Q05
$$ -649 -87 -142 -398 230 -235 407 -579 306 -327 520 -128 42 348 -292 868 -644 930 -233 572
3022E72R8r67J271j227O93n23P81n71J21R7r4K28o94J260j901J815j330N64J55
$$ 572 670 -297 974 -253 440 -83 698 127 248 345 251 479 -215 1045 -856 959 -371 193 348
3041C48o93J145j438J395j075M04j21M9m1k66N52q92Q06r50J082r76O49k37k62
$$ 348 -345 800 -638 757 -318 86 -35 14 -27 -293 259 -633 173 -777 305 -671 -22 -259 -521
3060e21R19j506J560j289Q65l25l47O73p28P51o55M81m23N87o56Q26n56j31P53
$$ -521 398 -1108 452 -837 28 -297 -644 29 -699 52 -603 -122 -545 42 -614 212 -344 -475 278
3079B78j292J717j525J331o87l15R65q00O42p84J072p83M97l12N03m19o4O15j013
$$ 278 -1014 703 -822 509 -178 -493 472 -328 314 -470 602 -181 316 4 507 88 24 639 -374
3098c74J295j270J282r27K21O77j056J203j161J166j118L24J37R1j99j74M23p52
$$ -374 921 -349 933 6 227 904 -152 1051 -110 1056 -62 262 399 490 291 117 540 -212
3116b12Q21r10Q22p91L94J81q18J309j562J217r90O17j83k77L88m85M87n61Q69
$$ -212 609 -301 521 -270 124 305 -513 796 -766 451 -539 78 -105 -382 6 -479 8 -553 316
3135C16j214Q27l90J94Q5n81R78j295J371j047O62j25k73N11o56O90n14N75p86
$$ 316 -898 -71 -461 -267 -182 -763 215 -1080 291 -756 -94 -219 -492 19 -637 53 -461 114 -672
3154f72J013n41n1K94k1N11j076J474j505P76r5k95P97q60J225j398J125p81M75
$$ -672 341 -200 -251 43 22 533 -543 931 -574 202 107 -188 609 -251 974 -424 701 -80 395
3173C95j30O7R2n80J108r00Q81j193R85m70l38Q35j011J050j110J123r07N33j44
$$ 395 265 332 424 -156 952 52 933 -260 725 255 -83 752 -259 791 -319 804 -103 430 286
3192B86l99N56r38R92q13O10p17O04o19J64O33j076J114j207J083p54K13K94o49
$$ 286 -113 443 -495 497 -316 294 -423 181 -438 -274 359 -717 397 -810 273 -481 -268 26 -623
3211f23N19o16Q35r18R74o72L89j56j15L69q58J185j115J244r63L17M2k35O45
$$ -623 -104 -720 115 -803 171 -501 -112 -268 -383 -14 -872 313 -802 442 -521 -204 -162 -397 248
3230B48r55J143j009R65n51K91j39k0M78r58J201q77N40k01J20m1j67N33p56Q58
$$ 248 -707 436 -573 392 -159 132 -7 -27 451 -507 694 -183 357 156 276 235 68 601 -155 703
3250G03q03Q83q66L18K01m90N70o74P95r65J029p78J92K5rO15j155J150r80O78
$$ 703 -100 783 -83 235 436 -54 516 -158 637 -328 701 -77 115 140 131 746 -409 741 -239 439
3270D39k68k09M2k94Q71j215Q54m50M57p20L23L09p73Q17j031J006r84J000p16
$$ 439 171 -38 4 -290 581 -634 220 -230 227 -493 -170 139 -634 183 -848 158 -826 174 -542
3289e42R5L49m52O27q53J012r35P92n85J26K65n97J065j144J036p87Q52m49O7
$$ -542 -447 -98 -550 77 -776 236 -699 93 -492 -366 -101 -698 367 -777 259 -528 324 -125 -58
3308e8L79o39P15q56R54r50R90m36j58N04n30Q82q66P14p54O20l92K39K77o64
$$ -58 321 -318 397 -459 495 -455 535 99 -59 445 -85 797 -69 645 -109 511 119 358 635 -29
3328b9Q45j056R37q86Q89n60j69O82o49O74j092R23p00N07k70J9K67n56O72j091
$$ -29 816 -240 697 -189 700 140 -29 653 4 678 -414 509 -191 316 46 65 332 -224 448 -643
3348f43R97p45N43m31K35N7n19P66q79O68o16O09l20p4L59o35P27n41M67m44J10
$$ -643 354 -391 152 -279 -44 13 -506 260 -619 49 -567 42 -278 -352 7 -628 99 -442 25 -419 -309
3369c09p2K05M7l78R26j282J306j224Q44Jk90O74j149J230n91L12l36N23k86k38
$$ -309 -381 -176 -129 -507 419 -863 443 -781 63 64 -226 448 -701 529 -62 250 -86 437 151 -87
3389h7L35l95P12r11J121r46O04Km42O35q45R33j009Q30m19K39n4k08N97r03R56
$$ -87 248 -147 565 -346 775 -171 433 435 -7 628 -217 716 -293 537 118 357 303 95 692 -211 745
3410G45r16O72o65N16j11k68L04n01R90j237R55o46O9L5l58P11r04R49p12L22
$$ 745 -171 501 -164 352 241 -27 277 -224 766 -471 484 -162 -93 -58 -416 295 -609 340 -372 -50
3430e0k44K35j95j46L26n53Q89r92J071p88J98J61l38P95j034Q13p04M25J8K3
$$ -50 -294 -59 -254 -400 -74 -627 262 -730 341 -447 -249 -88 -426 369 -665 148 -556 -131 -113 -90
3450i0M6Q3Q0m76M62n97P44o67O38lo17R80r88R68p30P13l41j72K53l40M18n09
$$ -90 -44 39 119 -357 105 -492 252 -415 223 220 -397 583 -405 563 -167 546 205 33 286 -54 364 -145
3472a45P01o98O40l97K11l62L5O78q47P94r77P85j62m2J38n65P36q89P88o73O58
$$ -145 556 -142 498 101 312 -50 -15 663 -184 610 -367 418 256 214 352 -213 523 -366 422 -251 407
3493D07m31J41J2l59M77n51Q30q86N40l77L0L76r38J040q33N88n25L28k65K52
$$ 407 -24 117 129 -230 247 -304 526 -360 180 -197 -167 209 -729 311 -522 66 -459 -131 -396 -144
3513a44l7l36M07k59M88p74P11l23j93L69m10P34q71P22l96M4L21j88K33m54O28
$$ -144 -181 -517 -110 -369 119 -655 56 -267 -460 -91 -501 233 -638 84 -312 -268 53 -135 98 -356 272
3534B72l58O85q01M67k20j15K83j45N80r46R70q79L65P2k9K79m07N30n86M22m04
$$ 272 -86 599 -202 265 45 -70 213 68 648 -298 672 -207 158 230 201 480 73 603 17 439 35
3555C5L83l34M1J81l08O56q85O28o80N87l2j97N81r63Q00r28P05m76L51k14o0
$$ 35 418 84 125 306 -2 654 -231 397 -283 304 272 75 656 -307 493 -435 270 -206 145 -69 -129
3576a29K34n16O61o26M76m18L46k78k8N24q32P91p76O24m09K63j79j59J62q4M32
$$ -129 105 -411 250 -376 100 -318 28 -250 -278 246 -586 205 -571 53 -356 -93 -272 -431 -269 -353 79
3597G9p20Q37n72K51O4L8J09n64R14p97P28m92L19q1k44N70p81P85n50M04o14
$$ 79 -641 196 -376 -125 -61 -23 86 -478 436 -361 367 -125 194 113 -131 439 -342 443 -107 297 -317
3618c17M81J13k96M34n29Q01o75N64o73K22K88l76L95n65O40n36L46k25J90j33
$$ -317 164 277 -19 415 -114 687 12 576 -97 125 413 37 432 -133 507 -29 317 92 282 149
3638A49l62O87o69N10m77M19l20J47q6k69N16m66O83j082O94j17o5L2j61L49p40
$$ 149 -213 474 -195 315 -162 257 -63 84 -2 -271 245 -221 462 -620 74 -43 -108 -76 -237 112 -628
3659f28P60o42N23o54N19q6k04N58q22P79p33P42m33M5K15l52M09n14N94l83L93
$$ -628 132 -510 13 -641 -122 -208 -412 146 -676 103 -630 112 -321 -276 -61 -413 -4 -518 76 -307 86
3680H6l21L39J63m54P22r87Q68o45O15n17j6N02n05M67n39P48n88M83l52K39q0
$$ 86 -235 104 267 -187 535 -452 416 -229 386 -131 -147 355 -150 317 -222 526 -62 421 69 308 228
3701B28l06N05n35P41n94K79k93K01K13n15O83o38N15o01M16k05j80L69m20M35
$$ 228 -78 427 -108 633 39 318 25 226 439 -76 607 -31 484 -117 299 94 -86 283 -137 298
3721B98o48P84o95L13l8k26L10k67M49p63N92m88M30k43R9m4k76N61r06Q85o57
$$ 298 -350 434 -261 52 14 -212 98 -169 280 -483 109 -379 51 -192 -93 -137 -413 148 -758 127 -530
3742e30M89j50j51L77n04M53n37P21n97M21J53k74K72n48P16o69N06l48L84k93
$$ -530 -41 -191 -342 35 -469 -16 -553 168 -429 -8 145 -129 143 -405 311 -358 148 -200 184 -109
3762a09L9L75o03M87k61M98m67L63k25j55O21n69N45o34O89m34J46J37l69M09
$$ -109 -70 305 -298 189 -72 426 -41 322 97 -58 563 -6 539 -95 594 160 306 443 74 483
3782D83p38R41q17M51m0n0j31k2K29n88O43p10O50n38J78K78l68M09o50O25o17
$$ 483 -255 686 -131 320 280 230 99 77 306 -282 361 -349 301 -237 -59 219 -149 260 -390 235 -382
3803c82L82j58J27J81l69L88n92N26n68O27l57P8r7l16M92m64Q34q61N97m68P3
$$ -382 0 -158 -31 150 -219 169 -423 103 -465 162 -195 -117 -214 -530 -38 -502 332 -529 68 -400 -327
3824c27L82m07N05m57N92n89M90l16NJ7p3J63j65O72p21M31m12L71M9n48O65o21
$$ -327 55 -352 153 -304 288 -301 189 -127 -122 -105 -178 -15 -180 492 -229 202 -210 161 210 -338 327 -294
3846b94P77n51N03k88l76M08p1K89m88N63o22M06k88M14k09l53O18q28P48j93
$$ -294 483 -68 435 147 -229 179 108 397 -91 472 -150 256 -32 382 173 -180 438 -390 358 165
3866A65j9j93M0J17j38L31l22L87o88O38m99L5J69n32O49m78K01k81M96j17j83
$$ 165 146 -47 -7 110 -28 303 -19 368 -320 318 -181 -146 23 -509 140 -338 -137 -418 78 -39 -222
3887b22l6l2K75m26N70q26P26k78Q5L26n91M51n29O58p04N25l33J18J84l85O32
$$ -222 -258 -290 -15 -441 129 -697 29 -249 -164 162 -429 22 -507 151 -553 -28 -361 -243 -59 -444 188
3908A88p54O65l65L29J03k82R3j45M01n43O82n22L64l00J73J83n03O18o28N89
$$ 188 -566 99 -266 63 166 -116 -23 -168 233 -310 372 -150 214 -86 87 270 -233 385 -243 346
3928C46j5j64r1P4J18j79L24o66O53o50N75m44J08N06p14L87o21N77l64L99j81
$$ 346 331 167 76 150 268 89 413 -253 400 -250 325 -119 -11 495 -219 168 -453 124 -240 159 -22
3949b2k55M78l30K78n07N42n42M11j26j00J90m11L78m97N19l05K07j64J7L84o20
$$ -22 -277 201 -129 149 -358 184 -358 53 -73 -173 17 -394 -16 -513 6 -299 -92 -256 -239 145 -475
3970d75M40k69L09k22J52M2k93L81l86L76k16K68k04P0K15k22L97n83O69o34K91
$$ -475 -35 -304 5 -217 -65 -23 -316 65 -321 55 -161 107 -97 -27 188 -34 363 -220 449 -185 106
3991A06jP1J82n48O66n32M36m76O26n45K02j16j14M88m26N72p31O14n72L16q0
$$ 106 105 176 358 -190 476 -56 380 -96 530 -15 187 71 -43 445 19 591 -140 474 -98 218 138
4012A38k93K35l01N72n03L30j70Q3l8k50L35m91L72m08O51m06R2J84l71J63k63
$$ 138 -155 80 -221 351 -152 178 8 91 53 -197 138 -353 19 -389 262 -144 -52 132 -239 -76 -339
4033c39M91n38M90l62RK05k83N02n08L68m56M96m91J94L7L4K72o84O49k47J44
$$ -339 152 -386 104 -258 -249 -44 -327 175 -333 35 -421 75 -416 -222 -185 -151 121 -563 86 -161 -17
4054a7k17J43M17o67M62l82N61n49N87l76J56p4k20Q12p77M57n64L88%j01L39
$$ -17 -234 -91 326 -341 121 -261 300 -249 338 -38 118 44 -176 636 -141 316 -248 140 140 39 378
4075C78m68L23k51K52j68J0M9j25K83l11M03o20P86o69M42l95J22L08o88P03o80
$$ 378 -90 233 -18 234 66 76 125 0 283 -28 375 -245 541 -128 314 -81 41 349 -339 364 -316
4096c16N58m90K62j44m5L27m45N13n40M39n45L81m7j79L63n50M92l98M93l48J35
$$ -316 242 -248 14 -130 -175 152 -293 220 -320 119 -426 -45 -92 -271 92 -458 34 -364 129 -219 -84
4117h4j68m0L05m28L94m90M22k36L06r4q2L48o35P65n09O02m27K46j98Q6J91o18
$$ -84 -252 -292 13 -415 -21 -511 -89 -325 -19 -113 -195 153 -482 283 -226 376 -51 195 -3 83 274 -344
4139c44M81l48O14n47L42%k87K50j15L59p23O67l00J64k0J4O4p9K55l96K59l14
$$ -344 137 -211 403 -144 198 198 -89 161 46 405 -318 349 49 213 193 207 271 192 447 51 310 -4
4161dN5Oj32M31l83M27n16L81m58P9L39n08O55m59L57o46O78o35K16J52j43K00
$$ -4 51 57 -75 356 -27 400 -116 265 -193 -114 225 -283 372 -87 270 -376 302 -333 -117 35 -108 92
4183I2k46J76l14J81p5p0k7J49J58l97M37m14M72m86L77j65k2K26l85M70m12L96
$$ 92 -154 22 -292 -111 -186 -256 -283 -134 24 -373 64 -350 122 -364 13 -152 -174 52 -333 137 -275 121
4205A21l95K07L47l74L86o18O01n15K83j22J04J11m09M96m00M38l06L90k63N8
$$ 121 -274 -67 280 -94 292 -326 275 -240 43 -79 25 136 -273 223 -177 261 -45 345 82 140
4225A40r9j25L42l38M00m19M13l66lM41k98K60m74O24n94N45m60j07L68n31N01
$$ 140 41 -84 258 -80 320 -99 314 -52 -55 386 88 348 -126 498 -96 449 -11 -118 250 -281 220
4246B20o40P61n74M14m21L09j92o4L87n89M26l56L73j27j03P5j35L86m92N31n56
$$ 220 -420 341 -233 181 -240 69 -123 -187 200 -389 37 -319 54 -73 -176 -101 -236 150 -342 189 -367
4267c67M86k85L9N2j30K29l15M81m03J96N2j58J74l38N75o17O26n40L20j31nK90
$$ -367 119 -166 -127 -75 -205 24 -291 190 -213 -17 35 -123 51 -287 288 -329 297 -243 77 -54 -59 231
4289B31k89K85m67L85j23K54k90J22J86m26M25m60M67l29L49k61O8K91m40L89
$$ 231 -58 227 -240 145 22 276 -14 108 294 -132 293 -167 300 -29 320 59 127 418 -22 367
4309C67l74K77l82J78J05q9K34n17L71l99O96o90J62p3N1K27m26N03n28N85m51
$$ 367 -7 270 -112 66 171 82 316 -201 170 -229 467 -223 -61 -134 -83 144 -282 221 -307 278 -173
4330a73J39J17l72M91l79K86m55N83m99J55j22MK65m75P04o39N17k29K2M2j42
$$ -173 -34 83 -289 202 -177 109 -346 237 -262 -107 -229 -225 40 -435 269 -370 147 -82 -60 -18 -160
4351a60K72m09N87n90M81m23J74J32j93M10m00N64o96L75k25m6L99l09L53l42
$$ -160 112 -297 290 -300 181 -242 -68 64 -129 281 -119 445 -251 124 -101 -147 252 -57 296 -46
4371d6M76n09L69l24J85o6R2J03k07L34l38K31l73K33o7k65M44l04N01p77M84
$$ -46 430 -79 290 -34 151 85 177 280 73 407 69 300 -73 160 93 -172 272 -32 469 -308 176
4392A76p7q9J05k57J85o4K04l85L08k28K50k23NK42n47N05m00J53j42K1K66p6
$$ 176 99 10 115 -142 43 -21 183 -202 106 -122 128 -95 -90 152 -395 110 -290 -137 -279 -258 8 -68
4414f8J94l84K78k79J87j25J28J0q6J04m20O42n08L48j67qJ90j13K47n12M92l51
$$ -68 126 -258 20 -259 -72 -197 -69 -59 -145 -41 -461 181 -327 21 -146 -154 36 -77 170 -342 150 -201
4436b01L41j56JJ28k92M98k92K57l98M48l61J18rj77L83m30K43l13N49k62J8J35
$$ -201 140 -16 -15 113 -179 319 27 284 -114 334 -27 91 82 -95 288 -142 101 -212 337 75 93 228
4458B28j43J28j32K21l88M77l05R9J45l36M18m87L27l18J80k06k17L12k27K45
$$ 228 85 213 81 302 -86 391 86 185 330 -6 412 -75 252 -66 114 -92 -309 3 -224 21
4478B1q1J13k70L37j47lp5j81M91m34K74j78J02j29o9M21o55O02l00K29l29L42
$$ 21 -60 53 -217 120 -27 -30 -105 -286 205 -229 45 -133 -31 -160 -229 192 -463 139 -161 68 -261 81
4500H1k64K8J9k12M06l34L26r1K00l08OK71k89M06n33L54k43K79J2j30K39k47
$$ 81 -183 -155 -136 -348 58 -276 50 -41 159 -149 -143 128 -161 245 -288 66 -177 102 114 -16 223 -24
4522b4K24n03N78j72M7j14j3J32l12O41m81K39j40q7J68ro4k86M66l47Q2M1R4
$$ -24 200 -303 275 103 150 36 23 155 -157 484 3 242 102 15 183 174 110 -176 290 -57 25 66 160
4545A60l2k21J81l09L00j83J67k56P2q2o2N21o26M40k75M06n58K26K31k25K75
$$ 160 128 -93 88 -221 79 -104 63 -193 -121 -203 -265 256 -370 70 -205 201 -357 -131 100 -125 150
4566A50m85L49l02J45l5K64l46J06J14j97L34j59Qj43J30K96m67M76l59M39n14
$$ 150 -335 14 -288 -143 -178 86 -260 -154 -40 -237 97 -62 -54 -197 -67 229 -238 238 -121 318 -196
4587a96K64j56Q8J56j38L02n81N50k98J09j34J16R5k18J24j67L53j25Q5qk50K41
$$ -196 68 -88 0 156 18 320 -261 289 -9 100 -34 82 177 -41 83 -84 269 144 229 221 -29 212
4609B12l10J87j51L40k18L64m27J48P9l34J43k28L92l35K23j22j1J60l94L96k97
$$ 212 -98 89 -62 278 60 424 -3 145 224 -110 33 -195 197 -138 85 -37 -48 112 -282 114 -183
4630a83L49l22J46R5k71J8j68L38j23K38m93L82j12J13Q9k49k7j53M05k19R7k53
$$ -183 166 -156 -10 85 -186 -168 -336 2 -121 117 -376 6 -106 7 96 -153 -180 -333 72 -147 -50 -303
4652c03Q6K67l11K47k97L93j61N6K1j77L79m68L51l36M88k62M1L8pJ51k26K19
$$ -303 -217 50 -261 -14 -311 82 -79 -23 -2 -179 200 -268 83 -253 235 -27 14 52 45 196 -30 189
4674A89k08J28j27K40j78L4l5k63O26n35L23j85K20k54J1J43pJ34l65L36k86L15
$$ 189 -19 109 -18 222 44 78 43 -220 406 -129 194 9 229 -25 -14 129 122 256 -109 227 -59 256
4696B56k28j96K41k77M26n19M61m88L31l4k32M90l93M65o93L24P0o1K3p7J52p3
$$ 256 28 -168 73 -204 222 -297 164 -324 7 -27 -259 231 -162 303 -390 -66 4 -57 -34 -111 41 -32
4718c2J0j53J18k21K89nk38N63n68M52l33K58j78K0K3k94M75l44J46o5P9j36K38
$$ -32 -22 -175 -57 -278 11 6 -232 331 -237 215 -118 140 -38 -18 5 -289 186 -158 -12 -77 2 -134 104
4741A04Q6k91J15k89O78m32K04k98K0L30j99K19j86K76n75M29j4k18L01j18j19
$$ 104 190 -101 14 -275 403 -29 175 -123 -103 227 28 247 61 337 -238 191 177 -41 260 142 23
4762B3l12O39m02L12k02p7R8J4J9n26Q06n32M05k76Qr3K8L84n01K10j74O0j06
$$ 23 -289 350 -52 260 58 -19 79 93 112 -414 392 -140 265 -11 -3 -96 -68 316 -185 25 -149 -89 -195
4785a95L7Q6j04K90n79N77j25N1j80j8L32m35L76m65M83l97L51j65K1J39m31M96
$$ -195 -158 -72 -176 114 -465 112 -13 38 -142 -160 172 -263 113 -352 131 -266 85 -80 -59 80 -351 145
4807A45l35K51j76J31JK2l9J2O9k41J10j20K14K2n0Q5p6N8p8K60l05J68J3k44
$$ 145 -190 61 -115 16 17 39 0 12 81 -160 -50 -170 44 66 16 101 25 83 5 265 -40 128 141 -103
4831a03L21l29M74m27K19l64K25J50j67J80j81J53k40K18k28K34j20J24k40n9
$$ -103 218 -111 363 -64 155 -209 16 166 -1 179 -2 151 -89 129 -99 135 15 139 -101 -160
4851a60K48k17L40m00J96P5J2j62j93L44k80K38k24O8k7K1L05o14M76l86M99n19
$$ -160 88 -129 211 -189 7 82 94 -68 -261 83 -197 41 -183 -115 -142 -121 184 -430 46 -340 159 -360
4873c60K31J78j43R9j38K84l77K58j94K72j66L4J67j65R2k93J63K0J23j48j64
$$ -360 -129 49 -94 5 -133 151 -226 32 -162 110 -56 -22 145 -20 72 -221 -58 -38 85 -63 -227
4894b27N27k50J43k74R6NQ1r3j45M04l90K28j01L09l21l2J53j92L84n93N93k86
$$ -227 300 50 193 -81 15 20 101 8 -137 267 -123 105 4 313 -8 -40 113 -79 305 -288 305 19
4916A9n1J2Q7m6j40L37n13N85m28M16l66J30J2j20J99m70L72k75L49o6k0J25m01
$$ 19 -32 -20 67 21 -119 218 -295 290 -138 278 -88 42 54 -66 133 -337 35 -240 109 43 23 148 -253
4939b53L73n36L48q2J75l37K53K87n11K06j63L04k01K58k39q7R0J58o5j22J86
$$ -253 120 -416 -68 -150 25 -312 -59 228 -283 -77 -240 64 -137 121 -118 -205 -115 43 -22 -144 42
4960D2j84P4o5J44J44k19J62j63K25k61K84k93J18J12r1K05k13K80k66j03LO3
$$ 42 -142 -68 -133 11 155 -64 98 -65 160 -101 183 -110 8 120 29 234 21 301 35 -68 -65 -2
4982bJ34j34J17j86K54k90q3Q8K25j5n4J25k62J54k78K19J18r6K54l81K76m12
$$ -2 132 -2 115 -71 183 -107 -190 -102 123 108 54 179 -83 71 -207 12 130 34 288 -93 183 -229
5004b29M35m74K61m2J3n2r9J11j38K94j96K28n6j91K09k65J40k61L12j90Q2J21
$$ -229 206 -268 -7 -49 -36 -88 -187 -76 -214 80 -116 112 56 -135 74 -191 -51 -312 0 -190 -108 13
5026A3j0Pq2L46m48J59j62J64M6o8J09k09O4r1M23l98K03k24J63M5j00J87j08
$$ 13 3 10 -72 274 -174 -15 -177 -13 33 -35 74 -135 -71 -162 261 -137 66 -158 5 50 -50 137 29
5049B9K26n19L92m2r6J88m65L32m3N8j54K12R4k56K96l74J91n1L0j82J86K15l12
$$ 29 255 -264 128 86 -10 178 -287 45 2 60 -94 118 212 -44 252 -122 69 18 48 -134 52 267 -45
5072d5m4j67N71m98N35l30r5J56j44J54j66K82j47j40p6j40K54%O4k02K78l44
$$ -45 -89 -256 315 -183 352 22 -73 83 -61 93 -73 209 62 -78 -154 -294 -40 -40 24 -178 100 -244
5094b44Q3J83j03R0p0P3j16Q5O8j64k9P0O9m7J0j60M01m35J77n4j18K12NJ54l48
$$ -244 -161 22 -81 9 -61 12 -104 -19 49 -115 -144 -74 -5 -52 -42 -202 199 -236 -59 -113 -231 -19 -14 140 -208
5119b08M41k50J25j14P1J43l43K50j47J34k15K84lk8p4j67L20l92K81j99K47j47
$$ -208 233 -17 108 -6 65 208 -135 115 -32 102 -113 171 168 140 66 -101 219 -173 108 -91 156 9
5141Ik8o8P2J3M7R1j21L9o8j05Q7j24K68m66M53k65K93M7p0j14Q0p2r4R0j91L20
$$ 9 -19 -87 -15 -2 45 136 15 54 -14 -119 -32 -156 112 -354 99 -166 127 174 104 -10 70 -2 -96 -6 -197 123
5167A23l15L10J59k27k31r5K81j49J98j05M0K8ML5p8K5j15J42J7J13j96j8K75
$$ 123 -192 118 277 50 -181 -276 5 -144 54 -51 -11 17 21 56 -22 3 -112 30 47 160 -36 -54 221
5190B21m64K56l7O2RrJ90j09J77l07K37k85K03j92lJ08p0L07k89K47l17J31j44
$$ 221 -243 13 -24 38 47 38 228 119 296 -11 226 -59 144 -48 -51 57 -13 294 5 252 -65 66 -78
5213g8K80K2k01J80k33J48k71L01l5k38L79l05J69k80L19k75J83j40J7J15k50
$$ -78 202 224 23 203 -30 118 -153 148 113 -125 254 -51 118 -162 157 -118 65 -75 -58 57 -193
5234a93K43j79J92j64n4J34p3J25j72K93l02K14n0j1n5j84J71QJ58k75M50m54
$$ -193 50 -129 63 -101 -155 -21 -94 31 -141 152 -150 64 14 3 -52 -236 -65 -57 101 -174 276 -178
5256a78J21J79j84K13l27J97k19L89j95Q9K80n05K45k29J99j54R3J89o5M1Q0k69
$$ -178 -57 122 -62 151 -176 21 -198 191 -4 85 365 -140 105 -124 75 -79 14 203 138 179 259 -10
5278a0O8poJ11o2o8J64j10K3j16R6k85K27n5J95M2j06L9k47M32l75J20l09K39
$$ -10 58 51 45 156 94 26 190 80 103 -13 83 -202 25 -30 165 207 101 140 -107 325 -50 70 -239 0
5302@Lj04J86j38j7P2Qj4k9K0KL4j50K72k61J23j39M5L69l04pj70K39k00J27J13
$$ 0 3 -101 85 -53 -70 2 10 -4 -33 -13 -11 23 -127 145 -116 7 -132 -87 282 -22 -29 -199 40 -160 -33 80
5328H0j23J7K18j97o8J58j72K70k29J35j08J14l19J05L65k91K55k98J39k2o4K30
$$ 80 -43 -26 192 -5 -73 85 -87 183 -46 89 -19 95 -224 -119 246 -45 210 -88 51 29 -35 195
5350A95l42J83j31J15n9q3K39m4N6k52L45k80O5O7k0J5r3Q4j59K42j24J10k49
$$ 195 -147 36 -95 20 -39 -122 117 73 129 -123 222 -58 7 74 54 69 -24 60 -99 143 19 129 -120
5373a20J0J35j50M8k4J87Qj32J00j72J98l06K89k33J67l07K61J97l95R4Q4J94
$$ -120 -110 25 -125 -77 -101 86 94 -38 62 -110 88 -218 71 -162 5 -302 -41 156 -239 -145 -61 133
5395A33l63K31j35J66j65k2J61j84M33l59M1k0l0R2l9o0K0K51l21K13j24J25l7
$$ 133 -230 1 -134 32 -133 -155 6 -178 255 -104 -63 -83 -113 -21 -60 -120 -100 151 -170 43 -81 44 7
5418GR4Kp5J36q1n7j26K10n3J04N8m02K52j60M9J03j32Q6r9L8J70q6j45N2N4J4
$$ 7 101 103 28 164 83 26 -100 110 57 161 219 -183 69 -91 -42 61 -71 15 -84 -46 124 38 -107 -55 -1 13
5444A3P0j17o3j01L16j23n3j33N3K98k27j3J11Q2k67K50j40m6K1Q8j73j4K02j04
$$ 13 83 -34 -97 -198 118 -5 -58 -191 -138 160 -67 -80 31 113 -154 96 -44 -90 -69 19 -154 -168 34 -70
5468g0J94j98N7k27%K87l1M3k35L29m4qk58J16J84j32Lj47K90Pk21J57R2r5n3
$$ -70 124 -74 -17 -244 -244 43 12 55 -180 149 105 97 -161 -45 139 7 10 -137 153 160 -61 96 188 93 40
5493D0n6j9K36j66K94l29K8L02l12n9K1O7J21r9R7k25K78j72J34j56J44q2J5j2
$$ 40 -16 -35 201 35 329 0 28 330 18 -41 -20 47 168 69 166 -59 219 47 181 25 169 87 102 90
5517I0l8j04K9l0j26K03k47J56J45k5j61n5k9O0N9j33K67j87Q7Mj99L78j55o5
$$ 90 52 -52 -23 -53 -179 24 -223 -67 78 53 -108 -163 -192 -132 -73 -206 61 -126 -39 -35 -234 144 -11 -76
5541g6J02k3j38pJ20n6J30j27J70k56J88J36l39L06l73L07j69K07l77L82j54n7
$$ -76 26 3 -135 -142 -22 -78 52 -75 95 -161 27 163 -176 130 -243 64 -105 102 -275 107 -47 -104
5563a04m3j8J88M5M8k08N5P1l2Lj58J80k01M9J66Jj18N6M12m19J94j15l9p2n4
$$ -104 -147 -165 23 68 116 -92 -37 34 2 5 -153 27 -174 -125 41 42 -76 -20 392 -27 167 52 13 -59 -113
5588a13R2M4J41rRk47J17J9j92K21j20R0j00O7l4K23k03o2O4o3J10j57K18j45
$$ -113 -21 23 164 155 164 -83 34 53 -139 82 -38 52 -48 19 -15 208 5 -57 7 -56 54 -103 115 -30
5612c0L2O3Q0j84k3K08j62Ol19L19q2L3Q4n0n3P6J05q5P7l05J74pL2J51lj14j04
$$ -30 2 65 145 -39 -62 146 -16 -10 -329 -10 -92 -59 25 -25 -78 -2 103 18 95 -210 -36 -43 -11 140 137 23 -81
5639h1o3N1p8P1lJ15j22LJ74j08K55q0j17P4P4l83L44n5j10P7O4N5p3J96o56K68
$$ -81 -144 -93 -171 -100 -103 12 -110 -107 67 -41 214 134 17 91 165 -218 126 71 -39 38 102 157 84 280 -376 -108
5665a08J77J83k33k02J95r4K22j88Q2l5J33o0n8j0j28O9Rk6l0P5o2K03k91J3K01
$$ -108 69 252 19 -183 12 -82 140 -48 34 -1 132 72 14 4 -124 -55 -46 -72 -102 -27 -89 114 -177 -164 37
5690C7Ol0p3N1k4p6J54%R5m10J83K15p3q7k49L10l53M19j79R5M4Mn6n6J02n7J47
$$ 37 43 13 -60 -9 -33 -109 45 45 140 -270 -87 128 55 -32 -281 29 -324 95 -84 11 55 59 3 -53 49 -8 139
5717A39q2j30Q6J24j78M4K39k52J38k85K38N4k56J64n6K6n3J20o2O9j61J35P5
$$ 139 57 -73 13 137 -41 3 242 -10 128 -157 81 135 -121 43 -13 13 -40 80 18 87 -74 61 136
5740A36J26l79J70p0r5J32P0j49J75p7R8l09K19L6o4J18k24K23k65K13k25R9q0
$$ 136 262 -117 53 -17 -112 20 90 -59 116 39 137 -172 47 83 19 137 -87 136 -129 84 -141 -42 -122
5763a22k4o1Q8Q1j9J19k13J92ok7R0q4P5r2Lj82L01k04J67L4j17J5L9k3m4j5l7
$$ -122 -146 -207 -119 -38 -57 62 -151 41 35 8 98 14 89 -3 0 -182 119 -85 82 116 -1 14 53 30 -14 -29 -66
5790f6K30l10J03J06p9P5o1mL5k8J54j96Q2n7R6j71J31nJ50j14r3J65j56K16m08
$$ -66 164 -146 -43 63 -16 59 -2 -6 29 1 155 -41 41 -16 80 -91 40 35 185 71 -22 143 -13 203 -205
5815b05L11j61J18k03K87m0k80L27j49K6m7p9j3J19J53l32J02J6m7J5N8l8l9J17
$$ -205 106 -55 63 -140 147 107 -173 154 5 31 -16 -95 -108 11 164 -168 -66 -50 -97 -82 -24 -62 -101 16
5839A6j92K18k31J28q4J28Pk9J4J23p3k48K51o7O4Q6k74J30j37J61j89J24P8M3
$$ 16 -176 42 -189 -61 -145 -17 -10 -39 -25 98 25 -223 28 -39 25 111 -163 -33 -170 -9 -198 -74 4 47
5863D7J15k40K23k55J46j09L0K3q4K30L3k58P5J29o8M0j05J05j04p7L86k71%M0
$$ 47 162 -78 145 -110 36 -73 -43 -20 -104 126 159 -99 -24 105 37 77 -28 77 -27 -104 282 11 11 51
5887E1R1j27L6p6J76k27J05O3j25P3j99Q8j4p7J51j8K0n2o4L44k67J47k44K39
$$ 51 142 15 51 -25 151 -76 29 92 -33 40 -159 -71 -85 -162 -11 -29 -9 -61 -125 219 -48 99 -145 94
5911I4j06K45j58n9k1KJ44j74J53j44J7k89J26n3J86O7q4Q6j8J01k7j50J84j88
$$ 94 -12 233 75 16 -5 -3 141 -33 120 -24 -7 -296 -170 -223 -37 30 -54 32 14 115 88 -62 122 -66
5935f6J02l43N70j54j42m8N3r9K17j08N2N6j53J78l41K97o8l3K47k79J57j6j5
$$ -66 36 -307 263 109 -33 -81 -28 -127 90 -18 34 90 -63 115 -226 71 3 -30 217 -62 95 79 64
5958F4r9LK58m56K65L8P8l14R7Pj10J14N6j08L5R7kQ8j73p6Q2NJ08j28R7l31L81
$$ 64 -35 -32 226 -230 35 73 151 -163 -66 -59 -169 -55 1 -107 -72 25 23 111 -62 -138 -56 -51 57 -71 26 -305 76
5985G6j79M2M0qm1r1J68j87K64j43m7P6Mm1r3J9n8K66j25Q7R9k12J10k58K35M1
$$ 76 -103 -61 -21 -29 -70 -161 7 -180 84 -59 -106 -30 -26 -67 -160 -141 -199 67 -58 29 128 -84 26 -232 3 44
6011D4j3J5k25M25l78NK16M5L3j19M1j2J13j66M5j25J71j68J51k10J71M4j04K47
$$ 44 31 46 -179 246 -132 -127 89 134 167 48 89 77 190 24 69 -56 115 -53 98 -112 59 103 -1 246
6035B46k02l4J25q7O8o1j02J5K62j06j70N3p2J41o2k1L7J77k35J19j08J45m5k92
$$ 246 44 10 135 48 116 55 -47 -32 230 124 -46 7 -65 76 14 -7 30 207 -28 91 -17 128 83 -209
6059b09K97k19Jk5J49l6J85j98J15L8j43J93j42o1r8J55j51L90k46O0J04n45M99
$$ -209 88 -131 -130 -155 -6 -42 143 -55 60 98 -45 148 6 -55 -153 2 -149 241 -5 55 159 -386 113
6082A13j92P8K3m8l5J86r7l9j4J3j7J76j5k4j12K26p6j03pk2K4J39J0q7K6k63
$$ 113 -79 -1 22 -26 -61 125 28 -11 -25 -12 -29 147 132 108 -4 222 146 43 36 14 38 177 187 100 126 -137
6108a37K95j9l7j00j45P4M9L14l20K04p2m0n9J8J3Q0N7k73K43Rm13J6K29N7k37
$$ -137 158 139 102 2 -143 -69 -20 294 -26 178 106 66 7 25 38 118 175 -98 145 154 -259 -243 -14 43 -194
6133a94J61k9P9j08K39j88j05R8M2N7j08J97l3l9O6p7j27M1J8L0q8o9K93j22j16
$$ -194 -33 -62 17 -91 148 -40 -145 -47 -5 52 -56 141 108 69 135 58 -69 -28 -10 20 -68 -137 156 34 -82
6158h2J65q6J06k03L7r3J77N6lj00R3R1k53J62j52J23j15m9K49p0J06j97j5j38
$$ -82 83 -3 103 -100 -63 -156 21 77 74 -26 67 158 -95 67 -85 38 -77 -126 123 53 159 -38 -53 -191
6182a91M03k15J6J8q7J38p4jj12m0K33j69NJ07j18J7kJ19n2PJ21k00J48j3k07
$$ -191 212 -3 13 31 -56 82 8 7 -105 -145 88 -81 -76 31 -87 -70 -72 47 -5 2 123 -77 71 58 -149
6207a49K40j21q3k9K20m5R0m2j53J52R4j90q1r7n4P8L15k87J77J5K3l17M3R7J85
$$ -149 91 -30 -113 -142 78 33 123 81 -72 80 174 -16 -97 -194 -248 -170 145 -142 35 50 73 -244 -201 -104 81
6232H1j63j14L27l11P2J74j71j09L41kj70nM0n8J78j18n3q9Q9J80j13O2j84O4
$$ 81 -82 -196 131 -180 -108 66 -105 -214 127 125 -45 -50 -10 -68 110 -8 -61 -150 -61 119 6 68 -116 -52
6256e2K29k3r6j6j03n0J6J84j1q3Q2o0j80K2K70p3p7J3q8K43k24P6M7r0J50q4
$$ -52 177 154 58 42 -61 -111 -95 89 78 -5 77 17 -163 -141 129 56 -21 -8 -96 147 -77 -1 46 -44 106 22
6282B2J8k02K04j74K18l16K35l6l2n6R6R5j39J43n7m1m4L1N1j57R1J21Jp8j06
$$ 22 40 -162 42 -132 86 -230 5 -31 -63 -119 -23 72 -67 76 19 -22 -66 -35 16 -141 -50 71 72 -6 -112
6307a12K44j30J41k93K70k77K74j47K29l07L0J67j28J47j02M1l15L15J79k08l6
$$ -112 132 2 143 -150 120 -157 117 -30 199 -108 -78 89 -39 108 6 47 -268 47 226 18 -18
6328a8n4J01L8r3J74p5m0J35n5r2j2n6Q4K5oj24K41j67RJ30j82J15j11J00l3k50
$$ -18 -72 29 67 -26 148 73 33 168 113 21 9 -47 37 62 56 -68 173 6 15 145 -37 78 -33 67 34 -216
6354b16P1J92j77J93j09J18l9m2m3j4P9P0k48J47N4j99Q3L7l9O4J22k16Qk3J76
$$ -216 -145 47 -130 63 -46 72 33 -9 -52 -66 13 83 -165 -18 36 -163 -80 -43 -82 -18 104 -112 -104 -127 49
6379D9P2k05L33l38J75J5o1Q9n2p2J31j46j2Q4L8Q8k87K30j12R9j7Q1j33N2j9
$$ 49 121 -84 249 -89 86 101 40 129 77 5 136 -10 -22 62 100 188 -99 131 19 118 101 182 49 101 82
6404H2l0K29k91LO4j40J70k00J30R0j80Q9j27K33j78J29j09Q8L0p4kp4j4j1K69
$$ 82 52 281 -10 -7 57 -83 87 -113 17 107 -73 16 -111 122 -56 73 -36 52 82 8 6 -68 -82 -93 176
6429A76k65J13J4J9J9j47L47l59L18m08K65J01m01J82P5j06j9K47k56J57j29j8
$$ 176 -89 24 38 57 76 -71 276 -83 235 -173 92 193 -208 -26 49 -57 -76 171 -85 72 -57 -75
6451g5J13j39J05j82Q6J19J02j43J9j08J91jm5J57j28j9j57K25k23J95o8k05L84
$$ -75 38 -101 4 -178 -92 27 129 -14 5 -103 88 87 42 199 71 52 -105 120 -103 92 24 -181 203
6474B03l83R2R9q6M1n9J00J27m6j29K9j11OK11J10k47J52j94PJ41p3o8L17k82
$$ 203 -180 -88 11 -75 -34 -93 7 134 88 -41 -12 -123 -117 94 204 -43 109 -85 -78 63 -10 -78 239 -43
6498d3J05J3rj17m0L11l01P7n4J69j02k5Q3J56k64J8K3j42R8n8J67j62J12jm0
$$ -43 62 75 66 -51 -91 220 -81 -4 -58 111 9 -16 67 223 -41 -23 0 -142 -44 -102 65 -97 15 14 -26
6523b6O5k11K58j80J24k1j41J90k22L41l28J74j40J99n7l1Rr0M9j06K62j67J22
$$ -26 39 -172 86 -94 30 9 -132 58 -164 177 -151 23 -117 82 25 -6 3 -87 -38 -144 118 -49 73
6546G3j37J0J25km3J32l7l1n6mj47M6N5J13r5p2K9Q4l7L5j02Q6k0QJ16k5m4R4
$$ 73 -64 -54 71 69 26 158 121 90 34 30 -117 -71 -16 97 2 -70 -41 43 6 41 -61 25 5 13 129 104 60 154
6574A54k28J58n5j15k6R5j9p9J86Q8J52m72K67N2k73J88%N0l33L35l87M39j51
$$ 154 -74 84 29 -86 -112 -17 -36 -115 71 159 311 -161 106 158 -115 73 73 123 -210 125 -262 177 26
6597B6J14k02P7q4P6M3k11J40j04J91j08k9j8P0K7j26K27j85J98j66M6q2J65l4
$$ 26 140 -62 15 -69 7 50 -161 -21 -125 66 -42 -71 -89 -19 8 -118 109 -76 122 -44 2 -80 85 51
6621E1N5j06O7J62l25L21k91L2J01R1n7ok44J15kJ12K4l6j54M2n3L3o3J2L42k94
$$ 51 106 0 67 229 -96 225 -66 -34 67 158 101 95 -149 -34 -36 76 100 64 -90 -48 -101 -68 -131 -119 223 -71
6647g1J72q3q0j5K84j31J55k49J11M4p7L2j36q0l6L04j70N1J26l93J97O7n7Qj49
$$ -71 101 18 -62 -77 207 76 231 -18 93 137 60 92 -44 -124 -160 144 -26 25 151 -242 -45 22 -35 -27 -176
6672a76J77kM3J1jp3J96j55l0r7Q9R3rK5j54K0k44K43NM5j5L3k44K20K15k39j4
$$ -176 1 -1 42 53 52 -21 175 20 -10 -107 -18 75 66 91 -63 -43 -287 -44 -39 6 -9 24 -220 0 215 -24 -38
6699c8J57j95J6%J4N2R1l9o8J97J8r6j59J43J0j93J09J16k69M4K85K7k0j82p9
$$ -38 119 -76 -60 -60 -46 6 97 58 -10 187 205 109 -50 93 103 -90 19 135 -134 -90 195 222 202 20 -59
6724e9R1K0j25J98j84J06m5O8j53O4r6K2J0l7J11n0O9oQ5j50r7q8J88K9Q1j24
$$ -59 32 52 -73 125 -59 47 2 70 -83 -19 -115 -93 -83 -120 -9 -59 10 4 89 -61 -158 -246 -58 -29 52 -72
6750g2Q9J09l32NJ2L85j66j01J26J3m1Q6N1j54K3k01L14k76J88k08K04k3p8J51
$$ -72 17 126 -206 -201 -189 196 30 -71 55 68 27 113 164 10 33 -168 146 -130 58 -150 54 31 -47 104
6774A04k21J48j30K11M7k72M9L51l54j72K74K4j03O5N7q2o5mQ4J06j48k9p1J4
$$ 104 -117 31 -99 112 159 -113 -64 287 -67 -239 35 59 -44 21 78 -4 -69 -73 11 117 -31 -60 -131 -117
6798a17J07L4j7n6j0pJ3J47k26J18p6J08nM3P6k69K85p4l05J70J68k35Q0lO0q7
$$ -117 -10 24 7 -49 -59 -66 -53 94 -132 -14 -90 18 13 56 132 -137 148 74 -231 -61 107 -128 -48 -51 9 -78
6824g8O7Ml5K7j28J81p8j03Q6J77j80r9J0J39n0N8q9j63J69J40p8L8p2o3Q6L1
$$ -78 -11 -7 -42 -15 -143 38 -40 -143 -57 120 -60 -159 -149 -10 -60 -2 -91 -254 -85 55 -23 15 -57 -120 -34 -3
6850cJ63p6k5j08J87k01K58k18j28J60R8l40J23K97l32O6m5J82O6m5M8k99k5L08
$$ -3 160 84 59 -49 138 -63 195 -23 -151 9 107 -233 -110 187 -145 -79 -124 58 124 79 127 -172 -197 111
6874A11k29R2l35L25PQ4j06q5O9J42j39M7n0M4j5q3J21k23J48j23J16J24K3j25
$$ 111 -118 -26 -361 -36 -29 55 -51 -136 -67 75 -64 -17 -67 -23 -38 -121 0 -223 -75 -198 -82 42 65 -60
6898f0rK0o3J07j29K70k88R7Q5o0J29oq4j27K23l1j52k6K28k59J30k4o5J87k08
$$ -60 -69 -49 -112 -5 -134 136 -152 -55 30 -30 99 93 9 -118 105 74 -78 -104 124 -135 -5 -29 -94 93 -115
6923a15J04J1m3Q7r7J35r9O4j86J09J37m0Kj26j03J50K0j67K48p1ml0K28m55J90
$$ -115 -11 0 -43 44 -53 82 -17 47 -139 -30 107 67 69 -57 -160 -10 10 -157 91 20 16 -14 214 -241 -51
6948e1O6q5J7Q1M5j2j29K9J30j75K03l35L39k5q5q4J57j10J23J16k30N3j78M23
$$ -51 15 -70 -53 28 73 61 -68 -39 91 -84 119 -216 123 98 13 -71 86 -24 99 215 -15 38 -140 283
6972B83l01M8j42K21j33k79P2l9M11k2k51L13k96K28n9K7k45J23K4m7L2J95k12
$$ 283 -18 30 -112 109 -24 -303 -231 -270 141 119 -132 181 -115 113 54 81 -164 -41 -17 -64 -32 163 -49
6995d9r5K04k03J45j28J16Mo8n1J89o0q8O3K16l18J3K0K06l17J14N9j72K29k29
$$ -49 -144 60 -143 2 -126 -10 -6 -74 -125 64 4 -84 -21 195 -123 -110 -90 116 -201 -87 -28 -200 29 -200
7019b00J97j14L05l05p2K33k67K93l68L03K83m06J09P8R2l12k6L16j68L0K8j62
$$ -200 -3 -117 188 -117 -189 44 -223 70 -298 5 288 -118 -9 69 161 -151 -177 139 -29 1 29 -133
7041a33J9o8N7P0o5J57j67L31k79J70J3j26m0L45k12j03L7O2K8j02P0k02R7l3
$$ -133 -114 -182 -125 -55 -120 37 -130 201 -78 92 105 -21 -61 284 72 -31 6 68 96 -6 64 -138 -41 -74
7065g4J00m8K9r2k5J89n0Rj07K21j52q7K13P3j3j97%r2K4K33j66P6j58K25j59
$$ -74 26 -22 7 -85 -110 79 29 38 -69 152 0 -87 126 199 186 -11 -11 -103 -79 154 -12 64 -94 131 -28
7090b8o4Q2K23k33o0L03m35K23K0k2j23O7J3Q8J21l13K06j67J39n6k5J10j35J79
$$ -28 -92 -10 213 -20 -80 223 -212 11 31 9 -114 -47 -34 54 175 -138 68 -99 40 -16 -41 69 -66 113
7114A13k19J48K2q2J40r1j98J60J46n4o7j19J21j66m3K49r7Q6j46J38J14j84J57
$$ 113 -106 42 64 -18 122 31 -167 -7 139 85 18 -101 20 -146 -189 60 -37 49 -97 41 155 -29 128
7137A28k35L24k96LJ84j37oN0N7q8j5J03j43K42o0r8j5k7J33j70j20J90k20K27
$$ 128 -107 217 -79 -76 108 -29 -35 15 72 -16 -31 72 -71 171 111 13 -2 -29 104 -66 -186 4 -216 11
7161A1J53j95L7L1j98J80p2R2p3m3J59J22j44j67J30p2J34K4o3k64K64j19J03
$$ 11 164 -31 6 37 -161 19 -53 39 -34 -77 82 204 60 -107 23 -49 85 109 46 -218 46 -73 30
7184C0j74J73o1Qj07N1N1j01J45m6k0l0j3J05J01j63ON2m9n2K2K64l42K61l8j95
$$ 30 -144 29 -32 -24 -131 -80 -29 -130 15 -31 -51 -81 -94 11 112 -51 -45 7 -42 -94 -72 192 -150 111 73 -122
7210a22J25j56J16L8O9R0k24P0j53K65j8k0k20K81j17j74L04j18M2j40P8j29K39
$$ -122 3 -153 -37 1 70 160 -64 6 -147 118 100 80 -140 141 24 -150 154 36 78 -62 16 -113 126
7233A26k30K63j83j11J14M3mR2p9J78n22L59J24M1l15k1K21k61L16l6k61J56l7
$$ 126 -104 159 -24 -135 -21 22 18 110 31 209 -313 46 170 211 -104 -125 96 -165 151 115 -146 10 -27
7256b7L0Q7m7o5OJJ25j9L6k25O4l6k40K48J67j42j0J41k39K66k86K56j75q2K46
$$ -27 3 90 43 -22 -16 -15 110 91 127 -98 -34 -70 -310 -62 105 -37 -47 94 -145 121 -165 91 -84 -166 80
7281H0q0L4j97K5k2J44j28K79j78oj29J03K22k11n3J53K4k6q5kr5K08L2l32K31
$$ 80 0 34 -163 -138 -160 -16 -144 135 -43 -49 -178 -75 147 -64 -117 36 60 34 -51 -53 -148 60 92 -240 -9
7306ir9J87m4o8K6J72j33q6k6J01K45k83J23j97M1L9JP6k08K25q7J07j69K15l1
$$ -9 -108 79 35 -33 -7 165 32 -54 -80 21 266 -17 106 -91 -50 -11 -10 66 -142 83 -4 103 -66 149 118
7331A18l5j20j19K69j05M0k2j62M1J48n1m3l5P8J08j64K5k3O1J80k29L28n61L55
$$ 118 83 -37 -156 113 8 48 26 -136 -95 53 2 -41 -76 2 110 -54 -29 -52 9 189 -40 288 -273 82
7355H2j81k5J01R4k07L6J62J01j8q2p0k2J07P0r6j95J66m0J9Lj50N5Q5j75P4J76
$$ 82 -99 -124 -23 71 -136 -100 62 163 145 63 -7 -29 78 148 52 -143 23 -17 2 5 -145 -90 -5 -180 -106 70
7381G0m0J76k84p8J84K46k81r9J30%j20J42Q3p1m7k77K34O1J5m9J4P3p9m6j39
$$ 70 30 206 -78 -156 28 274 -7 -106 24 24 -96 46 129 58 11 -266 -32 29 44 -5 9 82 3 -43 -182
7406a82J82o2o8J91k13J25m4J22p1Q8K00m14J61j69J06o6J78j69J64j63L2L3O6
$$ -182 0 -62 -130 61 -152 -27 -71 51 -20 68 268 -146 15 -154 -48 -114 64 -105 59 -104 -72 -39 27
7429B7l2m5O6q5K82l06N8L1L9N9o6j62K02O0j17K5k51L88j25l21K01R0n9J81r7
$$ 27 -5 -50 16 -69 213 -93 -35 -4 35 94 28 -134 68 128 11 36 -215 173 48 -273 -72 18 -41 140 43
7454D3qJ40k29J44j05m6KP4j18J28l2n4N9J70l29K81r7J48k31j0QO0l7k34L22
$$ 43 35 175 -54 90 -15 -61 -59 15 -103 25 -7 -61 -2 168 -161 120 23 171 -60 -70 -62 -2 -39 -273 49
7479D9R3p9j95J64r2J38J1j9mj88J07p8nO6L6L9p1J09j36J44j26n3O5L0J27m1
$$ 49 142 63 -132 32 -60 78 89 70 66 -122 -15 -93 -98 -32 4 43 -28 81 -55 89 -37 -90 -25 5 132 91
7505I1r9l6M0j7P7r5J72j04k35J56m2m5J5J76m3j5O2j00p2O4M8o0M3J11J6j46
$$ 91 -8 -44 -4 -21 56 -39 133 29 -206 -50 -92 -137 -122 54 11 -4 58 -42 -114 -50 -2 -62 -19 92 108 -38
7531c8L6L4r1K4P9P3n7%J19k73K9k3P7qJ92q7M6n7j4m4O5j59J20m6K14k45J76
$$ -38 -2 32 -59 -35 44 117 60 60 179 -94 -65 -88 -11 -19 173 86 132 75 61 17 82 -77 43 -3 211 -34 142
7558A42qo5j84J9R5mK7j94J93j10P2k3K20j43l4K18j58N2j93N0J10p7j46J34K0
$$ 142 134 69 -115 -96 -1 -5 22 -172 21 -89 -17 -40 180 37 3 221 63 115 -78 -28 82 5 -141 -7 13
7583A3n7K13k71rK96k02J09j83J76k47J78J49l14K91j79L1l1K2kQ9r5Q5r5j62
$$ 13 -44 169 -102 -111 185 -17 92 -91 85 -162 16 165 -149 142 -37 -6 -37 -15 -17 72 -23 62 -33 -195
7607a95J04J30o4J7L1n0K12p9j43L8o1J65j19L2j74J84j47J72o2J09j74J22j48
$$ -195 -91 39 -25 -8 23 -27 185 106 -37 1 -60 105 -14 18 -156 28 -119 53 -9 100 -74 48 -100
7630a00J04p4J1K35k53J11j5o1k8J27k81J37M2l2r2J72N6L4n7p8J34k3J4j04J44
$$ -100 4 -70 -59 176 -77 34 19 -42 -70 57 -224 -87 -45 -77 -169 3 59 93 36 -42 92 69 83 -21 123
7655A23j09J46k4j92j17L17k96J86m6j55O8R8J4r6J58j72m3P3J5K28l7J7j06j03
$$ 123 14 160 136 -56 -173 144 -152 34 -12 -167 -99 -1 13 -83 75 -97 -140 -67 -52 176 139 156 50 -53
7679e3M9k23J37k8K24p1l4J04Rj34R9J79k17j44N4lN1j5j8mJ22jJj48L65j32o
$$ -53 -4 -227 -90 -118 106 35 1 105 114 -20 79 258 41 -103 -49 -52 -1 -16 -34 -38 84 83 84 -64 301 169 163
7706A63j50J6L3j93K43r5n2P8j05Q5J15k2p2J79k34l6l3R5m9N4K6J79j79k3J39
$$ 163 13 29 62 -131 112 17 -35 43 -62 23 138 116 44 223 -11 -47 -80 15 -34 20 46 225 46 23 162
7731A62k33K4K12j37j2J68j92j37J53O8N5k18Q6j43K33n9J44j77npmM5k3k8K0
$$ 162 -71 -47 165 28 16 184 -8 -145 8 76 131 -87 -1 -144 89 30 174 -3 -8 -15 -19 26 3 -25 -5
7756eJ21Qo9k58L20pn6m3O5r7J36Nm5j85k6K80j20N0J96l13J03r8L9j03M6M8J38
$$ -5 116 124 55 -203 117 110 54 11 76 -21 115 120 75 -110 -136 144 24 74 270 -43 60 -38 1 -102 -56 -8 130
7783A30j35M4p9K6N3J5k03L9J89p5j77K58q6J92j85K3N8O9j02j00L5j08J54k66
$$ 130 -5 39 -40 -14 39 54 -149 -110 79 4 -173 85 -1 191 6 29 87 156 54 -46 -11 -119 35 -231
7807b31K04p6k3L52j54k58K46r3q4K13l7j81n1J52J20o9k8m8R4jl0j76R9J25J11
$$ -231 -27 -103 -126 226 72 -186 60 -33 -117 96 59 -122 -173 -21 99 30 2 -46 48 47 17 -159 -60 65 176
7832A76j86m5K06j83m8L3j6P2K57l95J78o2K53k45M0j06Q7k49J15J9J2L8K7R4
$$ 176 -10 -55 151 -32 -80 -47 -63 9 266 -129 49 -13 240 -5 35 -71 16 -233 -118 -99 -87 -49 -22 72
7856G2j68K26r9J08j48j15j50K36J16j50M3J2J55k64M4N2J00J28k69K65kJ4k15
$$ 72 -96 130 31 139 -9 -124 -274 -38 78 -72 -29 -17 138 -126 -82 -30 70 198 -71 194 192 206 -9
7879ikl00J44J60J17j66j73M86k49J90Oj71o0o4J14r6m2J72j48O2J74j59k12Q0
$$ -9 -11 -311 -167 -7 110 -56 -229 257 8 198 204 33 -27 -91 23 -73 -115 57 -91 -29 145 -14 -226 -146
7903a46J23K51k14r4J46M5k31m8L00k83L05k30Q7N0Nj60m0R6mj08K19j6L0o9%
$$ -146 -23 228 14 -80 66 111 -120 -168 132 -151 154 -76 11 61 66 -94 -134 -38 -42 -150 69 53 83 14 14
7928A4kj43J31J38o3q1N7j7j1p6j27J16L9K38k17m8J16m7j25J2K09k51P7n9K29
$$ 14 12 -131 0 138 75 -6 51 34 23 -53 -180 -64 -25 213 -4 -52 64 17 -108 -96 113 -138 -61 -120 109
7953A09j09n8L81k39k26L01k30J20M7k58K08k08J98j89L11j70M5l4Q6Ql4K41k15
$$ 109 0 -58 323 84 -142 159 -71 49 96 -162 46 -162 36 -153 158 -12 33 -1 85 93 59 300 85
7976H5j17j51M49j84j81J70j99L09l74K05K14j48j14J3l9J47j28p3m9J22J1p0
$$ 85 -32 -183 266 82 -99 71 -128 181 -193 12 226 78 -36 -23 -62 85 -43 -116 -165 -43 -32 -102
7998a02M0N2R4L3j99J96j3o9L9o5R7k6j38j5J96j89K68j82K1J57k14l1q9K38j76
$$ -102 -62 -10 84 117 -82 114 101 32 71 6 103 77 -61 -76 120 -69 199 17 38 195 -19 -50 -139 99 -77
8023g7q3O0J6k6j81K20n1J04O8j02J0O2j80q9L98l20J96rp5n8j26K35j0J59j47
$$ -77 -160 -100 -84 -110 -291 -71 -122 -18 50 -52 -42 20 -160 -249 149 -171 25 16 -59 -117 -243 -8 -18 141 -6
8048fO0j00J71j26j55Q6m9Q2P2K2j31j14K32j25J15J55k09j24J70q4L6J59j29
$$ -6 54 -46 125 -1 -156 -70 -119 -37 35 57 -74 -188 44 -81 34 189 -20 -144 26 -58 -22 137 8
8071HR2j64j74L69k43MO2K56j68l7jL7J02l6l55L33j12l9O1J27r9o4Q1q7j7R2
$$ 8 100 -64 -238 131 -112 -108 -46 210 42 5 4 41 143 107 -248 85 -27 -66 -5 122 23 -41 40 -47 -64 28
8097B8J8k33J00J47j4R4j65j45L30k24L6J26J3j50j34K21j05J14o3m2J44k59J96
$$ 28 46 -187 -87 60 46 140 -25 -170 160 -64 -28 98 111 -39 -173 48 -57 57 -6 -48 96 -163 33
8120C3q9M4j67J87J34k54J81l0N6q4j57m8R9O5K5j22J66j3L4Q2j46J55k45K2J60
$$ 33 -56 -12 -179 8 142 -112 69 39 95 11 -146 -194 -95 -30 -5 -127 39 26 60 142 -4 151 -94 -72 88
8145H8j9k08R9J18j75L4J12j41r3J75K6m6NJ21p3jj10M1N9R5k36J2J78j00m4N
$$ 88 69 -139 -40 78 -97 -63 49 -92 -185 -10 16 -30 -25 96 23 22 -88 -47 12 107 -129 -117 61 -39 -83 -78
8171g8J04p1p1%O4j78L07j40m1n5R1l3N3Jl4l7N9J53j40Q5
$$ -78 26 -45 -116 -116 -52 -230 77 -63 -104 -159 -68 -101 -48 -47 -81 -118 -59 94 -46 39
8191C9
$$ Imaginary data points
##PAGE= N=2
##DATA TABLE= (X++(I..I)), XYDATA
0@%%%%%%%Qj6J6k4L2m0M8n6P2r6J20j44J76k08K48k96L52m16M83n59O47p48Q60
$$ 0 0 0 0 0 0 0 0 8 -8 8 -16 16 -24 24 -32 40 -56 64 -80 96 -112 136 -160 192 -224 259 -300 347 -401 459
30D59r82J118j271J440j625J830k057K305k573K870l196L548l934M356m817N321
$$ 459 -523 595 -676 764 -861 969 -1088 1217 -1356 1514 -1682 1866 -2068 2288 -2529 2792
46B792n870O471p130P851q645R522j0492J1571j2779J4138j5679J7445j9495K1902
$$ 2792 -3078 3393 -3737 4114 -4531 4991 -5501 6070 -6709 7429 -8250 9195 -10300 11602
60A1602k4771K8266l2629L8242m5757N6379p2571J00393j60515M90498k25337
$$ 11602 -13169 15097 -17532 20710 -25047 31332 -41239 59154 -101361 389137 163800
71A63800n88585Q72248o38308K61591R6384l27772M10332l19660j5121L72379
$$ 163800 -424785 447463 -190845 70746 167130 -160642 249690 -69970 -85091 287288
81B87288m81917K12586J20344k14314J05623m5264K1983j7938K0542l9992K1793
$$ 287288 -194629 17957 138301 -76013 29610 -15654 6329 -11609 8933 -31059 -9266
92i266P0934k03371J96968m9586n3812Q9886j72476K01170l1189j79140K25488
$$ -9266 61668 -141703 55265 5679 -48133 41753 -130723 70447 39258 -139882 85606
103H5606j47888L7800R4202j88067K12434k04845Q1854K11234m01964K43165L5583
$$ 85606 -62282 -24482 69720 -118347 94087 -110758 -28904 182330 -219634 23531 59114
114E9114j14310P3828j15450J85864j22506n9251K15263k02944N8870P8452j20453
$$ 59114 -55196 18632 -96818 89046 -33460 -92711 122552 -80392 -21522 56930 -63523
125f3523J39972j42908Q7414N1975j74229J99919j10806K2394J8674p7959J63435
$$ -63523 76449 -66459 20955 72930 -101299 98620 -12186 10208 28882 -49077 114358
136A14358j32462l621N3426j0503L8586j29482J08176K1678j57894K09463j35354
$$ 114358 -18104 -21725 31701 21198 59784 -69698 38478 60156 -97738 111725 -23629
147b3629n5466J93706k04392J49159o6695r3172K24743j88333L4705P1591q9158
$$ -23629 -79095 114611 -89781 59378 -7317 -100489 124254 -64079 -29374 42217 -46941
158d6941O8775l1387j4236M3831k9290J255p658M3969k9879m2004R8470r8464
$$ -46941 21834 -9553 -23789 20042 -9248 -7993 -15651 28318 -1561 -43565 54905 -43559
170d3559O7259p676p0022J25273j41357J01027K4699j55593J36077m870m7125
$$ -43559 23700 16024 -53998 71275 -70082 30945 55644 -99949 36128 31258 -15867
181a5867Q07r653Q2965q8448r239J16014j42691O8611L9157p4428M3288m8819
$$ -15867 -15060 -24713 58252 -30196 -39435 76579 -66112 2499 41656 -32772 10516 -38303
193c8303J01425q3721l1948J23180r6149J1208K8680j3689L736k5676M2866k1824
$$ -38303 63122 -20599 -52547 70633 -25516 -14308 14372 683 4419 -21257 21609 -215
205b15m0897J00403q9825p926R3825r0237M4370l0239K0721J7956n7384O9824
$$ -215 -41112 59291 -30534 -38460 55365 -34872 9498 -20741 -20 17936 -39448 30376
217C0376n0598k655N0211k3092l1011J2922N3564l5261n5612R3985k4613o2336
$$ 30376 -20222 -22877 27334 4242 -26769 -13847 39717 4456 -51156 42829 18216 -44120
229d4120R4832o3829J8218O967j3987M5007q6273O9973J6724p4655L3880L1455
$$ -44120 50712 -13117 5101 12068 -1919 43088 -43185 26788 43512 -31143 2737 34192
241C4192k6188k4247K6896J5478m1539J7848K9891p4982O9892j3285m2851M9356
$$ 34192 8004 -16243 10653 26131 -15408 2440 32331 -42651 27241 13956 -28895 20461
253B0461m5197M7358k5539k9910N0794k1617j6202L0940k9755l321N1545n8178
$$ 20461 -24736 22622 -2917 -32827 17967 -3650 -19852 11088 -18667 -21988 29557 -28621
265b8621P961K9246j5856r004J2911q551j37K7009m7873L9203j2634q158L4401
$$ -28621 -20660 8586 -7270 -16274 -3363 -11914 -12051 14958 -32915 6288 -6346 -14504 19897
278A9897m9042K7481J5703k4308P824K787r569L6371m1705M297L8249m0521L0616
$$ 19897 -29145 -1664 14039 -10269 -2445 342 -9227 27144 -14561 -10264 27985 -12536 18080
291A8080k7185J5817J2614k5447J8239o016j733J875J7010k9177J008L3827j4735
$$ 18080 -9105 6712 19326 -6121 12118 6102 4369 6244 23254 -5923 -4915 28912 14177
304A4177l5224L9666j679k1595K2838m2871O5503m8458j7069Q3721j06480M9297
$$ 14177 -21047 18619 16940 -4655 18183 -24688 40815 -7643 -24712 59009 -47471 1826
316A826M8796j00292N2433K1700n2460M6528m6258K7722K2710p4540Q1795m6809
$$ 1826 50622 -49670 2763 24463 -27997 18531 -27727 -5 22705 -51835 29960 -16849
328a6849j1352N5603m8311J524J6386J5670l1136k954L6417j6043k4238L8425
$$ -16849 -28201 27402 -20909 -19385 -2999 12671 -18465 -21419 14998 -1045 -25283 13142
340A3142j4178j7242K8669o161q274j6476M8648k6436k1790K6710O244k171m8933
$$ 13142 -1036 -18278 10391 4230 -4044 -20520 28128 1692 -20098 6612 12856 10685 -38248
353c8248P4929l1825m0876P9662n7736j345M3234m1037K4475k1152l97O2901j05803
$$ -38248 36681 4856 -36020 43642 -14094 -15439 27795 -13242 11233 -9919 -10316 52585 -53218
366e3218O5419K6956q9939R4186n6691N752K9448l9699M5745m8308J5018M5550
$$ -53218 12201 39157 -50782 43404 -13287 -7535 21913 -17786 27959 -20349 -5331 40219
378D0219o9821K7578K8101m6117L0928j6449J0821q554o214L2904n2988M1550
$$ 40219 -29602 -2024 26077 -20040 10888 -5561 5260 -3294 -9508 23396 -29592 11958
390A1958j2338l716O287k6764N9711n5343N166M3446n3212L5969l12l7212N2272
$$ 11958 -380 -4096 2191 -24573 35138 -20205 -15039 28407 -24805 11164 10852 -26360 25912
403B5912l5998J5150J0653m8452P2732n2514J2487J6689m0197N7704n2086K2336
$$ 25912 -10086 5064 15717 -32735 39997 -12517 -30 16659 -23538 34166 -17920 4416
415D416O106l1510M7260m1751N585K9848m6317L9080j8911j6599N0956o3042M4032
$$ 4416 10522 -20988 26272 -15479 -9894 19954 -26363 12717 -6194 -22793 28163 -34879 9153
428I153j4844j1758M3349p1104O5819k3532k0131M8355n5583L8572k564k1850
$$ 9153 -5691 -17449 25900 -45204 20615 -2917 -23048 25307 -30276 8296 5732 -16118
440a6118L9337n3356L5721K8977p6112O2037k0938l563K2083m3165N7284n3922
$$ -16118 23219 -30137 5584 34561 -41551 20486 -452 -4015 18068 -25097 32187 -21735
452b1735K6225K3757n8915N0218j7871J601L287j7422L8148l5706M46M2992n5200
$$ -21735 4490 28247 -30668 19550 1679 3280 6567 -10855 27293 -8413 -7967 35025 -20175
465b0175L3517j728k2963L6829m0134M5922m7510Q868N7669q5554M9443o857j5281
$$ -20175 13342 11614 -11349 25480 -14654 31268 -16242 -7374 50295 -35259 14184 7327 -7954
478g954K9057m3798M0425k1763k5988P6225p5542L304N7514o1275M1635m0164
$$ -7954 21103 -22695 17730 -4033 -30021 46204 -29338 -26034 31480 -29795 11840 -28324
490b8324K8006J5136o8533Q6684n0042j1656M6649l9831K3958j4457N569J8084
$$ -28324 -318 14818 -53715 32969 -17073 -28729 17920 -21911 2047 -12410 -6841 11243
502A1243m3451M5383k264m2544M9727k8884J8352o858j1985L1456m6827N7332
$$ 11243 -32208 13175 10911 -31633 18094 -10790 7562 704 -11281 20175 -26652 30680
514C0680l0470k4700N2288l4473J8506j5053o35K8796m1673L0529O374m8176N6785
$$ 30680 210 -24490 27798 -6675 11831 -3222 -3857 24939 -16734 13795 20169 -28007 28778
527B8778k4227o008J5686k8743N2640n8265K6574K3763n5766N0168k9923J1844
$$ 28778 4551 -1457 14229 -14514 38126 -20139 6435 30198 -25568 24600 -5323 6521
539F521Q850l6431M2735k4429p224L4854n0939L2475P97k6877M3696n7497L9547
$$ 6521 15371 -21060 21675 -2754 -9978 24876 -26063 6412 7209 -19668 24028 -33469 6078
552F078J19k8979L9985n0476M1044l868k8554L4839k7124J3361Q435k3337K6949
$$ 6078 6197 -22782 17203 -33273 7771 3903 -24651 10188 -16936 -3575 4860 -18477 8472
565H472k0831M713K3459m0717L9268k1509j388K4359l5120L6968k8527J0750J0585
$$ 8472 -12359 -7646 15813 -24904 14364 -7145 -8533 15826 -19294 17674 -10853 -103 10482
578A0482k4113L2309k6526k76K3788j7198K320m311M123J7814l8282L4138p125
$$ 10482 -13631 18678 -7848 -8124 15664 -1534 786 -3525 598 18412 -19870 14268 7143
591G143k7786M7275l5574J5920j1641L351K8270n2164L4657N837k9749K3924n451
$$ 7143 -20643 26632 -8942 6978 -4663 -1312 26958 -25206 9451 15288 -14461 9463 4012
604D012n481N645j0439K1884k3630L199K5223m0893L1597r835l440M327j3742
$$ 4012 -1469 4176 -6263 15621 -8009 -4810 20413 -20480 11117 1282 -2158 2169 -11573
617a1573L2312l6355J4760J4198l0818K2708K863j6913P155j093J3599j4594j4487
$$ -11573 20739 -15616 -856 13342 -17476 5232 8095 -8818 -1663 -2756 10843 -3751 -18238
630a8238M2959l8164P315J9710k2705J0599j0685K5194k4347n460L1088k3571
$$ -18238 24721 -13443 -6128 13582 -9123 1476 -9209 15985 -8362 -13822 17266 -6305
642f305k661J3262l664m935j849Q316L543k5200L0329j1585j4923K8686k2811
$$ -6305 -8966 4296 632 -4303 -6152 2164 5707 -19493 10836 -749 -15672 13014 -9797
655i797J0685p356Q657J077j5748J8966q429j786O188j516n952P031J092L44j2844
$$ -9797 888 -6468 2189 3266 -12482 6484 -1945 -3731 2457 941 -5011 2020 3112 3456 -9388
670i388J5735M446k4802K6579j3396K354K768n212J1291j5784J1352J725q145
$$ -9388 6347 10793 -14009 12570 -826 1528 4296 -916 10375 -5409 5943 7668 -477
683d77j07J1526j0431p56O544l415J296o188R115q759Q113q528K769N765j2956
$$ -477 -584 10942 511 -245 6299 2884 4180 -2008 7107 -1652 6461 -2067 702 6467 -6489
698f489J5071j4573P442L71o475P679n793l755J1265o372j0020J9271j6875R914
$$ -6489 8582 -5991 1451 1822 -4653 3026 -2767 -6522 4743 -1629 -11649 7622 -9253 661
712F61n056k916J2940j9886J7754o059q389J2354k175q971R089j320j942K671
$$ 661 -4395 -7311 5629 -14257 3497 -2562 -10951 1403 -772 -9743 -654 -1974 -3916 -1245
726a245p263J7346k1339J3852M436j8683J9862p975O28k253M532L748q537J57
$$ -1245 -8508 8838 -12501 1351 5787 -12896 6966 -1009 -381 -2634 1898 5646 -2891 -2734
740b734J4827j3848k694K0187k0661Q055K216J564q483J609J5066j8893N327K338
$$ -2734 12093 -1755 -4449 15738 -4923 3132 5348 6912 -1571 38 15104 -3789 1538 3876
754C876O359j4758M669J3909k1176O543J1742j3880l593J6343j2013J911n509
$$ 3876 10235 -4523 146 14055 -7121 -578 11164 -2716 -6309 10034 -1979 -68 -5577
767e577J2403l931j9651L2720k3098J358J1295r889M741p035J2125p795q106J7328
$$ -5577 6826 2895 -16756 15964 -7134 -5776 5519 -4370 371 -6664 5461 -2334 -10440 6888
781F888n945j4352K0641j0759n1L069m077J1838k4253K7523j1046j4068K5262
$$ 6888 943 -13409 7232 -3527 -3578 -509 -4586 7252 -17001 10522 -524 -14592 10670
794A0670j6555O603o100M847P355j8463J2814Q055k3140K0145k651j1595J6007
$$ 10670 -5885 718 -5382 -535 6820 -11643 1171 9226 -13914 6231 3580 -8015 7992
807G992j6507K0706j9511L883J8471k7268J9606p934R95L974q178R203o010j189
$$ 7992 -8515 12191 -7320 -3437 15034 -12234 7372 -562 433 4407 -3771 5432 -578 -1767
821a767R005j1555N272N248j3153J6060j5900J1525l043p545J8536k6526K4846
$$ -1767 7238 -4317 955 6203 -6950 9110 -6790 4735 1692 -5853 12683 -13843 11003
834A1003j0237q574J9643j9864J3574l450r100J7679j4552J290J4089k4888K4203
$$ 11003 766 -7808 11835 -8029 5545 2095 -7005 10674 -3878 -2588 11501 -13387 10816
847A0816j1106p627K1223k5995K2870j4176J888R143j8192K2315j5837p65J2325
$$ 10816 -290 -7917 13306 -12689 10181 -3995 -2107 7036 -11156 11159 -4678 -5443 6882
860F882j1407M381j180k729J2015k0917J6814K798k4093L0487k1413R377k209
$$ 6882 -4525 -144 -1324 -4053 7962 -12955 3859 6657 -17436 13051 -8362 1015 -1194
873a194o277K0575l1023K3151N26j8545J7324o554N39J930p933J5137j4658J695
$$ -1194 -7471 13104 -17919 5232 5758 -12787 4537 -2017 -1478 452 -7481 7656 -7002 -5307
887e307J9636l2374K4726n688o232J1402j8211K6638k3851P232J5526k6293J7263
$$ -5307 14329 -18045 6681 993 -5239 6163 -12048 14590 -9261 -2029 13497 -12796 4467
900D467J446q869N818m514R161o290r180K6598k6177P416J1884j6909J5488j8997
$$ 4467 5913 -2956 2862 -1652 7509 1219 -7961 18637 -7540 -124 11760 -5149 10339 -8658
914h658K2216j3039q956K8236k8924R393Q646j1829P295p424M220P094k0261K2298
$$ -8658 13558 519 -8437 19799 -9125 268 8914 -2915 4380 -3044 1176 8270 -11991 10307
928A0307j0782j0530K4827k3726J3867j0133O103N495k1086K6230j7080p0J1364
$$ 10307 -475 -11005 13822 -9904 3963 -6170 -67 5428 -15658 10572 -6508 -6578 4786
941D786j1494O817n190Q18J0042j8792J4649K021k0277K6927j9080Q744q13r759
$$ 4786 -6708 109 -5081 -4263 5779 -13013 1636 3657 -16620 10307 -8773 -29 -842 -10601
955a0601K3238k6215J7389k124j1485J8648j3311L851L784r159J3513q134l220
$$ -10601 12637 -13578 3811 1687 -9798 8850 -4461 -610 3174 -5985 7528 -606 -3826
968c826J4304k0457K1440j0675o760J9762k2595J9729j1156N46R003j5330J5052
$$ -3826 10478 -9979 11461 786 -5974 13788 -8807 10922 -234 312 9315 -6015 9037
981I037o800l625Q027p149K538M061r483R770r070O390J68j0777J8089k0939J5384
$$ 9037 2237 -1388 6639 -510 2028 6089 -3394 6376 -2694 3696 3864 -6913 11176 -9763 5621
996E621k905r411J3337j5594J6573r395p358J6910j2129j210J0961j2200O662
$$ 5621 2716 -6695 6642 -8952 7621 -1774 -9132 7778 -4351 -5561 5400 -6800 -138
1009a38k957j17J0426k3779K3622p853q982J5245j2619J0171j1010Q518K992j3604
$$ -138 -3095 -3212 7214 -16565 7057 -796 -9778 5467 -7152 3019 -7991 527 3519 -10085
1023a0085J2136l18p852P788j850k901L719l622J0326j7420J3133K509j5376J9314
$$ -10085 2051 1733 -6119 1669 -181 -3082 637 -2985 7341 -10079 3054 5563 -9813 9501
1037I501j4547P484l263Q22Q059j6852J2505L627j3268Q110M327j0780P916m174
$$ 9501 -5046 2438 -825 -3 8056 -8796 3709 7336 -5932 2178 6505 -4275 3641 -533
1051e33P513q889k627J8389k1134J0112L40k041J53l187J0879j2817K892O230
$$ -533 6980 -1909 -4536 13853 -7281 2831 3171 1130 1283 -1904 8975 -3842 -950 5280
1065E280m364l430N711l170N16q41K078m4q397J4696j2830M782K026o332Q176
$$ 5280 916 -2514 3197 27 543 -298 1780 1736 -6661 8035 -4795 -13 2013 -4319 3857
1080C857r092R367p222n43P354n739k260O500l848k111N011m635N465r630J0666
$$ 3857 -5235 4132 -3090 -3633 3721 -2018 -4278 2222 -1626 -3737 1274 -3361 2104 -7526 3140
1095C140l570o669J0452p859N430n441N103j542k614M058j608J35j589L478l386
$$ 3140 -430 -7099 3353 -4506 924 -4517 586 -956 -3570 488 -1120 -985 -2574 904 -2482
1110b482M635n600M864j743p02L796n925Q399r487P260k04m853M528j030R47k624
$$ -2482 2153 -3447 1417 -326 -1028 2768 -3157 5242 -4245 3015 2811 -2042 2486 1456 2403 -221
1126b21L407k845L674n573O871l335m197R274q139M279l132L192k259L6J290j291
$$ -221 3186 341 4015 -1558 5313 1978 -2219 7055 -1084 3195 63 3255 996 1032 2322 1031
1142A031m7j588N782r264P073k367j654J485q01K907p994Q499l679j265l59L794
$$ 1031 984 -604 5178 -4086 2987 620 -1034 451 -350 2557 -5437 3062 -617 -1882 -2241 1553
1158A553l226l265Q477p075r3J648M962j0023M649M384o409K116p71O637j1782
$$ 1553 -1673 -4938 3539 -3536 -3629 -1981 2981 -7042 -2393 1991 -4418 -2302 -3073 3564 -8218
1173h218Q520J565p338M891m9J376n956O636j88l836M36O886o746j88O545p270
$$ -8218 302 1867 -5471 -580 -629 747 -5209 1427 1239 -2597 -2161 4725 -2021 -2209 4336 -2934
1189b934P093p629Q587m765l330J1367j0981L900J506j4k627J271J947j442l217
$$ -2934 4159 -3470 5117 352 -2978 8389 -2592 1308 2814 2800 173 1444 3391 1949 -1268
1204a268O139k295o979J2512j0448M605k170J891K061j0779J4947r643j121O194
$$ -1268 4871 2576 -4403 8109 -2339 2266 96 1987 4048 -6731 8216 -1427 -2548 3646
1218C646m125m2M73K90P72l552K142M737j1992J1301n074o02L883p537J0202r795
$$ 3646 -479 -521 -48 242 1014 -2538 -396 4341 -7651 3650 -1424 -2026 1857 -5680 4522 -5273
1234e273N560q30k879M383m119L388k204p9J578l10k237M581n946O198l230k940
$$ -5273 287 -543 -3422 961 -3158 230 -1974 -2053 -475 -785 -3022 1559 -4387 1811 -1419 -4359
1250d359R438j1894J1115p495K132N010j0198J1172o705Q16L715m778K909J060
$$ -4359 5079 -6815 4300 -3195 -1063 3947 -6251 4921 -1784 -968 2747 -2031 878 1938
1264A938m517O899o542K723M521j1443J4348j1993N012M034r608J0058q783P419
$$ 1938 -2579 4320 -2222 501 5022 -6421 7927 -4066 946 4980 -4628 5430 -3353 4066
1278D066l487l516Q610o305j352O771n484J276J144k211N907j2352J3771n508
$$ 4066 579 -2937 5673 -632 -1984 4787 -697 579 1723 -488 5419 -6933 6838 1330
1292A330o838J2888j1092P887o634L600K847r852R739k975m479O000k538j651
$$ 1330 -5508 7380 -3712 4175 -2459 1141 3988 -5864 3875 900 -3579 2421 -117 -1768
1306a768K861m837Q373j0335N118M900j3382J4701r824L976o37l050Q462j1842
$$ -1768 1093 -3744 4629 -5706 -588 4312 -9070 5631 -4193 -217 -854 -3904 4558 -7284
1320g284Q451P53p536N960L06l457L275m307P681o495j997J2933j7435J2432k788
$$ -7284 1167 1920 -5616 344 650 -2807 468 -3839 3842 -2653 -4650 8283 -9152 3280 492
1335D92l295N993r117J2585j0196J019Q053r540M043L033n786N283l496K211K416
$$ 492 -2803 3190 -5927 6658 -3538 -2519 5534 -4006 37 3070 -2716 2567 -929 1282 3698
1350C698r622J4432j1576K819O412j0262J0415r506P493j959n066Q905p202J296
$$ 3698 -5924 8508 -3068 -249 6163 -4099 6316 -3190 4303 2344 -2722 6183 -1019 277
1364B77L687m806K660n20k487P132j1567R313k122n459J0136j2223J0366o536
$$ 277 3964 -842 1818 1298 -1189 5943 -5624 3689 1567 -3892 6244 -5979 4387 -2149
1378b149L64N712r503Q051l597o44L304m325K031J876n869P531o216J643L989
$$ -2149 -1785 3927 -5576 2475 -1122 -1766 1538 -2787 -756 1120 -4749 2782 -3434 -1791 2198
1393B198r515J2407j0558M800J964o985R194q700N244q62k404M845l985k0M569
$$ 2198 -7317 5090 -5468 -668 1296 -5689 3505 -5195 49 -813 -3217 1628 -2357 -2377 2192
1408B192o096M374J16m865Q578q792Q569n562j057R524j2535R405l094p28K592
$$ 2192 -3904 470 586 -4279 4299 -4493 4076 -1486 -2543 6981 -5554 3851 757 29 2621
1423B621l445M921l807j422O228m899j497O880p534N864m796L416J185q922J2545
$$ 2621 -824 4097 290 -1132 5096 197 -1300 5580 -1954 3910 -886 2530 3715 -5207 7338
1438G338r101K480J209k546L743n556N026j812l319M498l82n037O454n015K383
$$ 7338 -1763 717 1926 -620 3123 -2433 2593 781 -2538 1960 1578 -3459 2995 -2020 363
1453C63k47k652O367j0585J0388m365l342O217n001L432l652L430n17l925L855
$$ 363 116 -2536 3831 -6754 3634 -731 -4073 2144 -2857 575 -3077 353 -164 -4089 -234
1468b34J861o397M412R54l672L451l654O526q398M384L610p563O214l651L509
$$ -234 1627 -4770 -358 596 -3076 375 -3279 3247 -5151 -767 2843 -4720 1494 -2157 1352
1483A352l409J484K244l512J430K244k273o26L162l367M171m941M513j726k150
$$ 1352 -2057 -573 1671 -1841 -411 1833 -440 -1066 2096 -1271 2900 -2041 2472 746 -1404
1498a404O180p449N641l005J505l9k011L451k986J243L38J66k321L783l304J832
$$ -1404 4776 -2673 2968 -37 1468 1429 -582 2869 -117 1126 1464 1630 -691 3092 -212 1620
1514A620j174J2K230n188O814n610K099k83p04K341l926L107j869J083j104J280
$$ 1620 446 458 2688 -2500 4314 -1296 803 520 -184 2157 -1769 1338 -531 552 -552 728
1530G28j980J531p86k77J640m380N444m238K104j412M73J399l751M453l161J616
$$ 728 -1252 279 -507 -784 856 -3524 1920 -2318 -214 -1626 -1153 246 -3505 948 -2213 -597
1546e97j664K462j862l74K053k287J732j807L508m095K541M32o76N6o03K956m283
$$ -597 -2261 201 -1661 -2035 18 -2269 -537 -2344 1164 -2931 -390 42 -634 -578 -1181 1775 -2508
1563b508M321k514J129p28R24J028l790M800k565J421k026K864j750p51K753k489
$$ -2508 1813 -701 428 -300 624 1652 -2138 2662 97 1518 -508 2356 606 -145 2608 119
1579A19J327j756L947m515K110R08j408j73j25L237n853M407j239R2j091Q26J730
$$ 119 1446 -310 3637 -878 1232 2140 732 559 434 3671 -2182 2225 986 1078 -13 813 2543
1596B543m968M973k101p86p31K983k154j243J918r54N00k471N046o023L040M76
$$ 2543 -2425 2548 447 -339 -1070 1913 -241 -1484 434 -520 -20 -2491 2555 -3468 -428 48
1612D8k444K267l294M929m921J922J538k173L69Q51j67r81J824j806K821m249
$$ 48 -2396 -129 -3423 1506 -3415 -1493 45 -2128 -1759 -908 -1075 -2056 -232 -2038 783 -3466
1628c466N105k703j539N076m979L952l699L467q00k044L536k043J39O68R83k907
$$ -3466 1639 -1064 -2603 2473 -2506 1446 -2253 1214 414 -1630 1906 -137 2 670 1653 -1254
1644a254K594j324J928k623J602J737m444N233m291L307k258N37K115l960M034
$$ -1254 1340 16 1944 -679 923 2660 -1784 3449 -842 2465 207 744 2859 -1101 2933
1659B933k984J495m95O8J6L80j712J945o34j676L060m978N657n023K177J284n003
$$ 2933 -51 1444 949 1017 1033 1413 -299 1646 1012 -664 2396 -2582 3075 -1948 229 1513 -3490
1676c490O518n546K844q00j101K220k414Q10J500k575J214J660m538N829n223
$$ -3490 3028 -2518 326 -474 -1575 645 -1769 -959 541 -2034 -820 840 -3698 2131 -3092
1691c092L409q14k699O610q072N800j623j004K022k519K749j639l95J843r92j754
$$ -3092 317 -497 -3196 3414 -4658 1142 -481 -1485 537 -1982 767 -872 -1267 576 -416 -2170
1707b170M705m866K733j088Q5K852o404P785n244J039K137k719K981l186L586
$$ -2170 2535 -2331 402 -686 -601 2251 -4153 3632 -1612 -573 1564 -1155 1826 -1360 2226
1722B226j960r61K526n70k578M082k288R1J058k225M881p460O734k418l098N787
$$ 2226 266 -695 1831 1261 -1317 2765 477 568 1626 -599 4282 -3178 3556 1138 -1960 3827
1738C827n490M241l788K214J089m159L374M00l419L036o26j920L171m981O537
$$ 3827 -1663 2578 -1210 1004 2093 -2066 1308 1708 -1711 1325 699 -1221 1950 -3031 3506
1753C506o032J703M004p450O782m550K436k90k322L987l715R67J970k920O51K211
$$ 3506 -2526 -823 3181 -4269 2513 -2037 399 109 -2213 1774 -1941 -974 996 -1924 -1273 938
1769I38l983M089l975L431m92m217P509p574M774j088j238K656l585M183k777
$$ 938 -3045 1044 -2931 500 8 -4209 3300 -4274 500 -588 -1826 830 -2755 1428 -1349
1784a349L8K189r47j431K791k683K659j652m84M071o147O302m427J960J049l630
$$ -1349 -1311 878 -69 -1500 1291 -1392 1267 -385 -869 3202 -2945 3357 -1070 890 1939 -1691
1800a691N517n512L415k71j398J345q64K32J022k523J919R04l974N843o141M341
$$ -1691 3826 -1686 1729 1458 60 1405 541 773 1795 -728 1191 2095 -1879 3964 -2177 2164
1816B164j006k532N182o631N895l487K9K364l386K208k51j465J371m76j284L409
$$ 2164 1158 -1374 3808 -2823 3072 -415 -386 1978 -1408 800 549 -916 455 -21 -1305 2104
1832B104n425M915k191j675L780n041N825n770L127J013l783L380j733O66q41
$$ 2104 -3321 1594 -597 -2272 1508 -3533 2292 -3478 -351 662 -3121 259 -1474 -808 -1649
1847a649P65L76m73j435M199l687M25K649l682M116m585M892k655q84M067m361
$$ -1649 -884 -508 -981 -2416 1783 -1904 -1479 1170 -2512 1604 -2981 1911 -744 -1628 2439 -1922
1863a922L097j760J533j032R0R01k35j144J881n19j955M016m318L966l194J761
$$ -1922 1175 -585 948 -84 6 907 672 -472 1409 890 -1065 2951 -1367 2599 -595 1166
1879A166N54l521N857n075K256m24O6L25j174J405n28j270J082J570m236M127
$$ 1166 1720 -1801 4056 -1019 1237 813 879 1204 30 1435 907 -363 719 2289 -1947 2180
1895B180k395J138p77j386M099n902M786j992o55J063q79J347k104J521n39L16
$$ 2180 -215 923 146 -1240 2859 -3043 1743 -249 -904 159 -720 627 -1477 44 -495 -179
1911a79j600K891k953J256K92j364K249l389L982l264J752L7j549K209k268K582
$$ -179 -1779 1112 -1841 -585 -293 -1657 592 -2797 1185 -2079 -327 -290 -1839 370 -1898 684
1927F84k244J544p73N24o62O99K39r64J598j982K683l264L233j472p19K443k943
$$ 684 -1560 -16 -789 -265 -927 -228 11 -953 645 -1337 1346 -1918 1315 -157 -876 1567 -1376
1944a376L126l032K540j090j02O05j87L26q26J637k245K485k330K419j718o6K186
$$ -1376 1750 -1282 1258 168 66 671 484 810 -16 1621 -624 1861 -469 1950 232 166 2352
1961B352l062K835k971K768j755L55P96j415J216j383K016k776K077j319J134
$$ 2352 -710 2125 -846 1922 167 522 1318 -97 1119 -264 1752 -1024 1053 -266 868
1976H68j500O06J144k841K800k093J543k135J849l28j472K040j864J868k580K704
$$ 868 -632 -26 1118 -1723 1077 -1016 527 -1608 241 -87 -1559 481 -1383 485 -2095 609
1992F09k013N36M51q37J234j784K600k848K196j090N48n56J99J653l108K944k020
$$ 609 -1404 -868 -417 -1254 -20 -1804 796 -2052 144 -946 -398 -954 -755 898 -2210 734 -1286
2009a286K046k204J611K16j867K750k077J704k076K611j202k53J039n27M90j751
$$ -1286 760 -1444 167 383 -1484 1266 -811 893 -1183 1428 226 -27 1012 485 975 -776
2025g76L105k960J849r51J301r65o02K906m161L401j789J177j288M00J015j915
$$ -776 2329 -631 1218 267 1568 603 1 2907 -1254 2147 358 1535 247 647 1662 -253
2041b53J453j207J403k151K354k010N88J90p53J532l385M048l363J678n05m04
$$ -253 1200 -7 1396 -755 1599 -411 177 367 -386 1146 -2239 1809 -1554 124 -381 -785
2057g85Q98j776K534k323J492r43J144j838J036K20r21Q83j618L155l705K838
$$ -785 113 -1663 871 -1452 40 -903 241 -1597 -561 -341 -1262 -379 -1997 1158 -2547 291
2073B91j183K8J064k151L105l325K718r79n19M14K47J81o50Q99p11J834k744L201
$$ 291 -892 -864 200 -1951 1154 -2171 547 -432 -951 -537 -290 -109 -759 140 -571 1263 -1481 1720
2091A720k555J169J221k712L563l718L330j855K9J393j605J026n22N19o99Q69
$$ 1720 -835 334 1555 -1157 2406 -1312 2018 163 192 1585 -20 1006 484 1003 304 1173
2107A173j430K392l089K101J64k427L238l369L590l395J559J094k796K422j494
$$ 1173 -257 2135 -954 1147 1311 -1116 2122 -1247 2343 -1052 507 1601 -1195 1227 -267
2122b67R15j326J402j071P22j195J687j074q80K422l390L369l057J952m46j364
$$ -267 648 -678 724 -347 375 -820 867 -207 -1087 1335 -2055 1314 -1743 209 -237 -1601
2138a601K792l414K735j438N79m35j17O68m93l97O04O19k125L248l220K536j377
$$ -1601 1191 -2223 512 -926 -347 -782 -899 -231 -724 -1121 -517 102 -2023 1225 -1995 541 -836
2155h36K48J662l906N103l377Q29L59m71R79j339J318k11p03OJ869l088L112j757
$$ -836 -588 1074 -2832 2271 -1106 -277 82 -389 590 -749 569 358 -345 -339 1530 -1558 1554 -203
2173b03M41P76k344M433m661K896o68p81J536j840J786j182M29j03K59r19J831
$$ -203 238 1014 -1330 3103 -1558 1338 670 -111 1425 -415 1371 189 618 515 774 -145 1686
2190A686k139Q59Q81k012K841l587L522k669N36J485k478K347k300J920j488N81
$$ 1686 -453 406 1287 -725 2116 -1471 2051 -618 -82 1403 -1075 1272 -1028 892 -596 -15
2206a5J81l84p67Q22J88j242J511k015K593l033K226o6k161L370l426K974k469
$$ -15 166 -218 -985 -163 25 -1217 294 -1721 872 -2161 65 -1 -2162 1208 -2218 756 -1713
2223a713J078O68j498J307n95J79j5N77j165J945k625K724j332q54L095m020L893
$$ -1713 -635 33 -1465 -158 -753 -574 -589 -12 -1177 768 -1857 867 -465 -1319 1776 -2244 1649
2240A649k713J443J42j574K371j774J013J6K07r77J613j558J438r91O4J402l162
$$ 1649 -1064 379 521 -1053 1318 -456 557 573 780 -197 1416 -142 1296 305 369 1771 -1391
2257a391L924l228J825l33q21J827k576K384j527N87k18K87p79M83j21k19L30
$$ -1391 2533 -695 1130 797 -24 1803 -773 1611 84 671 453 740 -39 444 323 104 434
2274D34j422K650l043K236j325K54N15k098L249l237J932n05k49K48m95J081j255
$$ 434 -988 1662 -1381 855 -470 -216 299 -1799 1450 -1787 145 -360 -609 -361 -856 225 -1030
2291a030P00m74P96j890K785k329O99J008j904K515l357L668k153q1J515j846
$$ -1030 -330 -804 -8 -1898 887 -1442 -743 265 -1639 876 -2481 1187 -966 -1047 468 -1378
2307a378J408n88P96p67P68p37J534j958J340L6j376K548k935L171k535J182P21
$$ -1378 30 -558 238 -529 239 -498 1036 -922 418 454 -922 1626 -1309 1862 -673 509 1230
2324A230j925J937j196J062j223J230p98M73m37M32n9r78K053k488K057j476J205
$$ 1230 -695 1242 46 1108 -115 1115 317 790 353 785 726 -252 1801 -687 1370 -106 1099
2341A099q67o26J807k247J921j355J175j323M41N69j145R88q54P61j375J664j585
$$ 1099 232 -394 1413 -834 1087 -268 907 -416 25 594 -551 437 -417 344 -1031 633 -952
2358i52J139q04q7J108k260K920k616J859j012R3P48j308J311j079N72q71J629
$$ -952 187 -617 -704 404 -1856 1064 -1552 307 -705 -612 136 -1172 139 -940 -368 -1239 390
2375C90j598J015k35k44R53j831K421k525K098q38k10P76r43J472j732J679j062
$$ 390 -1208 -193 -428 -672 281 -1550 871 -1654 444 -394 -604 172 -771 701 -1031 648 -414
2392d14Q64o88P16j09o67J173j654J962j698J576j024J6R43r27J090j911K377
$$ -414 450 -238 478 369 -298 875 -779 1183 -515 1061 37 53 996 69 1159 -752 1625
2409A625j814J120q01N83O7j102J714j812J513j185J147j212L36M45r88J299j553
$$ 1625 -189 931 130 713 780 -322 1392 -420 1093 -92 1055 -157 179 624 -364 935 -618
2426f18J970k205J578q97j25O08j001J216j742J932j713Q84n57K67J59j164J762
$$ -618 1352 -853 725 -172 -297 311 -690 526 -1216 716 -997 -113 -670 -403 -244 -1408 354
2443C54j750J451j554J380p45O3R15j249J079j196J880k162J532j74k93M16r05
$$ 354 -1396 55 -1499 -119 -864 -801 114 -1135 -56 -1252 628 -1534 -2 -176 -469 -53 -958
2460i58J832k149J838o58L34o09O71p8o75J596j723J693j664J731j270J71J201
$$ -958 874 -1275 563 -95 239 -370 301 223 -452 1144 -579 1114 -550 1181 -89 82 1283
2477A283j891J715j107J124j059O33Q0l14Q7k30R18j698J837j657J248r28L96
$$ 1283 -608 1107 0 1124 65 698 778 464 551 321 1239 -459 1378 -279 969 41 437
2494D37O56k009K162j612J102j087M25L12q52Q37q48R15j544J555j335Q11m43
$$ 437 1093 -916 1246 -366 736 -351 74 386 -466 371 -477 438 -1106 449 -886 -75 -518
2511e18K37K24j110K033k539J966j050J33L68o64J247j530J333p65L40l79R01
$$ -518 -281 -57 -1167 866 -1673 293 -757 -624 -256 -920 327 -1203 130 -635 -295 -674 227
2528B27r21K97L71p90J561k287K573j615O19J74p38J638k296K139j155N07k87
$$ 227 -694 -397 -26 -816 745 -1542 1031 -584 35 209 -529 1109 -1187 952 -203 304 17
2545A7O24m24p0L33k47Q28j598J946j840J055K03j015J528j863J917j803J020
$$ 17 641 217 147 480 233 1061 -537 1409 -431 624 827 -188 1340 -523 1394 -409 611
2562F11N0m23M03m53M21o47R95j304J106j478J399o71m55J258j764J991k126J750
$$ 611 661 238 641 188 609 -38 957 -347 759 -719 680 9 -446 812 -952 1039 -1087 663
2580F63r44o16J467r49N30r63J146r42O47o46O77j168P45Q80k038K034j814J734
$$ 663 -281 -897 570 -379 151 -812 334 -608 39 -607 70 -1098 -353 527 -1511 523 -1291 443
2598D43j260L32R58j907J915j436R88n57O68l98j67K19j59L30p03J633j901J720
$$ 443 -817 -485 473 -1434 481 -955 33 -524 144 -254 -421 -202 -361 -31 -734 899 -1002 718
2616G18j064M29M23j149J892j994J641r75M92j27k76R19r24M86m23Q45j224J590
$$ 718 -346 83 506 -643 1249 -745 896 -79 413 286 10 929 5 491 68 913 -311 1279
2634A279j247O11j33o48J842k718K539j634P06J21r35R44j189J186o48J64k43
$$ 1279 32 643 510 -138 1704 -1014 1525 -109 597 718 -217 727 -462 724 76 240 -3
2651cM47r85O85Jq05J301j964K275k166J235K9j015J462j558J462j232P73m38
$$ -3 444 -541 144 145 -660 641 -1323 952 -1214 21 50 -965 497 -1061 401 -831 -58 -496
2669d96K06k12J65o9m55R66j341J753k047J804n65k80J046j531J711j674J398
$$ -496 -290 -502 -337 -406 -861 105 -1236 517 -1530 274 -291 -571 475 -1056 655 -1019 379
2686C79o11O9L07j88L08l94R22j075R35j009J056p93O27L28j428J891j701J595
$$ 379 -232 -163 144 -44 264 -130 792 -283 652 -357 699 -94 533 861 -567 1324 -377 1218
2704A218r04L0O45j210J017o21L69n41O17n48P32j153Q82K49j535K277k125J399
$$ 1218 314 344 989 -221 796 175 544 3 620 72 804 -349 533 782 -753 1524 -601 798
2722G98j089O67Nr80J495j561Q07k11M00p85L98j02l7j8m88J195k068J959j161
$$ 798 -291 376 381 -599 896 -665 142 -69 331 -454 -56 -158 -195 -213 -701 494 -1574 385 -776
2741g76L46M35q24J311j933J686j223Q01j36N8l2l61P83q13O77r03J332j376R80
$$ -776 -430 5 -819 492 -1441 245 -978 -177 -313 -255 -287 -648 135 -678 -1 -904 428 -948 32
2760C2J90n52O49j042J839j957J382k81k95L12l55P81j062J099o00M83q96J073
$$ 32 222 -330 319 -723 1116 -841 541 260 -35 277 -78 703 -359 740 140 623 -273 800
2778H00n27l79J077j213J624j759J571p94l04Q11j132J333j294P88q02O97o09
$$ 800 273 -106 971 -242 1382 -377 1194 400 96 907 -225 1108 -186 602 -200 497 -112
2795a12L96N7l72P66j594J600j304J011n88j91Q65j536J608j204R27j198J028
$$ -112 284 341 -31 735 -859 741 -563 448 -140 -331 534 -1002 606 -598 329 -869 159
2812A59m69k66N64p71R53j202J364j112O55l24j1N58r80J250j557J497j061J097
$$ 159 -310 -576 -12 -783 170 -1032 332 -780 -125 -449 -460 98 -882 368 -1189 308 -753 344
2830C44p47k55Q95q84J122j177J240j126P70j72O1N7m32R29j358J447j134J188
$$ 344 -403 -658 237 -647 475 -702 538 -588 182 10 71 128 -304 625 -733 714 -420 768
2848G68p16p8O84j017J301j175R41p86R12m23l00O72o95P82r90J428j367M53L58
$$ 768 52 -26 658 -359 942 -233 708 -78 834 411 111 783 88 870 -120 1308 -59 394 752
2867G52o08L31o97J137j306J128r78P46n40l4O96j514J360r72P56p77N97l28l68
$$ 752 144 475 -222 915 -391 737 -241 505 -35 -69 627 -887 473 -499 257 -520 77 -251 -619
2886f19Q34r67J027j309J427j235P18j89l22P34j288J756j633P94l8M3k35j28
$$ -619 215 -752 275 -1034 393 -842 -124 -313 -635 99 -1189 567 -1066 -272 -310 -267 -502 -630
2904f30P47j213J217p30J134j310R82k34o34J209j362J419j237J329o22j58M20
$$ -630 117 -1096 121 -609 525 -785 197 -37 -671 538 -824 595 -642 687 65 -93 327
2921C27k40P57j135J146j170J115j017N98J76n30R94j236J323j285J359j277M13
$$ 327 87 844 -291 855 -315 800 -217 381 557 27 1021 -215 1108 -177 1182 -95 318
2938C18K22q19J202j042R26j306R82m46n2L11l14M73r82J210j150R46r38N31R2
$$ 318 540 -279 923 -119 807 -499 483 37 -15 296 -18 455 -527 683 -467 479 -459 72 164
2957A64r68J382j625J499j035M93l57J40J93l67L15o39J177j183R56r11P48k05
$$ 164 -804 578 -1047 452 -583 -90 -447 -307 -114 -481 -166 -805 372 -811 145 -766 -18 -223
2975b23n31J361j521J232j044R26n74l4P96j032P70n98Q26p02N67k99P4K48n15
$$ -223 -754 607 -914 318 -726 200 -374 -408 388 -644 126 -472 354 -348 219 -80 -6 242 -273
2994b73P76j313J798j339Q17l60n2M35q51J586j558R31m82%J05J67J01n49P77
$$ -273 503 -810 988 -351 466 106 54 489 -362 1224 -334 597 115 115 220 387 488 -61 716
3013G16q60J222j492J156o99J03L39p42J200j754J464p81Q6J76k40M78p92P27
$$ 716 -144 1078 -414 742 43 146 485 -257 943 -811 653 -128 -42 134 -106 372 -420 307
3031C07p59O52n46P66j052L81P48j236J292j258J115j322O16K00p23Q15n13O35
$$ 307 -452 200 -346 420 -632 -251 497 -739 553 -705 410 -912 -296 -96 -819 -4 -517 118
3049A18q76P38m12L43m83L27K69o87J173j284J238j097O36n8n43J176j103P26
$$ 118 -758 -20 -432 -89 -572 -245 24 -663 510 -774 464 -633 3 -55 -598 578 -525 201
3067B01n76O83l03J91pl0K29o38J078j393J465j147P88j80m40Q16j125J484j164
$$ 201 -375 308 5 196 189 159 388 -250 828 -565 900 -247 541 361 -79 737 -388 1096 -68
3086f8O62l64J02L2k46N18m22L84q50J124j303P99j90j95O52j276J425j470J083
$$ -68 594 230 332 364 118 636 214 598 -252 872 -431 368 178 -17 635 -641 784 -686 397
3105C97n99J61J09n38O02p33M87m07P55r31O38j75l57O22o93R69j408J193n71
$$ 397 -202 -41 68 -470 132 -601 -114 -521 234 -697 -59 -234 -591 31 -662 307 -1101 92 -479
3124d79j08O77p39Q36j030R80o60M40k76K86j75k0P34j089J217j219J325j266
$$ -479 -587 90 -649 187 -843 137 -523 -83 -359 -73 -248 -268 466 -623 594 -625 700 -566
3142e66M03O19q99J181r58Q44r06P52k51j7J75l50O40p68Q83q41P32p84O80n9
$$ -566 -163 456 -443 738 -220 624 -282 470 219 202 377 27 667 -101 782 -59 673 -111 569 510
3162E10q82J268j233J173q90O29l14l65Q59j075Q29n57O25j086R31o71K52n8j79
$$ 510 -372 896 -337 836 -54 575 261 -104 755 -320 509 -48 577 -509 422 -249 3 -55 -234
3181b34P54j430J435j178Q44m96JN52r60Q88p41O86p49M39k51J15J59m21P73j079
$$ -234 520 -910 525 -653 191 -305 -304 248 -712 176 -565 121 -628 -189 -440 -325 -166 -587 186 -893
3201h93J423j342Q15j27k20L95p59J287j315J062n64M26j90Q2J24o37R32q58J008
$$ -893 530 -812 3 -124 -344 51 -708 579 -736 326 -238 188 -2 80 204 -433 499 -359 649
3220F49q36N58k28j79N16p59Q64r40J168r81P54k80j52L35p55J084j161J018o88
$$ 649 -187 371 143 -36 480 -279 585 -355 813 -168 586 306 154 489 -266 818 -343 675 -13
3239a3M24j78k09K64k90O40j063J168q33K60l9j47K66p89J145j254Q54m46M54
$$ -13 411 233 24 288 -2 638 -425 743 -90 170 131 -16 250 -539 606 -648 206 -240 214
3258B14k22k60N23r01R91q70O89q68N17Q8m18P82r44Q54q12R41p93J55N6M5K64
$$ 214 -8 -268 255 -646 345 -525 164 -704 -187 -99 -517 265 -679 175 -637 304 -489 -334 -278 -233 31
3279C1p53J216j198R12o18M99k55k88Q10j062J025o54P26q76P59j16k83N53p37
$$ 31 -722 494 -704 208 -410 89 -166 -454 356 -706 319 -335 391 -485 274 158 -125 428 -309
3298c09R83r16R96n84m0K42j21R0m18Q66r87R54o01K18q6k72O53r73J102j031
$$ -309 674 -242 754 170 130 372 251 341 -77 789 -198 756 155 373 287 15 668 -305 797 -234
3318b34P41m15j14L68m85P25p50Q08j129R76p58L20J61l65N41r99J153r26M45
$$ -234 507 92 -22 346 -139 586 -164 644 -485 491 -267 53 214 -151 390 -609 544 -382 63
3337F3m48P0L98p08O54o25Q10j069R42m99K13J75o74Q40p04P94r08Q52n86J62
$$ 63 -385 -315 83 -625 29 -596 214 -855 87 -412 -199 -24 -698 142 -562 232 -676 176 -410 -248
3357b48K57n33R27j026R69p72L39J80j63L39n77N75m76O60p39Q51n18J88J45m35
$$ -248 9 -524 403 -623 346 -426 -87 93 -70 269 -308 267 -209 451 -288 563 45 233 378 -57
3377e7P09j059J115p62M40R6k60K37n19N69n47N72o96R10q00J85R0l11O99q78
$$ -57 652 -407 708 -54 386 482 222 459 -60 509 -38 534 -162 748 -52 133 223 -88 611 -267
3397b67J095j225O04j84l84N16n71O93p51P09n56K99k28m0K56o03R40r56P69m84
$$ -267 828 -397 207 23 -361 155 -416 277 -474 235 -321 -22 -250 -290 -34 -637 303 -653 116 -368
3417c68N30o40J14N46q09Q72j059J057o15M3K30m27O54l59J02l34O71n34M63l72
$$ -368 162 -478 -364 182 -627 245 -814 243 -372 -329 -99 -526 128 -231 -129 -463 208 -326 137 -235
3437b35J35M99q53R72j040J004n06j3J01j79N05q01P71m08M58m55L75j61O6J48
$$ -235 -100 399 -454 518 -522 482 -24 -37 64 -115 390 -411 360 -48 410 -45 330 169 235 383
3457C83n12Q99j318J136m88OK79k55L93o91R06o59K04j64O1k7l75P16o63N90p41
$$ 383 -129 770 -548 588 100 106 385 130 523 -168 738 79 283 119 180 153 -222 494 -169 421 -320
3478c20R10n44j74J92m35P88r61R95j041Q66m62j08L22l76M93o36O12o33O46n83
$$ -320 590 46 -128 64 -371 417 -544 451 -590 276 -186 -294 28 -348 145 -491 121 -512 134 -449
3498d49M57k96k86R29j000J175j173O51j2l71L30j71K61n19N89m87M40l71P13
$$ -449 8 -288 -574 355 -645 530 -643 8 -4 -375 -45 -216 45 -474 115 -372 68 -303 410
3517D10n11J02M77q50Q34q05Q78m41m4N10n96O02p03O44l87J88k07J41J36m43
$$ 410 -101 1 478 -372 462 -343 535 94 50 560 -36 566 -137 507 120 308 101 242 378 -65
3537f5N53n52P28q77N01l67K15L42p69P72o34N40m47K96l26j97M14l04N76p74
$$ -65 488 -64 664 -213 288 -79 136 478 -291 481 -153 387 -60 236 -90 -287 127 -177 399 -375
3557c75P56p54M47j38j62K21m45O99r91R89r47M93J14j67M33p55N91n13O62o58
$$ -375 381 -373 74 -64 -226 -5 -450 249 -742 247 -700 -207 -93 -260 173 -582 9 -504 158 -500
3577e00O55k77l5N5l22R19j012Q21o99M19k5l12P76q09O72n23L74m10M72k70M8
$$ -500 155 -122 -157 -102 -424 495 -517 304 -395 24 -1 -313 463 -346 326 -197 177 -233 239 -31 17
3598A7L80n02N93p01P05n73M81k08j44L20n34P87q60O97n17K33n7J78R6n47Q77
$$ 17 397 -105 488 -213 492 -81 400 192 48 368 -166 621 -239 458 -59 174 117 295 391 -156 721
3619G21p71L57m33L19j71j00K60l91O10j082R50n87M09m5n01M01l24O26p40P58
$$ 721 -50 307 -126 193 22 -78 182 -209 401 -681 269 -318 91 46 -455 -54 -378 248 -492 266
3639B66n70L11k69J1M66o86O94r01N44k51M12j71k60O42q21Q25r72R31n27L51
$$ 266 -304 7 -262 -251 215 -471 223 -678 -134 -385 27 -144 -404 238 -583 242 -730 201 -326 25
3659B5k67J12L26o60Q04n86N75m79K23K7k61L72m28M74m13L37k27K29N3%K29o71
$$ 25 -242 -130 196 -464 340 -246 329 -150 73 100 -161 211 -217 257 -156 181 -46 183 236 236 465 -206
3681b06M94m96Q30o84J64L54m19K44m11O00o55O41l32l9J29m49P40q22N15k30
$$ -206 288 -208 622 -62 102 456 37 281 -130 470 -185 456 124 85 214 -235 505 -317 198 -32
3701c2L49m37J11J69l52N62q24O37n76M91k25L7R9k67M90q59P45o19M70k86K47
$$ -32 317 -120 -9 160 -192 370 -454 183 -393 98 -127 -90 9 -258 232 -627 118 -501 -31 -317 -70
3722g0j5k95L52n84O13n25P34m81OJ82k91N69o51P17n74O04m41k07N46n25O12
$$ -70 -85 -380 -28 -612 1 -524 210 -271 -265 -83 -374 195 -456 261 -313 291 -150 -357 189 -336 276
3743B76m76O33n99N84n20L09j1l28N80n38O24q74P56j94j00J70m52O61n38N70
$$ 276 -200 433 -166 418 -102 207 196 -132 448 -90 534 -340 416 222 122 292 -160 501 -37 533
3763E33n29M47j43k08L35m68M87o90M59j02K42l10L2K22o64Q83j138Q21n51N82
$$ 533 4 451 308 100 435 -33 454 -236 223 121 363 53 85 307 -357 526 -612 209 -342 240
3783B40k34k32M92n53N44n68L22l90K35k19K20J35l57N84o92O88o94K04J54k95
$$ 240 6 -226 266 -287 257 -311 11 -379 -144 -363 -143 -8 -365 219 -473 215 -479 -275 -121 -416
3803d16N18m60M17m30M61n08N20j46n7K95n50O39q51R01m51J21K40j33J49n51
$$ -416 102 -358 59 -371 90 -418 102 -44 -101 194 -356 283 -568 333 -118 3 243 110 259 -292
3823b92Q82p09N69m48K05j04r1M37n83O25m36K99m24L81m4k58M06n27P43q41P13
$$ -292 590 -119 450 2 207 103 12 449 -134 491 55 354 -70 311 267 9 415 -112 631 -210 503
3844E03o18K76J65m78L32l11K32n66N36j26r4J68rJ15o06Q60q29O34k91j27K14
$$ 503 -115 161 326 -152 180 -131 101 -465 71 -55 -149 19 10 125 -481 379 -450 184 -107 -234 -20
3865b0l70N20n67N14n40M45n02L85j43J55K17n67P01q57P07k51P5J07l51N47n66
$$ -20 -390 130 -437 77 -463 -18 -520 -135 -278 -123 94 -473 228 -629 78 -173 -98 9 -342 205 -361
3886c61M68l96N69k79O0o7j05N73q57O92l51M1k35L58k30J97L34o43O74o78O94
$$ -361 107 -289 280 1 61 -6 -111 462 -395 297 -54 -13 -248 110 -120 77 411 -232 442 -236 458
3907D58l70P6J92l86M73k49Pl98L99j95J89n9k14L90m79O44n80L95l83L6K32m61
$$ 458 88 164 356 -30 443 194 201 -197 202 7 196 137 -77 313 -166 478 -102 293 -90 -54 178 -283
3929b83P40p92N66m31M04l38P4J99n55O17n82P95p84N08l68N6M0j72M16n29N95
$$ -283 457 -335 231 -200 204 -134 -60 139 -416 201 -381 414 -370 138 -230 -174 -134 -306 110 -419 176
3950A76l20J42k62j1M12m28N21n53O48n80L33k30p2M62p22M89l38N94m94L00J31
$$ 176 -144 -2 -264 -275 137 -291 230 -323 325 -255 78 -152 -224 238 -484 5 -333 261 -233 67 198
3971A98l42M55n03O82o87N10k47L67l26j24N76p21M89n90N78o12N46p7j77M82
$$ 198 -144 311 -192 490 -197 313 66 433 107 -17 559 -162 327 -263 315 -297 249 172 -5 477
3991D77n73N39o03K39j88J59n3J61j5k48N84o19O49q00M64j20j13L6m41P90o13
$$ 477 -96 443 -160 79 -109 50 -3 158 143 -105 479 -140 509 -291 173 53 -60 -24 -465 325 -288
4012b88L73m19J96J16j42Q6l36N59m31M14m37K96j56M2K23p25P20n45M32l59K92
$$ -288 85 -334 -138 -22 -164 -78 -414 145 -286 128 -309 -13 -169 -127 96 -629 91 -454 -22 -381 -89
4033h9K06m09N87o64M59k74N63l91n2K94j8k5m86M85k96M25k87N7J25m62O98o38
$$ -89 117 -292 295 -369 90 -184 379 -12 -64 230 212 187 -299 186 -110 315 28 85 210 -252 446 -192
4055a92M38j56J15l77K10L06k53K25m52N33m10L94k19o1r9j80N28n76O20n34K76
$$ -192 246 90 205 -172 38 344 91 316 -136 397 -13 381 162 101 2 -178 350 -226 394 -140 136
4076A36l25K98p7k23N06p00O67o40M93o58N23j60j71M77m47L88n23N42m00r1L40
$$ 136 -189 109 32 -191 315 -385 282 -358 135 -523 0 -160 -331 146 -301 87 -436 106 -294 -385 -45
4097d5l41O22m96L76n36M53j85j3J95k54N13o46N69o27L38L8M6J75m81N16m04
$$ -45 -386 236 -260 116 -420 33 -152 -165 30 -224 289 -357 212 -415 -77 -39 7 182 -299 217 -187
4118a87O94n09O3J7J3J01l13M73o08Q77q23L44j32M2J28k58M76m93O07l42o3O
$$ -187 507 -2 61 78 91 192 -121 352 -256 621 -202 142 10 52 180 -78 398 -95 512 170 107 113
4140A13J12o3l34N77n29N29o31N52j75q9J07n45O03o12Q60o97M64l53r8M09n17
$$ 113 225 162 -172 405 -124 405 -226 326 151 62 169 -376 227 -385 475 -222 242 -111 -209 200 -317
4161c17M12l78N08q28O19N2m51K47l04N86o92N67l98K39R7j78Rl8M97m23L11m28
$$ -317 95 -283 225 -603 16 68 -383 -136 -440 146 -546 21 -377 -138 -41 -219 -210 -248 249 -174 137 -291
4183b91L05Q2r7J7m64P55o05N59n34M34j70p5K53k87N34m45K27k54K20j4k64M44
$$ -291 14 96 -1 16 -448 307 -298 261 -273 161 -9 -84 169 -118 416 -29 198 -56 164 150 -114 330
4205C30m46O38o52L93l06J36jk9K91m85O30o03M91l34k0K77k70M05m64K48m89
$$ 330 -116 522 -130 263 -43 93 92 63 354 -131 499 -104 387 53 33 310 40 445 -19 229 -260
4226b60P08m56M6O1l34N80o57N10n34N21m18J91M4k67M97n23N45m80L57l17O3
$$ -260 448 -8 38 99 -235 345 -312 198 -336 185 -233 -42 2 -265 232 -291 254 -226 131 -186 -123
4247a23K20k10J53j83K70m56K48k84K10J02j68L80m24N49m93L83k49J61J05m04
$$ -123 97 -113 40 -143 127 -329 -81 -365 -155 -53 -221 159 -265 284 -209 174 -75 86 191 -213
4267b13L42l22M69l71L64l03J33j29J29K03l68L94m25K99l28J45K54k46M01o72
$$ -213 129 -193 276 -95 269 -34 99 -30 99 302 -66 328 -97 202 -126 19 273 27 428 -244
4287b44M94l55K55j87K75o0k05L47k84K92l06L09l66N8J02j15K0l25M89l58J58
$$ -244 250 -105 150 -37 238 178 -27 320 36 328 22 331 -35 23 125 10 30 -295 194 -164 -6
4308fo3j73K13k17K77m09L06l36M97j70j25J90j80J56n02Q32o28M37j23OQ6n47
$$ -6 -69 -242 -29 -246 31 -378 -72 -408 89 -81 -206 -16 -196 -40 -542 290 -338 99 -24 -18 68 -479
4330d79M22k18K96l33L35j43R9jn5N30q70O53m59K44k7k9J74k55K86k93M11l49
$$ -479 -57 -275 21 -312 23 -120 -21 -22 -77 453 -417 236 -223 21 -6 -35 139 -116 170 -123 288 -61
4352f1K99j58K01j10o9J90m73N55m57K14J17k56M55o96N31m44M48j59j2j96K19
$$ -61 238 80 281 171 102 292 -181 374 -83 131 248 -8 447 -249 282 -162 286 127 115 -81 138
4373A38L4l19O67q95N59k92o3K52m1Jj17K95o69M81l32J29N7K9K46l80L30m96
$$ 138 172 -147 520 -375 184 -108 -171 81 40 41 -76 219 -450 31 -301 -172 -115 -86 160 -220 110 -386
4395c86L70k00J28J21j25o6j19K91l74N21m34J87P3l08L91m43L98j62K33q4Q4
$$ -386 -16 -216 -88 33 -92 -158 -277 14 -360 161 -273 -86 -13 -321 70 -373 25 -137 96 12 96
4416I6r2k08L46j47J87l24L14k51L65k66L4J39l17L60j66K15j40q6j07K21J84
$$ 96 4 -204 142 -5 182 -142 172 -79 286 20 54 193 -124 236 70 285 145 59 -48 173 357
4437C57l29P5l03J95L21l73L12l23M94m33L36m83L50j89O3J1k75M15k70K62l21
$$ 357 28 103 -200 -5 316 -57 255 -68 426 -7 329 -154 196 7 70 81 -194 221 -49 213 -108
4458a08J13q5k6K36l75M47l75Q4m10O65j92j91M21m18J62k38N13m05K52j42j0
$$ -108 5 -80 -106 130 -245 202 -173 -89 -499 166 -26 -217 204 -214 -52 -290 223 -182 70 -72 -82
4479h2K09l34K55k08L52k72N1Nj97M19m90N29m05K09q3K89k58M2J23n05M57k39
$$ -82 127 -207 48 -160 192 -80 -29 -24 -221 198 -292 237 -168 41 -42 247 -11 31 154 -351 106 -133
4501a33N06m44L11lk45K13k44N23n37K26k13K36k32J84N5m54O15n17L77k54J35
$$ -133 373 -71 240 237 -8 205 -39 484 -53 173 -40 196 -36 148 203 -251 364 -153 224 -30 105
4522A05j32K8N7l37M31m24N06m11M33l49p5K53l17L03m16L48j30J4nj01J53k21
$$ 105 -27 1 58 -279 152 -272 234 -177 256 -93 -168 85 -232 71 -345 3 -127 -113 -118 -219 -66 -287
4544b87K55k89K26l07M07k1j64K05k15K22k84L33M2j53k04O1J39j67K31k29K40
$$ -287 -32 -321 -95 -402 5 -16 -180 25 -190 32 -252 81 123 -30 -234 -173 -34 -201 30 -199 41
4565D1k37K73o8j13K46l82M86n05N62k72J69p7o0K20l72L51k76K99k28j8Q7j53
$$ 41 -196 77 9 -104 142 -240 246 -259 303 31 200 123 63 283 -89 262 -14 285 57 39 126 -27
4587b7J97k32L86k55K00l47L14j54k82L65m48K53j78L68k95L02j09k02J96n07
$$ -27 170 -62 324 69 269 -78 236 82 -200 165 -283 -30 -208 160 -135 167 58 -144 52 -455
4607d55O26k56K71l89J1J3o3L21m62N09k14j5m0o3J38j40J41k24K36j14L02l85
$$ -455 171 -85 186 -203 -192 -179 -242 79 -383 126 -88 -103 -143 -206 -68 -208 -67 -291 -55 -169 133 -252
4629b52n6M07k76J48l26P10n28K84n8k95L30j83L08k65J56k23L01o0J6N9l26L60
$$ -252 -308 99 -177 -29 -355 355 -173 111 53 -242 88 -95 213 -52 104 -119 182 122 138 197 -129 231
4651B31j33J38k96K48j22n2K36k87K79n89N89k66J04j12Q1Mj68J70k0K52m37K55
$$ 231 98 236 -60 188 66 14 250 -37 242 -347 242 -24 80 -32 49 53 -115 55 35 287 -150 105
4673A05n5j28J31j17J98k09J34j75J24o5J08j55j3L02l71K80l4j8k46n9J42k07
$$ 105 50 -78 53 -64 134 -75 59 -116 8 -57 51 -104 -117 185 -186 94 60 42 -204 -263 -121 -328
4695c28K26k46K47j14K45k41Q2K40m17L57l42M41l70L13j84j47L91k72L53m52
$$ -328 -102 -348 -101 -215 30 -211 -129 111 -306 51 -291 150 -220 93 -91 -238 153 -119 234 -218
4715b18M01l51J54k3Q7O7k67K83k81L63q5Mk24J17J3j33M74l86L08k88N2J4R3
$$ -218 183 -168 -14 -37 50 117 -150 133 -148 215 130 134 -90 27 40 -93 381 -5 303 15 67 81 174
4738A74k7q9J52k61J80j08J3K23j22k8j07L37m05K91k65K13j71k25L00l08K34
$$ 174 147 58 210 -51 129 21 34 257 135 107 0 337 -68 223 -42 171 0 -225 75 -233 1
4759Al23M86l75J17j42J31K21o03O22l32L14k25j00J92k57L72k91K84j51J62k97
$$ 1 -322 164 -211 -94 -236 -105 116 -487 135 -197 117 -108 -208 -16 -273 99 -192 92 -59 103 -194
4780a94J15j4J15O4k43L03k86L00j68J92j00j08K75l94M40j33n6j27q1J90n8J60
$$ -194 -79 -93 22 86 -157 146 -140 160 -8 184 84 -24 251 -143 297 164 108 -19 -100 90 32 192
4802A92j91J16k67M91l66N5j1L4K17l23K44k84K66o8j36J88Ln8j67L37n01M33
$$ 192 1 117 -150 341 -25 30 19 53 270 -53 191 -93 173 105 -31 157 160 102 -65 272 -229 204
4824B04p4m6o8j61K99l01K74k82K27j74K32J36o14O04m02L13k84J83r6l1J10j55
$$ 204 130 84 16 -145 154 -147 127 -155 72 -102 130 266 -348 256 -146 167 -117 66 -30 -61 49 -106
4846a06P6R6M5j83N3k01K42k07K9J70j50J72m21N93j97j40K8K68k10p3L45n76
$$ -106 -30 66 111 -72 -19 -220 22 -185 -156 14 -136 36 -385 208 11 -129 -101 167 -43 -116 229 -347
4868c47M89l22L36r5k16M45l62M08m51K92j18MJ05j57K60n35N30k08o7L23k44
$$ -347 142 -180 156 61 -155 290 -72 336 -115 177 59 63 168 11 271 -264 266 58 -9 314 70
4889G0J86n25N31j90K78l93K12k98P4J76k42L57l36K76k15J94l09o4K11j60M30
$$ 70 256 -269 262 72 350 -43 169 -129 -55 121 -121 236 -100 176 -39 155 -154 -218 -7 -167 263
4910B63l21R6k54K16P7j69K0j83N41n52L65j36j15K17l28J40o8L46k73K12k65
$$ 263 -58 38 -216 0 77 -92 -72 -255 286 -266 99 -37 -152 65 -263 -123 -191 155 -118 94 -171
4931a71K15l38J77K71l98L68k82L46l07Q0K09k02K50m69J85J96k7k27K04P1j22
$$ -171 44 -294 -117 154 -244 124 -158 188 -119 -39 170 -32 218 -251 -66 130 103 -124 80 151 29
4952B9K03l61K20k04K18k42L36k13P7K51m40K97j61J33j3N6k3j62J46r5L08m36
$$ 29 232 -129 91 -113 105 -137 199 -14 63 314 -126 171 10 143 130 186 163 1 147 52 360 -76
4974g6K07j72J34o0r1K48k96K31l05L36o8j73j0NJ44n5J08l72J37K5n5L2p6J85
$$ -76 131 -41 93 33 -58 190 -106 125 -180 156 88 -85 -95 -90 54 -1 107 -265 -128 -103 -158 -126 -202 -17
4998a7l31M92n91M34j40J37j13K7J14k63J52j11L23q8n8K3J02r7k48K62j88J60
$$ -17 -348 144 -447 -13 -153 -16 -129 -102 12 -251 -99 -210 113 25 -33 -10 92 -5 -253 9 -179 -19
$$ [...]
8191I4
##END NTUPLES=NMR FID
##END=
