##TITLE=1H_EC-3236(22)
 CDCl3, 8 sc, 
 19.10.2020
##JCAMPDX= 6.0         $$ Bruker NMR JCAMP-DX V2.0
##DATA TYPE= NMR FID
##DATA CLASS= NTUPLES
##ORIGIN= UXNMR, Bruker Analytische Messtechnik GmbH
##OWNER= root
$$ XWIN-NMR		Version 3.5
$$ Mon Oct 19 10:32:12 2020 Russian Standard Time (UT+4h)  she@DPX200
##.OBSERVE FREQUENCY= 200.1315066352
##.OBSERVE NUCLEUS= ^1H
##.DELAY= (6, 6)
##.ACQUISITION MODE= SIMULTANEOUS
##.ACQUISITION SCHEME= undefined
##.AVERAGES= 8
##.DIGITISER RES= 18
##SPECTROMETER/DATA SYSTEM= spect
##.PULSE SEQUENCE= zg30
##.SOLVENT NAME= CDCl3
##.SHIFT REFERENCE= (INTERNAL, CDCl3, 0, 15.7039)
##AUDIT TRAIL= $$ (NUMBER, WHEN, WHO, WHERE, WHAT)
$$ ##TITLE= Audit trail, XWIN-NMR		Version 3.5
$$ ##JCAMPDX= 5.01
$$ ##ORIGIN= Bruker BioSpin GmbH
$$ ##OWNER= she
$$ F:/spectra/data/she/nmr/H-F/1/audita.txt
$$ ##AUDIT TRAIL=  $$ (NUMBER, WHEN, WHO, WHERE, WHAT)
(   1,<2020-10-19 10:31:00.26 +0400>,<she>,<DPX200>,
      <created by zg, POWCHK disabled, PULCHK disabled
       configuration hash MD5:
       00 E9 B6 7A A2 85 ED C7 34 08 36 98 17 FE 4E 26
       data hash MD5: 16K
       68 80 AA C3 C4 DA 4E D0 24 82 CE 03 AF 39 C8 C9>)
$$ ##END=
$$ 
$$ hash MD5
$$ FB A7 C7 95 3E 2B FF FC 7B 8A 7B 24 F5 E2 B0 12
##$RELAX= 
##$RELAX= 
##$RELAX= 
##$RELAX= 
##$RELAX= 
##$RELAX= 
$$ Bruker specific parameters
$$ --------------------------
##$DU= <F:/spectra>
##$EXPNO= 1
##$NAME= <H-F>
##$PROCNO= 1
##$TYPE= <nmr>
##$USER= <she>
##$AMP= (0..31)
100 100 100 100 100 100 100 100 100 100 100 100 100 100 100 100 100 100 
100 100 100 100 100 100 100 100 100 100 100 100 100 100 
##$AQSEQ= 0
##$AQ_mod= 1
##$AUNM= <au_zg>
##$AUTOPOS= <>
##$BF1= 200.13
##$BF2= 200.13
##$BF3= 200.13
##$BF4= 200.13
##$BF5= 200.13
##$BF6= 200.13
##$BF7= 200.13
##$BF8= 200.13
##$BYTORDA= 1
##$CFDGTYP= 0
##$CFRGTYP= 5
##$CHEMSTR= <none>
##$CNST= (0..31)
1 1 145 1 1 1 1 1 1 1 1 1 1 1 1 1 1 1 1 1 1 1 1 1 1 1 1 1 1 1 1 1 
##$CPDPRG= <>
##$CPDPRG1= <>
##$CPDPRG2= <>
##$CPDPRG3= <>
##$CPDPRG4= <mlev>
##$CPDPRG5= <mlev>
##$CPDPRG6= <mlev>
##$CPDPRG7= <mlev>
##$CPDPRG8= <mlev>
##$CPDPRGB= <>
##$CPDPRGT= <>
##$D= (0..31)
0 1.2 0 0 0 0 0 0 0 0.06 0 0.03 0 0 0 0 0.0002 0 0 0 0 0 0 0 0 0 0 0 0 
0 0 0 
##$DATE= 1603089059
##$DBL= (0..7)
120 120 120 120 120 120 120 120 
##$DBP= (0..7)
150 150 150 150 150 150 150 150 
##$DBP07= 0
##$DBPNAM0= <>
##$DBPNAM1= <>
##$DBPNAM2= <>
##$DBPNAM3= <>
##$DBPNAM4= <>
##$DBPNAM5= <>
##$DBPNAM6= <>
##$DBPNAM7= <>
##$DBPOAL= (0..7)
0.5 0.5 0.5 0.5 0.5 0.5 0.5 0.5 
##$DBPOFFS= (0..7)
0 0 0 0 0 0 0 0 
##$DE= 6
##$DECBNUC= <off>
##$DECIM= 32
##$DECNUC= <off>
##$DECSTAT= 4
##$DIGMOD= 1
##$DIGTYP= 9
##$DL= (0..7)
0 120 120 120 120 120 120 120 
##$DP= (0..7)
150 150 150 150 150 150 150 150 
##$DP07= 0
##$DPNAME0= <>
##$DPNAME1= <>
##$DPNAME2= <>
##$DPNAME3= <>
##$DPNAME4= <>
##$DPNAME5= <>
##$DPNAME6= <>
##$DPNAME7= <>
##$DPOAL= (0..7)
0.5 0.5 0.5 0.5 0.5 0.5 0.5 0.5 
##$DPOFFS= (0..7)
0 0 0 0 0 0 0 0 
##$DQDMODE= 0
##$DR= 18
##$DS= 0
##$DSLIST= <SSSSSSSSSSSSSSS>
$$ [...]
##$SUBNAM2= <"">
##$SUBNAM3= <"">
##$SUBNAM4= <"">
##$SUBNAM5= <"">
##$SUBNAM6= <"">
##$SUBNAM7= <"">
##$SUBNAM8= <"">
##$SUBNAM9= <"">
##$SW= 16.880792210976
##$SWIBOX= (0..15)
0 0 2 0 0 0 0 0 0 0 0 0 0 0 0 0 
##$SW_h= 3378.37837837838
##$TD= 16384
##$TD0= 1
##$TE= 0
##$TE2= 300
##$TE3= 300
##$TEG= 300
##$TL= (0..7)
0 120 120 120 120 120 120 120 
##$TP= (0..7)
150 150 150 150 150 150 150 150 
##$TP07= 0
##$TPNAME0= <>
##$TPNAME1= <>
##$TPNAME2= <>
##$TPNAME3= <>
##$TPNAME4= <>
##$TPNAME5= <>
##$TPNAME6= <>
##$TPNAME7= <>
##$TPOAL= (0..7)
0.5 0.5 0.5 0.5 0.5 0.5 0.5 0.5 
##$TPOFFS= (0..7)
0 0 0 0 0 0 0 0 
##$TUNHIN= 0
##$TUNHOUT= 0
##$TUNXOUT= 0
##$USERA1= <user>
##$USERA2= <user>
##$USERA3= <user>
##$USERA4= <user>
##$USERA5= <user>
##$V9= 5
##$VALIST= <valist>
##$VCLIST= <CCCCCCCCCCCCCCC>
##$VD= 0
##$VDLIST= <DDDDDDDDDDDDDDD>
##$VPLIST= <PPPPPPPPPPPPPPP>
##$VTLIST= <TTTTTTTTTTTTTTT>
##$WBST= 1024
##$WBSW= 4
##$XGAIN= (0..3)
0 0 0 0 
##$XL= 0
##$YL= 0
##$YMAX_a= 186660
##$YMIN_a= -171471
##$ZGOPTNS= <>
##$ZL1= 120
##$ZL2= 120
##$ZL3= 120
##$ZL4= 120
##$ABSF1= 10
##$ABSF2= 0
##$ABSG= 5
##$ABSL= 3
##$ALPHA= 0
##$AQORDER= 0
##$ASSFAC= 0
##$ASSFACI= 0
##$ASSFACX= 0
##$ASSWID= 0
##$AUNMP= <proc_1d>
##$AZFE= 0.1
##$AZFW= 0.1
##$BCFW= 1
##$BC_mod= 2
##$BYTORDP= 1
##$COROFFS= 0
##$CY= 11.3945322036743
##$DATMOD= 1
##$DC= 2
##$DFILT= <>
##$DTYPP= 0
##$F1P= 16.9975609425685
##$F2P= -3.02152046262296
##$FCOR= 0.5
##$FTSIZE= 0
##$FT_mod= 4
##$GAMMA= 1
##$GB= 0.15
##$INTBC= 1
##$INTSCL= 1
##$ISEN= 128
##$LB= 0.24
##$LEV0= 0
##$LPBIN= 0
##$MAXI= 10000
##$MC2= 0
##$MEAN= 0
##$ME_mod= 0
##$MI= 1.114404
##$NCOEF= 0
##$NC_proc= 0
##$NLEV= 6
##$NOISF1= 3.799351
##$NOISF2= 2.8
##$NSP= 1
##$NTH_PI= 0
##$NZP= 0
##$OFFSET= 15.70392
##$PC= 1
##$PHC0= -10492.8
##$PHC1= 18.00089
##$PH_mod= 1
##$PKNL= yes
##$PPARMOD= 0
##$PSCAL= 0
##$PSIGN= 0
##$REVERSE= no
##$SF= 200.130013532006
##$SI= 16384
##$SIGF1= 3
##$SIGF2= 2
##$SINO= 400
##$SIOLD= 16384
##$SREGLST= <1H.CDCl3>
##$SSB= 0
##$STSI= 0
##$STSR= 0
##$SW_p= 3612.71676300578
##$SYMM= 0
##$S_DEV= 0
##$TDeff= 0
##$TDoff= 0
##$TI= <>
##$TILT= no
##$TM1= 0
##$TM2= 0
##$TOPLEV= 0
##$USERP1= <user>
##$USERP2= <user>
##$USERP3= <user>
##$USERP4= <user>
##$USERP5= <user>
##$WDW= 1
##$XDIM= 8192
##$YMAX_p= 0
##$YMIN_p= 0
$$ End of Bruker specific parameters
$$ ---------------------------------
##NTUPLES= NMR FID
##VAR_NAME=  TIME,          FID/REAL,        FID/IMAG
##SYMBOL=    X,             R,               I
##VAR_TYPE=  INDEPENDENT,   DEPENDENT,       DEPENDENT
##VAR_FORM=  AFFN,          ASDF,            ASDF
##VAR_DIM=   8192,          8192,            8192
##UNITS=     SECONDS,       ARBITRARY UNITS, ARBITRARY UNITS
##FACTOR=    0.000296,      1,               1
##FIRST=     0,             0,               0
##LAST=      2.424536,      0,               0
##MIN=       0,             -171471,         0
##MAX=       2.424536,      186660,          0
$$ Real data points
##PAGE= N=1
##DATA TABLE= (X++(R..R)), XYDATA
$$ [...]
1636h61M89L404n865N619l014l56K870l850L621k336k62L261m779L398j71l044
1652a876M700m746L288p62k729N586o368M081j24l373M737m394K754r7l033M744
1668B388l860P78K638m805M890l195J66L120n796O178l801N0L265n232N145l059
1684a130j95L102m458L718j224j923M249m632L110r3l239N645n692L452J09l247
1700b448N240n243L402j33k862M586m005J551J511l351L752k748O75K559n145
1715b659N273l025j84L126m776M911l508Q88K271m560M564k193r01K866l417K914
1731A590j255j610M313n284L490k1l493N223n099L406j034k180M908n569L018
1746D03N32l189L792k944J065J230l677M804l628R9L592n375M689k692L47K296
$$ y = [-861, -372, 3032, -2833, 2786, -228, -584, 2286, -1564, 2057, -279, -541, 2720, -2059, 1339, 1168, -1876, 2824, -1922, 1366, 604, -2125, 3461, -2907, 1174, 1050, -2323, 2414, -1980, 774, 677, -2356, 2388, -1472, -694, 1944, -2861, 2029, -1166, -1000, 2120, -3676, 2502, -1299, -1249, 2016, -3216, 1929, -1130, -1325, 1777, -2681, 1037, -187, -2110, 2139, -2493, 617, 524, -2715, 2930, -2762, 690, 799, -2448, 2792, -2451, 951, 818, -2044, 2542, -1463, 88, 1599, -1752, 2000, -748, -73, 2486, -2659, 2614, -411, -595, 2531, -2245, 2666, -842, 46, 2317, -2243, 2321, 128, -773, 2093, -1324, 1590, 335, -1275, 3038, -2246, 1244, 1223, -2270, 2953, -2146, 1260, 226, -1954, 2954, -2615, 403, 935, -2254, 1538, -1406, -341, 889, -2788, 2016, -1612, -1513, 2079, -3296, 1393, -1299, -952, 1344]
1762A344m541N247l405o2L154m011K895q48r29K676l676L127k86k975M869m368
1778a789K522O0k406M194m539L387n85k424M085l387J410O93k215L058k628P26
1794A62J972m105M448k577l52K723m080M297l410Q93K236m289L838j958j81J765
1810A382k952K732j097j501L456l907K313J11k490L999m423L065l56k521M013
1825A824l893K388j88k059L156k618Q71J305k842L118j903k42K503l841L926k468
1841i63o5K586l798L765k206J6J885k693K503j255n91K375k692J525M56k084L058
1858A822l090K183j30k303M025l879K097M3j420K380k868K140m3k160K878j737
1874f2l00J796k456K644k050R9K483m231L826j810n12J960k691K645j882P5J745
$$ y = [1344, -3197, 2050, -1355, -1417, 1737, -2274, 621, -227, -1156, 1520, -2156, 971, 685, -2290, 2579, -1789, 733, 793, -1613, 2581, -1958, 1429, 844, -1580, 2505, -882, 528, 1221, -994, 2064, -564, 162, 2134, -1971, 2477, -100, -452, 2271, -1809, 2488, -922, -29, 2207, -2082, 1756, -202, -383, 1382, -1570, 1162, 65, -1436, 2020, -1887, 426, 537, -1953, 2046, -2377, 688, 332, -2189, 1824, -2069, 319, 131, -1928, 1228, -1390, -519, 786, -2056, 1062, -841, -1083, 1420, -2421, 1505, -963, -1028, 1558, -2240, 1525, -681, -665, 1220, -1473, 1030, -225, -816, 1559, -1133, 392, 848, -1236, 1822, -1268, 915, 785, -1518, 2507, -1372, 725, 768, -652, 1728, -1140, 1000, 957, -1203, 1675, -62, -362, 1434, -1022, 1622, -428, -329, 2154, -2077, 1749, -61, -573, 1387, -1304, 1341, -541, -466, 1279]
1891A279k542J724%j804K394j991J032J55j923L439l597J881N33k417K982k552
1907a407J633l96j314K642k295M24J540k268J797o50o06J944l014L059j560p81
1923a252K782l218K527j212K5J200k099K139o64j062J999j504L79R58j772K235
1939A461k168J235Q46k748L224k250J029K65j487K183k058R12O01j648J479n29
1955C47o91J582k178J867o32j184K579l137K329q71p62J924k492J979r10n52J566
1972G64j683O27O40j530J737j391K64J301k515K779k106N17J194k136K388k176
1988a326J159O58j894J753o77l91J217j459J270k35j280K740k787J558K74j511
2004i31K258k426K109p36j066K225j792O27L93r42J224r19m4J294k291K380j264
$$ y = [1279, -1263, 461, 461, -1343, 1051, -940, 92, 247, -1676, 1763, -1834, 47, 580, -1837, 1145, -1407, 226, -170, -1484, 1158, -1137, -713, 827, -1441, 356, -294, -900, 1044, -1970, 1089, -471, -1252, 1530, -1688, 839, -373, -348, 852, -1247, 892, 228, -834, 1165, -339, 40, 998, -774, 1461, -707, 528, 1374, -1374, 1850, -400, 629, 894, -593, 1590, -468, 444, 1045, -603, 876, 347, -344, 1238, -940, 927, 295, -889, 1690, -1447, 882, 11, -751, 1173, -1319, 660, -250, -802, 764, -919, -292, 348, -1182, 555, -836, -572, 729, -1786, 993, -1113, -596, 598, -1538, 850, -1326, -167, 491, -1403, 350, -327, -718, 499, -960, 310, 75, -1205, 1535, -1252, 306, 580, -931, 1327, -1099, 1010, 274, -792, 1433, -359, 268, 661, -281, 943, 24, -20, 1274, -1017, 1363, 99]
2021I9m76J882k476K390j716L71J012k081K200j288k08J167j213O43j36o62J630
2038A138k151J354N35k327K640k153J385m27j044K354k738J604K77j532J327p48
2054e06K15N44j622J991j091o45K211k930K432j049l50J598k485K637j541j05
2070f96J485j837J274j77o64J345j406Q59N49k023K771k199P42Q09j829K531k636
2087a102J726J08j702K327j655M18O81j153J329r90j32J834k763K172o31r81K215
2104A701k890K561j384l75J827k449J884p39n32J250j533J032J70j580K049j738
2120g46N31R32k215K619k422J385K05j993K862k444J060L44j330J767j512M20
2136e37J119k071K016q15q62K265k819K541j243p42K675l274K452q28n83J657
$$ y = [99, -377, 1505, -971, 1419, -297, 74, 1086, -995, 1205, -83, -291, 876, -337, 306, 170, -492, 1138, -1013, 341, 876, -1451, 1189, -964, 421, -6, -1050, 1304, -1434, 170, 447, -1085, 242, -506, -291, 253, -1369, 622, -469, -1114, 1097, -1833, 599, -450, -800, 798, -1687, 950, -591, -696, 789, -1048, 226, 49, -615, 730, -676, 183, 732, -1291, 1480, -719, 23, 832, -997, 1534, -1102, 624, 732, -970, 1357, -298, 120, 801, -352, 977, -13, -145, 1689, -1074, 1098, 467, -514, 1701, -1189, 1372, -12, -387, 1440, -1009, 875, 136, -396, 854, -679, 353, 523, -1057, 992, -746, -215, 717, -1498, 1121, -1301, 84, 289, -1704, 1158, -1286, -226, 118, -1212, 555, -957, -537, 582, -1489, 527, -288, -1150, 1115, -1704, 837, -406, -1148, 1527, -1747, 705, -123, -706, 951]
2152I51k024J642l91j005K036j750N40J144k205K363j795Q37P54k344L282k731
2168f96J066P08j836K112j749R41L20j663K048j035p54J927k194J722q19p49K351
2185A700l273K696j040r53K058k346J972j244k18J584k093J194L97j669J983j538
2201g90N38O92k007K865k744J308Q16k418K827k252J112K52j509K274j843M44
2217d35J247k178J871n79q24K060k769K621j036j079K695l029K322r28m06J669
2233A222k388K030m55j210J966j430L68O86j513K202k099R16R63k483K879k263
2249f09R75M37j678K367k221J026M87j546J703r88k40J380k113J858q15q87K316
2266A452k835K228r30o63J817k473K229j138m86J681j920J108j2r99J620j612
$$ y = [951, -1073, 569, 178, -827, 1209, -541, -1, 1143, -1062, 1301, -494, 343, 1097, -1247, 2035, -696, 370, 1078, -758, 1354, -395, 546, 866, -797, 1251, 216, -538, 1389, -805, 917, 98, -651, 1700, -1573, 1123, 83, -870, 1188, -1158, 814, -430, -648, 936, -1157, 37, 434, -1235, 748, -790, -252, 440, -1567, 1298, -1446, -138, 678, -1740, 1087, -1165, -53, 199, -1310, 964, -879, -435, 812, -1366, 505, -74, -898, 1162, -1607, 1014, -22, -1101, 1594, -1435, 887, -41, -447, 1222, -1166, 864, 409, -801, 1165, -265, 103, 789, -724, 1478, -621, 295, 1258, -1225, 1654, -609, 366, 803, -875, 1492, -729, 297, 784, -762, 941, -47, -287, 1093, -1020, 838, 23, -864, 1452, -1383, 845, -85, -748, 1069, -1404, 825, -313, -799, 882, -1038, 70, 58, -941, 679, -933]
2282i33Q25N50k121K779k208Q60O71j948K673k465J329L29j676K133j488M05P13
2299D28j392J653q85n84K107k538J878m78q92K051k567K361j186m69J964k233
2315g82J495l95n12J128j264Q71J89j383J999j616M04R53j915K214k031J170K61
2332G86j824K478j919O66L69j112J322j128K10R02j684J536m83j039J810k073
2348a183J794j047l37J727k536K144r28m07J268j478J109m55n32J515j605O68
2364b83Q18j781K002j622P57N42j837K653k191Q74O71j475J549j128N61M01j182
2381f71J296m33o66J520j660J204k81p18J654k184J888p34m83J402j741J374o67
2398A00j49Q67j108P99N1j149J491j056J65P14j480J985j882Q40M92j628J876
$$ y = [-933, -108, 442, -1679, 1100, -1108, -248, 423, -1525, 1148, -1317, 12, 341, -1335, 798, -690, -285, 428, -964, 689, -196, -780, 1327, -1211, 667, 189, -703, 1348, -1219, 1142, -44, -513, 1451, -782, 713, 318, -194, 934, -330, 541, 730, -653, 1346, -270, 134, 1087, -828, 1386, -645, 525, 786, -1038, 1440, -479, 187, 556, -556, 766, -362, -152, 750, -934, 602, 119, -920, 890, -1183, 611, -436, -773, 954, -1582, 562, -366, -773, 495, -983, 126, -329, -861, 654, -951, -283, 535, -1246, 756, -866, -109, 433, -1404, 1249, -942, -68, 603, -872, 677, -451, 110, 511, -671, 625, 192, -474, 1046, -614, 590, 309, -409, 1245, -939, 949, 215, -268, 1134, -607, 767, 100, -49, 818, -290, 509, 560, -589, 902, -154, 11, 725, -755, 1230, -652, 188, 680, -948, 928]
2415I28j555P08J32q63J239j022M0R08j256P91j33n91J334j836J627n87p75J726
2433H15k000J544p55j28J057j528J169j82o56R75p48J74N92j283J597j198K50
2450c05R98j768J913j261L57M60j030J428j098K98O36j012P59O4p45R98r39P98
2468E51j95q63J750j747J002q6n00R08j317J356p29l55J000p73O4M42p11P03o86
2487a86J17Q32j678J696j000r0Q95j383J396j132M74K99j014R98l78l89P16n86
2505d13K63P2o05J224j518J017M4j104J488j288R61m61l38J131j225O48K71p23
2523e56O91k57j52O42j058J254o61l31J301j522J319p96J76N82j079J214p46Q
2541B9N81n97K23K90o55Q30q08M08L97j224J545j326O39J28p88J140j282Q72m8
$$ y = [928, -627, 81, 213, -650, 589, -433, -393, 515, -741, 50, -83, -674, 660, -1176, 451, -136, -911, 815, -1185, 359, -396, -524, 533, -995, 174, -8, -664, 311, -437, -263, 329, -954, 643, -555, -305, 693, -1075, 838, -423, -66, 394, -636, 792, -306, -8, 628, -384, 375, 439, -306, 692, -247, 551, 356, -507, 1243, -504, 498, 412, -88, 820, -497, 859, 130, -225, 775, 2, 66, 508, -203, 500, -186, -69, 763, -915, 781, -219, -309, 586, -797, 599, -533, -59, 240, -774, 224, -154, -543, 173, -413, -150, -78, -683, 541, -977, 40, 84, -1020, 468, -820, 141, -320, -658, 473, -752, -104, 167, -556, 135, -122, -274, 368, -690, 564, -97, -428, 873, -649, 670, -126, 50, 632, -447, 767, 21, 29, 610, 13, 236, 526, -129, 701, -107, 301, 698, -526, 1019, -307, 332, 460, -328, 812, -470, 402, 354]
2560C54p20Q32m69l6L53p16P54l58m89J220j548J124m84l05R47j385J364p70j40
2579d72O91q06N11j22l49O86o52K20M65j056J367r77K41N85j176J447j349P72
2597B6K07r37J174p96K81K99n79N88k78k84J103j378R32O9q79J274j408J323p26
2616A1k59J160j358R26l04j38M85n80L60J57q89J211p37j20Q20j246J378j101
2634b24M30L24j158J535j265L32L75o48O01m37L8M50r06P75l2r94J377j296Q30
2653A07k25n26J269j685J311l79m95Q72q45O33k35l29Q56q83K96N64j251J369
2671D24q57J96O15j345J718j333M71M97j061J161p44L16L55p79P41k67m14J159
2689H53j277P93P3q60J474j637J263l56o35J322j374Q93k97k79P70r31M41L71
$$ y = [354, -366, 466, -3, -39, 314, -402, 352, -6, -495, 725, -823, 301, -183, -488, 459, -926, 438, -332, -472, 219, -587, -76, -198, -547, 139, -513, -293, 172, -884, 483, -494, -253, 332, -844, 603, -746, 26, 233, -704, 470, -326, -45, 254, -325, 263, -15, -299, 804, -574, 358, 427, -452, 822, -586, 737, 11, -248, 912, -446, 480, 176, 38, 523, -57, 303, 460, -429, 782, 45, -75, 745, -501, 877, -224, 206, 530, -628, 907, -358, -26, 349, -299, 302, -135, -97, 353, -553, 222, 190, -804, 573, -723, 107, -118, -644, 625, -1060, 251, -128, -623, 249, -596, 37, -198, -527, 329, -554, -258, 306, -945, 424, -433, -237, 378, -967, 751, -582, -111, 386, -675, 486, -258, 58, 413, -366, 375, 108, -306, 853, -424, 369, 442, -418, 1056, -581, 682, 326, -309, 1013, -361, 532, 235, -44, 726, -205, 236, 607]
2707F07j042J117o59j21Q04j364J514j182J52Q24j422J395j055L92K31q58R69
2724C02n87q4O16q66N88po92J174j361J053k25p35J448j588J167m65k70R12j190
2743h10J014k11n96R84o67O3N37j031J392j080K26R15j638J749j151L63M59j084
2761e66J407j081L15O00j053P92j02m90R56j128P76p0q65J656j765J109j20o88
2779c17J098j356J109m56m37J008r15K96K92p05P55n48P9O41j384J551j025KP63
2798D51j174J266j194O32K38r73J094o02j08N47o78N44k49l98J138j303Q57q3
2816Ep89J443j485J120m16m00J141j372R93k26n03Q55o51K83L96r81J201q70R0
2835a66R60j573J496q92K27N61j227J491j035J73M62p16P31l27k39P71j003O42
$$ y = [607, -435, 682, 23, -98, 706, -658, 856, -326, -174, 650, -772, 623, -432, -40, 191, -667, 302, -285, -369, 247, -619, -31, -38, -730, 444, -917, 136, -89, -824, 624, -964, 203, -262, -532, 380, -810, 204, -7, -603, 381, -286, -223, 314, -717, 675, -405, -179, 736, -902, 847, -304, 59, 518, -566, 841, -240, 75, 675, -378, 414, 312, -178, 778, -350, 426, 356, -509, 1147, -618, 491, 371, -317, 781, -575, 534, 78, -359, 649, -266, 30, 322, -383, 372, -176, -97, 544, -840, 711, -314, -312, 451, -723, 543, -651, -19, 219, -754, 340, -262, -370, 177, -501, 43, -206, -604, 534, -769, 88, 5, -784, 659, -826, 294, -122, -522, 619, -753, 240, 14, -489, 366, -285, -2, 394, -587, 614, -256, -166, 794, -779, 717, -175, 52, 613, -614, 877, -158, 15, 477, -239, 492, 165, -74, 697, -306, 336]
2853C36J15q94J323j276Q56k15o64J259j350J026m38k83O26p27M89p2m24O84n87
2872b16j4O23j114J143q31J64N82j217J498j167L43M01r47R41o02J81K88o61P06
2891A01j98n60J061j011N63N2o50J235j455J209k63o40J140j066P83l30j17O38
2909D92p06K40M81q99Q51l36k12P52j170J289r19J93O24j084J120p32K64J42n14
2928a24N89l49j20N85p92L14L09q02R18r41P18j61o03J125j280P95k14k55M96
2947B08o31N41k44l11N06k84j62O11q35Q08o31P3O75j188J299r92L46L84p74Q86
2967B85o66K19L17o06N46p9n19Q49o51L41K21p84J181j208P58J6n82R03q58O35
2987C18j92k58N13l66K9L77n82N22k03j94O65r85R47n09j01O22r32R39p22K47
$$ y = [336, 451, -443, 880, -396, 460, 245, -419, 840, -510, 516, 78, -205, 421, -306, 183, 111, -313, 371, -216, -230, 393, -721, 422, -409, -245, 337, -880, 618, -549, -206, 195, -752, 189, -413, -232, 56, -605, 101, -97, -657, 404, -607, -44, 8, -642, 593, -862, 347, 84, -556, 584, -482, 301, -29, -146, 492, -214, 26, 507, -392, 459, 123, -89, 663, -507, 782, -137, 56, 680, -404, 716, -16, 248, 390, -124, 465, 116, -4, 581, -211, 103, 412, -390, 528, -413, 305, 144, -459, 666, -614, 181, -33, -288, 208, -423, 118, -126, -437, 69, -215, -377, 234, -601, 207, -424, -351, 324, -864, 435, -557, -211, 173, -601, 285, -381, -162, 155, -451, 95, 16, -503, 346, -305, 36, 257, -527, 654, -554, 204, 220, -362, 541, -317, 318, 126, -132, 381, 15, 44, 421, -161, 361, 158, -36, 629, -356, 591, 82, -19, 603, -329, 610, -112, 135]
3007A35K23n48M96k47r0K74l60K18R9o01Q66q09L51K24p88R75r29O96k33l00O36
3028B88o80L40L0k96K42n0j95M87o98O51k81l81R02j042Q85n40K01L23p99Q82
3048B69m80nL30k44J23Q8l08M79m37J46M15r28J059p11L75J15n08P92p90N22p7
3069B25l06M58j61j77K98k71K21q3l02P65r43O37j50l36O06p92Q51o55J10L47
3089C42n03K86o4j43J56k63P3L87p85Q18o57J08M45p57Q45p94M96l7m43O01n01
3110c90K44P4k35K19K1l23N33o38M93J6n43R49q52O09k42j83O01p41O47k92m5
3131g8K86k57P7K68m69N18k79j48O13q41Q31o55L00L12p97R31o48K21R7k98L34
3152C18k36j2K80m17J80J59n40P45p24M28j1m60Q01r66P20l07k03M32m39L03q9
$$ y = [135, 358, -190, 306, 59, -31, 243, -117, 101, 200, -401, 465, -344, 7, 231, -557, 418, -511, 185, -48, -348, 288, -392, -52, -22, -318, -76, -126, -321, 166, -532, 119, -162, -543, 359, -683, 202, -338, -137, 186, -613, 269, -211, -216, 114, -130, -7, 81, -227, 252, -185, -39, 376, -552, 507, -204, 171, 286, -222, 570, -220, 302, 225, -81, 377, 216, 39, 337, 66, 287, 204, -98, 667, -276, 361, 211, -125, 481, -311, 540, -115, -5, 342, -161, 125, 61, -82, 74, -189, -116, 271, -514, 304, -353, -245, 200, -557, 288, -506, -10, -47, -490, 111, -390, -146, -72, -307, -88, -67, -390, 143, -495, -2, 14, -529, 420, -432, 177, -65, -248, 353, -388, 259, -33, -78, 208, -49, 28, 296, -173, 345, 66, -82, 531, -310, 521, -134, 166, 478, -319, 612, -36, 185, 282, -16, 318, 82, 70, 350, -67, 113, 272, -268, 477, -247, 181, 170, -290, 511, -455, 265, -42, -245, 187, -252, 51, -38]
3173c8j84L29k52j74N74p73O21l07p1M96p95R36p77K22K43m90N77m54K32L3k52
3194c04L45n8l80O63n09J67K45n92Q38q69O86j15m55P93p17M92k20j0K41l45K44
3215A40K04n47N58j88k83O49p74P82n77M3N92r62R01o17K28J47l74L97k85m2L22
3236C14l85J32L45p38Q18p29L55J15o90R88r63N58j10l00N22n29L42j02l00M04
3256D7k42j60M88o18N42k79j28N97r22R04n08N7L53o05O53m81K22J63l94L09J3
3277A1k81N01m54K45K13o81R84q86O10q0l94Q01q71O23j45k89N13m27J56J91m25
3298h5M22j89k21O93r35Q40m01k19O29q76Q30o12K28K27n85N52k20j38K38k69
3318i1M8J72n16P48p20K77K71p06Q34p64N11j68k50N34n67L65p0j78K43j45l6
$$ y = [-38, -222, 107, -145, -319, 255, -518, 103, -204, -275, 221, -574, 362, -415, -193, 50, -440, 137, -317, -85, -52, -304, 41, -17, -397, 266, -243, -76, 169, -423, 415, -454, 232, 117, -338, 455, -262, 230, 10, 0, 241, -104, 140, 344, -203, 355, 167, -116, 533, -241, 541, -36, 7, 599, -363, 538, -79, 149, 296, -78, 319, 34, -8, 314, -71, 61, 406, -332, 486, -243, 112, 227, -463, 525, -438, 120, 10, -290, 232, -297, 45, -57, -357, 47, -195, -355, 133, -485, 57, -222, -350, 247, -675, 229, -279, -222, 131, -474, 179, -302, -80, 83, -311, -2, 11, -270, 231, -223, 22, 235, -446, 538, -348, 262, 182, -212, 589, -282, 341, 196, -93, 420, -7, 149, 340, -85, 337, 148, -73, 620, -315, 525, 124, -95, 534, -342, 488, -124, 104, 331, -254, 298, 78, -60, 178, -91, -43, 129, -387, 361, -359, -82, 189, -517, 317, -447, 64, -104, -354, 180, -387, -22, -92, -270, -27, -172, -208]
3339b08K43m37N23l23j52O83q85P48m09N4L97o78P90n46J17K86m30L62o7k11M01
3360B58l71K54K14o88R20p78M04K8m38P93q57N77j21k82N04m08J32J47l90L78
3380B76j39k05N37p48O16k74j93N97q32P22m56R5K34m92M49k59j3J32j68N9J07
3401D5l71N36m86J17K61o38Q28p92N53j02l47N63n98M75j70j09K17k02P3K21l65
3422b91L03j18j59N65p46P28m96M0N36p57P49n30K24J59l89M77k39q1L37l00Q1
3443I3K57n71O57n54L63J22o11Q18p53N04j17k10L47l76J79L8k33K46o2k96M84
3464C25n02L50k10j41M95p05O10l63L9K19l82M19l99J39J57l18J68J01l62M04
3484D4k97O6K33n02O73p02M51M8m30N84n21M18k22p3L58l03L5K86l64K22P1k89
$$ y = [-208, 35, -402, 121, -202, -354, 329, -556, 192, -217, -163, 234, -444, 346, -200, -83, 203, -227, 135, 68, -143, 258, -113, 141, 355, -333, 587, -191, 213, 241, -197, 596, -261, 316, 195, -87, 417, 9, 141, 288, -102, 276, 137, -68, 469, -279, 337, 63, -130, 467, -365, 357, -99, -4, 230, -262, 187, -72, -85, 47, -121, -62, 45, -326, 210, -276, -159, 102, -536, 292, -500, 53, -49, -396, 167, -431, 44, -126, -235, -18, -220, -147, 74, -291, 12, -106, -265, 300, -446, 282, -214, -174, 362, -395, 354, -176, 48, 207, -182, 295, 56, -25, 312, 12, 93, 350, -221, 436, -118, 245, 367, -244, 574, -179, 325, 208, -2, 345, -31, 148, 186, -47, 199, 137, -159, 325, -177, 173, -37, -178, 317, -388, 222, -141, -102, 117, -265, 154, -245, -106, 51, -267, -99, 2, -360, 44, -253, -187, 46, -456, 217, -485, -34, 14, -416, 168, -353, 65, -157, -230, 128, -175, -140, 146, -218, 4, 75, -214]
3506b14N13o73O89k55k36O13o33N56l88J16J66l16L22j00j67K26j51J5K83n63
3526a97O06m17L7L14n33O43n91K94k3k18L59l72K19l0j39O1J15k80L29l65K20
3547C2l4k44N01n95M96k87l2K45m48M30k87Q8J01j37O6M6j79K45k43J5K84n07
3569d44N77m39K25J05l59N77n70L87q8j14K82k05PJ65j63J56M5l36N48n31L71
3590A96Kk79L92m89N43l20nK09k28J57n2kL4r6m0K64m62M71k37p2L46n10M64l74
3614h8K19L4l06K97k23N1l5J4j0Q6k05K30l04J44J70m21N00n54M47j52j44L32
3636H2m57M33j81k2O4n8qO3j04J92q8j48M26m86M00k86J04J84m08M97l62K41l0
3659D8j24J90j22J3J22n1j0J80l36M18l52J45Q6l20N33n30L63j24q3K48l28K01
$$ y = [-214, 299, -374, 315, 60, -176, 437, -196, 360, -28, 88, 254, -62, 260, 160, -7, 219, 68, 83, 366, -197, 409, -8, 29, 343, -190, 453, -138, 156, 133, -85, 274, -98, 121, 91, -48, 13, 128, -152, 177, -188, 32, -2, -246, 255, -340, 156, -131, -163, 82, -366, 64, -223, -135, -34, -171, -105, -59, -238, 7, -236, -221, 63, -444, 133, -306, -81, 24, -335, 242, -328, 59, -29, -143, 139, -66, -59, 106, -57, 99, 144, -192, 356, -175, 196, 198, -81, 311, -178, 365, 45, 40, 249, 21, 178, 126, 124, 158, 62, 22, 286, -176, 295, 58, -14, 332, -178, 286, -88, 131, 165, -141, 156, -67, -16, -51, -37, -47, 39, -166, 64, -240, -96, 74, -347, 153, -401, 46, -106, -250, 82, -375, 58, -123, -145, -81, -139, -147, -84, -188, 4, -84, -232, 194, -292, 108, -178, -74, 110, -298, 199, -163, 78, 48, -76, 114, -8, 5, 127, 76, 66, 246, -90, 328, -24, 121, 207, -113, 420, -110, 253, 129, 46, 294, -34, 167]
3681A67p2l9Q7l5j94L17m01L17p6k24M08n88O21m38N3K09l37L47l11J34j2r8P8
3704h7P8l08L21j90J7K45m04M86n27L42Kk85M31m30K94r2OJ29j27J8J16j98J86
3727B3J2k65M21m34M21k10pL36n72N16k52R1J5j34K07j56J4J70r1q6K66l76L72
3750B81l13J47J15m32N77n45L82p5j51K56l07K01k0j47J07mk25L86l69K08o4j96
3772a88M16n86N42k85n9K46l18K59j91R8K6j56J08J11l15K86j13l3K33m77N16
3793A20m28K16J17l75M50l88L10j38%J74j74N0J15j62J58M9j96L98n00L98j27
3814F7j70M38n41N24l22R0J59k84K91j65l0J38j37nK50m13M14k82P1K08n13O02
3836C90n25K99n3l03M12m02J50J03j56R2J1j54J94k89K45Ol35M96n02K82j19o7
$$ y = [167, 95, 56, 143, 108, -86, 231, -170, 147, 71, -153, 255, -333, 288, -150, -97, 112, -225, 122, -189, -55, -67, -165, -87, -9, -317, 4, -186, -169, 76, -328, 158, -369, -27, -25, -310, 121, -309, -15, -107, -101, 28, -99, -81, 35, -163, 23, 35, -230, 191, -243, 178, -32, -39, 297, -275, 241, -11, 80, 95, -39, 168, 12, 26, 196, 105, 19, 285, -91, 281, -32, 115, 230, -202, 375, -170, 212, 137, -14, 242, -65, 136, 116, -31, 76, 72, -153, 233, -136, 72, 8, -188, 228, -358, 184, -101, -160, 86, -232, 27, -164, -66, -40, -196, -88, 23, -292, -6, -119, -152, 81, -396, 120, -308, -92, 25, -350, 100, -288, 22, -116, -116, 58, -116, -66, 49, -113, 45, 94, -102, 296, -204, 194, 67, -103, 335, -206, 318, -4, 86, 245, -39, 252, 87, 57, 195, 58, 53, 303, -110, 304, 22, 93, 301, -212, 390, -135, 164, 111, -192, 220, -182, -32, 71, -85, 7, 18, -136, 58, -231, 14, 20, -315, 181, -321, -39, -158, -225]
3858b25K67l85L92k69P6M7m5K5R3j83J67j17kK36l88M30l26J92M6k46M73n09L65
3881A14p7j23K41j83J07l6K0N4Lj91L70l99L31j18j46L95n03M67l25P9J67l27
3903h0K89j30o8J35q8p5J79k94L60k21o8K62m42N40m60J74J1k63M46l82J62Kj07
3926a18Q6Rr8J46k52J73Q5l64M87m82K91j24m9L01m38M46k31qJ39j71J64j1j19
3949a38J76q1q0K05l13L78l35J61K10m39N16m39L41r0j29K64k16J53l3q8J50m5
3971A28j78L11k63K15p5k44M64n45M73k06m6K18k92K48k04M0O4q2QK26l36J61
3993H5r0r0K49m37M94l57J44M0k85L03k98K50j77L0J00k4q6J22j30L3J53k90L05
4016D4l26L01j04j04K76l97L65k59J66J2j63K16p7l1J41l8r5K25k56L55l28J24
$$ y = [-225, 42, -343, 49, -220, -144, -97, -142, -117, -24, -207, -40, -157, -159, 77, -311, 119, -207, -15, 31, -215, 258, -251, 114, 37, -86, 155, -28, 79, 43, 63, 117, 120, -71, 299, -100, 231, 113, -33, 362, -141, 326, 1, 80, 247, -80, 209, 79, 11, 146, 58, -17, 162, -132, 228, 7, -61, 201, -241, 299, -161, 13, 24, -239, 207, -175, -13, -11, -118, -32, -23, -121, 25, -227, -54, 31, -333, 154, -328, -37, -161, -210, 91, -347, 99, -132, -140, -1, -172, -8, -19, -138, 38, -43, -123, 82, -231, 147, -188, -27, 183, -256, 260, -179, 162, 72, -57, 207, -9, 144, 111, 23, 173, 128, -50, 261, -2, 213, 138, -106, 358, -187, 286, 80, 34, 252, -40, 208, 4, 44, 108, 26, 34, 260, -76, 85, -5, -95, 154, -283, 211, -146, -2, 38, -247, 56, -242, 8, -169, -139, -39, -63, -149, -27, -157, -124, 29, -261, 44, -282, 19, -85, -189, 87, -310, 55, -204, -38, -26, -189, 27, -50, -81, 60, 22, -73, 152, -104, 251, -77, 47]
4038D7K13m64N30l93K65o9j03K45l33K33j2r3M7Q2j84K50k56J49Qk59M45n13L51
4061A86j38j30K46k50K04j77Q3M0p9j23J76q2K2Rj65L18m30M19k99N7J11k02L31
4084A27l64K63j87M1Q1j29O2M7Pq4R7j64L26k91J91l1j40K64l93M30k25P9J05
4107A12k31J87l7m9L8J05j67K25k90L04j53p9L53m35L86l21K17k4j94K44j43J00
4129A48q8M2j4N5k26K46j86O1J57l52L65l58K07j9m0J93l63K71q6k4n8l6L1R3
4153A9j06M7nj13K63k92K34j43j5J85l54L84k77J72j8j02R4j13P2k1m1j8K30l51
4177b69L58k18J22K5j54L17l78L47j93N8Q4j38R4m1R8r3J20j44K27k62K38p6j81
4200e9L30k57K39k37J02N3k03K35j89J44o2K2pM7j95J93j40p5K03k97L71m15K27
$$ y = [47, 260, -204, 326, -67, 198, 129, 26, 271, -62, 171, 159, 66, 113, 195, 11, 261, 5, 154, 162, -97, 348, -165, 186, 48, -82, 164, -86, 118, -59, 24, 64, -15, -138, 38, -44, -22, -13, -178, 140, -290, 129, -170, -113, -2, -204, 127, -237, 26, -161, -120, -39, -168, -106, -59, -52, -136, -39, -203, 123, -168, 23, -8, -148, 116, -277, 153, -72, 7, 112, -119, 68, 31, -18, 20, 125, -42, 183, -107, 197, 44, -35, 318, -117, 269, -52, 165, 141, -53, 191, 48, 148, 60, 102, 88, 143, -83, 163, -23, 38, 195, -157, 208, -150, 57, 38, -2, 191, -172, 99, 13, -11, -69, -105, -74, 19, -87, -40, -45, -158, 105, -187, 47, -96, -111, 74, -280, 104, -173, -1, -19, -121, -27, -140, -68, -89, -130, -148, 82, -269, 89, -129, -7, 18, -136, 181, -197, 150, -43, 15, 99, -39, 55, 14, 112, 19, 139, -5, 222, -40, 198, 122, -59, 271, 14, 253, 16, 118, 171, -32, 203, 14, 158, 96, 118, 111, 158, -37, 156, 16, -59, 144, -153, 218, -197, 30]
4223C0L3k32K39k44K15j25L4J4l4kJ0j21R6J21k74L18l52L13j84m2K10k68K85
4246D0k27J44k5m1Q1jJ5L7j0j05K07k57K38j23mK20l09L41k43J99q5p9J25j53
4270a5J72o1J4p8J73j79J54r3j6R2j91K83l56K95j48m5J90k68K46k21J13m6J1
4293B6nK2j23P9j6j46K60l23L78l64J55O0k04K44k03J73j02nP8j11m7J51p8m5
4317a46J46j76K26k64K37l1j22K41k56K09j22L9N2j41J46p9L1K0O7j34J79j87
4339f5K28j33j4J32k81M09l07J46J0l4Q8k07J84p0l6oO3j17J69j49K7R4k17L27
4363B41l54K72j67J7J49k97L03k06j5O8m1oL9o5kRj48K43l32L74k02jJ70l27L18
4388D0k46J62Kj13J67j50J9M7K7q9J47k19K87k27J05P0k00L16k33K40k21P9P5
$$ y = [30, 63, -169, 70, -174, 41, -84, -50, -36, -70, -72, -62, -183, -87, 34, -240, 78, -274, 39, -145, -187, 23, -245, 40, -187, -43, -68, -109, -28, -29, -14, 23, 13, -92, 115, -142, 96, -27, -31, 189, -120, 221, -22, 177, 92, 13, 138, -15, 157, 96, 110, 32, 205, 26, 180, 87, 71, 163, -28, 255, -101, 194, 46, 1, 191, -77, 169, -52, 61, 15, 26, 21, 43, -80, -1, -17, -163, 97, -226, 152, -212, -57, 3, -201, 43, -160, 13, -89, -94, -16, -127, -174, -23, -101, -146, 0, -176, 50, -214, 23, -8, -130, 111, -145, 64, -58, -19, 33, -108, 38, -41, -10, 10, 77, -57, 122, -65, 163, 30, 16, 148, -133, 276, -31, 115, 125, 91, 179, -28, 156, 86, 50, 44, 107, -10, 159, 10, 37, 131, -86, 241, -113, 159, -8, 9, 158, -139, 164, -42, -57, 11, -30, -36, 3, -62, -64, -55, -203, 40, -292, 82, -120, -121, 49, -278, 40, -206, -44, -42, -155, 12, -138, -119, -72, -45, -134, 13, -206, 81, -146, -41, 29, -171, 145, -88, 152, -69, 10, 85]
4411H5j01J01q0Q8o5L6M2L7j58K05j28mJ91k95L52l02J95Nk54L11l34K40j04K
4435F5k9K7l7R4j74R0P3l07L90l69K21l1j25K29l25K59j46O1Np4M9Pj04J07j7
4460f1j47K46l05K08n9NJ51k44L10l14K17K5j53J51j51J37r7R0p0P2j22K24j26
4483a3J0O2j63K95k87K93j95N4P5j33J81j87J31m1L0k1Q5j78J42q1q9K19k49K47
4507A87k28J31J01k46K54k40J22o3p9J29l1o7O1n2q0J90l24L37k39J79p5j80L05
4530I2k65J85r3N0j6q1O5M6p0QL0j23J71j52J20p2m9K34k55K46j82R0k8l3J65
4555H3j57J40j28O1j9J32j74J99j19L9J04j81K49l22K84j28m0J04j00J45j67R1
4577I6N2j2p0J04p9N5l4j23K42l74L31j98%J50k08J89j95J43o3k8qK1m1P5j5j42
$$ y = [85, -16, 85, 5, 93, 28, 64, 106, 143, -15, 190, 62, 58, 249, -46, 306, 4, 199, 204, -50, 261, -73, 167, 63, 65, 36, 63, 26, 120, -54, 36, 109, -198, 192, -177, 44, 13, -112, 117, -208, 51, -95, -34, -29, -103, -54, -47, -151, -44, -61, -208, 38, -267, -59, -118, -113, 38, -206, 104, -210, 7, 32, -121, 30, -121, 16, -81, 9, -61, 11, -111, 113, -13, -3, 59, -104, 191, -96, 197, 2, 56, 131, -2, 179, -8, 123, 82, 112, 91, 176, -2, 140, 59, -30, 189, -60, 187, -41, 90, 191, -55, 199, -41, 81, 18, -61, 68, 37, -30, 31, -21, -101, 89, -235, 102, -137, 42, -33, -213, 92, -173, 12, -81, -31, -47, -128, -63, -17, -87, -79, -49, -172, -1, -153, -33, -105, -154, 80, -175, 71, -111, -21, -49, -82, 83, -74, 66, -62, -1, -20, 112, -62, 137, 18, 57, 161, -20, 229, -93, 191, 63, 23, 127, 27, 172, 5, 96, 148, 136, 66, 170, 91, 146, 112, -11, 231, -143, 188, -10, -10, 140, -68, 121, -74, 69, 6, -22, -30, -9, -50, 25, 10, -132]
4603a32J75k03J70j22M6M7j68K46k42K05j29Q5M5j23Q1j15R2o6J20j02J12j62
4625a40J46j4l8Q7j88K39j47M5L7r4K01j86J19j7J9n1Q3p1R1o2k9J53k65K90k63
4650e5K35j02m3J24j70J54j78J13j6j7M7K8j31M4P0j70K45l04K32o8p3J44k81
4673a72K55k69J99m1j6pl0L2Qj4q5J60j57J52j05j8P2j87K63j74Q9n1oO2ML4j13
4700a15J21m7P5j31J61r9JO3j10J96k38K28j13N6N8j53J92j64Q4NM3m7L6k3N3
4725A32l0p3J70k33K33j51J11l6j47K08k41J75m1K4r9rK3Rk8l7R0j27J58j98J10
4750gj9q4J17j94K70j76N1O5j00K3n7L7m0P5j04J55k39K43n9r2J54j88K66k31
4774a34J34q8L0N0r1J22o4N3j5J6n9J27n3Mk2n2K52k05J24j18N4J21k07K04k10
$$ y = [-132, 43, -160, 10, -112, -66, -19, -187, 59, -183, 22, -107, -22, 23, -100, -19, -134, -42, -108, 12, -90, 22, -140, 6, -8, -46, 41, -147, 92, -55, -10, 27, -67, 134, -52, 67, 50, 69, 18, 101, 30, 121, 59, 30, 183, -82, 208, -55, 180, 78, 35, 159, -11, 143, -35, 78, 62, 45, 92, 120, -11, 33, 103, -67, 178, -126, 106, 38, -35, 109, -172, 83, -186, 13, -28, -44, -51, -81, -49, -41, -55, -140, 20, -137, 15, -90, -108, -36, -223, 40, -134, -45, -96, -102, -40, -36, -2, -115, 6, -41, 34, -97, 64, -35, -34, 29, -81, 115, -123, 105, -8, 48, 106, -47, 145, -19, 65, 70, 113, 66, 102, 79, 132, 102, 29, 199, -34, 199, 48, 159, 123, -24, 184, -57, 118, 77, 101, 2, -7, 16, 25, -3, -40, 50, -77, 81, -117, -7, -26, -110, 7, -187, 83, -93, -42, 23, -77, -54, -111, -74, -114, -39, -143, 12, -227, 16, -43, -135, 19, -169, 97, -134, 0, -88, -58, -8, -99, 23, -41, 12, -3, 13, -46, 81, 28, 32, 10, -42, 210, 5, 129, 11, 65, 186, -21, 183, -27]
4799b7J19r7J32j16J22o4j3P2j22J35j93K22k36J57N0j81J56k51J93j08R6N0p9
4822A7k7L3k6p6J33j99K11k35J53p4m8J74k13J68j44J23j1j26J21l4j1J0Q8j56
4846a49J90j62R4J6j43J95k01L15k42N7M2o3R9j38J90j15O1p5J53j19P2J8j06
4869a1J32j20J68k29J79l4r1J90j77J34j13L3j1M3m6J0n4L2L8q3J56j93J66j10
4893IkN1k42K71j95J71j27m2R5r5N9Jm0j9J23j89K10k32J52m6j30K15j67J59j00
4918a10pJ21o7L1n9Q2q2J29j74K16q8JL1j17K61l58K84j16J7K3n2J26j08J53j11
4943B6R9q6K9k6L9L9r6J74k30K06k04J70k1j68J86j84J96k03J49q1LK3nk4K6L6
4969G3j78K21k57J79m1m5Q1k54K89j89R8kp6M2kJ5n8L4p3J41j67J45j04L7O7k08
$$ y = [-27, 92, -5, 127, 11, 133, 69, 56, 128, 6, 141, -52, 170, -66, 91, 141, -40, 116, -135, 58, -50, 46, 96, 17, -10, 23, -3, -79, 54, -145, 66, -169, -16, -90, -138, 36, -177, -9, -153, -30, -41, -167, -46, -80, -91, -81, 7, -149, 41, -121, -27, -11, -154, 41, -160, 155, -87, -30, 12, -51, 48, -90, 100, -15, 46, -29, 124, 5, 77, 95, -11, 121, 1, 169, -60, 119, 85, -6, 184, 7, 141, 28, 61, 50, 93, 47, 57, 3, 35, 73, -10, 146, -47, 119, 9, 7, 58, -184, 87, -108, 63, -64, -106, -11, -106, -47, -46, -86, -105, 18, -171, 39, -193, -41, -87, -217, -2, -169, -10, -110, -117, 4, -63, -32, -91, -9, -91, 38, -136, 80, -8, -7, 24, -93, 168, -190, 94, -22, -5, 18, -34, 92, -16, 137, 26, 125, 39, 68, 42, 81, 120, 24, 198, -32, 174, -30, 140, 119, -49, 137, -47, 149, -54, 95, 14, 17, 40, 35, 11, 37, 73, -105, 116, -141, 38, -3, -48, 33, -221, 68, -121, -23, -25, -101, -59, -61, -46, -104, -70, -143, -2, -169, -24, -128, -91, -24, -232]
4995b32L26k41J99j14o3J74j20R2n1P2o6L9m5J23j35J2J23q0J17j47J16j30J21
5018I0Lj07J74j83J24o8M7k6L4j6NO0q0O3j66K02j16Q9j9j21J55k28J71j46J17
5043E8k5m1J0%kl0M1j28J89j79N9Kn6J25j99J93j30P5j9r4J45q9N2p5Q6p5Q7j36
5071a56J75q3l6J52k20K56k14J61l6p8J19r6J40j09J08q2O8n9O0m7jN9j02J84
5095A63j73J55r8K9N9j91K30j97J75p6m6J9K0j7k5M6n4R8j69K05j77O5k5j36J81
5120F1j66J87j56J8O0p3O5o3M9o8J18j69J39r5J4P1j78K86k85J61l1j8jk4M1n7
5146a14R9o1Q5j31O4J0K1K6q5J26j32K01j90J25J1j30J93j79J41p9Q1l9jJ5KK0
5172G9m5J06j36J40j66J39p5k1J16k08K45j84Q0J4o1N5q4O4l8O7j55J61j44R9
$$ y = [-232, 94, -147, 52, -62, -125, 49, -71, 21, -30, 42, -24, 15, -30, 93, -42, -30, 93, 13, 130, -17, 99, -31, 90, 93, -14, 160, -23, 101, 33, 80, 54, 88, 72, 77, 137, 57, 120, -46, 156, 40, 129, 110, -11, 144, -84, 87, -59, 58, 33, -8, 2, 2, 0, -30, 11, -117, 72, -107, -48, -46, -102, 23, -176, 17, -113, -38, -57, -151, -6, -95, -43, -118, -32, -107, -20, -156, 19, -64, -100, 52, -168, 88, -126, 35, -1, -79, 40, -56, 84, -25, 83, 1, 69, 10, 70, 23, 22, 81, -21, 163, -10, 145, 47, 76, 135, -56, 174, -23, 152, 76, 30, 49, 69, 52, 27, 73, 19, 117, -52, 153, -24, 41, 16, -120, 61, -105, 82, -74, -56, 4, -69, -4, -67, -18, -86, 32, -137, 2, -93, -79, -8, -186, 100, -185, -24, -55, -73, -74, -98, -57, -114, -15, -76, 9, -122, -58, -48, -27, -1, -86, 40, -92, 109, -81, 44, 55, -75, 118, -61, 80, 1, 82, 43, 42, 57, 59, 79, 34, 140, 4, 144, -22, 117, 42, 21, 137, -71, 174, -10, 70, 84, 23, 78, -6, 58, 20, 87, -68, 93, -51, 48]
5196D8j18P9J03k08J82k02J87j30mO0p7K1PL3q7O5n8L4J4o4Q1j13J34j52J98r7
5222f4j0P9r3J11p2P6m9Oo3J47r8Q5Pj00J73j72J00j15J69j1q0R3j57J98j43J32
5248A49j35N1Ko5R4p9J24j87J76j33Q4Lo2J31k16J62j48J18j5o3M3m8P3j03J04
5273F0j28R8j46J48m8j08J61j78J64j55J22K5r2L6m2O6m8M6j17J38j52J17%q8
5297a21J25j64K13j81J33o1l5R7q2J22j09J04l3O5j7Mn1J9O3j16J42j75J29l1
5321D0N6j4n1R8j63J69r4j8K6K2k1PO6q7J00j66J30p2J6Kp0J32j99J58r2L4k5
5348a6m1J07r7O7q2P0j27Q2k0M5k2j24J67j51J72j49Q5J8j03J41j40J31j19R9
5372gl3K4o1nO0n3J28j89K21j37Q1k1J1L3j20J86j18N3nql8N4jq5J59j82J86q3
$$ y = [48, -70, 9, 112, -96, 86, -116, 71, -59, -63, -3, -80, -59, -52, -19, -106, -41, -99, -65, -51, -115, -34, -147, -13, -165, 33, -64, -74, 5, -88, 23, -49, 27, -22, -16, -79, 68, -30, 55, 62, -38, 135, -37, 63, -52, 117, 106, 26, 119, -38, 160, 17, 149, 14, 65, 67, 2, 96, 17, 141, -46, 130, -3, 81, 84, 22, 153, -63, 99, -49, 69, 54, -9, 34, -14, 59, -44, 60, -68, 30, -116, 32, -16, -124, 37, -141, 23, -132, -10, 15, -77, -41, -83, -17, -65, -19, -136, 2, -150, -33, -33, -121, 4, -160, 53, -128, 5, -56, -91, 6, -76, 46, -63, 41, 8, 73, 56, 60, 9, 28, 91, -25, 117, -58, 71, 40, 96, 82, 31, 129, -34, 135, 41, 23, 49, 71, 50, 57, 123, 36, 136, -30, 100, 28, 44, 46, -24, 108, -91, 67, -25, 9, -16, -57, 50, -47, 20, -62, 8, -119, -37, -57, -12, -34, -158, 9, -142, 30, -119, -34, -16, -119, 22, -118, 13, -106, -7, -40, -16, -77, -82, -22, -75, 53, -136, 85, -52, 29, 8, 19, 52, -68, 118, 0, 53, 48, 40, 2, 56, 55, -30, 129, -53, 133, 50]
5400E0L8k5jJ14j79J36j00Rn0K8R8j19J05p3L2j72J94j12P8r5L2J5o1J30j56R2
5426Hq0ON3m2O0n7N3j04O3q7K8NK0L1r1J76k50K42j46P1J0r1J34j30J20m0M9l2
5454b1P3p9pR0p4J05j26R0q6O2J6l8L8m6J21j10O9k2%L2o7M6p6Q1o9J15j17N6
5482E6O1j06Q4j52J96j07K6n4M7K4r0R2o6M7j07J14j35N4Rj8R1k32K28j25L2p
5508c8m8Nm9J07n5Oj6R3n9l0k3RP8r2J89j92J01q0j4J04r4J83j30Q1o5O3n0K8
5536A2j5K0J4l1J57j89J15q3N9K7r4J41j56K05k22J13%m5J7j9M0o5J02q9N8m7
5562B5j4O2j03J02j18J61j50R5p3j5R9j60J24m5k0l0Q9j00O1n9j2M9r8J73j69
5587a26K07j23n1J51j98J91j39O3o3M5m4J6M3r1J44j41K36j66R3j05J1J19j50
$$ y = [50, 88, 63, 62, 176, -3, 133, 33, 42, -8, 20, 118, -1, 104, 31, 63, -109, 85, -27, 51, -44, -12, 3, -58, 72, -84, 8, -72, -66, -13, -55, 5, -52, 1, -103, -40, -127, -99, -94, -74, -43, -134, 42, -208, 34, -112, -41, -31, -122, 12, -118, 2, -38, 11, -21, 52, -27, -34, 56, -18, 87, -39, 51, -35, 27, 43, 5, 43, -3, 118, 8, 77, 55, 55, 87, 20, 66, -10, 71, 2, 117, 0, 56, 117, 11, 95, -57, 139, 32, 58, 4, 51, 75, -15, 77, 11, 58, -49, 65, -70, -16, -7, -25, 66, -166, 62, -63, -31, -38, -86, -81, -130, -23, -78, -72, -88, 5, -54, -84, -107, -98, -20, -112, 77, -115, -14, -94, -108, -4, -98, 85, -45, 36, -29, 34, -16, 12, -3, 17, 31, 0, 157, -32, 83, 0, 59, 86, -8, 133, -23, 182, -40, 73, 73, 28, 45, 26, 66, 1, 103, 14, 72, 25, 11, 73, -30, 72, -46, 115, -35, 60, -13, -28, 71, -89, 35, -10, -30, -60, 29, -71, -10, -69, -81, -32, -130, 43, -126, 81, -42, -93, 58, -140, 51, -88, -25, -88, -43, -87, -71, -28, -119, 25, -116, 120, -46, 47, -58, -47, 72, -78]
5610g8J22o9J39j20N8j0LolK0o5J00o2R0j8m9j4j3R8j19J12o6K2J7n2O1l7J8r0
5639a1R0o1N2q7K3L0o9N8j13J44j23P9k5j00J10p2P7j08J29o1Nl3J3M8r8J08j93
5666a88K12j44J02Lj22J30j12P0k0nO7M2o1k2Jm4J33j10J26n3J5M1j4N5j53J56
5692A05j10J14p0qL2l6Q0n9M6n2Q2j07O0Rk1L8j83J90j42J14n5K3N5j33J18j70
5718h0J48j20P8q1O5l4l1R4j21J67k46J77m4o9Q6r8Q8o9P4p1M5p4P4Pn6Q1j13
5745a23J92k01J66r9L3K1n6Q6j31J06j6P7j06N8K0j10J27q4Q1n4J17m6Ll5k1N2
5771E7m9P9n0M4j0m6R1p7P8q3J05j34N9q2P2J7o6J01j21Q4n5L4o2J4J9o2J00p4
5799a7Q0r8L6l4K4o7K6P2j68J59r7N6J2n0J01j14O3p0O9n7M7l0N5l0%N1q8J30
$$ y = [-78, 44, -25, 114, -6, 52, 42, 45, 39, 36, 56, -9, 91, 29, 119, 101, 52, 38, 25, 123, 4, 116, 50, 72, 89, 37, 98, 61, 79, -11, 79, 18, 70, -17, 6, 36, -33, 25, -88, 56, -67, 12, -13, -113, -3, -75, 2, -106, 23, -38, -33, -66, -53, -5, -103, 5, -188, 24, -120, -18, -15, -137, -7, -119, -49, -69, -74, -7, 35, -26, -48, -47, -91, 42, -68, 58, 5, 20, 61, 47, 102, -51, 105, -5, 109, 39, 31, 63, 27, 107, 48, 94, 42, 124, 17, 77, 86, 65, 103, -80, 110, -32, 82, 27, 50, 105, -28, 90, -80, 68, -52, 26, -55, 10, -24, -55, 39, -82, 85, -161, 16, -28, -97, -11, -109, -21, -90, -16, -87, -42, -116, -42, -35, -91, -10, -123, 69, -132, 34, -65, -32, -11, -67, 19, -112, -6, -22, 55, -51, 7, 27, -83, 44, -40, 41, -13, 104, 58, 61, 26, 5, 57, 8, 87, 37, 81, 71, 25, 116, 39, 117, 34, 139, 5, 64, -18, 54, 71, 5, 106, -15, 69, 14, 48, -14, 0, 19, -43, 57, -17, 63, -35, 1, -33, -9, -76, -50, 22, -146, 13, -84, -28, -16, -66, 35, -79, -16, -86, -17, -74, -27, -57, -2, -32, -32, 19, -69, 61]
5827F1j60J45o9k8Q7j27J18l5N1o6O3ql9N5l9L7l4J20j17Q7l2j4M1j20J09p2O8
5854H2n6M6L7k2k4nP4r4N5o1J6l3nK0o3J09j02Q5k3%Jp2N2q0N9q6M4k6M7K7m2
5885d0N9j05Q1j24J61j44N9nj3R2j51J53q0R3q9L5NrO4j05J19j41J34p6M5Lm4
5912b3J36j39J11j00O5j6KM6n1O1j35J18j11J23r4O6J0n5R9r4Q6q0L6J3j7rk0
5939B8L2m9M4p5O9m4K5l2j2J13j66J11j13R5r4RK1mK7k8M6j31J50r5M7m2o9J55
5967A8j5lr4J17j04K7L3m3J11j13O7m2M3k8J2O6q6O3j19R9p4J78j21M5N6j33J98
5994A58k22K06j33O3lk1K4l4O6p4P8j50J68j47R9n4j9O4q0J95j97R6k7k4O7j36
6020c7P9o5K6m4O6l0l0M3m2M8j20J87k01Q2q5N2P8q7R0j22R5n9M2p4k3J00n0M5
$$ y = [61, -99, 46, -23, -51, 36, -91, 27, -8, 43, -23, 40, 32, -7, 48, 9, 46, 12, 132, 15, 102, 70, 56, 97, -23, 86, 14, 82, 26, 72, 109, 87, 63, 58, 132, 38, 93, 32, 48, 15, 10, 30, -33, 76, -26, 59, 36, 36, 37, -35, 17, -63, -4, -90, -46, -72, -25, 2, -40, 19, -86, -5, -129, 32, -112, -53, -58, -71, 21, -130, 23, -57, 36, -53, -18, -13, -22, 42, -63, 56, -85, 49, -27, 18, 21, -23, 113, -26, 85, -15, 50, 34, 36, 82, 31, 92, -43, 75, -36, 87, -7, 59, 69, 14, 113, 19, 105, 25, 61, 74, 57, 48, 28, 60, 11, 55, -20, 49, 5, 30, -2, -14, 99, -67, 44, -69, 26, -68, -59, -38, -42, -15, -43, 3, -128, 22, -73, -26, -68, -137, 18, 3, 0, -94, 23, -81, -54, -21, -64, 47, -66, 1, -41, 2, -26, -14, 52, -34, 29, -90, 9, -65, 113, -8, 37, 93, -40, 158, -64, 142, 9, 72, 69, 48, 72, 38, 104, 30, 108, -42, 126, -21, 78, 24, 5, 69, -11, 184, -13, 83, 56, 32, 99, -37, 42, -23, 3, -41, 25, -5, -35, 8, -34, 14, -106, 81, -120, -38, -123, -71, 7, -80, 10, -112, -17, -76, -34, -108, -131, -31, -81, -36]
6048c6k7N8j06J46r0N4J2r7J51j20J34j04L1N0o4J4M1Or7J14l4M6o9O9j5j06J57
6075A18j61J58r2M7m0K0J6o8R3q9P0q2J23o8Rm7n4J30j05O7j25J12p6jN6j34J31
6102Hm3QK3l9j0k1J07j09Q0q5O9r6J08p0oO1p5J42j59R9rl7nJ6O2q0R3r1Q8r3
6132f4K8K0k4R0r5J05r9R6o0J1omO0p5J10q7K6K7L4l9l3O1j04J24j56J36q3M0
6160C9O2r4P4n9L4o0M9p6P0l1l0N1m9J13j66J17p5K8k3m2J25j31P3q6K3%K0Oq
6189d6M5j19R4n0Q8p2Ol4pJ47j99J68p5L0n9O2jj9K5o0P0j3P6r9N7K1l2Q4j18
6218c0J40j46O4K1k4M4q5Q9j11J35j31P0l4N3J7o2J01j24P5m5P4j04M9L6j22Q8
6244C8n8R6j28R0l8K6K4p3O4j33R6p5P2p9R2ro9R1j29O9l7RK4J1J0q3L9o5J60
$$ y = [-36, -63, -5, -111, 35, -55, -1, 11, -86, 65, -55, 79, -25, 6, 56, -8, 6, 47, 53, -44, 70, 36, 82, 13, 82, 67, -39, 118, -43, 115, 23, 70, 30, 50, 66, -2, 91, 2, 72, -10, 113, 45, 54, 7, -47, 83, -22, 45, -80, 32, -44, -45, 11, -123, 8, -35, -27, -4, -43, -53, -74, 33, -76, 4, -81, -12, -108, 0, -70, -76, -15, -90, 52, -107, -8, -17, -54, -59, -43, 19, -61, 32, -59, 29, -64, -36, -16, -40, 50, -45, 60, -39, 57, -3, 8, 2, -2, 58, -17, 93, 6, 32, 59, 93, 54, 21, 82, -22, 102, -54, 82, -1, 39, 101, 7, 81, 22, 56, -4, 45, -31, 39, 8, -22, 29, -20, 93, -73, 44, -31, -3, -26, -68, 57, -74, -1, -87, -64, -64, -44, -38, -46, -1, -120, -26, -76, 12, -60, -54, -88, -95, 52, -147, 21, -54, -24, -83, -21, -22, -41, -16, -76, -6, -19, 57, -42, 15, 36, 4, 88, -30, 110, -36, 28, 49, 25, 69, -16, 73, -38, 97, -34, 36, 2, 55, 72, 10, 111, -13, 62, 17, 91, -13, 36, 72, -50, 38, -20, 76, -52, 38, 0, 26, 50, -23, 41, -92, 4, -71, 1, -78, 14, 5, -64, 27, -102, -33, -70, -61, -37, -26, -16, -99, -60, -125, 35]
6273C5j33M9j2mP9j03J40j61J98j44Q4n0J1N6p0P9q9J65r7M8p2L7J1m4Q5j14J14
6300I8n8R1j20nQ7r2R2o6J27j69N8L7j28Q5p8J51j40R0q1P9k2l3J0n5P8j06Q2
6327A2jm2MlL9p8J02j06J28j43N1RoL8j28J13m2M5m5LL0l5M6r2J51j17Q7l0K3
6356A3l6pP6j24J86j55Q0l6MK2k0L2j2P6j58J28p7L1O3j17J04j01J32r7Q2o6J8
6383D1K3n7Q4q4O2r8R5p6L5L4q9Q0o1Lo8J33j03L2k6j8Q6n0L5m5K2m2PJ2k5O7
6413Iq3O3o6M2l6k1M6n9J21j29J30j20R7j1J5J9m9M8m3M0q9J26m9lj2JP4j14J35
6442H2j19J15o1J5M6p1N8j9L8l6J6noRk1Mk7O7l9M0p5K5J0m7N0j6KmLj9k5Nn1
6475e6Q5p0R0j09J7NK1l6J1R6j10O4n9O5q6M8Qn6J08j24J02r4J17p3M5Qk8L2o7
$$ y = [35, -98, -49, -61, -65, 14, -89, 51, -110, 88, -56, 28, -22, -11, 45, -25, 54, -35, 130, 33, 81, 9, 46, 57, 13, 98, -16, 98, 40, 131, 11, 6, 93, 1, 93, 27, 154, -15, 43, 80, -48, 37, -41, 110, -30, 60, -21, 58, 36, 3, 13, -42, 36, -70, 12, 11, -31, -27, -30, 9, -69, 33, -73, 55, -88, -37, -28, -34, 4, -124, -11, -53, -8, -53, -50, -20, -55, -9, -101, 50, -67, 20, -10, 13, -23, -30, 46, -78, 108, -47, 33, -3, 1, 23, 3, 35, 23, 99, -59, 69, -8, 23, 86, -31, 73, -28, 104, 7, 89, 23, 41, 64, 7, 91, 7, 69, -29, 66, -10, 25, 59, -30, 50, -11, -8, -76, 57, -46, -14, -40, -58, 28, -22, 13, -32, -10, -52, -45, -33, -58, 9, -74, -11, -77, -35, -71, -92, -46, -105, 16, -113, 17, -103, -6, -17, -2, 17, -32, 16, -27, 13, -76, 50, 1, -2, -14, -13, 61, -53, 82, -37, 78, 17, 32, 78, 7, 65, 46, 84, 48, 64, 59, 53, 62, 41, 45, 18, 85, 46, 86, 11, 36, 46, -1, 49, 33, 35, 31, 34, 15, -10, -5, -56, 29, -41, 49, -60, -43, -38, -17, -53, -42, 54, -56, 8, -51, 14, -72, -24, -16, -72, 36, -88, 14, -80, 37, -36, 9, 17, -11, 21, -46]
6504d6O2j27R9M5o2K7m1P1n2M9n1O4Ql2R3q9J04j61J15r8Q3M2p5O2l6K1p2Q2n2
6533C3k3K2Rrk5O5j39R7m2P4p8j8P0n8O0j07LL0P0p6OL6q3J39j28R1j35O7lK7
6563b5L8j19N1o0M1K6K7Lo7P3pL5p4O3j4m4K1j3P4q8J12n1Pm2O7Rk1L2j4K9j8
6594E1J5o9O8l2PQm9Q7j09J18l9L3o2RN7r0P5n5J9l4O4K4q8L5m7Pl1N2j1rPk2
6626a1j0m0J07j30Q6k2Lj4L0Pj17J05k9M9q3k0L7J7N5q6K7j8jl3N6moQ5q6M6o6
6657f6N4kN5m4mR9j36J25j42J00k4N9L4l1jr1O1l9J3o6N3R0m8J4k4L8p4R7p3j2
6687A5P2p4J2j0P3j65J31l1j0j2m2J28j42J00n5N3p6m4R4r0J00n7P1p6J2L0n0
6714d3J1n1J09j46J11r4L2QK6jm0J63j96J35p3N5l0L1J2r8R9q4J21j05Q3n5J4
$$ y = [-46, 16, -111, -12, 33, -29, -2, -43, 28, -24, 25, -26, 38, 46, 14, 107, 18, 122, -39, 76, -22, 61, 103, 28, 90, 54, 75, 3, 85, 33, 10, 32, 41, 32, 7, 72, -67, 30, -12, 62, -16, -34, 36, -22, 38, -69, -66, -36, 34, -42, -36, 0, -83, 56, -72, 19, -116, -49, -52, -25, 13, -106, -55, -115, -74, -48, -21, -18, -85, -12, -19, 16, -58, 5, -9, -53, -32, -45, 29, -59, 53, 2, 9, -33, 34, 43, 22, 54, 40, 69, 51, 66, -3, 65, 33, 40, 48, -1, 86, -23, 95, 56, 89, 27, 36, 93, 3, 78, 23, 42, 8, 72, 96, 8, 43, -4, 3, -28, 24, 13, 4, 11, -11, -21, -61, 46, -84, 2, -20, -17, -31, -1, 6, -111, -6, -35, 14, -69, -89, -52, -35, 20, -66, -39, -57, -58, -91, -35, -39, -45, 40, -46, 0, -66, -12, -14, 41, -3, -7, 92, -44, 81, -61, 39, 15, 74, 108, 77, 76, -15, 46, 7, 20, -46, 7, 97, 49, 63, 39, 77, 3, 100, 27, 15, 87, 13, 25, 15, 88, -77, 54, 23, 13, 1, -41, 87, -55, 45, -10, 43, -33, -77, 17, -73, 27, -30, 41, -35, -23, 7, -43, -32, -83, 26, -120, -9, -103, -71, -63, -37, -38, -78, 85, -111, 24, -49, 6, -24, 7, 19, -79, 20, -64, 57, -48, 35, -20, -6]
6741fK0k8N2l6J28j13K9j1K9J8l2J6m5P8p3J3Jl8Jj8O6m4J15j19L1l0n0J20n3
6770B1Ql1L6j08M9J9m3M6j4Kk2N7n7J0M0l5L4p4P9j27Q6m1K9n0j7R2q1O3k4Q6
6800C3r3LM3q8R6j12J15l4K8m1O3rk6N0m2P2m4JMP8r3j2O4m4J14j16M9oOj6j4
6831B9N6o3O7j05Q7m0p8Q6n9Q0r8J12p2M9q5M3J2m1jl8P3n7O8r3j9M8K0L6r2Q2
6861Gr2J11j16kN4q2R6j35J72p3K9o3PO2l1R7q7K5q8Q6j7L5m6J7O0p4P7n8L6J2
6891A9k1K4l3P4o7Q9k9j0j7k5Q0m8K7j05J21j13J00o9L1lLJ11j43O0p0qR9k4l8
6920A5J1lm5M8m3N5q7N7km6L7q5J73j40M3n4j4J00j29Q5n9J31j18P1l6Pk7ON2
6949Cq3J06m8J7m4j8N7l1J01o0M4q2M0j8qL8p4J62j38J18p8j1RK1j5l3J27j02
$$ y = [-6, 14, -14, 38, 2, 130, 17, 46, 35, 64, 82, 50, 66, 21, 99, 26, 39, 40, 2, 3, -15, 51, 7, 122, 3, 34, 4, -46, 74, 21, 29, -2, 34, -74, -25, -6, -49, -3, -17, -15, -37, 20, -37, -27, 13, -22, 12, -62, 17, -110, -24, -65, -36, -86, -103, -11, -92, -29, -53, 33, -60, -57, -14, -102, -6, -118, -3, -37, -9, -50, 13, 4, -22, 28, -14, 58, 14, 15, 19, 97, 4, -8, 56, 12, 126, 10, 59, 53, 59, 43, 29, 85, 22, 89, -16, 71, 31, -47, 39, -20, 60, -38, 74, 2, 51, -34, 9, 21, -20, -21, -59, 14, -43, 25, -68, -87, -39, -19, 17, -75, 7, -85, 26, -90, -92, -38, -120, -24, -159, 13, -60, -31, -94, -87, -25, -56, 41, -46, -21, -109, -23, -40, -5, -51, -34, 26, -48, 29, -29, 7, 19, -2, 22, -11, 63, -4, 85, 56, 46, 29, 4, 84, 36, 63, -42, 79, -34, 66, -3, 28, 25, 28, 139, -4, 56, -14, -22, 77, 53, 15, 26, 23, -22, 26, -17, 38, -49, 8, 6, -40, -3, -88, 85, -55, -12, -66, -80, 20, -109, -24, -83, 48, -70, 1, -35, -28, -55, -49, 3, -80, 26, -22, -5, -49, -67, -10, -41, 60, 0, 44, -38, 2, -16, -24, 14, -60, 102, -36, 82, 4, -7, 2, 23, 8, -25, 102, 0]
6977@R7n6j3M1o9P3j05R0p3J14o0N8q0j7Q4j26J04q1Q3q0M8m1K4l5p6J30j20R2
7005Fn9K1m1O4K0j21J24q5M0K4K4p4l1Q1r0J06p2O2r0L3L8o7N6k4J19j81J50l5
7033bJ8j2lL4p8J14j10M4l6O6p6P0K4o1P1n6Q8j03P9l1jO4j43J11j09J02j8nP
7062D8l0M4k5K8n9K6k6PJ6m8M4p7Q5j24J18n1m2L3j8K0j6L0m9Q6j27O0jj6N2j38
7092a50J98r0Nj5pQ3q0M4p3J05j11P9l7J0J6rJ05j52O3r9J04rL0N0m3J2j3O5p0
7121A1L7m3j0K1lK1o7J39j73J35j2j0J9p0J13q2N7q2N2k4J1l6n0N4o8J40j48J10
7149D2n6pj8m3Q2q4J29q2J6J0pNj0K0j00R7o6M4Ok2K5m2P7q8Q2o7J9K4j8nj1J12
7181F4j14M7PJ4l7NM9p9J09r1N1k4K1Op8J12n6P5r0J21j16N0l1k0R2q7R1j00P1
$$ y = [0, 97, 41, 28, 69, 0, 73, -32, 58, -15, 99, 39, 97, 17, 0, 84, -42, 62, -19, 64, -16, 32, -9, 15, -20, -96, 34, -86, 6, -53, -32, -73, -9, 11, -110, 14, -71, -31, -7, 17, -57, -88, -7, -97, 9, -63, -1, -91, -58, -20, -87, -31, -55, 64, -117, 33, -2, 16, 4, 1, 35, -43, 71, -39, 5, -31, 35, -41, 29, 53, -8, 63, 7, 95, -8, 71, 40, 39, 103, -40, 71, -38, 64, 46, 41, 48, 18, 62, 37, 65, 6, 32, 6, 13, 29, -19, 25, -52, 33, -91, 27, -24, -66, -33, -51, -31, -47, -17, -66, 20, -107, -47, -48, -64, -12, -150, 48, -42, -37, -52, -59, 24, -56, -12, -85, 20, -91, -12, -49, -39, -23, -32, 73, -79, -16, -115, -11, -20, 10, 60, 17, 29, 16, 81, 11, 48, 5, -5, 16, 13, 34, -33, 106, -67, 68, 56, 46, 65, -5, 108, 26, 83, 1, 53, 29, 40, 4, -46, 8, -60, 80, -68, 42, -14, -21, -39, -82, 0, -84, 45, -37, -21, -11, -18, -13, -23, -3, -103, -6, -72, -28, -22, -44, -19, -61, 16, -72, 10, -57, -38, -14, -32, -37, -48, 64, -50, -3, 4, 18, -19, -14, 35, -44, 65, -26, 25, 1, 22, 28, -50, 62, 6, 81, -9, 112, -4, 46, 15, -5, 87, 0, 91, -9, 62]
7210F2p7M9J2l6K3n9J38q7J2n2O1q0ML7k1K8o1J05n0k7J8o0N4o0N4n9P0o4N4k8
7240d0k0Q9j06O6j24J45j15M8NJK9r9J39m4k1%L6j5J8J7n9O5k8Ok1M2M2l9K5o7
7270b5Q6r6J12j12L0J5k4J36j26R8l8J4q3OM6o8J28j13M9l9P4r7N2L0n7L0m9N7
7298C6Nl7q3Q3ml6L4n5Q3q5K9j7RNr6J66j31M8l6R7o8J8M6l7nl2R2p4P6l3Kl8
7330c8K2l4k0N6n4J77n1k4nm1N3p1M9rP2m2m0J3L5PNN4j41J05q6M6L9q9R7j08
7360b3O1PJ6o6L0Q2j60J38o5L0r5Q6k0l8P5o1Lm9J17q8%m4P1lj9M2j22Q4p4M8
7390c7jjP4q7K4n2O6l9M0n6P8l5m5N7n5M3o1N8nk4nJ5O1o2J24r2Q3m4o9J6J2O1
7422D2m1P6j04Q7j2n9Q7l3O3j10Q9l9j5P4r1P2r3O3p9M0j6N4jk0Rp8R5o7N3o5
$$ y = [62, -15, 34, 46, 10, 33, -26, 112, 25, 37, -15, 46, -34, -30, 7, -14, 14, -47, 58, 8, -19, -1, -61, -7, -67, -13, -72, -2, -66, -12, -40, -60, 29, -77, -11, -135, 10, -105, -57, -52, -51, -22, -121, 18, -26, -47, -47, -11, -26, -8, 9, -50, 15, -13, -7, -28, 14, 56, 17, 42, -25, 61, -35, 77, -35, -5, 10, -14, 122, -4, 94, 56, 70, -13, -7, 39, -29, 99, -14, 35, -4, 70, -27, 25, 55, -2, 28, -21, 36, 41, 4, -79, 4, 0, -36, -2, -57, 26, -59, -30, -47, -38, -33, -129, 37, -94, -46, -82, 15, -53, -35, 11, -26, -31, -63, 29, -45, 31, -2, 0, -38, -16, -50, -70, -14, -68, 109, 58, 34, 29, -12, 41, -30, 19, 10, 82, 40, 0, 13, 48, 55, 60, 114, -27, 78, -8, 38, 77, -12, 85, -23, 38, 45, 61, -5, 25, 107, -53, 85, 20, 50, -45, 41, 21, -17, 58, -3, 0, -49, 68, -20, -20, -64, 7, 4, -15, 27, -95, -11, -85, -37, -38, -39, 35, -52, -28, -80, -14, -53, -13, -69, 9, -26, -71, -14, -69, -26, -87, -29, -34, -58, -63, -48, 13, -49, 75, -17, 66, 22, -47, -31, -19, 42, 1, 77, -27, 60, 48, -11, 76, 43, 106, -4, 85, 46, 31, 105, 14, 86, -7, 56, -23, 17, 1, 55, 54, 34, 43, -35, 60, -7, 46, -19]
7452a9M5q3L9J8q7J57j37Q9k7Jl1oJ9m4O6n0P0j00L3mJ6l2j0P3r2J22m3J6l2m4
7482g7N7p2J17q4M8j6K4K8m6M4j1L5n4O0l8J9m3lL0l6O4m3K1%N7J5j20P5q9P2
7512C4j8N2m1PqjOk0L8n7J3Mk2J8OM8j14Q4o1R1j01L3m6l2O5j4L8p6J08q0K2n8
7544h2K7M3m1N6m6J4k2M6l9%J06j41P3j4j3nQ3q3lQ5r1J11p9M2p0P5pM0N7j31
7574iJ21j02K9k7JP9q6Q0r6J8J9oj2L8j4k6M5n3K7k2J0l5j6N9%J8k4j2n6O6ln7
7606d6O2n3M3m7M4n8M3j5L7k7l5K9m8N1o0N6oj0NJ7K3p9L8rK1J9j2Jr4J04q6R2
7638@n3N8l1MN1n2M2l8L1j2Nm0RR3n6K7m2L5m1O4m3L7K7p2L5o0M3Kj2J9k2L2k7
7671A3R0r4M6m5oN7n5J9p3J7KK0l9K8j9qM4o0O4r3P1m0K9J1k0jr2J42q9N9j2m3
$$ y = [-19, 26, -57, -18, 0, -87, 70, -67, 22, -5, -4, -35, -41, -22, -66, 0, -50, 20, -80, -47, -51, -35, -67, -77, -4, -96, 26, -17, -1, -33, -77, -20, -92, 25, -59, -11, -27, -3, 25, -21, 23, 12, 47, -7, 53, 15, 34, -9, -12, 18, -18, 46, 3, 24, 24, 81, 96, -24, 51, -38, 34, 16, 68, 27, 34, 26, 25, 31, 11, 49, -8, 5, 9, -13, 5, 11, 59, -55, 29, -32, 59, -42, -9, -55, -87, -22, -36, 2, -74, 34, -46, -24, -82, -55, -12, -53, 3, -43, -29, -51, -5, -44, -44, 62, -79, -6, -20, -33, -38, 45, -38, -41, 44, -47, 64, -15, 27, -43, 32, 25, 65, 122, -9, 112, 10, 39, 12, 13, 92, 6, 86, -10, 8, 27, 21, 9, 47, 33, 7, 52, -1, 26, 4, 14, -21, -37, 22, 22, 40, 16, 4, -52, 14, 11, -46, 16, -37, 6, -41, 3, -55, -12, -27, 10, -17, -52, -23, -71, -20, -80, -24, -30, -40, -35, -18, 5, -74, -36, -45, -24, -5, -17, -16, -110, -6, -92, 0, -53, 5, -26, -22, 29, -23, 19, -19, 12, 0, 5, -35, -26, 67, 11, 38, -4, 31, -10, 54, 11, 48, 75, 3, 38, -22, 21, 23, 11, 30, 8, 40, 13, 103, 9, 55, 10, 4, 61, 6, 25, -48, -31, -29, -9, -48, -20, -39, -47, -3, -63, 1, -92, -21, -61, -32, -21, -41, -42, -134, 8, -81, -22, -34, -77]
7703g7J8pJ03q2R3p6M4l8l0P0m3Om6Q5l0M9o7O9l0l6K5o9J23p5Q4o2qO9n7P7r9
7734a7N5jK1m1K5j2RK4n9K4J6l1J2k3N5o5KLj8K2%mj9LK6L2r0N0l1J8oj0kJk9
7769f0L2N0j22P4qJJ4k6L9q6N9J2J7k2L0k8qO1p9N5j8J0PK1m0lN5o0Q8n0K3K8
7801F6m4mk3M1k4R9j16N4j1%K8r5Q5m2K2j16Q8M8p4kJ0j6L5O4q9J8Lj3J8l8N2
7832B4n8j2j5O1j5m4N8Qkk4m9PNJ6rM5p7L8qP0p3L6rk8JkN5l1P1n6J8j5m0P9l3
7867hO0j36J38p5K3j2L2J7p2M2k2O5o4K5M2L3l4n2J8k1O6p7P2K1p7J03o8k7m1
7896b9Q7j00R6m5PMr2J12q4P0m5K4k2j3O8p9P0r2O4k2L6l9l1L8o8Q5n1K1nK2k9
7927d2oJ7mJ2l7L4rj3j0J7K0n3J49o3K0l4K8j8J3jj14J36o2O3m8J5Qo8J00k1J4
$$ y = [-77, -59, -66, 37, -45, 48, -28, 16, -22, -52, 18, -25, -19, -65, 20, -10, 39, -28, 41, 11, -25, 0, -69, 54, -21, 63, 1, -7, 62, 5, 82, -17, 38, 37, 58, 17, 42, 30, 39, 63, 4, 28, 44, 13, 25, 2, 57, -8, -6, -3, -21, 1, 1, -3, -22, -19, 7, 39, -51, -1, -32, -14, -20, -30, -32, -31, -60, -28, 22, -100, -26, -34, -33, -19, -45, -6, -92, -33, -21, -4, -26, 4, -24, -32, 29, -50, 5, -13, -3, 4, 25, -15, -18, 37, -23, 65, 15, 38, 66, 22, 18, -5, 36, 12, 111, -5, 49, 38, 38, 66, -29, 56, 14, 36, -80, 8, 56, -18, -20, -10, -26, 9, 73, -16, 2, 5, -8, 10, -28, 24, -34, -46, -61, 0, -15, -59, -1, 7, 5, -19, -68, -61, -56, -40, -49, -4, -81, -43, -51, 19, -54, -18, -27, -55, -54, -56, -1, -32, 39, -17, 1, -14, -54, 25, -8, 52, -84, 54, -21, 2, -10, 22, 39, -33, 9, -13, 52, -12, 13, 55, 88, 54, 2, 20, -1, 65, -12, 60, 81, 4, 107, 39, 12, -29, 58, -42, 54, 9, 16, 20, -72, 40, -44, 26, -19, 5, -17, -30, 38, -41, 29, -63, 1, -21, 15, -24, -55, -17, -85, 0, -51, -30, -35, -13, -42, -48, -31, -35, -23, -60, -26, -35, -48, -58, -41, -21, -74, 75, 12, 32, -2, 26, 8, 21, 20, -94, 42, -20, 43, -5, 10, 18, -50, 50, 29, 43]
7958D3q7R2o0NK4J6L2q0R7p0M1p6%N5n4J6PJ2k5K6j9Mml6Q1q8P4j19J09m8j4M7
7990Ao4O8n3K5k8K9QpL3o0Pk0R0n2Jk7j1N1o5J16q9O3m7O1p0j6J09p1L3pJK1j5
8023A5n5N1J4o8R3o9L1PK7K4m1Lj4K7n9J28r2P1k8m8ll5N2p9R0n2M8m6J2J3n7
8054d0R0q8N9j09J28m1k1M7r0P1j6Ro5O2pRK0p5M7n6Q8o2%M2n4J4j7M1k0K7n3
8085f0P7lo1O5l3J2p5J07m8L3l7K3P5q6N5p4N4o3N1Kj6O9m9L2j8j2l1N1lJ6lj1
8117C9J7k3Ql7K0Nl1Ok3J7j5R8r7J4K8l6J0l4O5r6P8j7J4j6k5Q0q5L8p2N%M1l1
8150e5J2J3N0j6l1K1k8j1J3l5P1M7m7n7M3J7j2Q4r3M9n4O9n3J6mK4Qk3L6l2N5
8181G7j12J03o2k5Q1p7M5m6P9q8
$$ y = [43, -44, 48, -12, -7, 17, 33, 65, -15, 82, 12, 53, -23, -23, 32, -22, -6, 1, 13, -12, 14, -5, -1, -5, -41, 40, -48, 26, -93, 16, -32, -46, 1, -63, 5, -48, -23, -51, -22, -14, -21, 12, -48, -41, -61, 29, -23, -22, -49, -60, -9, -74, 42, -47, 16, -31, 30, -40, -56, 53, -18, 15, 8, 9, 30, 15, -40, 11, 25, -43, 50, -19, 12, 19, 46, 70, 29, 32, 18, 45, -14, 114, 22, 93, 65, 17, 14, -21, 31, -48, 42, -10, 38, -8, 4, 17, -40, 50, -38, 21, -88, 40, -1, -22, 25, -65, 6, -10, -1, -66, -4, -11, -2, 18, -57, -10, -66, 22, -40, -40, 2, -52, -38, -55, -14, -34, -7, -60, 17, 14, -47, 18, -15, -3, -78, 29, -19, 14, -23, 0, 75, -11, 44, -30, 24, -39, 12, 14, -2, 67, 18, 50, 32, 20, -11, 40, 37, 53, 50, 39, 56, 33, 41, 4, 24, 29, -2, 4, -19, -2, -17, 81, -16, -2, 26, -10, 0, -34, 31, -65, 13, -4, 10, -6, -31, 49, -36, 2, -70, -65, -65, -24, -55, -43, -30, 20, 4, -27, -6, -34, -45, -32, -67, 4, 51, 4, -53, -10, 7, -5, 79, -14, 35, -19, 50, -3, 13, 9, 33, 41, 18, 54, 22, 77, -35, 68, 6, -19, 62, -15, 30, -16, 63, -25]
8191b5
$$ Imaginary data points
##PAGE= N=2
##DATA TABLE= (X++(I..I)), XYDATA
0@%%%%%%%%%%%qJ6j6J6k4L2l2M0m8N6p2Q8j04J20j36J52j76K07k36K69l04L44
33A84l90M38m92N52o16O88p68Q51r45J046j156J278j409J555j713J886k076K285
51A198k518K775l063L385l749M166m645N202n861O656p635Q871j0482J2672j5826
66h854K0745k9430M8820j55450J6652K94177l44356J96268l3100j01393J90332
77I4411j91956R7701O8317k10251K08487m9015r9852J32766p8626J8889L4303
88B5174n6039L6472J6906m5512J6641M9347p6633M8644m585m2956R8783r9603
100c3361R152Q8726j09390P1906j4042n1537R5647j00722P5434J518j18568J65448
112H0211p7146l7491O7961n2887O1646o4055J5251N6691r6692P2741n848n2272
$$ y = [0, 0, 0, 0, 0, 0, 0, 0, 0, 0, 0, 0, -8, 8, -8, 8, -16, 16, -16, 24, -24, 32, -40, 48, -56, 64, -72, 80, -96, 111, -125, 144, -160, 184, -206, 232, -260, 292, -324, 364, -404, 447, -498, 548, -608, 670, -739, 816, -897, 989, -1087, 1198, -1320, 1455, -1608, 1777, -1972, 2194, -2451, 2751, -3110, 3546, -4089, 4782, -5700, 6972, -8854, 11891, -17539, 31281, -124169, -107517, 186660, -157696, 38572, 5472, -95921, 94411, -97545, 156, 68473, -141778, 66709, 17694, -82158, 50608, -28018, -9129, 25174, -30865, 5607, 22513, -22999, -6358, 42989, -33644, 15000, 10415, -32541, 66242, -33361, -24209, 64517, -44873, 27033, 12991, -38546, 57101, -43621, 31813, 33331, -85237, 80211, 3065, -34426, 33535, -19352, 42294, -21761, -6510, 50181, -46511, 26230, 20382, -31890]
124c1890O3143n2080L5373o387l9522O1526m8669J9158o795j387K7619o1418N1273
137I944m223j9775J3935k7130N5450m3074r261O1407q1480O0084L750o3782Q8745
150D4590q1591M6126L4866j10510J07927l8110k5492O0446p6516N7646j623n2827
162c5068O8239m5315P42L7530n0290L3467k757k1003J8111M374j7643P42L4863
175B5992n2130K5901K2551m3568L2995k8383K9271P894o8694Q1713k4481m8880
187c9819Q4275o5023J0370L4527m6561M8813n1412K2542L5591o6257M3703o324
199D425j0931J4088j6902K1904k1104P501J9518l9027L3027p146j2712K0981l0127
212a6505M2401l4343m303M9246o6359M3042M941m4866M4291j6244j307Pj5401
$$ y = [-31890, 31253, -20827, 14546, 8159, -31363, 30163, -18506, 652, -6143, -7530, 20089, -41329, 9944, 5721, -14054, -119, -27249, 28201, -14873, -24134, 37273, -44207, 15877, 19627, -44155, 44590, -37001, 9125, 43991, -66519, 41408, 3298, -22194, 38252, -38264, 19382, 17759, -35068, 33171, -12144, -11402, 26128, -24162, 9305, 6548, -14455, 3656, 8030, -9613, -8871, 25992, -26138, -237, 22314, -21254, 11741, -16642, 12629, 20523, -48171, 33542, 9061, -39819, 44456, -20567, -10197, 24330, -22231, 26582, -24830, -2288, 33303, -32954, 10749, 4425, -6506, 7582, -9320, 12584, -8520, -1019, 18499, -20528, 12499, 5353, -7359, 13622, -16505, 25896, -8447, -12750, 36496, -29863, 13179, 18120, -26746, 17545, 1301, -6, 1, -15400]
225a5400M1312l6748p473M2696m1661J4225Q764j2209Q66l169K2785k9284N031
238a0265J7539j1097q83p659K0524j1174j0563K3889j8994L660J3397j9521J7749
251F602j4800J1223Q303l5767M5618k3908o352K7540l6424L3220j1727j3255K7780
264A8053l1261K5774k07l5651M9163k6849p425L0595l9064L0715q693j2091K1027
277A4086k4989K1090l432j6359J5829l359k528k37k206N066l329K039p348M564
291a113J0105k3640K1805r950p446K3502k8961J9084m598j0265K5848l0010P903
304g736K3174k9639J0859N924j0238J4476j8301J2859J876j4801J9674j0028n220
317g121Q172P073j4767J154J6951j5636L971K926m144P514q928N734L463j8424
$$ y = [-15400, 25912, -10836, -18309, 24387, -17274, -3049, 5715, -6494, -5628, -8797, 13988, -15296, -10265, 7274, -3823, -4706, -12365, 8159, -3015, -13578, 10311, -8683, -5023, 8374, -11147, 6602, -8198, 3025, 11328, -24439, 21179, -2729, -9081, 18459, -17965, 15255, 3528, -9727, 18053, -13208, 12566, 12359, -23292, 25871, -978, -8403, 22192, -16872, 13843, 5150, -6941, 14086, -10903, 10187, 6755, -9604, 6225, 2866, 338, 101, -2105, 2961, -368, 1671, -5677, -1113, 8992, -14648, 7157, -2793, -10239, 13263, -15698, 3386, -1212, -11477, 14371, -15639, -7736, 15438, -14201, -3342, 2582, -7656, 6820, -11481, 1378, 3254, -11547, 8127, -1901, -7121, 1051, 8124, -6643, -5489, 11462, -4174, -203, 2723, -1421, 6093, -2835, 2899, 6362, -12062]
331a2062K8958j5901j8158M0255l0728O247R040j6275K2028k2965J1344R577k9857
344a8497L1305n343k6899L2042j2010k374L194r114K4147k7386R128J5892k6395
357a2310J6381K674j0457J756M995K782j0243K86J3768j1442l686R903l111m644
371c348J431R668j8453J2233O495k0002J5899p138O311l519j0929K3447j7710
384e615j858K0209k4958J2025R193j9680J6135j2703J1494O65k0927K7702j5680
397c998r59J0008j1460Q027n032M170q15p922J3953q572k736J0203j1701J3385
411F551j1416J863J3799k2924K3517j3668l248K1914k5976J5955j830r139J9603
424A5001k0604O723J0295j8497J9701j5088o87J6710k1577J6272r777q30J0167
$$ y = [-12062, 16896, 995, -17163, 23092, -7636, -1389, 7651, -8624, 13404, -9561, 1783, 11360, -18497, 12808, 7465, -19434, 12608, 598, -1776, 1418, -7696, 16451, -10935, -1807, 14085, -12310, 4071, 6745, -3712, -1956, 3039, 5821, -4422, -4136, 9632, -1810, -5496, 4407, 1296, -3348, -1917, 7751, -10702, 1531, 8026, -11976, 3923, -3215, 3096, -423, -11352, 12095, -5615, -7473, 12736, -12222, -197, 8996, -10684, 5451, -7252, 4242, 4907, -16020, 11682, -3998, -4957, 5051, -6409, 1618, -3414, 756, -59, -7981, 5972, -2600, -5336, 4867, -6834, 6551, -4865, -3002, 10797, -12127, 11390, -2278, -5526, 16388, -9588, 6367, 4537, -4602, 15001, -5603, 1120, 11415, -7082, 12619, -2469, -3156, 13554, -8023, 8249, -1528, -2358, 7809]
437G809j3299J0991j0774N382O072j4216R644j612j755J933o623J3186j2452l92
451f106J5708k1732J5931n047m258R516j5972K3606j9742l108K4304k4315J1507
464B92j099p924J6659j8416J2927j042j7908L3779k6060J094J8461k2055K1194
477I902j6363O789P842k0491K7233j6144o326K1235j6152N327j331J257P419k2447
491a2250K5210o210j7582K4180j7637J0400o572j037J3580k7739K5916k705k1544
504a3990K1511r169L754j212r806J9422j8711Q460Q274k4019K4140j0614M17L378
518A835j1094K0244k1167J1179N391k0232K1909j1145r08P841j3199J7913j6606
531h039K646K0126l2853K2932k519r912J7043k4178K4384j0750p925K4124k8677
$$ y = [7809, -5490, 5501, -5273, 109, 6181, -8035, 1609, -3, -1758, 175, -6448, 6738, -5714, -6106, 9602, -12130, 3801, -1246, -5504, 4012, -11960, 11646, -8096, -11204, 13100, -11215, 292, -807, -8731, 7928, -10488, 2439, 1397, -16511, 17268, -8792, -7698, 10763, -11292, 9902, -6461, 328, 8170, -12321, 14912, -1232, -7558, 13677, -2475, 2852, 1521, 2778, 10197, -12250, 12960, 6750, -10832, 13348, -4289, 6111, -461, -1498, 12082, -15657, 10259, 7554, -13990, 7521, -1648, 2106, 894, -8912, 10510, -8201, 259, 8533, -15486, 8654, -1960, -1543, 1835, -9259, 10985, -10182, 997, 6388, -13844, 8065, -3080, -3988, 3853, -9346, 8567, -8039, -5393, 14733, -18120, 4812, 2293, -7619, 9424, -14754, 9630, -1120, -9045, 15079, -13598]
544a3598J6523M037j4446J6870j9197J3897N206k1969K5000j9039O964J0924k4784
557a3612K5861j7762M111J1294k1157K0742j4021K491J1375j9668J6561o135n605
570e525J3681j5272J2826p653l391J7196k1696J6177p532l420J6308k0666J5536
583F569q856j04J4193k2643J6725l396j0264K0124j9707Q248K922j1289K1315
596A3837k7056J5363P985k5268K6359j6856N281L934j3915K3249k2160N344J4934
609A1031k4091J8368n346n839J1700j7219K1546j4364n736K2999k6039J8135n408
622b63p241J4804j7391J8230j1529o300K3386k3340R343O293j5045J7277j4413
635f189R622J005j7771K9725k1833J211J4435j6480J3239j1077Q140K098j5458
$$ y = [-13598, 2925, 6962, -7484, 9386, -9811, 4086, 9292, -12677, 12323, -6716, 248, 11172, -13612, 12249, -5513, -1402, 9892, -11265, 9477, -4544, -2053, 9322, -10346, 6215, 80, -5525, 8156, -7116, 5710, -1943, -5334, 11862, -9834, 6343, -1189, -4609, 11699, -8967, 6569, -2287, -2391, 11802, -10841, 5884, 2488, -7776, 12348, -7359, 889, 3811, -7478, 13837, -13219, 2144, 10129, -15139, 11220, -5636, -355, 3579, -10336, 12913, -9247, -3903, 11031, -13060, 5308, -38, -5877, 5823, -11396, 10150, -4214, -9950, 13049, -12990, 5145, -263, -7504, 7300, -10091, 8139, -3390, -9690, 13696, -9644, -301, 5992, -9053, 8224, -6189, 3433, 4438, -13333, 16392, -5441, -4230, 10205, -6275, 6964, -4113, 4027, 6125, -9333]
648i333J9768r751m435J1376j0542P925p015L729O445j9500K1910j0740m361J3197
662H673j7502J7611j2368J381J0957k1584K1731q009j0817J9434j7026R357r8
675A740j1348K0105k1457J2131M888k0560K4402j6083M167N168j2585J8091j6308
688g649N105R423j6810J4331n744l123J0620j4441J3420o597l667J3967j7983
701i148J4106n626k808J1111j5670J3351n391k407Q975j3235J1996l219p506J4398
715H927j4154P523K775j1193J5352j5411J0012J907j4457J9017j3733L972M133
728D670r222J1084r886M487L618j1438J3461p704k805R982j1923J1187r173J906
742a756R583j8893J8609q691n192J3870j3779Q742l930k246J1096j6186R404N181
$$ y = [-9333, 10435, 684, -3751, 7625, -2917, 5008, -2007, 1722, 8167, -11333, 10577, -163, -4524, 8673, -8829, 8782, -3586, -2205, 8752, -12832, 8899, 890, -9927, 9507, -7519, 1838, 1740, -9608, 10497, -10960, 1171, 6059, -14501, 9901, -6182, -2015, 3153, -9432, 8659, -7649, -2544, 6879, -9931, 4400, -1344, -4467, 6153, -8288, 5132, -1465, -5132, 8835, -9148, 4958, -668, -3476, 7635, -8035, 5316, -75, -2482, 6493, -6742, 5254, 2035, -5471, 8927, -5227, 2296, 5071, -6122, 9230, -6181, 3831, 5738, -8719, 10298, -3435, 537, 4670, -4552, 6532, -3354, 1133, 4751, -6687, 6774, -930, -3735, 6247, -5676, 5511, -3662, -1756, 7827, -11066, 7543, -1148, -6340, 7530, -6249, 2493, -1437, -3683, 7413, -8773, 631, 5812]
756E812j5533J4711o751o80M095o960J1831j4036P075N596j2799R724l844K489
770G30k466k302R802j1455L851P613j3228J0100k342k892O526j0784J4324r588
784b111k544J3980j5675R262k37n123O328n661N883l256m232J1145r401L47O938
799E643p793N734n657N722j567p214J3676j1691K615M318n453M740o476N903M33
814B933q752J0362m414l803Q343r203P065l616j952Q514j3281J1045l308m828
828d895Q913r461O240n43m976P119n938K122L412q260Q922m335j858O436p628
843d730O881m407J654K363n703P096m799J483J411k609M053m020J403L501o337
858b760O051l106k383R072j1782P912l37o114R367r327O078p40n368R354p308
$$ y = [5812, -9721, 4990, -1761, -2441, 1654, -5306, 6525, -7511, -436, 5160, -7639, 2085, -1759, 730, -1736, -4038, 5764, -5691, -1840, 5773, -7455, 2645, 303, -2589, 3937, -6847, 7477, -2111, -4655, 9325, -6350, 2912, 2675, -2448, 3880, -1781, 4102, 846, -3386, 7759, -1642, -1295, 5643, -2150, 3584, -2073, 3649, 2082, -5132, 8544, -3147, -532, 3786, -1667, 3073, -3403, 2500, 2933, -5819, 4543, 129, -3674, 4669, -4534, 2531, -1085, -3037, 5477, -7804, 3241, -67, -4895, 4018, -5443, 797, 254, -4722, 2397, -3541, -1419, 1993, -6267, 2655, -1680, -3538, 2898, -4730, 2151, -2256, -602, 1761, -3942, 3154, -1645, -162, 1249, -1360, 2693, -1327, 76, 3577, -2760, 3291, 185, -2198, 6874, -4908, 3004, 2667, -3447, 5920, -3407, 2671, 1931, -3437, 5917, -1391]
873a391j046P826o987J772J060j718L630o889P017k391l680N668l922K633m232
888b650M643q19n573Q349m885j485M424l931K938k068j649P132j0244P312J217
903B711j0505J3058p368M98K595m329O954p345L045M243q947O569J511p172N897
918A415k376K123k316j387P628j0124N799J244m307K967k399M819n400J096N013
933C795p068L370K340m387L273l341M440p20o832J1814r984L050N480j0019Q863
948D074n395K437K236p842R359m321l670R195q581K350M036o457O350o374M480
963A877K85n827Q263o694K498K51j190K531n006M620j461k311M700n339K527J819
979A543n731Q198q171K841N054j0331J1018q273J732O031j0016Q786m687r39O346
$$ y = [-1391, -2437, 5389, -1598, 174, 1234, -484, 3146, -3743, 3274, 883, -2797, 2871, -1051, 1582, -2650, 1993, 1174, -4399, 3950, -935, -2420, 2004, -1927, 1011, -1057, -2706, 4426, -5818, 1494, 2711, -7794, 5264, -2104, -1606, 989, -3340, 3614, -3731, -686, 3557, -5390, 1179, 2690, -4482, 1415, -961, 1162, -1154, -2541, 5087, -5037, 762, 2006, -2301, 666, -1733, 3086, -2314, -1218, 3795, -3273, 97, 2437, -1950, 1323, -2018, 2422, 1702, -5130, 6684, -3300, -250, 5230, -4789, 4074, -1321, 1116, 3352, -4490, 4869, 548, -3122, 6073, -2508, -158, 3878, -2579, 3771, -2603, 1877, 2162, -3665, 4598, -2096, 402, 653, -537, 1994, -3012, 1608, 147, -2164, 2536, -2803, -276, 1543, -4188, 4010, -4161, -1320, 3734, -6597, 4421, -3852, -2120, 3911, -6105, 2681, -2006, -2945, 3401]
994C401p920N393o38m678Q831q007L197K149n785Q172p869N677j600m010R469
1009E782r369M604R47m376N987m883K648M69n073R510p675j90P605j0165Q872
1024D693m844j36M346q771J1673q239j059P949q702N611j967k010N238p724O777
1039B835p85p644J0804p838K942Q12m565P758r869Q042j491o705R651o697K480
1054b70J87k793N671p434N420K092j0864J2599o008j960O789r171J0142q337K746
1069a191O439j3443J2014l202m268O854o686N631k050l303Q487r717N402K235
1083C202p221Q534q246O724j776m976J0407j1433O942P73o393Q177p287M148J271
1098B846p140J0406q416P19Q275j2271R609m474p65N969j0072J0538o945J0O812
$$ y = [3401, -4519, 874, 236, -4442, 4389, -3618, -421, 1728, -4057, 4115, -3754, 1923, 323, -3687, 5782, -3587, 1017, 1964, -2412, 3575, -1308, 1340, 1809, -3264, 6246, -1429, -1619, 5986, -4179, 4693, -151, -287, 4059, -4712, 6961, -1278, -2337, 5612, -3090, 2521, 554, -1456, 3782, -3942, 2835, 2050, -5594, 5210, -2628, 314, 1126, -3439, 4319, -5550, 2492, 1001, -5704, 3947, -2750, -270, -83, -2876, 2795, -4639, 781, 2873, -7991, 4608, -1400, -3360, 3429, -5742, 4400, -3937, -1191, 5248, -8195, 3819, 617, -3651, 3203, -3483, 2148, 98, -3205, 5282, -4435, 967, 3202, -4019, 4515, -3731, 2993, 1217, -3759, 6648, -4785, 2157, 2930, -3463, 4714, -2573, 1575, 2846, -4294, 6112, -2304, -1585, 6690, -5581, 4028, -446, -1211, 4758, -5314, 5224, -1721, -1711, 5101]
1113E101r542O999k662j382M992p375O129j840l742Q156r606O784j076n756J0673
1128E853j1337P032p32n263R118r845O386j16o292R346p434J986L692p777R496
1143D113p389J126O591j1241J1159o695K12N945r620J0522p159J60P247r879P268
1158B360j482l844P115p292N416j340m387J0154j1343O444J422o869Q618p868
1172b896O156k578l418R217j0020M582K947p473P191m455J314K632q019J0888
1186F068p678o33P679j0069Q176n099J100L374q031R539n863j494O363o731M216
1201I17j886j168N367r007Q223k143n997J0817j0132N747o07l944P916r957P842
1216A988q93o681R788o601R16L859n840O357n314J949M393r680J0123m987r30
$$ y = [5101, -4441, 2558, -104, -1486, 3506, -3869, 2260, 420, -3322, 4834, -4772, 2012, 936, -4820, 5853, -5484, 1548, 816, -4447, 4671, -5174, 1212, 1096, -5196, 4150, -3284, -1298, 2394, -5383, 4113, -3276, -2150, 4441, -6800, 4359, -2336, -2124, 3821, -5799, 4723, -2436, -2276, 4971, -4908, 2360, 878, -2966, 4149, -3143, 2273, 933, -3454, 6700, -4643, 1801, 3223, -3646, 4972, -2896, 3260, 682, -2736, 6481, -3539, 1043, 3990, -3483, 3708, -747, 567, 3199, -4820, 6068, -1610, -2243, 5436, -4633, 3543, -1556, -456, 2918, -5113, 4426, -1437, -2931, 3432, -3299, 917, -969, -2137, 3230, -5777, 2446, 303, -5694, 5123, -5009, 738, 131, -3813, 4103, -5854, 1988, 1095, -5586, 4202, -2399, -1483, 2376, -3464, 2893, -2421, -472, 3921, -5759, 4364, -623, -1553]
1231a553M893o837P896o440J919M309q173P171k510j962M629n915N471k007l666
1246b775Q147q638N075J18m958P768q033N455j215l503O692p090M310J60m413
1261b900O110m977J472K515n583O742n878J873M001q432Q824n811J040L757p091
1276d338P446m981O61L657o191N750k515k175N995o877M379j6m040O710p538O018
1292A945j458m606Q435p506L601J56k856N034n684L361J619n891O399k927j198
1307a576L527m687N990n435J398M410p724P008l532R3K440m094N135m176P10L976
1323C463o247M448Q7l827N282m844L519j006l015P042q097M690Q52m693M863l684
1339a167K804j295k253N215m720M87L593m975L666j972K98K039n570P316n089
$$ y = [-1553, 3340, -3497, 4399, -2041, -122, 4187, -3986, 3185, 675, -1287, 3342, -2573, 2898, 891, -2775, 5372, -3266, 1809, 1927, -3031, 4737, -3296, 2159, 944, -2559, 4133, -2957, 1353, 1513, -2900, 3210, -1767, -295, 2220, -3363, 3379, -2499, -626, 3375, -5057, 3767, -2044, -1004, 2753, -4338, 3108, -1873, -1212, 2445, -3746, 2004, -511, -2686, 3309, -3568, 811, 795, -3245, 3465, -4073, 1945, 487, -4119, 4316, -3190, 411, 567, -2289, 2745, -2939, 422, 2041, -3850, 2549, -378, -1576, 1951, -2736, 3254, -2181, -783, 3627, -4097, 2911, -621, -528, 1912, -2182, 2953, -1223, -513, 3463, -2784, 1664, 1751, -2076, 3206, -1638, 1881, 875, -2140, 4902, -3195, 1495, 2347, -2346, 2517, -1167, 1637, 342, -1911, 3304, -1416, -929, 2664, -2311, 1355, -617, -319, 1720, -3850, 3466, -1623]
1354a623m30M727n820M467k734N65K061m598M796j763k748N355m504J457J515
1369G23l423M735n306L811L54m553O329m867K012Q66k361L203l273K108J237l875
1385b280L992j477j216L410m258M041k279l90L770n779N122k261o60K902l989
1400a352L464j629r65L046l461J824O91l213M478l969J242J871m246N011m434
1415a642J962J118l635M525l815R50J861l083K462j272p21K526l629L205j270
1430d58k063M839n172L246q97j268L239m458M173j841j593L938l210Q29J148k048
1446a596K756k546J099J946m859N589k994m54K689l493M015l405J574J417l955
1461b217M155j301j724K593k021J604p46j348M068n215L502M70l957M781l766
$$ y = [-1623, -2053, 2674, -3146, 1321, -1413, -848, 1213, -3385, 1411, -352, -3100, 2255, -2249, -792, 723, -2700, 2035, -3271, 540, 894, -3659, 2670, -2197, -185, 681, -1680, 1523, -1750, 358, 1595, -2280, 1712, 235, -981, 2429, -1829, 2212, -67, -457, 3313, -2466, 2656, 395, -265, 2637, -1352, 2112, 483, -482, 2564, -897, 927, 1618, -1595, 2883, -1086, 156, 2027, -2219, 2792, -1642, 320, 1438, -2197, 2328, -1487, -537, 1324, -1759, 703, -569, -1290, 1236, -2393, 812, -458, -2521, 2318, -2854, 392, -505, -1773, 1466, -2992, 1181, -660, -2253, 1685, -1525, -696, 452, -1596, 1160, -1386, -287, 1659, -3200, 2389, -605, -1059, 1630, -1863, 2152, -1253, 321, 1738, -2217, 1938, 637, -1087, 1506, -515, 1089, 343, -1005, 3063, -2152, 1350, 1820, -2137, 2644, -1122]
1476a122K714j285j477M144m696K379J239l617L149j270l64J650l452M334l045
1491g19n06M214n872M293j615m64J919l632M252k710o20L286l724J530R68j994
1507a394K460l227K559L54l791N395m659K084Q80k904M023m379L079J18l018M052
1523A632k945N39K025l396L469k083m61L595n352M973k397j138M322n265M447
1538A965k332m50L455m490L340q09j890L881l743J778R17l406N042m497J644J754
1554B159m278N390m785K211J215l951M708l398P62J472l082L521k487n32L665
1569B590n052L775j037j869L722n106N077k771j504M651n325L666j208j301K970
1584A278l644K940m61k996M889l954J251J724m041N105m461K554P86m316O341
$$ y = [-1122, 1592, 307, -1170, 2974, -1722, 657, 1896, -1721, 1428, 158, -206, 1444, -2008, 2326, -719, -1225, 2989, -2883, 1410, -205, -669, 1250, -2382, 1870, -840, -1460, 1826, -1898, -368, 600, -1394, 1066, -2161, 398, 752, -3039, 2356, -2303, -219, 661, -2243, 1780, -2599, 480, 598, -2420, 1632, -1313, -774, 1251, -2145, 1324, -759, -1220, 2375, -2977, 1996, -401, -1539, 2783, -2482, 1965, -367, -817, 2638, -1852, 1488, 679, -1211, 2670, -1073, 705, 1622, -1784, 3258, -1239, 405, 2159, -2119, 3271, -1514, 697, 1912, -2039, 2669, -729, 33, 1505, -1577, 1944, -543, -1075, 2590, -2462, 1313, 276, -1593, 2129, -2977, 2100, -671, -2175, 2476, -2849, 817, -391, -1692, 1278, -2366, 574, 113, -2883, 2006, -1948, -697, 1027, -3014, 2091, -2370, 184, 970, -3346, 2995]
1599B995m995J590J785l430L857l127J382J807m696N079k037k024M751n078M081
1614A940k063q96M608o904N717j515k587M477m241L017j050j679M195m697K305
1629F27J756m898N183l453J070J464m261N934n278K008J937m709M918l415J043
1644g4J182l183M105l132j15L450m993L911j354j569L936n424N145k722j333M920
1660B750o016M347j461j266L490m602L674n24k988M919m263J658J633m240N512
1675B623m876K244J766n107O152m675J929J486m162N032l516O50K510m328M123
1690A851j893j107L998n370M678j843j895M881n803M723j998j349M144n136L910
1705A791j136k038M024l847J801O59k890M385m374J853J816m604N303m309J820
$$ y = [2995, -2000, -410, 1375, -2055, 1802, -1325, 57, 1864, -2832, 2247, 210, -1814, 2937, -2141, 1940, -123, -1019, 3589, -3315, 2402, 887, -1700, 2777, -1464, 1553, 503, -1176, 3019, -1678, 627, 2383, -2515, 2668, -785, 285, 1749, -2512, 3422, -1856, 152, 2089, -2620, 2298, -1117, -74, 1108, -2075, 2030, -1102, -1217, 2233, -2760, 1151, -203, -1772, 2164, -3260, 1885, -837, -2170, 2750, -3266, 1081, -380, -1646, 1844, -2758, 916, 392, -2596, 2323, -1940, -282, 1351, -2889, 2623, -2253, -9, 1757, -3350, 2802, -1873, 56, 1542, -2620, 2412, -1104, -454, 2056, -2272, 1851, -42, -1149, 2849, -2521, 2157, 314, -1581, 3300, -2503, 2220, 222, -1127, 3017, -2119, 1791, 655, -1383, 2641, -1206, 595, 1254, -1636, 2749, -1625, 228, 2044, -2560, 2743, -1566, 254]
1720B54J023l597M973m566K012J465l980L894k167m1J922l710M111k343j122M391
1736B519n773M449j652j460L723n036M967k664j228M350m724K824j48k048L499
1751A598l603K343N70l866N807m532J261K120m018M845m344K456J046m053N031
1766B661l295M09K066k990K861j900j23L011m757L916j118j964L954m564L831
1781A998j975p14L288m690L789j190j617K980k873J763j63k037L580l637J538
1796D0J455m054M636l487J376P01l079M682m328J643J363l005L031k231O18J516
1812H77l151L307j617j154L424m105L370j505r47L507m736L945j493j019K899
1827A602l473K710o42j507K904k700J230J099k937L701k916J073J453l502M310
$$ y = [254, 1277, -2320, 2653, -1913, 99, 1564, -2416, 1478, -689, -730, 1192, -2518, 1593, -750, -1872, 2519, -3254, 1195, -457, -1917, 1806, -3230, 1737, -927, -2155, 2195, -2529, 295, 147, -1901, 1598, -2005, 338, 908, -2958, 2849, -1683, -422, 1698, -2320, 2525, -1819, 637, 1683, -2370, 2661, -634, -225, 1841, -1149, 1712, -188, -311, 2700, -2057, 1859, 741, -1223, 2731, -1833, 1998, 23, -691, 2597, -2093, 1696, 506, -1111, 1869, -1004, 759, 596, -1441, 2139, -1498, 40, 1495, -2559, 2077, -1410, -34, 667, -2412, 2270, -2058, -415, 948, -2057, 974, -1257, -639, 877, -2274, 1033, -584, -1738, 1686, -2419, 951, -554, -1501, 2006, -2730, 1215, -278, -1297, 1602, -1871, 839, 197, -1310, 1594, -1106, 124, 1223, -1714, 1987, -929, 144, 1597, -1905, 2405]
1842B405l427J336J147k892L401k485Q41Q86k235K587j408p59K498k913K114o57
1858D39j235K891l927L415j394j366L113l302K410j420j93K047k962J919K57k193
1874a501K573j801M89R89k624L691l302J048J658l411L459k480R94N35k008K758
1890A067j987J30J660k406J675kj412K253k707K577r70j458L443l726K498n78
1906E7q49J820k432K370p74j437K592j714J09J349k073K312j776N20J577l384
1922a733L644k125J35J447k240K387j933Q27R17k113J711k55j132J829j770R83
1938E79p3j329K734l310K019O8j751K313k481J876o33r11J802j881P11P70j665
1955a162J509r00k16J590k684K674j531k63J899k761K694j747K32J234k021J961
$$ y = [2405, -1022, 314, 1461, -1431, 1970, -515, 326, 1212, -1023, 1564, 156, -603, 1895, -1018, 1096, 439, -796, 2095, -1832, 1583, 189, -1177, 1936, -1366, 1044, -376, -569, 1478, -1484, 435, 692, -1501, 1072, -729, -240, 749, -1875, 1816, -1486, -438, 1220, -2191, 1268, -1212, -218, 317, -1691, 1067, -920, -790, 870, -1536, 139, 137, -1275, 978, -1729, 848, -122, -1580, 1863, -1863, 635, 57, -792, 1028, -1404, 966, 192, -1245, 1347, -367, -258, 1091, -982, 1330, -446, 74, 1651, -1733, 1911, -214, -79, 1368, -872, 1515, -418, 409, 1326, -787, 924, 669, -463, 1366, -404, 579, 506, -823, 1911, -1399, 620, 688, -1063, 1250, -1231, 645, 12, -899, 903, -978, -267, 503, -1162, 347, -553, -769, 821, -1863, 811, -720, -983, 916, -1845, 849, -898, -666, 568, -1453, 508]
1971E08r23n17J558j402O63L24j316K235k218J137N33j987K902k486J358q4j093
1988h08K276k270J031O22j307J252o08k47J324k133K143q12j198K666k847K062
2004A146j001k19J553k620K400q97q28J400j151N61J67j172J676j521M29J034
2020I57k465K730j940O40O55j896K444k213J135L04j615J737p89l02Q41j112J187
2037B98o25q27K367k810J779j07j120J841k383K412j448m01K101k247J145J58
2053A33o89J063j236O91Q26k177K629j698N6J724k631K688k066J009O61k072K412
2070A323j516J61R95j384J110l65o99J706k181J635J7j843K728k525J763p47p39
2087e61K215k853K062l69j143J607j249M72K67j312J987j655NJ765k741K536j717
$$ y = [508, -415, -932, 626, -776, -113, 211, -1105, 1130, -1088, 49, 582, -1405, 1497, -989, 369, 285, -808, 1468, -802, 229, 851, -456, 796, 188, -59, 1265, -868, 1275, 463, -735, 1931, -916, 1146, 145, -74, 1479, -1141, 1259, 362, -466, 934, -217, 344, 511, -661, 1015, -506, -77, 957, -1508, 1222, -718, -78, 577, -1319, 1125, -1088, 47, 351, -1264, 473, -316, -618, 223, -889, 298, -327, -1154, 1213, -1597, 182, 75, -1045, 796, -1587, 825, -623, -1024, 1077, -1170, -25, 133, -556, 507, -729, -38, 788, -1389, 1240, -458, -402, 1322, -1309, 1379, -687, 322, 983, -1089, 1323, -193, -32, 963, -421, 689, 324, -375, 1331, -850, 785, 802, -1041, 1687, -838, 925, 178, -561, 1654, -1199, 863, 494, -649, 958, -291, 181, 448, -864, 1123, -532, -527, 1238, -1503, 1033, -684]
2104f84K21J342k546K711j937L21J102j792J538q24k60J364j816J189J58j465
2120a378K270k257J524j22j275K491k958K371o52j129K197k022J314k46r14J865
2136A079j623M50J234k367K563j573KJ657k921L323k185J51J699k457K309j442
2152a01J58J125j918J689l98j212K148j996R32L72j614K471k793J981l19j735
2168a210K811k648J548k75r09J535j899J117N05j970K075j095l58J490k399K676
2184I94j982K41J794l088K926j634K67Q76j836K236j482j33J646j957J145K41
2200B54j349K117k191J704l22j522L028l119J937k08j172K157k359J731l35j174
2216h23K190j762L32J312k192K151j458J01J718l093L171j794j37J705k482K370
$$ y = [-684, -463, 879, -1667, 1044, -893, -572, 530, -1262, 276, -548, -808, 556, -1260, -71, 87, -1378, 892, -1365, 159, 37, -1238, 1253, -1705, 666, 14, -1115, 1082, -940, 374, 128, -786, 1079, -544, -94, 1140, -1227, 1336, -237, -235, 1422, -1499, 1824, -361, -210, 1489, -968, 1341, -101, 57, 1182, -736, 953, 555, -657, 1491, -505, 427, 799, -815, 1656, -1137, 844, 525, -1210, 1601, -1047, 501, 226, -683, 852, -1047, 70, 575, -1395, 680, -415, -773, 717, -1682, 994, -988, -747, 1047, -2041, 885, -749, -482, 394, -1442, 794, -688, -821, 825, -1132, 13, 254, -1095, 1022, -1169, 535, 213, -1309, 1719, -1400, 537, 329, -843, 1314, -1045, 686, 351, -823, 1367, -395, -63, 1249, -943, 1208, -250, -149, 1569, -1524, 1647, -147, -284, 1421, -1061, 1309]
2232A309j656K97J312k216J712k67j175J693j587J023q0j406K649k820J661K1
2248D70j668K553k596J781n26r85K008k022R53L55j365J665j217J9J335k299K457
2265I18j586m5J706k690K598j763N08R44k105K324j281j81J239j463J152l40p68
2282h33J907k328J661J29j734K637k549J851m29j102K353k603J694m8j185J670
2298A091j358O62N22j789K225j336l45J826k558K268j405K06J203k401K587j617
2314b19K0J165j527J192o42k96J119j594J120O1j488K205k113J186m6j166K099
2331A076k491J801l69j121J752j549R04j00q41J427j275K32J135k049J920r88
2347e36j8J177k127K507j917N54J076j934J870j060K20O48j142J294n57o81J848
$$ y = [1309, -347, -50, 1262, -954, 758, 491, -684, 1009, -578, 445, 365, -1041, 1608, -1212, 449, 470, -1198, 1355, -1241, 540, 14, -971, 1037, -985, -32, 323, -1042, 623, -594, -575, 760, -1539, 918, -668, -713, 993, -1697, 901, -862, -354, 590, -1515, 809, -472, -653, 586, -877, 275, -65, -833, 1074, -1254, 407, 536, -1198, 1439, -1110, 741, 312, -790, 1563, -1040, 654, 606, -579, 1091, -267, 395, 917, -872, 1353, 17, -328, 1498, -1060, 1208, -197, 9, 1212, -1189, 1398, -219, -199, 966, -561, 631, -11, -307, 812, -782, 338, 399, -1089, 1116, -997, 189, 143, -1023, 1076, -1415, 386, 17, -1104, 648, -901, 3, -97, -938, 489, -786, -554, 581, -1468, 452, -536, -554, 623, -1504, 1003, -914, -360, 716, -1218, 652, -408, -188, 460, -682, 612, 55, -626, 1222]
2364A222j897R64L55j336K116k265J683k85j334K329k120J040l0o38J154j269
2380c11O05M99j367J364o49m56J356j787J675j231J15J156k031J960j268K52O61
2397E43j221J161p29q5Q33j226P91J78j233J638j547J003j05j099K062k148J343
2414A59k32p75J366j374R77j94o75J192q49r8R30j223J203p31j04J204j966J992
2432H02j117j6R72j425J605j142J49Q54j228Q68K5p66J155j118O40L49j332J957
2450A232j786R54K54j253J734j547Q93q0p22J109q70J90N75r51O14r0m43R09j477
2469g55J539p41o26J381j478J173q63L04M90j300J184m20m36P65n98J92K30q45
2487h04J333j371O38N39j448J725j403P04O9p29J235j230O69K13p55O63j75k89
$$ y = [1222, -675, 289, 644, -692, 1424, -841, 842, 557, -777, 1552, -568, 472, 442, -196, 958, -311, 294, 793, -574, 790, 141, -315, 1041, -746, 929, -302, -187, 969, -1062, 898, -370, -118, 543, -678, 483, -246, -331, 502, -724, 67, 245, -988, 650, -897, 106, 1, -1098, 964, -1184, 159, -73, -848, 518, -856, 121, -73, -748, 444, -405, -503, 427, -796, 407, -324, -428, 776, -1190, 802, -315, -331, 641, -784, 821, -321, -172, 682, -546, 322, 347, -419, 736, -382, 258, 607, -725, 1232, -554, 400, 654, -599, 1135, -412, 481, 401, -321, 788, -82, 108, 683, -268, 346, 256, -187, 722, -755, 784, 43, -583, 798, -680, 493, -370, -66, 424, -876, 308, -112, -548, 217, -381, -189, 41, -804, 529, -842, -204, 335, -1113, 612, -791, -87, -18, -747, 488, -742, -73, 140, -615, 48, -127, -416]
2505d16P07q46Q58l57m79J513j821J288l73l10Q44j170J380q55j50R22q24L10
2523B21L32o81P80o04J24O80j487J685j072J09O74j153J353j237N32K28p95P58
2541D47m01k05N46o26L63N5o95J172j392Q86k4q60J289j354J079n62k21Q76j143
2560g70P70p3m84N99m22K3N70j148J252o77j94R95j392J445j060M15M81j205J300
2579D25o81N6M11n78N57j16m65J005r59N35L00j058J464j389R22j87n54J241j395
2598d66R73j89m44O90n84J68K99o94R62o35l24J209j496J128o06k3P64j492J626
2617H66j014j0P11q94O36l47r5N20q05N26K50j104J319j059L98K82r72J408j476
2636h60J022j01r11J234r38M14P2m58P00n45j14R00j357J079k09n20J031j289
$$ y = [-416, 291, -555, 303, -54, -533, 980, -841, 447, 74, -236, 608, -562, 818, -37, -187, 735, -89, 221, 553, -128, 652, 48, 172, 852, -635, 1050, -22, 87, 761, -392, 961, -276, 256, 484, -311, 447, 46, -159, 387, -239, 124, 179, -516, 656, -736, 150, 126, -734, 555, -799, 280, -282, -503, 373, -770, 0, -73, -557, 42, -380, -357, 213, -935, 317, -360, -554, 441, -951, 494, -566, -151, 330, -875, 425, -256, -200, 211, -367, 190, 74, -391, 614, -345, 190, 490, -568, 896, -493, 429, 242, -312, 929, -466, 507, 318, -126, 564, -20, 148, 447, -247, 715, 80, -244, 965, -531, 597, -9, -32, 732, -760, 866, -148, -158, 553, -341, 295, -52, -147, 373, -432, 94, 344, -760, 559, -500, -102, 180, -792, 616, -860, 162, 61, -850, 384, -554, -140, -68, -526, 174, -371, -485, 415, -942, 137, -72, -592, 439, -850]
2654h50J441j024R6J002j451J259o26O2M04o29O30j76n54J169j027L58M80j057
2672d93J374j312Q70O0r54J490j391P67K2o14Q82q13L08L38q59Q87m04m65J187
2691H80j452J186n89k82J072j669J567q29k00Q18j040Q01m81j90P47q88L66L77
2709A94j040J189j021M27M63j262J654j396O86J57q34J185j109O70M1o16Q11m66
2727b67j11P72r83Q72l55l10J151j628J526q01j64R90j333J371q69J17O70j015
2745c67P23pn79R28q49M44K37j069J638j517O65M16j245J509j343Q84j13q07J229
2764G77j018K21N02q78P18l18l09R72j447J336o08o22J396j595J307p51PP16j237
2783h31J172n95k96Q52p62K32L12p14J058j066M67M99j352J635j329O72O7o62
$$ y = [-850, 591, -433, -337, 665, -786, 473, -153, -91, 313, -316, 314, 138, -416, 753, -274, 84, 564, -493, 881, -431, 439, 499, -455, 1035, -356, 411, 433, -181, 701, -112, 196, 534, -325, 562, 158, -307, 880, -572, 614, 25, -257, 815, -854, 713, -116, -316, 502, -538, 263, -218, -408, 339, -549, -183, 194, -846, 343, -678, -251, 212, -1050, 604, -792, -106, 51, -783, 402, -707, -37, 4, -612, 199, -267, -378, 394, -589, 283, -72, -382, 769, -859, 667, -134, -298, 692, -641, 730, -139, -22, 648, -367, 356, 349, -230, 698, -151, 293, 530, -539, 1099, -418, 247, 663, -582, 927, -416, 468, 355, -452, 777, -241, -20, 482, -396, 322, 4, -305, 667, -780, 556, -52, -674, 722, -873, 434, -317, -310, 406, -831, 341, -254, -550, 302, -460, -228, 84, -630, 428, -638, -171, 328, -1024, 611, -718, -46, 21, -641]
2801f41J237j273P52J09o80P81m55K1N03q60R46m50l98J274j631J391o13k25R86
2820G74j435J426q39M5P34j072Q37k33m04Q06q21M11L28j098J517j295M10N49
2838F40j213J475j417Q41L2q40J119q65K63K86o90O53l44k56R12j271R91k88n16
2857d88J047j408J274p34j17P73j081R50n14k1M48o38L95M7n55Q94p91K92M33
2876B06j017J361j241P51J18q92J364j214O68L0m58P20p01K87M91q84Q83k53m76
2895b57J010j212J100n99k04J125j525J279n81j11N37q19P55l37k55P43p46J31
2913C4N57j004J062r02K99M11j094J396j213N39J94p09Q73p89L29P0m17N34l19
2932a49k88P27q55N36j07l12P97j241J235o54k10P93q77Q06n63K13K21n63M79
$$ y = [-641, 596, -677, 75, 184, -496, 285, -170, -149, 354, -506, 440, -10, -408, 866, -765, 626, 13, -212, 774, -661, 765, -74, -29, 705, -367, 470, 237, -167, 639, -182, 229, 557, -541, 976, -319, 91, 640, -573, 902, -515, 326, 358, -482, 637, -228, 35, 321, -369, 284, -60, -316, 596, -675, 316, 28, -488, 559, -849, 425, -309, -426, 347, -734, 216, -298, -319, 129, -509, -114, -67, -622, 272, -519, -227, 206, -811, 550, -691, 60, 178, -714, 650, -564, 104, 134, -324, 396, -305, -18, 473, -411, 472, 219, -257, 753, -459, 641, 42, -162, 963, -562, 717, 136, 25, 562, -257, 498, 161, -94, 649, -97, 34, 591, -413, 649, -253, 46, 457, -637, 759, -454, 85, 279, -430, 443, -346, -17, 53, -364, 170, -149, -437, 290, -565, -29, -136, -448, 349, -892, 343, -311, -521, 272, -605, 201, -362, -149, 72, -491, -12]
2951a2J9m68P28m57Q4L22q00J183j087N81K28q39J129r61N72k3m53P08n05J20
2971F9L44n94M87On13Q95r96P85k76m53J025j211J004m80o3M53p33N95k25k33
2991a14M68l87q8M63p10P63o35J12N18r61J036q87M48L9n05P55p14L57Q3l43K95
3012gn8k33M50n84M09j4m96R83j152Q47l42k72P43r67Q68m15j4M22m31J71J65
3033G3l65M40l18J21M39r85J100o44N4M68p00Q87r02N43J18m66N33k39p1K34k90
3054C0K22K1m24P82q23M71J46o88Q71q79O73l13j81N28o61M32r6j88J64m2j13
3075f8K67n38N93m90j06O66q90P87n85K13K45o55P62n16J05J81k37J51K0k64M38
3096G9m10J40K72o98R63q05M67k2l29P12q44O79j93k07L91l01J26J50k99L07o6
$$ y = [-12, 7, -461, 267, -190, -106, 216, -584, 599, -488, 93, 321, -518, 611, -350, 222, 199, -254, 454, -51, 69, 413, -181, 306, 312, -201, 694, -302, 483, 207, -246, 779, -432, 572, 92, 29, 482, -251, 344, 119, -114, 354, -33, -121, 342, -368, 395, -240, -128, 390, -571, 465, -422, 26, 65, -440, 315, -399, -42, 41, -302, -7, -65, -298, 152, -432, -23, -37, -533, 450, -702, 145, -197, -469, 274, -693, 175, -240, -254, 168, -263, -92, 73, -292, 148, -170, -49, 390, -595, 505, -139, -85, 383, -317, 570, -332, 211, 329, -137, 396, 157, 86, 320, 30, 252, 273, -151, 631, -192, 279, 425, -263, 608, -271, 402, 89, -92, 436, -225, 207, 111, -77, 87, 45, -68, 199, -339, 254, -236, -342, 324, -566, 221, -364, -151, 94, -561, 201, -315, -210, -29, -266, -115, -95, -359, 79, -331, -191, 81, -617, 346, -459, 8, -14, -343, 369, -475, 204, 11, -196, 195, -106, 20, 170, -129, 178, 112]
3117A12k49O89r62P73k38j80O22q79Q87n95J74K32m35M35k05m3J64k31O2J89n91
3138b69Q10o09J11K81o88R24r72N92om48N27n29L91j19k44K77r4j99M22n90M91
3159E9n2m57P11r01Q43n52L6M90p70O91l52O0J52k62K56J03m39O00l53j10M69
3180B22o54Q04p04M39O9o58R62p39L65n5j64L97l53J29J71m21M16L0m58P15p57
3201b44N88k84k10P31r50Q96m21j25L70m92M26k33k0K76l80J08L23o20O43m63
3221h1J21L03q30J071r50L98J85n55N52m65K42L3l07L69j80k41N53o80M00P2m81
3242d71P97r85Q23l06k65O40p58O47l49qK51l07K94M4l76M94k79r4N13p32Q48
3263D21o81K52M04p75Q65o75L87n0k60N38m77J84J89l25K70o8k41O20p73N64j18
$$ y = [112, -137, 552, -410, 363, 125, -55, 567, -312, 575, -20, 154, 386, -49, 386, 181, 138, 302, 71, 133, 322, -269, 541, -68, 43, 324, -364, 560, -412, 180, 174, -274, 253, -276, 115, -4, -248, 29, -65, -264, 158, -432, 59, 7, -450, 261, -640, 203, -349, -313, 177, -593, 98, -254, -194, -42, -304, -48, 55, -384, 216, -137, -247, 222, -432, 372, -332, 107, 176, -482, 480, -259, 106, 51, -113, 284, -69, 60, 231, -190, 226, 256, -202, 513, -244, 344, 60, -150, 581, -369, 527, 106, -19, 351, -141, 285, 52, 32, 308, -72, 36, 359, -261, 382, -81, 40, 343, -487, 584, -366, 32, 217, -338, 214, -251, -9, 24, -283, 86, -94, -335, 218, -462, -62, 10, -471, 326, -659, 164, -142, -407, 233, -525, 122, -227, -235, 16, -291, 3, 47, -329, 165, -114, -208, 305, -427, 421, -260, -8, 396, -379, 486, -189, 198, 148, -112, 426, -51, 133, 322, -3, 267, 199, -42, 578, -195, 369, 251]
3284B51m43P70r11Q09m09j34N71p97O46k49j80L38l35Q4J94n56O68m83M9M93r47
3305e71R37o94K32J92n60P54p60M04J13m17K79l6k55M24m19L60On29Q85r04N82
3326B3j46k04O01p61P29l97j6L80l84J89M9j31K49k53J12K80o55Q30n81J38L62
3347D14o95Q78p65M49Nm79O52m56J16J31k28J97j44j36N45p43N06j8n17Q36r33
3368c85P55m24o8N30p89N50j16k18K77k75J38J69n22N48l56q7N04q01Q24o18K11
3389a53K78n98P05o54L08Q2l04L06r0j19K71l53K96Km02P35p10N30j37k31O47
3410D09q19O67l07k0K97l73L66j55j43K75j45o2L57n20O27m76M6L77o72Q55o86
3431a02K92Q8l99N50m68K17J3k38K76j10k70N43n66K89J9l93P33q98O46j89l27
$$ y = [251, -192, 578, -333, 476, 67, -67, 504, -293, 353, 104, -76, 262, -73, 11, 205, -351, 317, -166, -117, 376, -571, 366, -328, -96, 96, -464, 290, -470, -66, 47, -370, -91, -127, -382, 42, -377, -17, -11, -540, 345, -559, 23, -123, -327, 274, -487, 242, -155, -171, 209, -175, 14, 63, -68, 181, -72, 40, 320, -335, 495, -86, 52, 414, -281, 597, -168, 281, 286, -193, 459, 3, 119, 250, 22, 219, 75, -61, 484, -259, 247, 229, -288, 548, -385, 370, -54, -122, 408, -381, 169, 53, -165, 112, -163, -25, 144, -378, 170, -186, -273, 231, -570, 254, -364, -153, 125, -473, 232, -422, -114, -32, -336, -30, -120, -239, 32, -321, -25, -23, -425, 310, -400, 130, -7, -238, 409, -410, 257, -50, -70, 227, -146, 220, 65, -78, 197, 52, -10, 347, -173, 454, -22, 24, 401, -271, 584, -102, 190, 278, -121, 429, -39, 178, 191, -47, 229, 119, -151, 392, -174, 115, 134, -259, 474, -424, 222, 33, -294]
3452b94N24n44M01j67j04K98l46J39J61l70K98j29j40M35n87O19n37J35L25o42
3472e25O84m66K89o5j99L58k26J2J58j97J07J65l47N52n96M62j39k68O77p42N40
3493B34j82KK45m51M45j92o9K92k05j21L98n15M55k80m1M68p39P58n52J42J99
3514B91m78N72m98J94J03k78J37N0k53L35l22J30J44m40O38o79L91j5l61N49n45
3535c35L77k19P3Q2j68P7J02k01J58m7j57L99n71N23k76j1L61n66N71m12J87R8
3557D5k56K95k11R1Q7j00M8J38l00M50l94J76P1l10N64n69M62k44m6L18m02K76
3579A89o7r9J75j24k6K16l64L56o8k93M55n55M86k67KJ82m08M58l66J30O3p0o0
3602e5J04j81J47j81R9K09n25N67m28K57p3k11M17n48L65j12MN7j09J11L3j00
$$ y = [-294, 230, -314, 87, -80, -184, 114, -232, -93, 68, -302, -4, -133, -273, 162, -425, 194, -343, -208, 117, -525, 159, -307, -18, -83, -282, 76, -150, -138, 20, -177, -70, 95, -252, 300, -296, 166, 27, -241, 436, -306, 234, 52, 54, 299, -152, 293, 101, 32, 324, 119, -2, 396, -119, 336, 56, 15, 483, -256, 502, -50, 92, 291, -187, 385, -113, 81, 184, -94, 43, 93, -160, 175, -147, -17, 127, -313, 325, -354, 37, 22, -339, 210, -335, 42, -177, -104, -22, -190, -113, -11, -212, -54, -101, -258, 141, -430, 93, -183, -194, 167, -399, 172, -240, -53, 45, -211, 84, -127, -36, 51, -49, -1, 137, -163, 287, -107, 69, 140, -170, 394, -175, 287, 43, -3, 315, -87, 189, 122, 23, 198, 74, 48, 264, -100, 256, 188, -105, 350, -205, 281, 14, 16, 198, -210, 248, -118, 12, 75, 5, -55, 49, -132, 15, -166, -67, 142, -383, 184, -244, 13, -60, -271, 146, -402, -37, -149, -145, -88, -197, -86, -53, -153]
3624a53J48o2j93L73m22L34p0j78L67m25M90l71J49J80l38K52o0J0Rl0M4J15k41
3647g2L64k45qL06m77N18n04L17j6k18L37k94J92o6j3jl1m1K00k79J42N2l35N16
3671C44n36L62j73p5K81m71L49j84M8L2q6L2J9j56K59j48j19K90m58M44l35J38
3693a43J31l34M84m08J68O1j09J62j64P0P6j50J28P3k96M96m28K33j2k20N05n96
3715b73M88j98k0J65k40K00o9m5R5n7k6K39l56K88j08n7K71m68N78m79J88J00
3737B16k80L15k90J94q3q5J73j4k44K95k15Q8L4k83M30n23L41j05j97M29m91L37
3759D2j97O9Q2j93Q9L3j61J33N1k49L76m34M46k85K2K97n46O13m07J52O7j69K56
3782H7k28L7J71j51j2K40l46M06l30K17O7l44N33n62M49k17MK29l32K94j64nJ15
$$ y = [-153, -5, -67, -260, 113, -309, 25, -45, -223, 144, -281, 209, -162, -13, 167, -171, 81, 21, 31, 40, 10, 54, 169, -72, 292, 47, 39, 345, -132, 386, -118, 199, 183, -35, 302, 8, 200, 134, 121, 120, 89, 48, 248, -31, 111, 163, -172, 344, -192, 170, -3, -78, 203, -268, 81, -103, -55, -23, -109, -77, -58, -214, 45, -103, -222, 68, -390, 54, -281, -143, -12, -346, 138, -270, -102, -41, -150, 12, -152, -82, -6, -156, -28, 45, -251, 245, -183, 50, 38, -182, 323, -273, 215, 17, -3, 162, -78, 122, 53, 8, 103, 46, 20, 259, -97, 191, 83, 26, 297, -171, 407, -72, 116, 216, -64, 251, -39, 155, 72, -13, 160, 146, -98, 197, -18, 70, 104, -179, 251, -272, 69, -36, -233, 196, -295, 42, -155, -86, -4, -197, -108, -75, -236, -103, -52, -301, 75, -359, 87, -198, -176, 121, -425, 188, -219, -67, 0, -169, 87, -141, -104, 67, -84, -96, 144, -202, 204, -126, 91, 158, -186, 347, -215, 234, 17, 21, 250, -82, 212, 48, 43, 158]
3805A58m7o0J90k68K72j78p4L08m75N57m48J51J63l82L89m00K51m3j46J10Mj51
3827a19K38k76J14J01l94N26n78M24j04k12L78n32M66k01p7K29j25j0O1j27J50
3848f8m5j06L77m91L89j40r1L35m97N46l80J53O2j77K72j53O6J0K5p3J45k89L48
3871B18k91J83J93m44M90m28L47k09r5L58m08K78j28O4M0o7J6O0k62K79j64j29
3893i9L65n23M65k98J34J00l87N06m43J88N5k09J49q6j00K09j48L2J45m03N44
3914A96n05K52J7l02N40n72L84j40j00K82k54J04L6q0P1j4r8L35l48K56k7j68
3936a35L16l91M31l35Q6J09j60K52j98J52o6n5P9K7j73K76k01J25O3l07M71n17
3958a51L76r2k26L75l77L28j88j9J23j28M7P9k26J83l8k17L62m36M01l00M1K70
$$ y = [158, 111, 51, 241, -27, 245, 67, -7, 301, -174, 383, -65, 86, 249, -133, 256, -144, 107, 64, -82, 28, 32, -119, 119, -157, -43, 58, -336, 190, -388, 36, -68, -280, 98, -434, 32, -169, -246, -17, -142, -152, -91, -218, -68, -113, -219, 158, -333, 56, -84, -175, 160, -337, 209, -171, -18, 44, -133, 139, -14, 52, 62, 87, 14, 159, -130, 218, -73, 110, 303, -141, 349, -79, 268, 59, -36, 322, -86, 192, 64, 128, 168, 101, 117, 177, -85, 194, 30, -99, 266, -257, 208, -90, 44, 144, -243, 263, -180, 8, 63, -146, 3, -83, -183, 26, -122, -90, 55, -348, 196, -309, -57, -40, -342, 198, -374, 10, -130, -230, 52, -202, -98, -62, -142, -71, -85, -183, 152, -196, 60, 33, -135, 181, -210, 221, -114, -28, 81, -79, 173, -25, 127, 61, 6, 85, 112, -61, 215, 14, 139, 202, -105, 366, -151, 225, 133, -93, 282, -95, 233, 45, 26, 149, 21, 68, 147, -79, 104, 66, -151, 211, -225, 176, -124, -83, 187]
3980A87m67M34l24J95l9j27J71j55n6J38p0l3J74l19L51l32J49Q7k81M05l54K81
4002A5r0l2R5k30K47r2lP4N7j74K60k52K06m3j22L88m68M47l28J28J27k40K75
4025B45k57J72k3m3M5M2j56J53j06P4M0k77M06m38K87m4j74L02l73K88k12M4J45
4048A40j68l4J19j54Q5ok06L66m09L48k01m8K65m13L72k30Q9j4p1J50j49K7J06
4071c6r2n4J62k36L15k43R4J81l31L64l50L21j75l0K21k30J93n9M9n8Mk3J82k27
4095e8J87j0j16K67m06M09k48M4J08k42L29k46J25j5n4p6J03l5O9j23k3K22l72
4118a61L64k38J08K2k27K99l80K55q6K2Jo9O2k1m5NJ30k70L57l50J96k3j23J96
4142B4k93L97k75M6N1r8J00l3pj2O0o1Q3j70K63j56q9K45k64L09k63K34r5j25
$$ y = [187, -280, 154, -170, 25, -14, -141, 30, -125, -181, -43, -113, -146, 28, -291, 60, -272, -123, -36, -317, 88, -266, 15, -75, -107, -12, -242, 5, -87, -90, -16, 41, -133, 127, -125, 81, 38, -84, 304, -164, 283, -45, 83, 210, -30, 245, -12, 160, 137, 94, 139, 181, 25, 178, 72, 146, 186, -91, 315, -123, 164, 120, -54, 248, -125, 163, -49, -5, 140, -28, -62, 57, -97, -12, -18, -224, 142, -267, 81, -120, -168, 97, -316, 56, -174, -85, -99, -170, -20, -169, -142, -36, -128, -182, -20, -256, 59, -184, -90, 91, -240, 124, -226, 95, -80, -110, 111, -119, 74, 15, 64, 6, 10, -13, 169, -58, 129, 119, 3, 270, -136, 273, 25, 69, 177, -65, 264, 18, 143, 128, 74, -2, 101, 66, 135, 12, -11, 211, -161, 203, -35, 73, 95, -132, 167, -213, 42, -44, -22, -21, -90, -28, -49, -94, -89, 41, -229, 128, -222, -26, -49, -172, 24, -269, 128, -147, -101, -50, -148, -48, -81, -88, -100, -40, -101, -18, -188, 75, -81, -170, 75, -189, 120, -143, 91, -4, -129]
4166a29K39k28K48j56P4j6L8p9J87j61J06O3k56L37l59L09j83J9J95k74K85k06
4188E3N7Kl5j0O7q6L8l0j29K67l87L28j86M6M2k63L76l35J34L8r6N9q5N7o9M2
4214a05k5J75k67K42k29K03m4k45M10l94L23j99L9R3j75K19j18P2o8P3r1J98k41
4237a54K05n5o9K65l39L81l26K26J0k38K25j85K06j03N4m8J03j31J77j30p1K18
4259B21k42L00l71K65o0j03K12k79K27k19J30J7j35L5O8q8J3j5j44K65k93K70
4281G4j78p2K78l20L13l07K24j27j6O6j13R2j7m6K8J02j86J66j22R5M1k16M46
4304B05m18K45o6k7R0j93K51p7l2K0L2r9J56j32Q2L7j74K50l11L97k41J0J30j73
4328c8K34k15J20m7M2m7O6j27J16J7r7P1j66K93k92K15m7j47L04l74K75k02J3
$$ y = [-129, 110, -118, 130, -26, 48, 32, 70, -9, 178, 17, 123, 186, -70, 267, -92, 217, 34, 53, 248, -26, 259, 53, 110, 112, 77, 67, 134, 48, 86, 56, -73, 194, -193, 135, -51, -5, 37, -226, 150, -185, -51, -13, -109, -50, -135, -78, -147, -105, -130, 45, -222, 20, -209, -6, -50, -295, 115, -279, 44, -155, -116, -23, -198, 21, -97, -25, -93, -20, -111, 87, -154, 51, -4, -73, 192, -147, 234, -92, 134, 144, -94, 131, -54, 152, 49, 103, 55, 158, 27, 204, 74, 3, 221, -21, 279, -92, 173, 113, 10, 222, -57, 170, -49, 81, 98, -37, -2, 66, -22, -9, -24, -168, 97, -196, 74, -104, -176, 102, -218, 95, -212, 12, -115, -131, -65, -178, -86, -103, -149, -121, -19, -205, -39, -161, -66, -25, -241, 205, -213, 32, -34, -61, 29, -164, 87, 10, -22, -2, 30, -69, 87, -45, 37, 74, -100, 150, -161, 236, -5, 5, 135, -38, 196, -19, 101, 54, 96, 49, 115, -12, 104, 121, 24, 95, -71, 222, -70, 145, 98, -49, 255, -119, 156, -46, -33]
4351c3P6p9L1K1j02L9P9j72K21l38K85r7j04K00l19M24l83J54M4j67K44j69O6
4374g9j0Kp4J94k43K72j22nJ28k81L35l26K81p4n4J84k59K15n6k3N6kq2J44r4
4399B7N6M1j84L38l21K41k15Q3J03j72K55k54Q3M2l4j9J1j5M2r0L4J24l07L39
4423B08k67R9L0j90K91l18K38j72J1Q7j13R1m4J2k4nj38K14k61K60j46p8K50l43
4447c08L79k55R9J63l01J55m5P5m8O9n4P7j67K41j37k1K56l23K78k33J90o2o5
4470c7K31k02J18j06R3K1n2PLk8k7J47j99K80k98K55j48l9J03j74J96k11J08K6
4494F7n7O5j14P0Qm2l8J24k33K83k36J10O3k75L39l50K30j08l2J45j91J44n8n3
4518a39M9N6j69K08j92J37m6j11K72l18L00j38L3O6j16J79j56Q2ORm8J06j26Q5
$$ y = [-33, 43, -36, -5, 16, -86, -47, 32, -140, 81, -257, 28, -69, -173, 27, -292, 132, -251, -97, -53, -220, 24, -145, -79, -89, -87, -161, 33, -210, 62, -60, -65, 63, -218, 117, -209, 72, -2, -56, 128, -131, 84, 28, 5, 61, 59, -23, 121, 27, 83, 124, -60, 278, -43, 198, -17, 66, 169, -3, 252, -2, 81, 123, 89, 70, 81, 66, 108, 18, 52, 176, -131, 208, -59, 40, 70, -120, 171, -147, 91, -81, -70, 17, -96, -5, -49, -37, -61, -66, -204, 10, -251, 9, -137, -215, 35, -308, 71, -184, -85, 78, -223, -68, -113, -38, -86, -17, -71, 6, -161, 80, -57, -78, 178, -145, 133, -100, 90, 28, -37, 194, -8, 110, 4, 97, 118, 66, 73, 76, 48, 21, 168, -31, 249, -49, 206, 58, 19, 122, -52, 144, -67, 41, 67, 10, 75, -39, 31, 39, -3, -41, 83, -150, 133, -103, 7, 70, -205, 134, -216, 14, -94, -126, 19, -172, -28, -86, -139, -90, -34, -203, 5, -187, -50, -96, -207, 65, -253, 47, -91, -58, 8, -108, 71, -85, -3, 3, 12, -36, 70, -56, 29]
4542B9J9r5J80k18K77k48J10N8q7J92k76K71k06P6M4l5j9L0n2L9N0j70J52j78
4566e7K24j59o5K53k89K13k07J62l5q5J34j11m4L4K6o7J13j34J34j52L9J48k82
4589b07L23k74R4L2j07J29j43R0J2l9kP0j02J57j67P5J05j93K13k17J69m4o8J42
4613D8j43K21j50J5l0L9oP7q3K2J12q4J10j47K73k79R9Q2k01K82k80K27j34j5
4637E5K5k5j4K4l9j4O8k18K98k45J42l8r7K31k76K10j34OJ8j28K02j49L5L1K0
4662a2j11J08j10J35j15n2K51l05K73k37J42kr4J68j95R6n2R0m5M0m0J00j52K0
4686i9J95j82K12k25J57n3JR8j76J78r1N9k6J4qK5n1L7Q1j82K49k64K39r0n4J43
4712A87k52L24l09J34k5mJ2l6L4l6K2m1O6k56K36j63J3Q5q0J48k65K54j26J9O2
$$ y = [29, 48, -47, 133, -85, 192, -56, 54, 112, 25, 217, -59, 212, 6, 82, 126, 91, 72, 102, 50, 89, 139, -31, 121, -57, 167, 8, -57, 196, -93, 120, -87, 75, 40, -45, 89, -22, -66, -32, -6, -73, 40, -94, 40, -112, -73, 75, -207, 116, -158, -64, -32, -139, -10, -153, -63, -51, -90, -92, -22, -124, 33, -134, -59, 46, -147, 66, -151, 18, -26, -94, 48, -95, 126, -24, -9, -39, 0, -6, 71, -12, 10, 122, 38, 148, 1, 274, -5, 94, 176, -25, 257, -23, 204, 70, 55, 80, 55, 41, 65, 26, 12, 80, -138, 160, -85, 57, 19, -78, 153, -123, 87, -47, -41, -23, -151, 51, -98, -63, -32, -12, -123, -15, -125, 10, -105, -157, 94, -211, 62, -175, -33, -35, -129, 39, -156, -60, -112, -22, -67, -27, -67, 33, -119, -99, 96, -86, 126, -99, 58, 5, 6, 104, -72, 106, 15, 74, 48, 62, 54, 79, 28, 65, 146, -36, 213, -51, 188, 98, 44, 187, -65, 259, -50, 84, 59, 55, 67, 31, 65, 29, 51, 10, 76, -180, 56, -107, -94, -9, -89, 59, -206, 48, -78, -59, 3]
4737Cj40J40j73J52o2ll8J39j34L1N9j23K00k74K72k12J19lr7K42j81M5k7N1l5
4762d9K9mM1l2l6J82j95J90j75J37j9q5J99j94J85j34J06j61L8J2P1n5j4P5j40
4787b8J94k01J97j05q0K37k54K08k12P5l1o0Q3l1J5k3O6j54R0q1Q9r3nJ01j86
4812a89K84k66J40j2o8O6p9J26j19Q6p7R5p0Q0j03L8j9k2K15l10K63j17K3R9j50
4837h6J43r9J21qo5ON4n3J0O1j03J52k29K50j40L9J07j58J68j77J21m8k8N6n8
4862C6J8N8Lm4M6j32J59j23R5l2r1J55k58J50r2Q8o8oL7j02J14q4K0j5N0n6L8
4889c6p0qJ12k12K55k21J33k9l9J46j78K15j44j3mQ8j26J44m8K7Nj09K43l03K98
4914A26r9p4J74k31K39j26%O3K0m6Mm1M9O6j26J92k56K37j04L1L3j45K04j66J02
$$ y = [3, -137, 3, -170, -18, -80, -83, -121, 18, -116, -85, -26, -149, 51, -223, 49, -163, -44, -47, -144, 98, -83, -38, -65, -14, -49, -20, -24, 17, -15, -51, 131, -64, 126, -49, 88, 69, -16, 183, -11, 174, 40, 146, -15, 23, 35, 106, 51, 37, 112, -28, 166, -35, 162, 57, -23, 214, -40, 168, -44, 31, 0, -60, 23, -8, 7, -16, 50, -104, -14, -95, -6, -99, -104, -3, -189, 95, -171, -31, -43, -111, -45, -124, 2, -117, -31, -108, -13, -83, -3, -106, -68, -87, -109, 106, -204, 59, -58, -35, 64, -86, 57, -42, 79, 71, 6, 12, 66, 13, 23, 84, -19, 133, -96, 154, 14, 53, 160, 2, 170, -7, 114, 66, 38, 94, 36, 54, 112, 115, 71, 117, -15, 144, 21, 116, 84, -7, 148, -110, 40, -52, 36, -32, -38, -1, -103, 11, -73, -53, -68, -18, -74, -36, -106, -114, -2, -214, 41, -180, -47, -76, -115, 31, -147, 68, -76, -89, -93, -5, -131, 13, -35, -8, -3, -112, 131, -172, 126, 27, -47, 127, -104, 135, 9, 9, 72, 92, 46, 50, 9, 58, 124, -2, 190, -66, 171, 67, 98, 131, -14, 190, 24, 126]
4939A26p9J1l3K3L6n0om5J25j47J12r6N3Jj34J58k18K96k33M2J3n2J39j23N2q2
4965a11Q9k6K1p7N2k4o9J69k37K52k07J09N7j17J67j77J17j46R2MO7k3K0k2j5
4990c5J35k09K70j85Q7p7l2J98k25K55j83Q5p1P0k3k2N2m2Kq3J78j76J49q7l6
5015eJ31j48J53k09J96j54N6L8r3O1m2K0o5J34j07R1j37O2J12k28K32k40K13k40
5039a69J15K8j55K08j59L4j6K7NO0j07M4J7m0J27k12K27j11M9N4r5J48j62J27
5063D4o2K7mj3MK5j7J1Q3j38J58j67J61j3j14J39j46J53j17M0Jk3M4p7Q3p1J18
5090A29j65J48r8J08j00l0O6j77K39j82J15p2pO0j97J79p3M8j01J07p8R8j43O0
5114f6R2j64J90k18J08No2P0p7J27j24N8M2l9p3R9l1QM7q3J81k44J86j08P6O6
$$ y = [126, 47, 58, 25, 48, 84, 34, 28, -17, 108, -39, 73, -23, 30, 31, -103, 55, -163, 133, -100, -58, -45, -97, 42, -81, -29, -111, -22, -48, -27, -104, -52, -76, -145, 24, -213, 39, -168, -59, -2, -119, 48, -129, -12, -158, -66, -62, 5, -18, 2, -20, -35, 100, -109, 161, -24, 63, -14, -46, 152, -73, 182, -1, 84, 13, 83, 60, 38, 90, 48, 50, -33, 145, -31, 118, 31, -5, 126, -22, 131, -78, 118, -36, 20, 58, -35, 26, -16, 4, -61, 73, -34, 57, -80, -18, 94, -134, 98, -142, 71, -169, -54, -26, -181, 27, -132, -98, -114, -87, -82, -22, -129, -85, -68, -108, 19, -193, 34, -77, -28, 26, -69, 79, -83, 44, -18, 9, 5, -8, -4, 21, 4, 15, 98, -40, 118, -49, 112, 99, -15, 124, -22, 131, 14, 54, 55, 32, 76, -1, 82, 11, 129, -36, 112, 14, 122, 22, -8, 58, -119, 120, -62, 53, -19, -26, 34, -163, 16, -57, -9, -110, -3, -81, 17, -126, -66, 26, -138, 52, -166, -58, -53, -115, -45, -122, 5, -119, -61, -19, -58, -131, -32, -63, -55, -8, -91, 90, -154, 32, -76, 0, 66]
5140F6q3J27j68R9k8J3O1Nn6l8J16j33J89j21R4j31O9K6j25J65j85K02k28J16
5164E2J6o1N6q3O5l4J8l9N1j01R8j5l8L2j52K41j99J04m2l8J27j82J41r4L9n6
5190i4N9j21Q9Pj3Q6k22K35j98J31mrJ8r7J85j57P9l9L6J9j0Pl5J12j60J89j39
5217d6R1n5NQ0j90K39j76J56o7K2L5o2O1l8N1j40J83j58J30o8J5J04j86J48j58
5242b4O2j5kL3p5R6j59J80j66J00j24J32o8qK2r3J59k47K31j03j1O6j11J65j68
5267a28J36j26N3j2N9p1L3jo5J71k02J77j73O7Q3j10J51j75J62n7N6o5L9ko1N5
$$ y = [66, -17, 110, -58, 41, 13, 26, 87, 92, 36, -2, 114, -19, 170, 49, 143, 12, 81, 107, -18, 147, -38, 164, -64, 52, 68, 7, 63, -20, 45, 11, 29, -10, 41, -60, 38, 23, -15, 17, -135, 106, -93, 11, -31, -69, 58, -124, 17, -77, -38, -94, -35, -156, -67, -60, -73, 13, -209, 26, -172, -41, -45, -54, -36, -133, 52, -105, -26, -65, -29, -10, -20, -13, -48, 64, -96, 93, -46, 45, -10, -5, 75, -115, 124, -52, 104, 37, 59, 94, 32, 93, 55, 106, -34, 149, -9, 121, 53, 68, 172, -14, 134, -24, 38, 23, 21, 54, -21, 75, -84, 96, -70, 30, -94, 38, -30, -38, -16, -109, 50, -197, 34, -69, -80, -14, -125, 40, -128, 8, -118, -65, -77, -18, -89, -56, -57, -122, 49, -153, 24, -149, -82, 1, -109, 42, -133, 29, -28, 28, -37, 2, 0, -61, -6]
$$ [...]
8191a4
##END NTUPLES=NMR FID
##END=
