##TITLE=1H_EC-3236(21)
 CDCl3, 8 sc, 
 19.10.2020
##JCAMPDX= 6.0         $$ Bruker NMR JCAMP-DX V2.0
##DATA TYPE= NMR FID
##DATA CLASS= NTUPLES
##ORIGIN= UXNMR, Bruker Analytische Messtechnik GmbH
##OWNER= root
$$ XWIN-NMR		Version 3.5
$$ Mon Oct 19 10:38:17 2020 Russian Standard Time (UT+4h)  she@DPX200
##.OBSERVE FREQUENCY= 200.1315066352
##.OBSERVE NUCLEUS= ^1H
##.DELAY= (6, 6)
##.ACQUISITION MODE= SIMULTANEOUS
##.ACQUISITION SCHEME= undefined
##.AVERAGES= 8
##.DIGITISER RES= 18
##SPECTROMETER/DATA SYSTEM= spect
##.PULSE SEQUENCE= zg30
##.SOLVENT NAME= CDCl3
##.SHIFT REFERENCE= (INTERNAL, CDCl3, 0, 15.7039)
##AUDIT TRAIL= $$ (NUMBER, WHEN, WHO, WHERE, WHAT)
$$ ##TITLE= Audit trail, XWIN-NMR		Version 3.5
$$ ##JCAMPDX= 5.01
$$ ##ORIGIN= Bruker BioSpin GmbH
$$ ##OWNER= she
$$ F:/spectra/data/she/nmr/H-F/1/audita.txt
$$ ##AUDIT TRAIL=  $$ (NUMBER, WHEN, WHO, WHERE, WHAT)
(   1,<2020-10-19 10:37:12.75 +0400>,<she>,<DPX200>,
      <created by zg, POWCHK disabled, PULCHK disabled
       configuration hash MD5:
       00 E9 B6 7A A2 85 ED C7 34 08 36 98 17 FE 4E 26
       data hash MD5: 16K
       33 5E 93 EC E5 75 52 37 11 5A 94 2D 5D 8F F8 0B>)
$$ ##END=
$$ 
$$ hash MD5
$$ 13 FC 0E EA 07 CA 8E 8B 13 EF CD D0 C4 88 CF 97
##$RELAX= 
##$RELAX= 
##$RELAX= 
##$RELAX= 
##$RELAX= 
##$RELAX= 
$$ Bruker specific parameters
$$ --------------------------
##$DU= <F:/spectra>
##$EXPNO= 1
##$NAME= <H-F>
##$PROCNO= 1
##$TYPE= <nmr>
##$USER= <she>
##$AMP= (0..31)
100 100 100 100 100 100 100 100 100 100 100 100 100 100 100 100 100 100 
100 100 100 100 100 100 100 100 100 100 100 100 100 100 
##$AQSEQ= 0
##$AQ_mod= 1
##$AUNM= <au_zg>
##$AUTOPOS= <>
##$BF1= 200.13
##$BF2= 200.13
##$BF3= 200.13
##$BF4= 200.13
##$BF5= 200.13
##$BF6= 200.13
##$BF7= 200.13
##$BF8= 200.13
##$BYTORDA= 1
##$CFDGTYP= 0
##$CFRGTYP= 5
##$CHEMSTR= <none>
##$CNST= (0..31)
1 1 145 1 1 1 1 1 1 1 1 1 1 1 1 1 1 1 1 1 1 1 1 1 1 1 1 1 1 1 1 1 
##$CPDPRG= <>
##$CPDPRG1= <>
##$CPDPRG2= <>
##$CPDPRG3= <>
##$CPDPRG4= <mlev>
##$CPDPRG5= <mlev>
##$CPDPRG6= <mlev>
##$CPDPRG7= <mlev>
##$CPDPRG8= <mlev>
##$CPDPRGB= <>
##$CPDPRGT= <>
##$D= (0..31)
0 1.2 0 0 0 0 0 0 0 0.06 0 0.03 0 0 0 0 0.0002 0 0 0 0 0 0 0 0 0 0 0 0 
0 0 0 
##$DATE= 1603089432
##$DBL= (0..7)
120 120 120 120 120 120 120 120 
##$DBP= (0..7)
150 150 150 150 150 150 150 150 
##$DBP07= 0
##$DBPNAM0= <>
##$DBPNAM1= <>
##$DBPNAM2= <>
##$DBPNAM3= <>
##$DBPNAM4= <>
##$DBPNAM5= <>
##$DBPNAM6= <>
##$DBPNAM7= <>
##$DBPOAL= (0..7)
0.5 0.5 0.5 0.5 0.5 0.5 0.5 0.5 
##$DBPOFFS= (0..7)
0 0 0 0 0 0 0 0 
##$DE= 6
##$DECBNUC= <off>
##$DECIM= 32
##$DECNUC= <off>
##$DECSTAT= 4
##$DIGMOD= 1
##$DIGTYP= 9
##$DL= (0..7)
0 120 120 120 120 120 120 120 
##$DP= (0..7)
150 150 150 150 150 150 150 150 
##$DP07= 0
##$DPNAME0= <>
##$DPNAME1= <>
##$DPNAME2= <>
##$DPNAME3= <>
##$DPNAME4= <>
##$DPNAME5= <>
##$DPNAME6= <>
##$DPNAME7= <>
##$DPOAL= (0..7)
0.5 0.5 0.5 0.5 0.5 0.5 0.5 0.5 
##$DPOFFS= (0..7)
0 0 0 0 0 0 0 0 
##$DQDMODE= 0
##$DR= 18
##$DS= 0
##$DSLIST= <SSSSSSSSSSSSSSS>
$$ [...]
##$SUBNAM2= <"">
##$SUBNAM3= <"">
##$SUBNAM4= <"">
##$SUBNAM5= <"">
##$SUBNAM6= <"">
##$SUBNAM7= <"">
##$SUBNAM8= <"">
##$SUBNAM9= <"">
##$SW= 16.880792210976
##$SWIBOX= (0..15)
0 0 2 0 0 0 0 0 0 0 0 0 0 0 0 0 
##$SW_h= 3378.37837837838
##$TD= 16384
##$TD0= 1
##$TE= 0
##$TE2= 300
##$TE3= 300
##$TEG= 300
##$TL= (0..7)
0 120 120 120 120 120 120 120 
##$TP= (0..7)
150 150 150 150 150 150 150 150 
##$TP07= 0
##$TPNAME0= <>
##$TPNAME1= <>
##$TPNAME2= <>
##$TPNAME3= <>
##$TPNAME4= <>
##$TPNAME5= <>
##$TPNAME6= <>
##$TPNAME7= <>
##$TPOAL= (0..7)
0.5 0.5 0.5 0.5 0.5 0.5 0.5 0.5 
##$TPOFFS= (0..7)
0 0 0 0 0 0 0 0 
##$TUNHIN= 0
##$TUNHOUT= 0
##$TUNXOUT= 0
##$USERA1= <user>
##$USERA2= <user>
##$USERA3= <user>
##$USERA4= <user>
##$USERA5= <user>
##$V9= 5
##$VALIST= <valist>
##$VCLIST= <CCCCCCCCCCCCCCC>
##$VD= 0
##$VDLIST= <DDDDDDDDDDDDDDD>
##$VPLIST= <PPPPPPPPPPPPPPP>
##$VTLIST= <TTTTTTTTTTTTTTT>
##$WBST= 1024
##$WBSW= 4
##$XGAIN= (0..3)
0 0 0 0 
##$XL= 0
##$YL= 0
##$YMAX_a= 89634
##$YMIN_a= -80561
##$ZGOPTNS= <>
##$ZL1= 120
##$ZL2= 120
##$ZL3= 120
##$ZL4= 120
##$ABSF1= 10
##$ABSF2= 0
##$ABSG= 5
##$ABSL= 3
##$ALPHA= 0
##$AQORDER= 0
##$ASSFAC= 0
##$ASSFACI= 0
##$ASSFACX= 0
##$ASSWID= 0
##$AUNMP= <proc_1d>
##$AZFE= 0.1
##$AZFW= 0.1
##$BCFW= 1
##$BC_mod= 2
##$BYTORDP= 1
##$COROFFS= 0
##$CY= 11.3945322036743
##$DATMOD= 1
##$DC= 2
##$DFILT= <>
##$DTYPP= 0
##$F1P= 16.9975609425685
##$F2P= -3.02152046262296
##$FCOR= 0.5
##$FTSIZE= 0
##$FT_mod= 4
##$GAMMA= 1
##$GB= 0.15
##$INTBC= 1
##$INTSCL= 1
##$ISEN= 128
##$LB= 0.24
##$LEV0= 0
##$LPBIN= 0
##$MAXI= 10000
##$MC2= 0
##$MEAN= 0
##$ME_mod= 0
##$MI= 1.114404
##$NCOEF= 0
##$NC_proc= 0
##$NLEV= 6
##$NOISF1= 3.799351
##$NOISF2= 2.8
##$NSP= 1
##$NTH_PI= 0
##$NZP= 0
##$OFFSET= 15.70392
##$PC= 1
##$PHC0= -10496.74
##$PHC1= 20.80089
##$PH_mod= 1
##$PKNL= yes
##$PPARMOD= 0
##$PSCAL= 0
##$PSIGN= 0
##$REVERSE= no
##$SF= 200.130013532006
##$SI= 16384
##$SIGF1= 3
##$SIGF2= 2
##$SINO= 400
##$SIOLD= 16384
##$SREGLST= <1H.CDCl3>
##$SSB= 0
##$STSI= 0
##$STSR= 0
##$SW_p= 3612.71676300578
##$SYMM= 0
##$S_DEV= 0
##$TDeff= 0
##$TDoff= 0
##$TI= <>
##$TILT= no
##$TM1= 0
##$TM2= 0
##$TOPLEV= 0
##$USERP1= <user>
##$USERP2= <user>
##$USERP3= <user>
##$USERP4= <user>
##$USERP5= <user>
##$WDW= 1
##$XDIM= 8192
##$YMAX_p= 0
##$YMIN_p= 0
$$ End of Bruker specific parameters
$$ ---------------------------------
##NTUPLES= NMR FID
##VAR_NAME=  TIME,          FID/REAL,        FID/IMAG
##SYMBOL=    X,             R,               I
##VAR_TYPE=  INDEPENDENT,   DEPENDENT,       DEPENDENT
##VAR_FORM=  AFFN,          ASDF,            ASDF
##VAR_DIM=   8192,          8192,            8192
##UNITS=     SECONDS,       ARBITRARY UNITS, ARBITRARY UNITS
##FACTOR=    0.000296,      1,               1
##FIRST=     0,             0,               0
##LAST=      2.424536,      0,               0
##MIN=       0,             -80561,          0
##MAX=       2.424536,      89634,           0
$$ Real data points
##PAGE= N=1
##DATA TABLE= (X++(R..R)), XYDATA
$$ [...]
$$ plain form
1209 87 -143 165 -264 540 -650 483 -463 290 -309 62 -24 -678 590 -722 425 -718 328 -244
1227 -244 -567 353 -560 143 -670 371 -583 111 -342 -150 106 -619 642 -811 364 -468 130 -129 -289
1246 -289 282 -476 582 -641 514 -274 95 105 -110 314 -245 346 -377 736 -601 607 30 -144
1264 -144 800 -701 984 -321 300 217 114 138 31 229 161 532 -746 1086 -519 194 201 -318 755
1283 755 -907 652 -227 6 -100 277 -100 -259 194 -296 463 -776 586 -475 16 7 -493 450 -860
1302 -860 343 -553 288 -360 -308 86 -280 78 -472 464 -801 212 -342 164 -122 -446 708 -859 298
1321 298 -396 291 -298 -30 249 -386 291 -370 706 -625 481 -29 62 274 -176 633 -358 604 -267
1340 -267 556 -107 178 428 -286 691 -543 684 -205 133 203 133 137 -198 547 -306 489 -512 660 -157
$$ packed form
1209H7k30L08m29Q04j190J133r46P53n99L71q6o54J268j312J147j143J046n72
1227b44l23R20r13P03q13J041r54O94m53J92K56p25J261j453J175q32N98k59j60
1246b89N71p58J058j223J155p88L69J0k15M24n59N91p23J113j337J208n77j74
1264a44R44j501J685j305O21q3j03K4j07J98o8L71j278J832j605P13Pn19J073
1283G55j662J559q79K33j06L77l77j59M53m90P59j239J362j061M91rn00R43j310
1302h60J203q96Q41o48N2L94l66L58n50R36j265J013n54N06k86l24J154j567J157
1321B98o94O87n89K68K79o35O77o61J076j331J106n10R1K12m50Q09r91R62q71
1340b67Q23o63K85K50p14R77j234J227q89L38P0p0Ml35P45q53P95j001J172q17
$$ plain form
1360 -157 -285 503 -419 408 -581 487 -243 -66 -75 15 -47 -465 431 -634 332 -572 157 -155 -464 177 -509
1381 -509 334 -747 305 -413 67 -261 -280 319 -658 154 -491 416 -491 136 13 -152 91 -466 615
1400 615 -617 390 -205 181 45 -183 400 -290 415 -403 598 -250 170 176 -56 472 -414 642 -210
1419 -210 391 -162 308 169 -69 447 -423 688 -395 434 -114 122 140 -211 415 -324 424 -447 478 -362
1439 -362 -3 208 -286 222 -494 475 -471 221 -269 22 -107 -349 377 -722 354 -403 105 -314 -119
1458 -119 120 -439 42 -317 306 -697 329 -305 -140 83 -483 468 -634 381 -289 53 -77 -19 107
1477 107 -197 322 -368 552 -413 328 -134 123 314 -324 608 -281 498 -363 512 146 -131 278 -9 461
1497 461 -379 504 -22 322 -187 280 312 -453 628 -340 503 -411 269 222 -348 261 -230 269 -412 356
$$ packed form
1360a57j28P88r22Q27r89J068p30J77rR0o2m18Q96j065R66r04P29l12l09O41o86
1381e09Q43j081J052p18M80l28j9N99r77Q12o45R07r07O27j23j65K43n57J081
1400F15j232J007n95L86j36k28N83o90P05q18J001q48M20Ok32N28q86J056q52
1419b10O01n53M70j39k38N16q70J111j083Q29n48K36J8l51O26p39P48q71R25q40
1439c62L59K11m94N08p16R69r46O92m90K91j29k42P26j099J076p57N08m19J95
1458a19K39n59M81l59O23j003J026o34J65K23n66R51j102J015o70L42j30N8J26
1477A07l04N19o90R20r65P41m62K57J91o38R32q89P79q61Q75l66k77M09k87M70
1497D61q40Q83n26L44n09M67L2p65J081r68Q43r14O80m7n70O09m91M99o81P68
$$ plain form
1517 356 -257 217 -278 -26 159 -478 441 -767 375 -347 -77 -65 -284 255 -552 253 -381 77 -380 84
1537 84 -169 -219 111 -336 228 -749 530 -461 -111 78 -269 335 -575 414 -191 95 -14 255 -111 17
1557 17 335 -321 501 -420 726 -283 3 433 -190 442 -255 490 -143 303 -74 301 89 -70 521 -378
1577 -378 508 -324 306 -73 68 195 -202 306 -411 395 -307 379 -264 -43 256 -365 179 -363 433 -470
1597 -470 47 -207 54 -172 -319 399 -694 213 -421 167 -308 -217 180 -425 98 -369 364 -433 113 -189
1617 -189 36 9 -380 379 -442 460 -519 176 -2 -161 233 -315 417 -308 251 -99 258 -146 177 234 -179
1638 -179 448 -335 755 -414 219 385 -190 361 -78 443 -194 255 -76 433 -188 149 249 -406 616
1657 616 -513 420 -229 120 165 -285 228 -213 236 -336 313 -372 119 -155 -143 215 -499 296 -546 196
$$ packed form
1517C56o13M74m95K52J85o37R19j208J142p22K70J2k19N39q07Q05o34M58m57M64
1537H4k53n0L30m47N64r77J279r91L50J89l47O04r10R89o05K86j09K69l66J28
1557A7L18o56Q22r21J146j009K86M30o23O32o97P45o33M46l77L75k12j59N91q99
1577c78Q86q32O30l79J41J27l97N08p17Q06p02O86o43K21K99o21N44n42P96r03
1597d70N17k54K61k26j47P18j093R07o34N88m75R1L97o05N23m67P33p97N46l02
1617a89K25k7l89P59q21R02r79O95j78j59L94n48P32p25N59l50L57m04L23N7m13
1638a79O27p83J090j169O33J66n75N51m39N21o37M49l31N09o21L37J00o55J022
1657F16j129R33o49L49M5m50N13m41M49n72O49o85M91k74J2L58p14P95q42P42
$$ plain form
1677 196 -313 -81 -126 -259 200 -514 244 -422 136 -354 50 -120 -363 200 -333 195 -507 307 -225 -42
1697 -42 -7 -145 219 -514 483 -293 200 -121 133 186 -245 348 -184 330 -280 424 -123 190 34 -78 572
1718 572 -442 494 -190 321 -34 -53 374 -22 144 -121 435 -314 459 -192 257 59 -349 631 -497 373
1738 373 -245 149 -30 -177 169 -152 3 -335 332 -417 220 -312 -26 82 -540 374 -526 241 -309 -76
1758 -76 -71 -192 2 -260 131 -488 228 -473 176 -206 -139 201 -488 331 -323 246 -317 128 -22 -94 171 -245
1780 -245 315 -396 481 -223 191 54 45 364 -318 463 -250 347 -206 285 91 -94 323 -146 481 -357 446
1801 446 -143 156 153 -41 301 -166 357 -303 409 -259 158 -35 -152 270 -528 474 -339 103 -206 18
1821 18 -52 -223 121 -191 168 -572 403 -375 -81 18 -304 251 -591 267 -295 21 -209 55 -135 -206 115
$$ packed form
1677A96n09K32m5j33M59p14P58o66N58m90M04j70k43N63n33N28p02Q14n32J83
1697d2L5j38L64p33R97p76M93l21K54N3m31N93n32N14o10P04n47L13j56j12O50
1718E72j014R36o84N11l55j9M27l96J66k65N56p49P73o51M49j98m08R80j128Q70
1738C73o18L94j79j47L46l21J55l38O67p49O37n32K86J08o22R14r00P67n50K33
1758g6Nj21J94k62L91o19P16p01O49l82O7L40o89Q19o54N69n63M45j50p2K65m16
1780b45N60p11Q77p04M14j37rL19o82P81p13N97n53M91j94j85M17m69O27q38Q03
1801D46n89K99lj94L42m67N23o60P12o68M17j93j17M22p98J002q13M42l09K24
1821A8p0j71L44l12L59p40R75p78K94R9l22N55q42Q58n62L16k30K64j90p1L21
$$ plain form
1842 115 -407 370 -464 286 -216 -32 113 -351 384 -304 269 -210 235 -44 -50 144 -23 175 -275 505 -277
1863 -277 307 -23 187 204 -277 573 -229 310 -115 301 31 69 275 -99 278 -283 524 -360 243 11 -10
1884 -10 231 -242 405 -332 279 -186 172 -108 -19 141 -309 258 -337 264 -319 114 -110 -135 99 -395 247
1905 247 -450 289 -417 102 19 -255 99 -362 274 -379 113 -199 75 -273 22 146 -486 369 -433 374
1925 374 -358 46 247 -337 160 -155 316 -209 251 -75 261 -127 54 367 -287 472 -245 436 -82 113
1945 113 228 -156 399 -251 366 -126 285 -173 252 101 -125 230 -150 456 -463 381 -60 25 87 -240 387
1966 387 -446 230 -170 134 -190 -18 -16 -151 137 -381 283 -508 237 -243 -132 143 -331 271 -432 237 -370
1987 -370 42 -155 -68 -13 -288 180 -426 249 -305 242 -213 -11 143 -227 352 -425 418 -315 209 33 -93
$$ packed form
1842A15n22P77q34P50n02J84J45m64P35o88N73m79M45k79oJ94j67J98m50P80p82
1863b77N84l30K10J7m81Q50q02N39m25M16k70L8K06l74L77n61Q07q84O03k32k1
1884a0K41m73O47p37O11m65L58k80Q9J60m50N67n95O01n83M33k24k5K34m94O42
1905B47o97P39p06N19q3k74L54m61O36o53M92l12K74l48K95J24o32Q55q02Q07
1925C74p32M04K01n84M97l15M71n25M60l26L36l88J81L13o54P59p17O81n18J95
1945A13J15l84N55o50O17m92M11m58M25j51k26L55l80O06r19Q44m41Q5O2l27O27
1966C87q33O76m00L04l24J72Kj35K88n18O64p91P45m80J11K75m74O02p03O69o07
1987c70M12j97Q7N5k75M68o06O75n54N47m55K02J54l70N79p77Q43p33N24j76j26
$$ plain form
2008 -93 266 -119 262 -262 358 -139 268 -81 152 231 -292 532 -348 359 -103 244 115 -57 288 -56 239
2029 239 -269 371 -189 156 -80 60 239 -268 378 -319 271 -250 107 19 -191 112 -313 234 -348 145
2049 145 -206 48 -151 -131 122 -336 153 -433 344 -438 -67 20 -211 131 -435 294 -313 -2 -189 94 -92
2070 -92 -93 184 -295 302 -334 331 -235 -7 131 -192 312 -320 292 -190 145 -83 139 102 -44 202 -167
2091 -167 379 -296 379 -159 135 184 -176 449 -252 378 -128 163 -15 87 97 -50 229 -215 400 -345 335
2112 335 -130 -6 224 -221 268 -353 224 -174 66 -150 -30 39 -232 236 -345 253 -354 145 -163 -132 38
2133 38 -284 302 -399 202 -295 168 -176 -190 155 -316 202 -381 284 -265 36 -149 1 40 -278 347 -312
2154 -312 318 -256 215 -12 -143 289 -133 289 -243 271 -128 205 -28 65 181 -177 391 -249 409 -193
$$ packed form
2008i3L59l85L81n24O20m97M07l49K33P9n23Q24q80P07m62L47j29j72L45l44K95
2029B39n08O40n60L45k36J40J79n07O46o97N90n21L57q8k10L03m25N47n82M93
2049A45l51K54j99K0K53m58M89n86P77p82L71Q7k31L42n66P29o07L11j87K83j86
2070i2jK77m79N97o36O65n66K28J38l23N04o32O12m82L35k28K22l7j46K46l69
2091a67N46o75O75n38K94M9l60O25p01O30n06K91j78J02J0j47K79m44O15p45O80
2112C35m65J24K30m45M89o21N77l98K40k16J20O9k71M68n81N98o07M99l08L1J70
2133C8l22N86p01O01m97M63l44j4L45m71N18n83O65n49L01j85J50L9l18O25o59
2154c12O30n74M71k27j31M32m22M22n32N14l99L33k33R3J16l58N68o40O58o02
$$ plain form
2174 -193 136 135 -107 270 -168 394 -120 239 -109 172 -40 20 203 -269 300 -326 376 -166 19 112 -142
2195 -142 168 -328 189 -220 125 -179 102 -180 -138 183 -395 215 -399 220 -223 -75 14 -273 138 -257 128
2216 128 -293 194 -242 -35 17 -139 245 -329 295 -315 134 -61 -31 57 -89 194 -289 306 -222 222 -142
2237 -142 55 161 -151 266 -171 297 -210 232 6 11 117 15 288 -304 377 -160 213 -116 38 210 -184
2258 -184 259 -195 255 -202 168 -62 23 90 -203 339 -340 222 -217 187 -32 -153 66 -230 78 -308 231
2279 231 -249 47 -211 -19 100 -416 261 -327 130 -317 2 -58 -254 61 -176 99 -300 250 -253 126
2299 126 -97 -23 155 -340 302 -283 173 -63 47 6 -3 151 -141 215 -186 349 -219 150 56 -111 330 -169
2321 -169 384 -172 225 -42 129 95 86 191 -211 321 -196 249 -143 184 93 -164 247 -249 242 -201 182
$$ packed form
2174a93L29jk42L77m38N62n14L59l48K81k12O0J83m72N69o26P02n42J85R3k54
2195a42L10m96N17m09L45l04K81k82M2L21n78O10o14O19m43J48Q9k87M11l95L85
2216A28m21M87m36K07N2j56L84n74O24o10M49j95L0Q8j46K83m83N95n28M44l64
2237a42J97J06l12M17m37M68n07M42k26NJ06j02K73n92O81n37L73l29J54J72l94
2258a84M43m54M50m57L70k30Q5O7k93N42o79N62m39M04k19j21K19k96L08l86N39
2279B31m80K96k58J92J19n16O77n88M57m47L19o0j96L15k37K75l99N50n03L79
2299A26k23P4J78m95O42n85M56k36J10m1rJ54k92L56m01N35n68L69r4j67M41m99
2321a69N53n56L97k67J71l4rJ05m02N32n17M45l92L27r1k57M11m96M91m43L83
$$ plain form
2342 182 -154 50 60 -89 62 -248 288 -332 151 -151 40 -9 -242 180 -289 129 -326 135 -199 -43 -20
2363 -20 -196 134 -341 250 -208 117 -141 -52 119 -215 82 -202 245 -295 152 -73 24 16 -178 349 -219 183
2385 183 -88 210 -75 44 137 -55 196 -186 413 -188 217 131 69 161 -162 351 -137 191 -124 184 67
2406 67 49 84 -70 276 -245 303 -193 169 -32 -29 221 -235 179 -183 155 -185 151 -29 -34 9 -184 191 -282
2429 -282 236 -170 86 -86 -112 122 -319 202 -246 51 -268 63 -45 -188 85 -218 173 -330 214 -160
2449 -160 15 -44 -56 160 -256 238 -199 180 -97 87 69 2 207 -163 311 -160 218 -50 76 62 -38 186
2471 186 -148 297 -187 297 -109 20 155 -59 162 -127 295 -144 155 -117 153 -5 -168 231 -242 227
2491 227 -301 217 -33 -91 67 -119 165 -312 176 -166 59 -214 43 -21 -160 94 -303 190 -287 60 -148
$$ packed form
2342A82l36K04J0j49J51l10N36o20M83l02J91m9k33M22m69M18m55M61l34J56K3
2363b0j76L30m75N91m58L25k58Q9J71l34K97k84M47n40M47k25R7qj94N27n68M02
2385A83k71K98k85J19R3j92K51l82N99o01M05q6o2R2l23N13m88L28l15L08j17
2406F7j8L5j54L46n21N48m96L62k01LK50m56M14l62L38l40L36j80nM3j93L75m73
2429b82N18m06K56j72k6K34m41N21m48K97l19L31j08j43K73l03L91n03N44l74
2449a60J75n9j2K16m16M94m37L79k77J84j8o7K05l70M74m71L78k68J26j4j00K24
2471A86l34M45m84M84m06J29J35k14K21k89M22m39K99k72K70j58j63L99m73M69
2491B27n28N18k50n8J58j86K84m77M88l42K25k73K57o4j39K54l97M93m77L47k08
$$ plain form
2512 -148 -83 11 -197 199 -238 133 -196 67 -204 -48 82 -73 88 -298 237 -193 133 -65 19 134 -133
2533 -133 198 -176 215 -105 139 -29 54 133 -134 234 -183 281 -111 127 17 -10 243 -98 249 -91 207
2554 207 -114 121 24 0 80 -89 206 -251 229 -185 85 -12 -84 78 -253 209 -167 156 -188 107 -41 -136
2576 -136 53 -164 144 -298 177 -168 15 -56 -103 89 -245 116 -192 125 -166 -41 -39 -116 57 -253 181 -192
2598 -192 114 -124 97 8 -146 201 -105 149 -191 243 -91 -2 103 -29 219 -147 286 -115 203 -58 107
2619 107 95 -81 243 -104 215 -168 259 -23 23 106 -78 193 -123 199 -93 224 -79 84 29 -76 161
2640 161 -189 228 -169 90 -100 -10 75 -177 195 -192 69 -193 42 -102 -37 13 -200 96 -264 175 -233
2661 -233 95 -73 -136 -10 -163 114 -256 54 -94 51 -195 -11 41 -183 153 -255 239 -192 77 2 -42
$$ packed form
2512a48O5R4k08L96m37L71l29K63k71J56J30j55J61l86N35m30L26j98Q4J15k67
2533a33L31l74L91l20K44j68Q3P9k67L68m17M64l92K38j10k7K53l41L47l40K98
2554B07l21K35r7k4Q0j69K95m57M80m14K70r7p2J62l31M62l76L23l44K95j48r5
2576a36J89k17L08m42M75l45J83p1m7J92l34L61l08L17k91J25Kp7J73l10M34l73
2598a92L06k38K21q9j54L47l06K54l40M34l34Q9J05j32K48l66M33m01L18k61J65
2619A07j2j76L24l47L19l83M27k82M6Q3j84K71l16L22k92L17l03J63n5j05K37
2640A61l50M17l97K59j90R0Q5k52L72l87K61k62K35j44O5N0k13K96l60M39m08
2661b33L28j68o3J26j53K77l70L10j48J45k46J84N2k24L36m08M94m31K69p5m4
$$ plain form
2682 -42 131 -118 189 -130 203 -135 156 -8 -2 107 -147 350 -203 201 -40 87 22 20 114 -136 203 -80
2704 -80 250 -159 143 67 -33 126 -90 212 -191 144 -103 96 -57 -36 223 -169 199 -202 174 -138 -5
2725 -5 -6 -152 92 -155 103 -182 96 -211 7 -22 -123 85 -230 161 -298 120 -70 -113 -16 -124 96 -242
2747 -242 103 -121 88 -180 132 18 -98 201 -178 261 -232 157 -16 -35 86 -57 136 -110 222 -101
2767 -101 180 -79 133 43 -60 254 -137 305 -133 142 39 46 129 16 182 -50 196 -91 224 -92 60
2788 60 76 -108 147 -160 232 -139 38 -38 -16 -11 -143 102 -230 128 -175 64 -160 -109 87 -167 46 -287
2810 -287 98 -226 -54 -92 -25 17 -253 207 -250 63 -144 106 10 -79 99 -79 129 -187 216 -182 102 -71
2832 -71 -33 133 -226 194 -140 190 -116 52 63 -60 127 -24 193 -94 217 -117 168 -46 9 224 -199
$$ packed form
2682d2J73k49L07l19L33l38K91j64OJ09k54M97n53M04k41J27o5kR4k50L39k83
2704h0L30m09L02p6j00J59k16L02m03L35k47J99j53K1K59l92L68m01L76l12J33
2725ejj46K44k47K58k85K78l07K18k9j01K08l15L91m59M18j90m3R7j08K20l38
2747b42L45k24K09k68L12j14j16K99l79M39m93L89j73j9J21j43J93k46L32l23
2767a01K81k59K12r0j03L14l91M42m38K75j03PQ3j13J66k32K46k87L15l16J52
2788F0J6j84K55l07L92l71J77p6K2Nj32K45l32L58l03K39k24N1J96k54K13l33
2810b87L85l24J72l8O7M2k70M60m57L13k07K50r6q9J78j78K08l16M03l98K84j73
2832g1L8J66l59M20l34L30l06J68J1j23J87j51K17k87L11l34K85k14N5K15m23
$$ plain form
2853 -199 249 -136 149 -30 63 72 23 111 -80 225 -136 243 -129 107 23 -107 202 -180 205 -194 101 -86
2875 -86 -56 -68 -64 53 -160 132 -229 80 -204 62 -7 -128 127 -249 96 -147 61 -111 -14 -36 -116 66 -204
2898 -204 160 -158 97 -49 -22 75 -106 108 -118 130 -144 95 38 46 66 -62 253 -166 145 -135 60 -3
2920 -3 45 66 -23 89 -168 296 -112 167 10 32 79 -113 241 -132 100 -90 120 -21 1 74 -62 103 -220
2943 -220 193 -166 140 -53 -30 97 -204 152 -151 138 -103 24 -35 -60 -52 -140 158 -270 139 -178 63 -73
2965 -73 -98 138 -240 60 -174 91 -135 36 -27 -65 -7 -150 193 -201 186 -67 90 48 -7 195 -134 190
2987 190 -147 125 -83 168 21 -40 174 -63 245 -164 167 -5 63 52 -17 155 -134 201 -137 156 -62
3008 -62 74 46 -60 161 -160 206 -151 66 -9 98 19 -62 110 -161 159 -195 125 -43 -69 36 -101 113
$$ packed form
2853a99M48l85K85j79R3Rm9Q8j91L05l61L79l72K36q4j30L09l82L85l99K95j87
2875h6L0j2MJ17k13K92l61L09k84K66o9j21K55l76L45k43K08j72R7k2q0J82k70
2898b04L64l18K55j46K7R7j81K14k26K48k74K39n7QK0j28L15m19L11k80J95o3
2920cM8K1q9J12k57M64m08K79j57K2M7j92L54l73K32j90K10j41K2P3j36J65l23
2943b20M13l59L06j93K3J27l01L56l03K89k41J27n9k5Qq8K98m28M09l17K41j36
2965g3k5K36l78L00k34K65k26J71o3l8N8j43L43l94L87k53J57m2n5K02l29L24
2987A90l37K72k08K51j47o1K14k37L08m09L31j72O8j1o9J72k89L35l38K93k18
3008f2J36k8j06K21l21L66l57K17p5J07p9q1J72k71L20l54L20j68k6J05j37K14
$$ plain form
3030 113 -273 98 -115 50 -171 27 22 -165 113 -203 97 -268 103 -50 -46 2 -198 122 -159 110 -177 78
3052 78 -35 -57 57 -77 123 -183 190 -46 79 18 33 67 -89 228 -56 200 -102 177 -3 53 123 -116
3074 -116 152 -137 173 -115 156 41 2 86 -124 160 -118 140 -78 108 -42 -7 146 -134 138 -156 125
3095 125 -119 18 31 -79 91 -138 121 -189 139 -107 30 -35 -72 56 -167 163 -203 132 -133 23 -60
3116 -60 -52 79 -204 106 -162 79 -151 4 -6 -76 39 -134 174 -220 86 -35 -8 33 -87 199 -152 111
3138 111 -150 170 -101 18 84 -13 148 -113 233 -95 172 -37 132 84 -62 140 -107 226 -153 203 15
3159 15 85 49 -54 191 -169 156 -100 120 -78 25 17 -105 110 -151 200 -212 63 -31 -24 13 -142 119 -151
3182 -151 122 -131 71 -89 17 53 -138 35 -122 135 -210 -32 -82 -87 55 -85 130 -150 98 -92 86
$$ packed form
3030A13l86L71k13J65k21J98nj87K78l16L00l65L71j53MM8k00L20k81K69k87K55
3052G8j13k2J14j34K00l06L73k36J25o1J5L4j56L17k84K56l02K79j80N6P0k39
3074a16K68k89L10k88K71j15l9Q4k10K84k78K58k18J86j50L5J53k80K72k94K81
3095A25k44J37J3j10J70k29K59l10L28k46J37o5l7J28k23L30l66L35k65J56q3
3116f0QJ31k83L10k68K41k30J55j0p0J15j73L08l94L06j21K7M1j20K86l51K63
3138A11k61L20k71J19O6r7J61k61L46l28K67k09J69m8j46K02k47L33l79L56j88
3159A5P0l6j03K45l60L25k56K20j98J03qj22K15k61L51m12K75r4PL7j55K61k70
3182a51K73k53K02j60J06L6j91J73j57K57l45J78n0nJ42j40K15k80K48j90J78
$$ plain form
3203 86 -116 12 52 -100 153 -187 177 -139 73 -6 -18 93 -120 192 -68 113 -59 128 0 4 132 -75
3225 -75 186 -113 202 -66 124 37 -4 59 -67 112 -89 146 -104 124 15 -40 144 -139 145 -142 102 -103
3247 -103 11 -13 -100 66 -121 72 -107 74 -198 32 -42 -97 40 -248 143 -176 5 -50 66 -14 -102 97
3269 97 -125 184 -190 152 -124 32 28 -57 113 -150 150 -100 95 -87 47 20 -72 114 -139 224 -104 106
3291 106 -33 19 35 -21 178 -84 114 -62 127 -64 88 65 -46 206 -109 173 -77 100 1 -28 42 -70
3313 -70 126 -134 98 -102 75 -32 5 31 -163 109 -146 120 -129 42 -28 -62 12 -102 103 -200 105 -152
3335 -152 24 -93 -48 102 -145 102 -192 99 -139 -7 -84 -20 22 -138 89 -171 77 -145 116 -32 -87 102
3357 102 -125 200 -147 117 -7 103 -43 32 81 -112 172 -115 115 -74 109 45 -50 81 -8 198 -60 112
$$ packed form
3203H6k02J28M0j52K53l40L64l16K12p9j2J11k13L12k60J81j72J87j28MJ28k07
3225g5K61k99L15k68J90q7m1O3j26J79k01K35k50K28j09n5J84k83K84k87K44k05
3247a03J14k4q7J66j87J93j79J81k72K30p4n5J37k88L91l19J81n5J16q0q8J99
3269I7k22L09l74L42k76J56mq5J70k63L00k50J95j82J34k7r2J86k53L63l28K10
3291A06j39N2J6n6J99k62J98j76J89j91J52k3j11K52l15K82k50J77r9k9P0j12
3313g0J96k60K32k00J77j07L7K6j94K72k55K66k49J71p0l4P4j14K05l03L05k57
3335a52J76j17M5J50k47K47k94K91k38J32p7O4M2j60K27k60K48k22K61j48n5J89
3357A02k27L25l47K64j24J10j46P5M9j93K84k87K30j89J83o4r5J31q9K06k58J72
$$ plain form
3379 112 -45 142 -4 21 105 -108 153 -106 188 -90 51 56 -59 100 -116 99 -59 122 -102 92 -3 -171
3401 -171 127 -190 115 -157 39 -61 -40 -18 -93 -11 -126 84 -200 81 -102 16 -22 -170 87 -185 45 -104
3423 -104 58 -26 26 -21 -27 105 -96 141 -128 112 -22 30 77 -116 138 -121 125 -73 73 26 77 72 -37 146
3447 146 -111 134 -83 93 12 28 49 -27 107 -42 160 -148 108 9 40 35 -29 151 -132 116 -119 81 -22
3470 -22 -16 84 -69 105 -93 71 -140 -23 -29 -37 29 -141 138 -82 8 -148 68 -32 -82 7 -68 69 -199 46
3494 46 -126 33 -86 -48 103 -106 116 -113 97 -49 46 -35 -49 10 -98 143 -205 161 -81 57 -3 -80 143
3517 143 -97 89 -52 122 -43 70 30 -24 113 -77 183 -98 93 -17 55 56 -37 105 -48 92 -72 73
3539 73 -119 23 75 -46 80 -95 143 -132 77 -90 -51 -33 -103 65 -160 88 -130 75 -45 -37 3 -98 65
$$ packed form
3379A12j57J87j46K5Q4k13K61k59K94k78J41Nj15J59k16K15j58J81k24J94r5j68
3401a71K98l17L05k72J96j00K1K2p5Q2j15K10k84K81j83J18l8j48K57k72K30j49
3423a04J62q4N2m7oJ32k01K37k69K40j34N2M7j93K54k59K46j98J46m7N1nj09J83
3447A46k57K45k17J76q1J6K1p6J34j49K02l08K56r9L1no4J80k83K48k35K00j03
3470b2OJ00j53J74j98J64k11J17oqO6j70K79k20R0j56K16j00n0Q9p5J37k68K45
3494D6j72J59j19L8J51k09K22k29K10j46R5q1j4N9j08K41l48L66k42J38o0p7K23
3517A43k40J86j41J74j65J13m0n4J37j90K60k81J91j10P2Jr3J42j53J40j64J45
3539G3j92J42N2j21J26j75K38k75K09j67L9J8p0J68k25K48k18K05j20QM0j01J63
$$ plain form
3562 65 -160 63 -98 53 -71 20 2 -128 76 -153 15 -187 65 -11 25 9 -112 112 -103 85 -52 47
3584 47 -2 80 55 -62 132 -39 136 -74 9 -27 57 127 -112 148 -83 100 -59 142 35 -33 63 -82 126
3607 126 -96 162 -91 19 4 -7 103 -81 77 -46 64 -73 15 -17 -26 66 -85 75 -120 107 -71 12 5
3630 5 -50 69 -83 53 -145 80 -146 38 -66 -40 66 -121 105 -169 51 -61 48 -45 -76 27 -125 81
3652 81 -122 66 -101 -21 -16 -19 48 -114 93 -153 126 -55 20 -20 -37 132 -67 113 -110 118 32 32 65 -1 71
3677 71 -76 149 -96 84 -24 41 77 -24 144 -76 63 -79 132 -23 22 44 1 38 -173 46 -75 64
3699 64 -90 -5 33 -157 43 -138 160 -117 41 -27 -53 -46 -101 45 -188 50 -136 61 -43 1 17 -63 72 -112
3723 -112 127 -40 41 -57 -15 65 -74 54 -100 107 -51 93 12 -29 -1 -58 99 -94 124 -78 97 23 -55
$$ packed form
3562F5k25K23j61J51j24R1j8j30K04k29J68k02K52p6L6j6j21K24k15J88j37R9
3584D7m9Q2k5j17J94j71J75k10Q3l6Q4P0k39K60k31J83j59K01j07o8R6j45K08
3607A26k22K58k53J10j5j1J10j84J58j23J10j37Q8l2rR2j51J60j95K27j78Q3p
3630En5J19j52J36j98K25k26J84j04K6J06j87K26k74K20j12J09r3l1J03j52K06
3652H1k03J88j67Q0NlO7j62K07k46K79j81P5m0j7J69j99J80k23K28q6%L3o6P2
3677G1j47K25k45J80j08O5L6j01J68k20J39j42K11j55M5K2m3L7k11K19j21J39
3699F4j54Q5L8j90K00j81K98k77J58o8k6Pn5J46k33K38j86J97j04M4J6q0J35j84
3723a12K39j67Q1r8M2Q0j39J28j54K07j58J44q1m1K8n7J57j93K18k02J75p4p8
$$ plain form
3746 -55 69 -83 115 -95 146 -75 24 -6 57 117 -99 149 -97 138 -29 -20 61 -35 92 -38 114 -106 89
3769 89 -40 58 -50 -71 47 -124 101 -169 63 -94 -21 -57 -54 0 -114 61 -114 74 -110 12 -31 -51 39 -159
3793 -159 85 -101 45 -66 -72 9 -64 45 -57 41 -99 85 -64 31 62 -43 60 -93 88 -50 26 -39 53
3816 53 50 -30 105 -27 153 -106 91 -73 35 52 -23 129 -52 112 -70 125 13 28 84 -27 76 -69 145
3839 145 -121 99 -17 36 43 -78 74 -39 109 -122 28 -122 30 -6 -73 90 -179 90 -99 -29 -62 -73 42
3862 42 -118 44 -144 107 -117 72 -55 -65 35 -90 120 -147 93 -50 -14 -7 -5 35 -58 27 -101 139 -89
3885 -89 75 -27 -3 94 -96 126 -82 92 -30 36 -9 49 67 -91 119 -64 133 -60 81 72 -20 61 -32 116
3909 116 -50 90 12 37 -36 -20 89 -124 84 -89 96 -64 14 -21 -43 45 -97 64 -50 102 -57 51 -26
$$ packed form
3746e5J24j52J98k10K41k21R9l0O3O0k16K48k46K35j67RQ1r6J27j30J52k20J95
3769H9j29R8j08k1J18j71K25k70K32j57P3l6LN4j14J75j75J88j84J22m3k0R0j98
3793a59K44j86J46j11oQ1p3J09j02R8j40J84j49R5L1j05J03j53J81j38P6o5R2
3816E3lq0J35j32J80k59J97j64J08J7p5J52j81J64j82J95j12J5N6j11J03j45K14
3839A45k66K20j16N3Pj21J52j13J48k31J50j50J52l6o7J63k69K69j89P0l3j1J15
3862D2j60J62j88K51k24J89j27j0J00j25K10k67K40j43L6PKM0r3Q5j28K40k28
3885h9J64j02K4R7j90K22k08J74j22O6m5N8J8j58K10j83J97j93J41rr2Q1r3J48
3909A16j66J40p8K5p3J6J09k13K08j73J85j60P8l5k2Q8j42J61j14J52j59J08p7
$$ plain form
3932 -26 -55 45 -141 79 -133 -30 -83 -12 20 -80 10 -99 66 -120 25 -159 45 -4 -129 95 -146 104
3954 104 -111 23 6 -63 -5 -56 100 -54 96 -76 82 -26 15 43 -22 117 -81 90 -95 91 -24 104
3976 104 51 -56 58 -81 112 -84 84 -69 -62 55 -39 86 -48 104 -30 78 -84 -18 50 -91 68 -129
3998 -129 85 -73 16 -3 -39 72 -53 21 -100 43 -121 41 -66 -81 -26 -99 46 -139 12 -47 6 -20 -100 -8
4022 -8 -63 27 -96 122 -100 7 -57 -33 50 -66 134 -98 86 -82 48 53 -67 1 -47 99 -61 99 -48 23
4046 23 -31 -12 130 -73 120 -88 113 -22 34 -25 -9 36 -64 94 -93 157 -104 50 23 -34 46 -62 112
4069 112 -73 114 -43 -7 11 -35 61 -105 78 -82 88 -82 -9 -4 -51 33 -92 68 -76 -2 -77 7 -47 -101 53
4094 53 -112 56 -88 23 -83 -16 7 -60 52 -117 51 -114 105 -31 -36 6 -19 57 -91 128 -39 64 -25
$$ packed form
3932b6k9J00j86K20k12J03n3P1L2j00R0j09J65j86J45j84K04m9j25K24k41K50
3954A04k15J34j7o9N8n1J56j54J50j72J58j08M1K8o5J39j98J71j85J86j15J28
3976A04n3j07J14j39J93j96J68j53PJ17r4J25j34J52j34J08j62O6O8j41J59j97
3998a29K14j58Q9j9l6J11j25P4j21J43j64J62j07j5N5p3J45j85J51n9N3k6q0R2
4022hn5R0j23K18k22J07o4K4Q3j16K00k32J84j68J30Nj20O8m8J46j60J60j47P1
4046B3n4J9J42k03J93k08K01j35N6n9J6M5j00J58j87K50k61J54k7n7Q0j08J74
4069A12j85J87j57L6J8m6R6j66J83j60J70j70P3Nm7Q4j25J60j44P4p5Q4n4n4J54
4094E3j65J68j44J11j06O7K3o7J12j69J68j65K19j36nM2k5P6j48K19j67J03q9
$$ plain form
4117 -25 62 87 -55 69 -90 87 -97 61 3 58 47 -53 61 -39 82 -19 93 -20 -14 66 -53 40 -74
4140 -74 123 -29 34 -12 29 45 -72 64 -124 62 -123 27 -49 -71 27 -93 23 -84 61 -112 20 -63 -68 -5
4164 -5 -115 63 -95 103 -59 2 -41 -27 19 -101 84 -97 103 -97 28 -33 -38 0 -110 78 -37 87 -53
4187 -53 28 -13 -31 46 -111 145 -93 65 16 51 97 29 87 -37 84 -56 61 -59 80 35 -13 75 -57 47
4211 47 -94 56 -47 97 59 -36 62 -64 92 -120 53 -44 -4 -11 -41 33 -143 79 -91 42 -71 -57 34 -85
4235 -85 81 -86 49 -123 73 -71 -37 10 -24 110 -129 46 -94 37 -72 -35 47 -97 76 -77 62 -34
4257 -34 54 -48 -21 18 -102 144 -78 67 -46 63 11 -44 101 -60 94 -121 70 -9 52 -7 -31 114 -62
4280 -62 62 -36 82 -1 38 -20 29 57 -28 124 -73 61 -41 65 -8 9 44 -62 92 -63 98 -89 -2 -18
$$ packed form
4117b5Q7K5j42J24j59J77j84J58n8N5j1j00J14j00J21j01J12j13OQ0j19R3j14
4140g4J97j52O3m6M1J6j17J36j88J86j85J50p6k2R8j20J16j07J45j73J32q3nO3
4164ej10J78j58J98j62O1m3J4M6j20J85j81K00k00J25o1nL8j10J88j15J24j40
4187e3Q1m1j8P7j57K56k38J58m9L5M6o8N8j24J21j40J17j20J39m5m8Q8j32J04
4211D7j41J50j03J44l8r5R8j26J56k12J73r7M0pl0P4j76K22j70J33j13J4R1j19
4235h5J66j67J35j72J96j44L4M7l4J34k39J75j40J31j09L7Q2j44J73j53J39r6
4257c4Q8j02K7L9j20K46k22J45j13J09n2n5J45j61J54k15J91p9O1n9k4J45j76
4280f2J24r8J18q3L9n8M9K8q5J52j97J34j02J06p3J7L5j06J54j55J61j87Q7j6
$$ plain form
4304 -18 -36 -21 -78 21 -151 50 -114 11 -54 -29 36 -114 48 -122 57 -103 -2 -57 -59 17 -97 70 -76 78
4328 78 -2 66 -26 -74 128 -20 81 -63 24 -64 71 -9 -38 87 -83 125 -77 27 -29 57 66 -64 133 -54
4352 -54 48 -54 113 -8 0 57 1 111 -52 124 12 89 -37 20 77 -25 73 -32 75 -55 124 -10 -15 1
4376 1 -49 85 -86 37 -68 81 -86 23 1 -110 17 -94 80 -73 -36 -57 -63 -5 -75 63 -129 17 -111
4399 -111 -4 -76 0 9 -78 59 -90 93 -131 42 32 -45 23 -2 91 12 85 -38 11 -79 -7 89 -16 111 -87
4424 -87 20 -47 32 31 -2 -1 24 95 -1 65 -16 65 32 -46 88 -47 126 -51 64 -27 -12 35 18 22 -107 53 -9 60
4452 60 -112 22 1 -32 56 -61 40 -69 -9 -70 -13 -60 -49 62 -69 5 -94 13 -108 4 9 -29 41 -146 51
4477 51 -60 39 -38 43 38 -68 68 -88 87 -84 57 -62 -23 -18 -12 116 -40 84 -75 99 -53 -7 21 -23 118
$$ packed form
4304a8j8J5n7R9j72K01j64J25o5K5O5j50J62j70J79j60J01n5kP6j14J67j46J54
4328G8q0O8r2m8K02j48J01j44Q7q8J35q0k9J25j70K08k02J04n6Q6Rj30J97j87
4352e4J02j02J67j21QN7n6J10j63J76j12P7j26N7N7j02R8j05J07j30J79j34nJ6
4376An0J34j71J23j05J49j67J09k2j11J27j11J74j53L7k1oN8p0J38j92J46j28
4399a11J07p2P6Rq7J37j49J83k24J73j0p7O8k5R3p9P3j23M9r0P2R6j05J27j98
4424h7J07o7P9jl3JK5P1r6O6q1Q1l3p8J34j35J73j77J15r1J5M7j7Mj29J60o2O9
4452F0j72J34k1l3Q8j17J01j09O0o1N7m7J1J11j31P4r9J07j21J12Nl8P0j87J97
4477E1j11R9p7Q1nj06J36j56J75j71J41j19L9NOJ28j56J24j59J74j52M6K8m4J41
$$ plain form
4502 118 -65 99 -21 62 -42 44 -4 -50 100 -44 119 -58 83 -13 -32 35 -50 115 -107 51 -73 3 -70
4525 -70 -27 -34 -82 38 -35 70 -54 -9 -29 -2 25 -43 94 -54 -32 -72 -24 -27 -34 -30 -48 26 -130 60 -73 22 -11 -4 -4
4554 -4 -42 28 -77 73 -24 35 12 20 12 -94 141 -43 47 1 -19 22 -33 115 -49 62 -94 99 -10 77 -14 35
4580 35 108 -10 52 -75 100 -90 10 22 -24 23 -76 114 -37 43 -20 -12 4 -61 45 -69 29 -77 69 -47 16
4605 16 19 -17 6 -97 88 -67 38 -76 18 10 -59 33 -47 -9 -72 42 -90 60 -24 -18 98 -96 74 -107 29
4630 29 -50 19 36 -16 1 -48 76 -95 -5 -43 24 -2 -18 62 -75 122 -36 64 1 22 35 -14 64 -52 45 -78
4656 -78 9 23 -12 1 -3 71 -81 89 -15 48 -25 14 11 5 70 -85 34 -43 0 -41 -1 16 -82 83 -56 86 -108
4683 -108 -34 10 -33 45 -68 12 -67 78 -109 -30 -24 -84 -7 -74 77 -77 38 -94 24 -8 38 -12 -38 16 -146 52
$$ packed form
4502A18j83J64j20Q3j04Q6m8m6J50j44J63j77J41r6j9O7q5J65k22J58j24P6p3
4525g0M3pm8J20p3J05j24M5k0K7K7o8J37j48K2m0M8lpMj8P4j56J90j33R5l3P%
4554dl8P0j05J50r7N9k3Qqj06K35j84R0m6k0M1n5J48j64J11j56J93j09Q7r1M9
4580C5P3j18O2j27J75j90J00J2m6M7r9J90j51Q0o3QJ6o5J06j14R8j06J46j16O3
4605A6Ll6K3j03J85j55J05j14R4qo9R2q0L8o3J14j32J50q4OJ16j94J70j81J36
4630B9p9O9J7n2J7m9J24j71R0l8O7k6j6Q0j37J97j58J00o3K1J3m9P8j16R7j23
4656g8Q7J4l5J3mP4j52J70j04O3p3L9loO5j55J19p7M3m1M0J7r8J65j39J42j94
4683a08P4M4m3P8j13Q0p9J45j87P9Oo0P7o7J51j54J15j32J18l2M6n0k6N4j62J98
$$ plain form
4709 52 -82 16 16 35 -4 -30 22 -15 77 -53 11 3 25 32 -13 107 -31 60 -9 94 43 -31 12 -34 1 -49 30 -60 49
4738 49 12 -31 15 -53 8 -87 32 -38 -29 3 -19 31 -68 31 -23 9 -30 -21 5 -40 16 -71 41 -70 70 -48 -10 1 -45
4767 -45 5 -51 15 -93 43 -21 4 -11 -35 16 -95 88 -59 6 -44 -46 17 -27 45 -67 13 -54 64 -10 41 -22 -57
4794 -57 104 -28 48 -74 47 25 1 -9 -23 66 -53 138 -57 85 -10 -25 32 18 89 -46 90 -3 78 -45 7
4819 7 39 -58 74 -70 59 -36 4 -21 -13 82 -90 -2 -98 46 -95 40 -26 -14 36 -75 91 -97 -11 -38 56 -41
4845 -41 -26 28 -41 54 -56 51 -38 19 -9 -26 10 -57 81 -40 82 -49 0 -15 1 34 -111 44 -41 65 3 44
4871 44 51 16 41 -105 66 -39 42 -8 47 22 27 61 -34 70 -50 74 13 72 22 -9 21 -121 110 -62 58 -62
4897 -62 8 -35 -30 56 -88 83 -52 46 -26 -30 -34 -104 28 -55 68 -48 1 -93 43 0 -38 18 -61 54 -142 40 -27
$$ packed form
4709E2j34R8%J9l9k6N2l7R2j30O4qK2Pm5J20j38R1o9J03n1p4M3m6L5n0P9r0J09
4738D9l7m3M6o8O1r5J19p0RL2k2N0r9R9n4L2l9RK6m5N6q7J12j11J40j18L8J1m6
4767d5N0n6O6j08J36o4K5j5k4N1j11J83j47O5n0kO3m4P2j12Q0o7J18p4N1o3l5
4794e7J61j32P6j22J21k2k4j0j4Q9j19J91j95J42r5j5N7j4P1j35J36r3Q1j23N2
4819GL2r7J32j44J29r5M0k5QR5j72Q8r6J44j41J35o6J2N0j11J66j88Q6k7R4r7
4845d1J5N4o9R5j10J07q9N7k8j7L6o7J38j21J22j31M9j5J6L3j45J55q5J06o2M1
4871D4Pl5K5j46J71j05Q1n0N5k5NL4r5J04j20J24o1N9n0l1L0j42K31j72J20j20
4897f2P0m3NQ6j44J71j35R8p2mmp0J32q3J23j16M9r4J36m3l8N6p9J15j96J82o7
$$ plain form
4924 -27 -17 -2 -23 91 -75 39 -103 75 37 -42 16 -36 85 -115 61 -61 24 -44 56 37 -35 87 -76 52
4948 52 -84 57 43 3 47 -39 76 -57 45 -19 50 40 -22 15 -31 119 -51 57 -38 74 7 -65 43 -46 94
4973 94 -80 54 -61 17 -6 -17 16 -16 77 -120 42 -68 -18 -17 -30 62 -60 58 -80 42 -48 1 -9 21 16 -25
4999 -25 48 -43 67 -82 4 55 -63 42 -117 86 -94 71 -2 48 -27 29 54 -6 77 -84 65 -28 17 -1 -3 22
5025 22 -27 64 -14 47 22 69 -22 -74 39 -49 83 -34 59 -39 23 59 -39 76 -55 18 -73 29 -57 13 -8 21 28 -61
5053 -61 11 -95 -9 -6 -36 20 -35 -39 -71 6 -66 69 -40 22 20 -114 20 -88 20 -64 -10 -8 -58 0 -34 6 -87 37
5081 37 -61 33 -25 -5 -15 -31 52 -61 84 -70 91 -28 -3 59 -56 78 -38 47 -44 61 76 20 101 -88 5
5106 5 -71 45 -72 -10 -43 -16 54 -16 53 -55 84 -108 -41 -19 -52 34 -88 82 -35 54 -26 -16 -13 -12 43 -95 33
$$ packed form
4924b7J0J5k1J14j66J14j42J78l8p9N8n2J21k00J76j22Q5o8J00j9p2J22j63J28
4948E2j36J41j4m0M4q6J15j33J02o4O9j0o2L7m6J50j70J08r5J12o7p2J08q9J40
4973I4j74J34j15P8k3j1L3l2R3j97J62j10N0Jj3R2j22J18j38J22r0M9j0L0nm1
4999b5P3r1J10j49Q6N1j18J05j59K03j80J65p3N0p5N6K5o0Q3j61J49r3M5j8kK5
5025B2m9R1p8O1k5M7r1n2J13q8J32j17R3r8O2L6r8J15j31P3r1J02q6P0k1K9Pq9
5053f1P2j06Q6Ll0N6n5ml2P7p2J35j09O2kj34J34j08J08q4N4Kn0N8l4M0r3J24
5081C7r8R4n8K0j0j6Q3j13J45j54J61j19K5O2j15J34j16Q5r1J05J5n6Q1j89R3
5106Ep6J16j17O2l3K7P0p0O9j08J39j92O7K2l3Q6j22J70j17Q9q0J0LJN5j38J28
$$ plain form
5133 33 -87 -14 2 14 -15 14 6 -83 -15 -52 49 -96 37 3 -60 39 -31 38 -105 56 -36 -13 0 -8 22 -51 56 -2
5161 -2 51 -48 26 55 -12 58 -111 83 -27 85 -48 16 29 17 42 -38 104 -40 98 -12 -19 25 -52 30 -39 40 -47
5188 -47 -20 -22 -13 -2 2 13 -123 122 -80 38 -16 -28 64 -47 32 -51 26 -124 17 -26 -18 15 -45 74 -82 85 -30
5215 -30 32 -61 2 -3 -86 -27 -63 19 -69 74 9 -52 44 -58 -14 -46 46 -72 -25 21 20 24 -37 39 -74 28 -29 40 -8
5244 -8 33 80 6 64 -23 59 -41 33 -16 -27 75 -57 109 -34 82 -31 36 -5 27 3 -53 62 -10 77 -29 40
5270 40 36 -4 4 -45 70 -47 35 31 50 45 -69 14 -48 30 -82 42 -34 18 -54 -53 18 2 64 -71 12 -101 -13 0 12
5299 12 32 -47 83 -45 94 -37 41 -33 5 29 -123 56 -53 16 -37 17 9 11 79 -37 39 -37 72 -7 -7 77 -68
5326 -68 96 -28 48 -33 64 15 -10 48 11 11 -32 73 -74 78 -16 -7 -5 -37 81 -45 66 -91 36 22 -35 0 -75
$$ packed form
5133C3j20P3J6J2k9K9qq9O8l7J01j45J33l4o3R9p0O9j43J61r2K3J3qL0p3J07n8
5161bN3r9P4K9o7P0j69J94j10J12j33O4J3j2K5q0J42j44J38j10pM4p7Q2o9P9q7
5188d7K7kRJ1MJ1j36K45k02J18n4j2R2j11P9q3P7j50J41m3QL3o0J19j56J67j15
5215c0O2r3O3nq3N9l6Q2q8J43o5o1R6j02M4l2R2j18M7M6jMo1P6j13J02n7O9m8
5244hM1M7p4N8q7Q2j00P4m9j1J02j32J66j43J16j13O7m1L2k4n6J15p2Q7j06O9
5270D0mm0Qm9J15j17Q2mJ9nj14Q3o2P8j12J24p6N2p2JP1j6O2j35Q3j13Q8J3J2
5299A2K0p9J30j28J39j31P8p4L8K4j52J79j09O9n3N4qKO8j16P6p6J09p9%Q4j45
5326f8J64j24P6q1R7m9k5N8l7%m3J05j47J52r4RKl2J18j26J11j57J27j4n7L5p5
$$ plain form
5353 -75 34 -104 67 -20 1 -17 23 1 5 61 -70 60 -102 11 -38 -39 -24 -69 41 -91 31 -81 22 -16 18
5378 18 32 -17 68 -109 56 -74 39 8 -3 19 -18 73 -22 78 -9 29 11 -9 63 -79 57 -53 1 -25 24 31 -32
5405 -32 88 -32 58 -26 50 44 34 -1 41 59 -44 69 -23 47 -20 31 9 -37 32 -25 31 -70 11 -26 -18 17 -66 35
5433 35 -80 58 -89 18 -43 -26 -27 -41 45 -76 47 -136 39 6 -6 -31 -38 -25 -66 35 -40 14 -78 -17 52 -41 52
5460 52 -18 40 -7 44 -25 3 36 -38 53 -35 110 -21 54 -54 43 81 -49 45 -19 49 -15 52 39 38 48 -28 62 -30 7
5489 7 0 53 -15 -30 2 -48 39 -63 89 -3 8 -11 33 2 -67 35 -17 9 -63 -34 -52 -10 -16 -81 37 -31 -9 -46 -18 -14
5519 -14 -33 78 -38 79 -62 -20 -20 13 33 -49 -8 -75 70 -43 71 -31 9 -3 -9 20 -80 71 -26 -14 -22 1 -20
5546 -20 -2 31 -47 50 -58 35 -12 -1 -14 -53 56 -52 62 -39 34 -16 67 -33 -19 35 -20 70 -5 29 0 45 8
$$ packed form
5353g5J09j38J71q7K1j8M0k2MN6j31J30j62J13m9jJ5m5J10j32J22j12J03l8L4
5378A8J4m9Q5j77J65j30J13l1j1K2l7R1r5J00q7L8j8k0P2j42J36j10N4k6M9Po3
5405c2J20j20R0q4P6oj0l5M2J8j03J13r2P0o7N1k2m6O9n7N6j01Q1l7QL5q3J01
5433C5j15J38j47J07o1J7jj4Q6j21J23j83J75l3j2k5pJ3m1J01p5N4r2O1O9r3R3
5460E2p0N8m7N1o9K8L3p4R1q8J45j31P5j08R7L8j30R4o4O8o4O7j3jJ0p6R0r2L7
5489GpN3o8j5L2n0Q7j02J52r2J1j9M4l1o9J02n2K6p2K9j8M2oo5J18o8K2l7K8M
5519a4j9J11j16J17j41M2%L3K0q2M1o7J45j13J14j02M0j2oK9j00J51r7J2qK3k1
5546b0J8L3p8R7j08R3m7J1j3l9J09j08J14j01P3n0Q3j00J4N4n5R0p5L4k9M5l7
$$ plain form
5573 8 -13 51 -41 22 -28 34 -3 -24 -23 -23 19 -80 57 -61 39 17 -34 -16 -64 -10 -47 2 -58 -50 -74 21 -39 -31 29 -27 18
5604 18 -39 16 -62 -18 12 -48 32 -51 53 -29 33 32 -7 26 -51 45 -38 94 -94 25 9 -4 -2 -66 68 -69 72 -53
5632 -53 46 24 7 41 -4 38 -13 34 -4 15 -22 5 25 -32 62 -71 69 -2 35 -21 -8 21 -42 51 -42 40 -34 26 -38
5661 -38 27 -7 -65 25 -50 15 -55 -15 -7 -37 43 -105 24 -17 27 -27 25 4 -3 47 -47 28 15 18 -8 -2 -71 -1 22 -23 62
5692 62 -5 63 -26 5 68 -32 59 -15 100 2 39 -28 26 -45 -29 27 -73 67 -35 71 -11 12 46 -15 49 -48 12
5719 12 -22 20 -29 25 43 -76 3 3 34 -92 -15 -48 26 -8 -44 33 -10 -26 -31 0 27 43 50 -60 -25 -24 12 -60 4 -32 -41
5750 -41 11 -74 27 -96 60 -60 -21 -53 -34 18 -64 25 -55 22 -108 37 20 -31 42 -44 45 -79 80 -27 28 20
5776 20 -20 47 -38 7 12 14 -33 52 78 -39 38 -38 49 -13 90 -38 38 -17 -51 19 -67 49 -45 68 14 3 36 9 -13
$$ packed form
5573Hk1O4r2O3n0O2l7k1J%M2r9J37j18J00k2n1J8m8N4l7M9o0Qk4R5o0QO0n6M5
5604A8n7N5p8M4L0o0Q0q3J04q2O2jl9L3p7R6q3J32j88J19j6j3Ko4J34j37J41j25
5632e3R9k2j7L4m5M2n1M7l8J9l7K7K0n7R4j33J40p1L7n6J3K9o3R3r3Q2p4O0o4
5661c8O5l4n8R0p5O5p0M0Ql0Q0j48J29m1M4n4N2k1pN0r4P5j3Lk6Oo9P0K3m5Q5
5692F2o7O8q9L1O3j00R1p4J15r8L7o7N4p1J6N6j00J40j02J06q2K3L4o1O4r7O0
5719A2l4M2m9N4J8j19P9%L1j26P7l3P4l4l6P7m3j6nL1K7J6Pj10L5JL6p2O4l6r
5750d1N2q5J01j23J56j20L9l2J9N2q2Q9q0P7j30J45j7n1P3q6Q9j24J59j07N5q
5776B0m0O7q5M5NKm7Q5K6j17P7p6Q7o2J03j28P6n5l4P0q6J16r4J13n4j1L3k7k2
$$ plain form
5805 -13 -61 84 -32 24 13 6 -29 -22 -16 -52 46 10 61 -35 -5 -2 -25 -10 -27 15 -69 23 -44 -20 15 8 -27 -12 35 -17 -17 -58
5837 -58 -20 10 -38 -9 -3 67 -75 81 15 -22 29 -17 23 -18 53 -16 51 -14 51 41 -19 22 -73 51 4 52 23 50 66
5866 66 -41 60 -18 46 -32 -14 68 10 9 -48 48 -68 19 -39 -26 -24 -29 21 -42 38 -45 25 -68 7 -29 -36 21 -32 49 -67
5896 -67 -4 -57 -5 -11 -44 6 -19 52 -23 33 -43 58 -10 -38 5 -52 50 -52 20 -12 -18 -17 -14 62 0 76 -30 20 29 50 19
5927 19 2 17 -35 63 -66 59 -15 47 -12 24 67 -51 4 -29 74 -12 29 2 44 31 -87 63 -39 31 -30 10 -54
5954 -54 -40 -21 -43 40 -81 18 3 -20 -24 14 11 -59 -26 -31 -12 -56 7 -25 -44 15 -54 41 -4 69 -26 20 11 -14 2 -43 29 -47
5986 -47 18 -28 -43 -27 -55 90 -32 17 -13 -2 -5 -38 10 3 6 -41 24 -12 41 -24 24 42 5 37 -28 71 -36 38 21 -3
6016 -3 37 -16 78 -96 75 16 26 26 2 16 -31 31 -76 37 -66 21 -18 -22 17 -74 59 -75 5 -37 30 0 -66 -24
$$ packed form
5805a3m8J45j16N6j1pl5POl6R8l6N1r6L0Lk3J5j7M2q4R2o7K4L5pl5J5M7n2%m1
5837e8L8L0m8K9OP0j42J56o6l7N1m6M0m1P1o9O7o5O5j0o0M1r5J24m7M8k9K7J6
5866F6j07J01p8O4p8J8Q2n8jn7R6j16Q7n8J3KnN0o3Q0q3P0r3P5l6pN7n3Q1j16
5896f7O3n3N2ol3N0k5P1p5N6p6J01o8k8M3n7J02j02P2l2oJLP6o2P6j06N0RK1l1
5927A9j7J5n2R8j29J25p4O2n9L6M3j18N5l3J03q6M1k7M2j3j18J50j02P0o1M0o4
5954e4J4J9k2Q3j21R9j5k3mL8lp0L3nJ9m4O3l2j9N9o9R5m5P3r5M6rk5J6m5P2p6
5986d7O5m6j5J6k8J45j22M9l0J1ll3M8pLm7O5l6N3o5M8J8l7L2o5R9j07P4j7k4
6016cM0n3R4j74J71n9J0%k4J4m7O2j07J13j03Q7l9mL9r1J33j34Q0m2O7l0o6M2
$$ plain form
6044 -24 -82 -3 -53 49 -57 -25 -3 2 35 -97 44 -37 68 -3 -8 -24 -18 42 -34 32 -24 73 -73 12 -4 -72 41 -22
6072 -22 19 -31 38 -27 34 -14 -4 36 -31 15 -60 35 -11 -16 42 7 54 -82 17 6 34 53 54 -16 -17 28 -15 -2 -57 45 22
6103 22 30 -1 -1 42 -45 46 -47 85 -21 26 -5 -59 8 -72 36 -64 -2 -69 -30 13 13 34 -49 1 -64 47 -40 6 -16
6132 -16 -64 57 -63 59 -71 20 -80 -9 10 26 0 -104 88 -60 21 41 49 33 -46 7 -25 55 -17 37 15 -14 46
6159 46 -15 21 -8 62 4 18 -33 4 75 -40 41 -17 55 -50 2 -21 33 60 -64 0 -64 26 -20 2 7 -69 73 -59
6187 -59 54 -56 12 -40 -18 -18 5 28 -65 18 -49 18 -49 -29 -62 2 1 -22 15 -51 36 -16 -3 14 -50 37 -77 43 -73
6216 -73 68 -27 -4 18 25 59 -38 52 5 73 -55 51 58 -65 25 -22 65 -22 9 -29 0 -4 -22 37 -12 27 -32 41 42 -12
6246 -12 51 -54 -66 -60 97 -77 7 -57 -6 9 -66 25 -63 51 -8 1 25 77 48 -10 31 -63 80 -40 -42 -17 -5 0 23
$$ packed form
6044b4n8P9n0J02j06L2K2NL3j32J41q1J05p1nj6OO0p6O6n6R7j46Q5j6o8J13o3
6072b2M1n0O9o5O1m8J0M0o7M6p5R5m6nN8l5M7j36R9j1K8J9Jp0jM5m3J3n5J02k3
6103B2Ql1%M3q7R1r3J32j06M7l1n4O7q0J08j00O2o7L9M3%K1q3N0o5J11q7M6k2
6132a6m8J21j20J22j30R1j00P1J9J6k6j04J92j48Q1K0Qj6p9N3l2Q0p2N4k2k9O0
6159D6o1L6k9P0n8J4n1L7P1j15Q1n8P2j05N2k3N4K7j24O4o4R0m6K2Np6J42j32
6187e9J13j10O8n2K2%K3K3r3Q3o7O7o7K0l3O4jk3L7o6Q7n2J3J7o4Q7j14J20j16
6216g3J41r5K3K2PL4r7R0m7O8j28J06Pj23R0m7Q7q7L1l8K9mj8N9m9L9n9P3Jn4
6246a2O3j05j2OJ57j74Q4o4N1J5p5R1q8J14n9RK4N2k9n8M1r4J43j20kK5J2NK3
$$ plain form
6275 23 7 -51 55 -28 3 -16 -32 -19 -85 5 -34 48 -37 16 -41 -42 30 -60 53 -67 29 -32 29 55 41 54 43 62 -25
6304 -25 23 -30 40 -17 33 73 -16 19 -36 75 -72 37 19 14 19 -6 42 -51 47 -70 69 -56 -39 37 -66 47 -62
6331 -62 46 -13 44 -4 -36 41 -45 14 -51 30 -23 -14 -36 -54 42 -5 18 -54 44 -49 -48 -5 14 58 -24 -22 -46 -22 29 15 10 -36
6363 -36 48 -24 15 -7 6 -61 2 -42 7 26 -53 76 -12 26 -8 27 7 47 48 -67 33 -60 -10 11 5 17 -45 6 5 37
6393 37 -20 74 -26 25 49 -17 52 -47 39 -7 38 -39 2 31 -40 76 -19 3 -46 -2 45 22 -9 -69 -14 -55 -28 -10 10
6422 10 -11 -47 46 -3 46 -107 58 -13 69 -17 -49 6 -15 7 -58 33 13 11 15 -52 43 -26 31 18 39 -15 -1 21 1 31
6452 31 -24 14 -34 -15 -29 61 13 -56 46 -29 60 -3 8 23 1 36 40 60 -49 51 -64 -21 -35 6 -11 -41 -13 -44 38
6481 38 -20 30 -21 -13 -6 -18 20 -26 62 -45 20 29 32 -30 21 -26 -119 46 -17 34 -44 53 48 -42 41 -87 58 -27 6 11 -21
$$ packed form
6275B3j6n8J06q3L1j9j6J3o6R0l9Q2q5N3n7jP2r0J13j20R6o1O1K6j4J3j1J9q7
6304b5M8n3P0n7N0M0q9L5n5J11j47J09j8nNk5M8r3R8j17J39j25J7P6j03J13j09
6331f2J08n9N7m8l2P7q6N9o5Q1n3Rk2j8R6m7K3p2R8r3JM3J9M4q2Kk4K4N1j4nm6
6363c6Q4p2L9k2J3o7O3m4M9J9p9J29q8L8l4L5k0M0Jj15J00r3N0K1oJ2o2N1jL2
6393C7n7R4j00N1K4o6O9r9Q6m6M5p7M1K9p1J16r5K2m9M4M7k3l1o0N5m1K7J8K0
6422A0k1l6R3m9M9j53J65p1Q2q6l2N5k1K2o5R1k0kMo7R5o9N7j3K1n4J4K2k0L0
6452C1n5L8m8J9j4R0m8o9J02p5Q9o3J1J5k2L5MK0j09J00j15M3j4M1j7l0K8l1Q2
6481C8n8N0n1QPj2L8m6Q8j07O5RLo2N1m7r3J65o3N1p8R7nr0Q3j28J45q5L3Nl2
$$ plain form
6512 -21 43 -5 55 -72 20 -85 -22 -1 -36 39 -29 47 -116 20 -17 19 34 -4 64 24 38 -44 43 -33 10 4 -10 42 -35
6541 -35 38 -45 49 -49 18 34 -10 18 7 -28 -24 18 -27 35 0 -16 4 -16 12 -81 56 -13 1 17 -13 -46 -41 -6 -78 17 -25
6572 -25 1 5 -1 -8 -87 1 -26 36 -47 -25 -3 35 63 -21 15 -61 61 -39 16 -6 -24 19 -34 59 -15 53 -3 -2 25 -73 13
6603 13 5 41 -17 11 -31 5 37 -51 34 -39 65 -17 15 24 8 -5 47 40 -76 98 -70 71 12 5 -24 10 -13 -7 71 -45
6633 -45 38 -34 -13 8 -19 2 8 47 -26 -30 6 -21 57 -14 30 -89 23 -19 54 -30 -36 24 -22 -2 -16 31 -16 4 -31 34 0
6664 0 -10 31 -46 140 -12 -49 6 -34 56 -29 62 -40 29 -57 1 -15 18 -4 17 95 -46 62 -25 -3 5 4 8 -36 37 -54
6694 -54 11 36 41 -27 -1 31 -42 15 -7 28 -23 20 -29 -22 7 -6 -15 -44 -28 -39 -8 -5 -9 9 -37 -24 -10 8 -34 2 -42 -60 31
6727 31 -65 17 -3 9 -34 5 21 -48 66 3 61 -32 21 -18 40 19 -3 23 -28 -7 -6 -11 -38 35 38 -37 37 -11 33 21 37
$$ packed form
6512b1O4m8O0j27R2j05O3K1l5P5o8P6j63J36l7L6J5l8O8m0J4q2Q7p6M3oj4N2p7
6541c5P3q3R4r8O7J6m4K8j1l5MM2m5O2l5j6K0k0K8r3J37o9J4J6l0l3NL5p2R5m2
6572b5K6Mopp9Q8k7O2q3K2K2L8K8q4L6p6J22j00N5k2j8M3n3R3p4O8n6JK7r8Q6
6603A3qL6n8K8m2L6L2q8Q5p3J04q2L2Rj6j3N2pj16J74j68J41n9pk9L4k3OP8j16
6633d5Q3p2K1K1k7K1OL9p3mL6k7P8p1M4j19J12m2P3q4oO0m6K0j4M7m7K0l5O5l4
6664@j0M1p7J86j52l7N5m0R0q5R1j02O9q6N8j6L3k2K1P8j41J08q7K2QjMm4P3r1
6694e4O5K5No8K6L2p3N7k2L5n1M3m9PK9j3rk9J6j1L1LmJ8m6J3J4J8m2L6m4j8R1
6727C1r6Q2k0J2m3L9J6o9J14o3N8r3N3l9N8k1k2K6n1K1Jnk7P3Lp5P4m8M4j2J6
$$ plain form
6758 37 1 36 -12 -50 34 10 51 -32 48 4 31 -7 -52 29 -68 23 -30 25 -8 -6 -13 -45 34 -11 24 -36 82 14 -67 36
6788 36 35 11 -34 -33 5 29 -4 -12 -26 -1 50 -56 -18 -61 -11 37 -10 38 -35 9 -73 12 23 -28 -31 -2 -23 -43 14 -24 64 -31
6820 -31 47 -42 -43 50 -22 50 -13 24 0 -30 11 0 54 -9 24 -7 44 -25 33 -10 23 11 -6 45 9 17 -21 54 -2 -22 21
6851 21 -15 15 -52 -6 -6 -23 -26 -9 59 -30 11 -29 1 -50 11 16 -20 4 -40 70 -1 -5 6 4 -43 -26 24 -56 18 -75 -19 -37
6883 -37 -66 12 -12 -11 -52 -28 -14 56 -12 5 62 -22 -8 -45 45 -26 4 -2 -4 62 -16 80 12 31 17 24 28 -13 -6 29 34 -21 38 -31
6917 -31 -15 -6 -24 21 -68 -1 -31 14 -31 -21 -31 -27 0 -42 12 -59 -6 -23 45 41 6 59 -15 31 -45 -16 -62 6 -34 -16 34 -57
6949 -57 21 -30 20 -15 -17 2 24 83 8 38 -32 50 -52 -28 53 -3 -19 -15 36 -58 4 -52 5 -80 45 49 -61 44 -39 -17
6979 -17 -3 -49 -1 -8 13 -37 50 -20 32 -51 -43 25 -60 -32 27 35 -22 0 2 -32 43 -56 29 -45 71 -19 35 -30 11 -11 -73 -11
$$ packed form
6758C7l6L5m8l8Q4k4M1q3Q0m4K7l8m5Q1r7R1n3N5l3Kpl2P9m5L5o0J18o8q1J03
6788C6jk4m5JL8K4l3qj4K5N1j06L8m3N0M8m7M8p3M4q2Q5J1n1lK9k1k0N7l8Q8r5
6820c1P8q9jR3p2P2o3L7k4l0M1j1N4o3L3l1N1o9N8m3L3j2j7N1l6Ql8P5n6k0M3
6851B1l6L0o7M6%j7lJ7O8q9M1m0L0n1O1Nl6K4m4J10p1mJ1km7J7N0q0P4r3N6j8
6883c7k9P8k4Jm1K4J4P0o8J7N7q4J4l7R0p1L0okO6p8R6o8J9j4PMm1PL5Nn5N9o9
6917c1J6Rj8M5q9O7l0M5m5J0j0MK7m2N4p1N3j7O8ml5N3p4M6p6K9m6O8m0J8N0r1
6949e7P8n1N0l5kJ9K2N9p5L0p0Q2j02K4Q1n6j6MN1r4O2n6N7q5J25Mj10J05q3K2
6979a7J4m6M8pK1n0Q7p0N2q3QO8q5K8N9Qn7K2Kl4P5r9Q5p4J16r0N4o5M1k2o2O2
$$ plain form
7011 -11 -71 17 -75 31 -42 -15 -28 -56 -10 -43 3 -15 41 -33 19 2 -25 65 15 76 22 13 -1 -17 -15 -1 -2 2 -11 -3 -13 1
7043 1 21 20 29 71 -31 55 -31 27 30 -26 -18 7 56 -20 38 -29 18 1 -38 24 -46 19 -45 1 -9 34 21 -42 26 -9 31 -30
7075 -30 31 26 -12 19 -30 40 -49 -2 -64 -12 -38 -24 17 3 -1 -11 14 -26 35 -66 24 -18 -56 44 -29 62 -44 5 -20 -2
7105 -2 -17 -13 -28 -29 12 -2 18 -23 -34 22 -9 4 -26 13 -13 44 -7 51 -12 26 29 -68 49 17 -18 -62 25 0 -5 58 -47 10
7137 10 -16 80 20 58 -16 -16 -3 -54 13 -22 -3 47 -13 9 -13 19 11 31 -31 8 36 -16 8 11 -16 -75 44 -21 40 10 -46
7168 -46 -11 19 14 -74 22 -30 1 -53 -19 40 17 -26 -47 38 -43 35 69 -7 18 -41 -4 -36 20 -18 -12 -19 17 69 -48 4 -29
7199 -29 8 -33 7 11 3 -7 1 39 -77 100 -40 42 -7 36 -37 -30 29 1 11 -8 -54 -15 -7 -29 -23 -8 -35 1 -10 68 -15 -18
7231 -18 15 15 29 -41 -46 -75 -16 -32 10 5 -21 11 -71 -51 1 -5 -17 -40 11 -51 26 -21 16 36 -27 -14 -52 16 -71 55 -48
$$ packed form
7011a1o0Q8r2J06p3K7j3k8M6l3M6j8N6p4N2j7k7R0n0O1n4rj4j6KJ4jMj3Qj0J4
7043AK0jRM2j02Q6q6N8Ln6QK5M9p6N8o7M7j7l9O2p0O5o4M6j0M3j3o3O8l5M0o1
7075c0O1nl8L1m9P0q9M7o2N2k6J4M1j4mj0K5m0O1j01R0m2l8J00p3R1j06M9k5J8
7105bj5Mj5jM1j4K0m1j1N6l1J3l0L9k6N7n1N8o3L8Lr7J17l2l5m4Q7k5nO3j05N7
7137A0k6R6o0L8p4%J3n1O7l5J9N0o0K2k2L2qK0o2L9K8n2K4Lk7n9J19o5O1l0n6
7168d6L5L0nq8R6n2L1n4L4N9k3m3k1Q5q1P8L4p6K5n9L7l2N6l8OpL6N2j17N2l3
7199b9L7m1M0Mqj0QL8j16J77j40Q2m9M3p3PN9k8J0j9m6L9Qk2OJ5k7L6j1P8q3l
7231a8L3%J4p0nk9N9j6M2nk6L2q2K0N2oj2k3N1o2P7m7L7K0o3J3l8O8q7J26j03
$$ plain form
7262 -48 22 14 -15 71 -91 -53 -11 12 -8 30 18 -14 18 -37 10 -21 0 -33 27 8 82 27 7 10 -27 -3 11 18 34 29 22 25 10
7295 10 -26 20 -44 8 9 24 -5 -19 -35 -43 42 -25 6 25 10 -12 -38 32 -21 0 -37 29 -42 -2 58 -44 61 -26 26 -26
7325 -26 17 -34 -21 20 -7 4 -19 82 -38 -12 -8 -17 52 -12 1 5 7 -32 37 20 -4 0 -34 -11 1 89 -15 29 20 -14 -9 -35
7357 -35 38 -2 -8 -31 38 6 21 16 -43 -24 14 67 -20 8 29 13 41 3 13 -22 -2 -32 14 -10 -1 1 -48 55 12 -5 -38 -24
7389 -24 -55 12 6 -110 41 -6 38 -8 -51 -8 -18 2 -58 24 -21 6 14 -10 29 -4 51 -24 39 -11 50 -45 -33 40 22 35
7419 35 -16 49 -17 48 -44 94 17 -18 52 -58 12 -10 68 18 -33 -18 3 74 -39 13 12 -10 35 29 7 -8 17 -12 -38 -109
7449 -109 46 -34 28 -68 -16 27 -10 40 -44 -29 -29 -21 18 7 29 -20 28 5 -3 1 19 -8 -17 15 -59 -15 -55 -6 -31 -44 -17 -18
7481 -18 -8 -47 39 -30 -12 4 -14 -66 -33 33 -11 -16 -49 -7 -57 -26 -34 -40 9 -16 55 -73 20 1 -32 -1 35 -13 3 11 31 28
$$ packed form
7262d8P0qk9Q6j62L8M2K3k0L8j2l2L2n5M7l1K1l3O0j9P4n5k0Ll7K4J4PJ6npLj5
7295A0l6M6o4N2JJ5k9j4j6qQ5o7L1J9j5k2k6P0n3K1l7O6p1M0O0j02J05q7N2n2
7325b6M3n1J3M1k7J1k3J01j20K6MrO9o4J3MKl9O9j7k4Ml4K3J2Q8j04M4rl4Nk6
7357c5P3m0ok3O9l2J5nn9J9L8N3q7K8K1j6K8l8J0l5K0l0M6k4RKm9J03m3j7l3J4
7389b4l1O7oj16J51m7M4m6m3M3j0K0o0Q2m5K7Qk4L9l3N5p5O3n0O1r5J2P3j8J3
7419C5n1O5o6O5r2J38p7l5P0j10P0k2P8n0n1J5K1P1j13N2jk2M5ok2j5K5k9k6p1
7449a09J55q0O2r6N2M3l7N0q4J5%QL9j1K2m9M8k3qMJ8k7rL2p4M4m0M9k5j3K7j
7481a8J0l9Q6o9J8J6j8n2L3O6m4nl3M2n0L1qoM9k5P1j28R3j9l3L1L6m8J6QK0l
$$ plain form
7513 28 0 17 46 -46 56 -37 64 13 -15 11 -1 22 -15 52 29 -8 -27 47 -2 -16 -3 28 13 -44 10 9 -33 77 -44
7542 -44 -17 -24 -27 -36 20 8 -4 14 19 -14 -18 5 -37 2 -26 -6 15 -33 16 7 52 3 26 5 9 6 -36 17 -26 25 26 52 -21 23 36
7577 36 -18 49 -25 18 -5 34 -7 1 22 -5 53 -42 -14 2 39 16 -3 40 19 48 -3 -1 -20 44 49 8 -24 -21 5 -24 57 3
7609 3 32 -7 8 2 -25 -20 13 -14 15 15 0 0 23 -16 28 -51 27 12 -26 32 -35 -47 -1 48 -19 -17 2 49 2 8 21 -41 44 -14
7643 -14 -4 -9 12 33 -11 11 -21 37 -36 -18 -13 57 -4 -22 27 -14 53 -2 -19 8 -24 23 -4 36 -4 47 12 17 11 -25 42 -25
7675 -25 26 13 -26 -7 -9 2 10 29 23 54 16 37 -39 -12 4 -20 -32 -2 -29 -35 26 -27 5 -50 -23 21 -41 9 6 16 0 4 -19
7708 -19 22 15 4 17 -36 13 -42 12 3 -9 38 -19 41 -68 24 -27 37 -21 -33 17 -69 53 -45 -4 -24 7 -13 29 -7 -20
7738 -20 27 -42 7 -27 36 9 1 12 -48 -10 31 15 -16 -20 -4 -32 16 -19 48 -58 24 -22 17 4 -32 18 -23 -9 -15 -3 -23
$$ packed form
7513B8k8J7K9r2J02r3J01n1k8K6j2K3l7O7k3l7j9P4m9j4J3L1j5n7N4jm2J10j21
7542d4K7plrN6j2j2J8Nl3mK3m2L9k8K0K1m8M9rM5m9K3k1Mlm2N3m3N1JK6p3M4J3
7577C6n4O7p4M3k3L9m1QK1k7N8r5K8J6L7k3j9M3k1K9n1Kj9O4Nm1l2LK6k9Q1n4
7609CK9l9J5ok7NL3k7K9%j5%K3l9M4p9P8j5l8N8o7j2M6M9o7KJ9M7m7OJ3o2Q5n8
7643a4J0nK1K1m4K2l2N8p3J8NP0o1j8M9m1O7n5j7K7l2M7k7M0m0N1l5Nol6O7o7
7675b5N1j3l9J9kJ1QJ9oL1l8K1p6K7J6k4j2L0k7oO1n3L2n5K7M4o2N0lJ0j6Mk3
7708a9M1pj1J3n3M9n5N4rj2M7n7O0j09R2n1O4n8j2N0q6J22r8M1k0L1k0M2l6j3
7738b0M7o9M9l4O3k7qJ1o0L8M1j6l1mJ6k8M8l5O7j06Q2m6L9j3l6N0m1J4oJ2k0
$$ plain form
7769 -23 -29 -8 -57 -7 -17 -4 -30 11 -4 -50 25 -16 13 -42 88 -24 12 -16 -25 20 -32 31 -16 12 -23 40 -21 47 5 14 -4
7800 -4 -4 46 30 42 -12 -9 -2 -20 29 -19 4 6 -16 8 -10 -15 -14 -25 -40 84 -4 6 -67 -3 31 -15 21 -67 -12 7 16 53 23 -3
7834 -3 -69 -20 13 19 8 -33 11 -6 37 -64 7 -9 24 -25 37 -12 29 38 -19 25 -59 82 -32 2 -58 3 35 47 24 -46
7864 -46 -24 -4 29 -19 -21 -1 -44 4 22 22 -41 -7 45 15 42 -37 32 -5 6 -15 40 -55 0 46 -47 63 27 -4 19 4 23
7895 23 -17 3 -49 -4 -15 -6 -12 60 9 12 16 -7 22 -14 23 16 19 -27 -25 -1 2 40 -58 -16 17 -55 42 27 -19 4 34 -18 -7 -40
7929 -40 14 15 14 16 -46 -23 -1 -4 49 36 33 7 34 22 12 -42 -3 11 -12 6 16 29 -32 37 -22 37 -11 5 -57 -3 49 4 35
7962 35 -18 8 -16 -12 21 12 -35 -66 23 5 16 -11 68 23 56 35 9 3 -47 -40 -4 19 1 -16 42 -27 35 -58 40 19 19 10 -17
7995 -17 16 -84 32 21 30 -9 11 14 -28 -4 -29 31 -29 33 1 -18 44 -41 23 65 21 -13 42 32 29 3 17 32 -41 9 -7
$$ packed form
7769b3oK1m9N0j0J3k6M1j5m6P5m1K9n5J30j12L6k8rM5n2O3m7K8l5O3o1O8m2Rj8
7800d%N0j6J2n4LPj8M9m8K3Kk2K4j8nJj1j5J24q8J0p3O4L4m6L6q8N5J9RL7l0k6
7834co6M9L3Oj1m1M4j7M3j01P1j6L3m9O2m9M1Rn7M4q4J41j14L4o0O1L2J2k3p0
7864d6K2K0L3m8kK0m3M8J8%o3L4N2l0K7p9O9l7J1k1N5r5N5M6r3J10l6l1K3j5J9
7895B3m0K0n2M5j1RoP2n1LMk3K9l6L7pLm6KK4LL8r8M2L3p2R7j5m6K3L0n2J1l3
7929d0N4JjKo2K3K2lN3j3lk6K7j2j0n4L9J4k3J8J0J3o1O9n9N9m8J6o2N4N2m5L1
7962C5n3K6k4ML3rm7l1Q9j8J1k7P9m5L3k1k6on0PL6K3j8j7N8o9O2r3R8k1%rk7
7995a7L3j00J16j1Rl9K0Lm2K4k5O0o0O2l2j9O2q5O4M2m4l4N5j0lk6J4J5p3N0j6
$$ plain form
8026 -7 -49 27 18 5 15 28 -4 8 33 40 11 -7 -1 -9 41 14 20 -47 -7 43 60 -4 11 57 11 67 27 -40 2 -31 8 -10 18
8059 18 -40 -23 20 39 36 -9 -16 -62 7 6 33 -14 21 -25 -36 49 -11 20 37 20 27 -15 11 -55 -17 51 14 -7 43 -10 16 19 -13
8092 -13 4 -34 19 -8 -47 -33 -22 -22 -7 -18 -9 -5 -21 9 42 27 62 -39 -7 -5 38 -45 25 35 -15 21 6 24 -33 72 -45
8123 -45 15 8 -6 39 35 18 -15 64 42 -2 50 -18 37 -62 73 -3 33 -9 19 -6 25 -20 -49 18 16 14 -47 68 64 24 4 -64
8155 -64 -38 53 32 -12 18 -15 -38 32 9 18 -49 6 -86 -38 24 51 15 -7 15 -23 -34 9 20 17 -48 3 -69 39 -39 43 12
8186 12 -15 8 9 46 -37
$$ packed form
8026gm2P6rj3J0J3l2J2K5Pk9j8OqN0k7Oo7M0N0J7o4J5M6m6N6m0o7M2l3L9j8K8
8059A8n8J7M3J9lm5pm6O9jK7m7L5m6j1Q5o0L1J7j7Pm2K6o6L8O8l7k1N0n3K6Ll2
8092a3J7l8N3k7l9J4J1%J5j1RMj6L0L3j5L5j01L2KM3q3P0J0n0L6j5J8n7J05j17
8123d5O0pj4M5mj7l3P9k2m4N2o8N5r9J35p6L6m2K8k5L1m5k9O7kko1J15mm0k0o8
8155f4K6R1k1m4L0l3k3P0k3Ro7N5r2M8O2K7l6k2K2l8j1M3J1lo5N1p2J08p8Q2l1
8186A2k7K3JL7q3
8191c7
$$ Imaginary data points
##PAGE= N=2
##DATA TABLE= (X++(I..I)), XYDATA
$$ plain form
0 0 0 0 0 0 0 0 0 0 0 0 0 0 0 -2 8 -8 8 -8 8 -16 16 -18 24 -25 32 -40 41 -48 56 -64 72 -87 96 -109 121 -136
36 -136 153 -170 192 -213 236 -261 290 -322 354 -390 430 -474 522 -575 632 -696 768 -848 938
55 938 -1041 1156 -1292 1449 -1638 1868 -2150 2514 -2990 3655 -4633 6213 -9151 16338 -66302
70 -66302 -64697 89634 -70701 8083 5805 -41806 28251 -33482 -4862 25960 -53167 22789
82 22789 6503 -33187 23455 -10456 -5376 6643 -4506 60 678 6191 -8717 7255 -993
95 -993 4912 -1390 -9878 20816 -6799 -12119 21038 -11270 -1100 15261 -19821 17321 -7277
108 -7277 -6779 24557 -29244 15313 6859 -19025 19259 -9687 -912 12106 -13570 8623 3247
121 3247 -9015 13970 -10368 4089 5950 -9465 10051 -4845 488 -119 1436 -855 -3352 5206
$$ packed form
0@%%%%%%%%%%%%%kJ0j6J6j6J6k4L2l4M2m9N7p2Q1q9J04j20J36j59J83k05K30k57
36a36K89l23L62m05M49m97N51o12O76p44Q20r04R96j097J207j328J464j616J786
55I38j979K197k448K741l087L506m018M664n504O645q288J0846j5364K5489q2640
70f6302J605J54331j60335P8784k278m7611P0057o1733K8620L0822p9127P5956
82B2789j6286l9690N6642l3911N080J2019j1149M566O18N513j4908J5972q248
95i93N905o302q488L0694k7615n320L3157l2308J0170J6361l5082L7142k4598
108g277M98L1336n3801M4557q454k5884L8284k8946Q775J3018k5676K2193n376
121C247j2262K2985k4338J4457J861j5415J9516j4896N333o07J555k291k497Q558
$$ plain form
135 5206 -4319 81 -828 1880 -63 -4676 3016 2098 -8321 7727 283 -9899 11615 -9490
149 -9490 4960 2619 -9650 11815 -8014 1230 6086 -9367 5539 3138 -9921 7495 -1893
162 -1893 -4036 5419 -7489 6773 -6396 -1829 8141 -8585 -923 4042 -768 -5474 2789 -116
176 -116 399 -3317 -279 5046 -5824 2423 2046 -3098 217 5057 -4967 2262 3116 -5137 6888
191 6888 -4874 2896 1361 -3597 5808 -3630 -947 6492 -2974 -4397 8420 -3700 768 1159 -1708
206 -1708 5441 -5757 3573 2915 -3854 819 4698 -3861 107 4783 -4312 3306 -2632 1681 1354
221 1354 -3625 2041 100 -2449 446 1343 -5398 4896 -3636 -2560 3693 -4866 1642 -1654 -1039
236 -1039 -455 -1430 -1430 2441 -4245 -366 4150 -8182 5074 -555 -3132 2637 -2132 1544 369 -2338
$$ packed form
135E206r525M400r09K708j943m613P692r18j0419J6048p444j0182K1514k1105
149i490J4450k341j2269K1465j9829R244M856j5453J4906k401j3059J7416r388
162a893k143R455j2908J4262j3169M567R970j6726P662M965m810m706Q263k905
176a16N15l716L038N325j0870Q247l77n144L315M840j0024P229Q54q253J2025
191F888j1762P770j535m958R405r438K683P439r466j423J2817j2120M468L91k867
206a708P149j1198R330o58o769M673L879q559L968M676r095P618n938M313l27
221A354m979N666j941k549K895Q97o741J0294q532J076O253q559O508l296O15
236a039N84r75%L871o686L879M516j2332J3256n629k577N769m769L676j175k707
$$ plain form
252 -2338 2534 1439 -4930 6927 -3640 -371 5536 -6082 5237 -610 -816 2945 -804 798
266 798 1950 -1603 2769 1677 -4580 6692 -2223 -1491 2971 -215 188 -1277 2034 -606 1319 -2948
282 -2948 3479 -379 -3645 5242 -3242 -508 2089 -1616 -569 2211 -3840 2389 -476 -3530 5099
297 5099 -5995 3314 -257 -4267 4205 -2290 -1318 1280 -118 -1670 716 -1775 2596 -2747 -729
312 -729 3147 -4620 2354 -1381 -45 -562 -573 149 -1061 482 -1467 1662 -2689 1641 -319 -1272 1751
329 1751 -809 -275 1038 1229 -3077 3716 -1344 270 1032 -1953 4239 -2985 1110 1573 -1120 420
345 420 2333 -1336 341 2466 -1881 2610 -2054 2767 183 -1722 3050 -997 356 646 1117 -1857
361 -1857 2547 -758 -217 758 -1379 2788 -2909 1142 423 -1154 -226 738 -1517 -798 2190 -3095 1032
$$ packed form
252b338M872j095o369J1857j0567L269N907j1618J1319n847k06L761l749J602
266G98J152l553M372j092o257J1272q915P32M462l186M03j465L311k640J925m267
282b948O427l858l266Q887q484K734K597l705J047K780o051O229k865l054Q629
297E099j1094R309l571m010Q472o495R72K598j398j552K386k491M371n343K018
312g29L876p767O974l735J336n17j1P22j210J543j949L129m351M330j960r53L023
329A751k560N34J313J91m306O793n060J614P62k985O192p224M095M63k693J540
345D20J913l669J677K125m347M491m664M821k584j905M772m047J353K90M71k974
361a857M404l305N41R75k137M167n697M051p19j577R28R64k255P19K988n285M127
$$ plain form
378 1032 -1744 914 -707 -2379 2026 -1755 -979 -465 909 -2622 976 -731 -644 364 -2012 2775
394 2775 -2684 728 773 -1008 200 655 -707 168 1669 -2755 3074 -1630 469 1197 -1688 2396
410 2396 -1305 395 812 439 -1832 2298 -411 -676 1882 -2018 2523 -1087 246 863 489 -453 959
427 959 530 -929 2790 -2720 2845 -255 -1384 2988 -1224 13 508 323 -143 668 -1954 2927 -1789
444 -1789 -1436 3343 -3924 2102 -690 -1141 354 -628 154 -678 -629 -102 1116 -2979 2115 -865 -1104
461 -1104 1232 -1224 388 -986 1129 -1321 432 -1174 1003 -277 -1927 3043 -2995 611 842
476 842 -1311 83 645 -1034 308 91 -567 2474 -3836 3017 339 -2212 3005 -1312 1178 -283
492 -283 692 726 -35 -153 1887 -411 -549 2513 -1559 1413 -347 1217 -303 105 1214 -958 1582
$$ packed form
378A032k776K658j621j672M405l781P76N14J374l531L598j707Q7J008k376M787
394B775n459L412M5j781J208M55j362Q75J501m424N829m704K099P28k885M084
410B396l701J700M17l73k271M130k709k65K558l900M541l610J333O17l74r42J412
427I59m29j459L719n510N565l100j129M372m212J237M95j85m66Q11k622M881m716
444a789L53M779p267O026k792m51J495r82P82q32M9N27J218m095N094k980k39
461a104K336k456J612j374K115k450J753j606K177j280j650M970o038L606K31
476H42k153J394N62j679J342k17o58L041o310O853k678k551N217m317K490j461
492b83R75L4p61j18K040k298j38L062m072K972j760J564j520M08J109k172K540
$$ plain form
509 1582 -1740 1791 -720 172 862 -1837 1041 222 -736 -328 945 -1657 1528 -1810 629 930 -3204
526 -3204 3099 -2462 304 485 -1581 938 -959 -644 436 -617 -1274 1672 -2523 1054 -843 -1252
542 -1252 2051 -2514 776 -825 337 -147 -43 -605 -76 1045 -1426 1430 -1101 973 124 -343 566
559 566 226 256 34 1271 -1606 2392 -885 461 1020 -903 2319 -1545 1152 744 -32 -88 1008 -157
577 -157 258 1031 -1152 1371 -1161 1802 -545 -585 1006 -337 526 -1153 1722 -1559 482 205 -620
594 -620 451 -990 719 -810 -117 -478 691 -1681 775 -321 -1454 1428 -2484 1695 -1131 -809
610 -809 480 -951 412 -683 -615 -129 683 -2157 1584 -697 -781 678 -1330 1635 -1481 217 288
627 288 93 -791 705 190 -1059 1684 -1354 1386 -692 276 1053 -700 368 140 569 -478 1337
$$ packed form
509A582l322L531k511Q92O90k699K878q19r58M08J273k602L185l338K439L01m134
526c204O303n561K766J81k066K519j897L15J080j053o57K946m195L577j897m09
542a252L303m565L290j601J162m84J04n62N29J121k471K856k531K074q49m67R09
559E66l40L0k22J237k877L998l277J346N59j923L222l864K697m08p76n6J096j165
577a57M15P73k183K523k532K963k347m0J591j343Q63j679K875l281K041k77q25
594f20J071j441J709j529O93l61J169k372K456j096j133K882l912M179k826L22
610h09J289j431J363j095O8M86Q12k840L741k281q4J459k008K965l116J698P1
627B88j95q84J496n15j249K743l038K740k078R68P77j753J068k28M29j047J815
$$ plain form
644 1337 -1287 1388 -85 -337 1519 -1339 1596 -656 736 191 108 144 364 273 -385 1502 -1326 1077
662 1077 -443 463 179 -502 764 -847 816 -952 863 -1188 503 473 -1468 667 -700 452
678 452 -1016 17 -669 356 -970 -145 404 -1924 1566 -1721 267 -238 -817 258 -871 79 -393
695 -393 301 -1192 1038 -1172 583 375 -1431 1366 -1012 679 -458 303 175 370 -369 227 1014
712 1014 -1138 1833 -1165 902 435 -453 1259 -368 346 96 813 -589 1289 -866 834 534 -1168
729 -1168 1946 -1169 778 -191 213 349 -160 87 13 579 -1049 1159 -1020 731 -484 -393 724 -1044
747 -1044 512 -851 838 -1288 248 86 -606 213 -1030 839 -1203 52 -161 277 -1268 302
763 302 354 -1405 1016 -1445 965 -1044 -126 612 -1118 442 -114 -21 -632 1015 -1040 602 -368 -84
$$ packed form
644A337k624K675j473k52J856k858K935k252J392n45q3L6K20r1o58J887k828K403
662A077j520R06k84o81J266j611J663j768J815k051J691l0j941K135j367J152
678D52j468J033o86J025j326Q25N49k328L490l287J988n05n79J075j129R50m72
695c93O94j493K230k210J755k08j806K797k378J691j137P61j28J95p39N96P87
712A014k152K971k998K067m67q88J712j627P14k50P17j402J878k155J700l00j702
729a168L114l115J947r69M04J36n09K47p4N66j628K208k179J751j215R1J117j768
747a044J556j363J689k126J536j62o92Q19j243J869k042J255k13M38j545J570
763C02N2j759K421k461K410k009R18P38j730J560n56R3o11J647k055J642r70K84
$$ plain form
781 -84 690 -1356 1501 -1028 420 74 20 -50 140 534 -712 1051 -653 1089 -416 489 525 -418 985
800 985 15 630 -646 1638 -733 460 645 -254 1077 -1172 1454 -333 -101 359 429 -388 39 448
818 448 -595 711 -1377 1448 -1078 -329 657 -1120 689 -1194 351 -528 -131 -633 11 -305 -547
835 -547 312 -1112 744 -1135 375 -630 -1 -106 -881 968 -1371 691 -896 423 -125 -704 613
852 613 -370 -22 -374 772 -777 811 -621 794 211 -918 1925 -1289 1074 -103 180 636 -277
869 -277 593 209 252 -243 1197 -910 986 -38 -26 757 -543 1082 -893 942 -394 404 -138 32
887 32 656 -1078 1101 -561 149 -321 349 -322 -162 55 -356 486 -1221 1443 -1293 184 549 -1066
905 -1066 632 -716 541 -707 27 -132 87 -868 287 275 -1385 937 -938 491 -921 236 125
$$ packed form
781h4P74k046K857k529J448l46n4p0J90L94j246J763j704J742j505R05L6r43J403
800I85r70O15j276K284k371J193J85q99J331k249K626j787K32M60P0q17M27M09
818D48j043J306k088K825k526P49R86j777J809j883J545q79L97n02O44l16k42
835e47Q59j424J856j879J510j005O29j05p75J849k339K062j587J319n48n79J317
852F13r83L48l52J146j549J588j432J415n83j129K843l214K363j177K83M56r13
869b77Q70l84M3m95J440k107J896j024J2P83j300J625j975J835j336P98n42J70
887C2O24j734K179j662P10m70O70o71J60K17m11Q42j707K664k736J477L65j615
905a066J698j348J257j248P34j59K19r55J155j2j660K322j875J429j412J157j11
$$ plain form
922 125 -836 537 -694 594 -945 714 -522 -39 340 -573 343 -300 555 -825 820 -379 373
939 373 -88 83 953 -1374 1558 -374 147 196 305 461 -275 600 70 696 -789 1303 -397 250 381
958 381 -329 1043 -911 979 -445 567 -241 19 473 -498 434 -587 765 -795 311 -309 137
975 137 -230 -551 714 -1161 739 -955 322 -360 -584 421 -803 256 -617 178 -769 463 -700
992 -700 68 70 -847 896 -1201 719 -666 98 87 -433 280 -259 232 -613 879 -750 479 -277 114
1011 114 523 -906 1190 -585 579 -123 471 20 -96 706 -226 669 -548 1009 -403 463 235 14
1029 14 563 -394 888 -690 978 -511 318 349 -338 548 -590 768 -661 344 -70 283 -523 81
1047 81 475 -1054 642 -737 761 -903 -154 320 -718 357 -649 374 -788 357 -558 11 -50
$$ packed form
922A25r61J373j231J288j539J659j236M83L79r13R16o43Q55j380J645j199P52
939C73m61J71Q70k327K932j932N21M9J09J56p36Q75n30O26j485K092j700O47J31
958C81p10J372j954J890j424J012q08K60M54r71R32j021J352j560J106o20M46
975A37l67l21J265j875J900j694J277o82k24J005j224J059q73P95r47J232j163
992g00P68Kr17J743k097J920j385P64j1n20P13n39M91q45J492j629J229p56L91
1011A14M09j429K096j775J164p02N94m51j16Q02r32Q95j217J557j412Q66k28k21
1029A4N49r57J282j578J668j489Q29L1o87Q86j138J358j429J005m14L53q06O04
1047H1L94j529J696j379J498j664P49M74j038J075j006J023j162J145r15N69o1
$$ plain form
1064 -50 -514 224 -650 511 -991 572 -535 75 -140 -466 863 -1297 845 -243 -91 -66 29 224
1082 224 -209 6 -44 765 -1086 1290 -673 65 700 -728 1149 -777 761 51 -9 191 381 -97
1100 -97 264 566 -628 1213 -700 690 -86 188 685 -720 884 -333 491 -404 526 -96 -4 307
1118 307 -502 480 -514 666 -696 244 -236 12 95 -660 707 -1012 478 -676 141 -101 -550 149
1136 149 -494 217 -769 532 -724 135 -301 -131 216 -841 703 -677 236 -634 518 -166 -387 394
1154 394 -526 625 -739 618 -213 31 71 17 211 -223 522 -529 1011 -717 524 301 -267 801
1172 801 -670 1090 -312 28 315 507 -290 161 511 -224 652 -702 1259 -639 22 695 -631 467
1190 467 -421 632 -466 43 -89 243 -370 -13 392 -881 635 -824 461 -293 -113 1 -551 577
$$ packed form
1064e0m64P38q74J161j502J563j107O10k15l26J329k160K142j088J52K5R5J95
1082B24m33K15n0Q09j851K376j963P38O35j428J877j926J538p10o0K00J90m78
1100i7L61L02j194J841j913J390p76K74M97j405J604j217Q24q95R30o22R2L11
1118C07q09R82r94J180j362R40m80K48Q3p55J367j719J490j154Q17k42m49O99
1136A49o43P11r86J301j256Q59m36J70L47j057J544j380R13q70J152o84k21P81
1154C94r20J151j364J357q31K44M0n4J94m34P45j051J540j728J241k23n68J068
1172H01j471J760j402L40K87J92p97M51L50p35Q76j354J961j898O61O73j326J098
1190D67q88J053j098N09j32L32o13L57M05j273J516j459J285p54J80J14n52J128
$$ plain form
1208 577 -692 265 -529 318 -568 -141 46 -445 175 -600 489 -899 529 -268 -131 100 -359 625 -886
1227 -886 668 -348 92 -170 65 215 -363 397 -440 616 -597 597 -174 -98 416 -315 609 -541
1245 -541 689 -291 458 -58 50 585 -380 656 -293 554 -165 348 -21 301 86 -156 872 -723 935
1264 935 -545 323 303 -495 543 -365 256 -308 281 -287 355 -745 262 175 -887 716 -934 468
1282 468 -662 -144 286 -691 144 -270 33 -732 226 -437 128 -457 -137 230 -798 545 -789 508
1300 508 -472 -33 136 -267 402 -576 578 -295 261 -175 435 -108 -107 536 -271 616 -565 878 -190
1319 -190 45 429 -61 439 -346 667 -325 405 -59 406 109 -165 692 -462 527 -340 496 -135 156
1338 156 173 -177 331 -555 657 -546 425 -294 -92 285 -505 436 -318 248 -448 289 -307 -64 -92 -203
$$ packed form
1208E77j269R57p94Q47q86M27J87m91O20p75J089j388J428p97J37K31m59R84j511
1227h86J554j016M40k62K35J50n78P60q37J056j213J194p71P6N14p31R24j150
1245e41J230r80P49n16J08N35r65J036r49Q47p19N13l69L22k15k42J028j595J658
1264I35j480Q68k0p98J038r08O21n64N89n68O42j100J007q7j062J603j650J402
1282D68j130N18M30r77Q35m14L03p65R58o63N65n85L20L67j028J343j334J297
1300E08r80M39J69m03O69r78J154q73N56m36O10n43JO43q07Q87j181J443j068
1319a90K35L84m90N00p85J013r92P30m64M65k97k74Q57j154R89q67Q36o31K91
1338A56J7l50N08q86J212j203R71p19K02L77p90R41p54N66o96P37n96K43k8j11
$$ plain form
1358 -203 387 -1021 604 -494 56 -270 -176 156 -594 194 -349 194 -664 347 -303 -64 78 -382 477
1377 477 -661 468 -373 217 -199 -78 232 -312 422 -463 670 -332 181 79 195 222 -241 670 -327
1396 -327 581 -324 573 17 -87 453 -244 533 -366 589 -189 259 -12 83 304 -453 626 -358 459 -337
1416 -337 208 48 -230 208 -272 420 -593 371 -476 178 -54 -344 251 -536 357 -577 274 -336 27 -153
1436 -153 -175 109 -679 432 -590 176 -423 146 -140 -443 220 -433 267 -569 405 -420 56 187 -312 273
1456 273 -351 485 -450 199 -117 317 -105 -32 507 -502 739 -417 498 -56 35 355 -234 497 -168 425
1476 425 -141 505 -105 291 163 -98 504 -333 596 -476 434 -45 -9 130 -137 542 -560 424 -190 175
1496 175 -268 -36 241 -302 27 -337 488 -771 352 -181 -176 -13 -456 523 -734 138 -183 -18 -281 -128
$$ packed form
1358b03N90j408J625j098N50l26R4L32p50P88n43N43q58J011o50K39J42m60Q59
1377D77j138J129q41N90m16J21L10n44P34q85J133j002N13j02J16K7m63R11r97
1396c27R08r05Q97n56j04N40o97P77q99R55p78M48k71R5K21p57J079r84Q17p96
1416c37N45j60k78M38m80O92j013R64q47O54k32k90N95p87Q93r34Q51o10L63j80
1436a53k2K84p88J111j022P66n99N69k86l03O63o53P00q36R74q25M76J31m99N85
1456B73o24Q36r35O49l16M34m22P3N39j009J241j156R15n54R1L20n89P31o65N93
1476D25n66O46o10L96j28k61O02q37R29j072R10m79L6J39k67O79j102R84o14L65
1496A75m43K32K77n43L29l64Q25j259J123n33NJ63m43R79j257Q72l21J65k63J53
$$ plain form
1516 -128 47 -279 83 -441 376 -565 231 -288 -43 330 -541 331 -484 422 -358 100 67 -169 133 -179
1536 -179 392 -332 468 -257 341 -176 268 404 -462 740 -321 462 -204 220 325 -161 357 -2 304
1555 304 -202 638 -301 370 35 92 384 -563 782 -383 260 -139 89 62 -138 242 -231 316 -467 411
1575 411 -418 45 -26 -266 238 -490 304 -484 177 -354 14 -46 -273 144 -585 437 -521 66 -192 106
1595 106 -130 -417 161 -311 238 -552 514 -359 -88 115 -261 330 -470 487 -260 194 -99 155 82 -121
1615 -121 386 -189 442 -454 502 -64 205 156 -231 656 -340 444 -194 392 150 -49 292 8 266 -170
1635 -170 580 -352 498 -134 195 163 -374 660 -511 222 -175 72 -80 -159 31 -45 59 -426 462 -643
1655 -643 269 -229 -284 213 -566 318 -520 156 -197 31 -227 -9 -25 -351 325 -505 382 -440 132 -75 -155
$$ packed form
1516a28J75l26L62n24Q17r41P96n19K45L73q71Q72q15R06p80M58l3k36L02l12
1536a79N71p24Q00p25N98n17M44J36q66J202j061P83o66M24J05m86N18l59L06
1555C04n06Q40r39O71l35N7K92r47J345j165O43l99K28k7k00L80m73N47p83Q78
1575D11q29M63p1k40N04p28P94p88O61n31L68o0k27M17p29J022r58N87k58K98
1595A06k36k87N78m72N49p90J066q73K71K03l76N91q00R57p47M54k93K54p3k03
1615a21N07n75O31q96R56n66K69m9l87Q87r96P84o38N86k42j99L41k84K58m36
1635a70P50r32Q50o32L29l2n37J034j171P33l97K47j52p9J90p6J04m85Q88j105
1655f43R12m98n5M97p79Q84q38O76l53K28k58K18j6l26O76q30Q87q22N72k07q0
$$ plain form
1676 -155 228 -386 286 -331 313 -289 175 -46 -134 246 -215 392 -408 413 -127 132 -60 46 346 -341
1696 -341 491 -226 428 -258 320 216 -160 364 -178 479 -326 355 10 154 1 30 325 -298 438 -349
1716 -349 577 -328 20 199 -222 363 -482 350 -216 52 -179 157 -190 -174 167 -396 282 -642 407 -337
1736 -337 -229 159 -349 226 -490 246 -287 -88 -284 129 -92 -210 120 -468 454 -608 302 -129 -147 183
1756 183 -373 349 -237 209 -181 239 -156 133 100 -36 408 -397 525 -289 336 95 50 236 -121 443 -209
1777 -209 380 -175 364 -73 119 230 -253 426 -263 440 -284 245 -15 -72 189 -89 334 -395 391 -159
1797 -159 195 -132 -88 231 -344 273 -430 165 -281 11 -176 -121 61 -379 284 -532 270 -506 47 73 -361
1818 -361 197 -301 157 -420 189 -239 79 -292 12 159 -495 453 -376 358 -299 -1 181 -191 192 -145
$$ packed form
1676a55L83o14O72o17O44o02M64k21q8L80m61O07q00Q21n40K59j92J06L00o87
1696c41Q32p17O54o86N78j04l76N24n42O57q05O81l45J44j53K9K95o23P36p87
1716c49R26r05L48J79m21N85q45Q32n66K68k31L36l47J6L41n63O78r24J049p44
1736c37J08L88n08N75p16P36n33J99j96M13k21j18L30n88R22j062R10m31j8L30
1756A83n56P22n86M46l90M20l95K89l3j36M44q05R22q14O25k41m5J86l57N64o52
1777b09N89n55N39m37J92J11m83O79o89P03p24N29k60n7K61k78M23p29P86n50
1797a59L54l27M4L19n75O17p03N95m46K92j87N5J82m40O63q16Q02p76N53K6m34
1818c61N58m98M58n77O09m28L18l71L04J47o54R48q29P34o57K98J82l72L83l37
$$ plain form
1838 -145 293 -259 334 -180 303 -11 -89 392 -293 493 -367 367 -53 23 186 -94 321 -241 431 -134 256
1859 256 -215 300 89 -185 333 -250 470 -437 327 -55 -122 177 -107 179 -389 282 -241 155 -216 120
1879 120 -32 -334 321 -429 288 -411 213 -180 -144 79 -298 95 -427 217 -449 91 -136 -88 -29 -306 268
1900 268 -438 279 -412 175 -136 14 100 -329 431 -429 305 -165 176 -9 -82 216 -60 204 -173 541 -390
1921 -390 365 130 62 273 -321 683 -294 221 26 195 79 -10 250 -56 249 -231 426 -316 286 15
1941 15 -75 297 -356 438 -318 278 -148 4 39 -174 85 -243 317 -420 181 -265 140 -261 -207 263 -441
1962 -441 264 -468 254 -314 -145 103 -235 27 -266 190 -352 152 -280 87 -117 -181 240 -531 430 -345
1982 -345 226 -135 9 116 -202 270 -162 338 -233 353 -76 87 118 4 327 -257 446 -268 341 -36
$$ packed form
1838a45M38n52N93n14M83l14p8M81o85P86q60P34m20P6J63k80M15n62O72n65L90
1859B56m71N15k11k74N18n83P20r07P64l82o7K99k84K86n68O71n23L96l71L36
1879A20j52l02O55p50P17o99O24l93L6K23l77L93n22O44o66N40k27M8N9k77N74
1900B68p06P17o91N87l11J50Q6m29P60q60P34m70L41j85p3K98k76K64l77P14r31
1921c90P55k35o8K11n94J004r77N15j95J69j16q9K60l06L05m80O57p42O02k71
1941A5r0L72o53P94p56N96m26J52L5k13K59l28N60p37O01m46M05m01N4M70p04
1962d41P05p32P22n68J69K48l38K62k93M56n42N04m32L67k04o4M21p71R61p75
1982c45N71l61J44J07l18M72m32N00n71N86m29J63L1j14L23n84P03p14O09l77
$$ plain form
2002 -36 75 227 -107 422 -272 365 -80 250 -112 161 113 -165 263 -245 369 -461 353 -106 -133 208 -206
2023 -206 286 -415 254 -131 23 -192 48 44 -304 211 -412 315 -396 103 -106 -157 103 -312 244 -389 187
2044 187 -297 91 -131 -153 112 -246 80 -331 319 -319 84 -114 19 98 -380 465 -305 240 -238 212 83
2065 83 -179 218 -45 254 -229 452 -170 223 10 115 286 -282 524 -223 369 -62 141 149 -100 282 -111
2086 -111 284 -203 263 -122 264 -36 -48 258 -341 348 -388 262 -182 9 53 -199 169 -231 220 -308 200
2107 200 -259 72 -115 -165 234 -508 326 -351 150 -213 -11 50 -253 163 -277 193 -364 205 -253 -12 -42
2128 -42 -184 273 -310 217 -243 283 -136 30 52 -178 220 -351 435 -201 178 -7 112 115 -173 280 -147
2149 -147 280 -221 333 -10 44 231 -62 463 -345 401 -131 194 3 7 202 -104 212 -167 347 -254 278
$$ packed form
2002c6J11J52l34N29o94O37m45L30l62K73m8k78M28n08O14q30Q14m59k7L41m14
2023b06M92p01O69l85J54k15K40ml48N15o23P27p11M99k09n1K60m15N56o33N76
2044A87m84L88k22k2K65l58L26m11O50o38M03j98J33P9m78Q45p70N45m78M50j29
2065H3k62L97k63K99m83O81o22L93k13J05J71n68Q06p47N92m31K03Qk49L82l93
2086a11L95m87M66l85L86l00j2L06n99O89p36O50m44J91M4k52L68m00M51n28N08
2107B00m59L31j87n0L99p42Q34o77N01l63K02O1l03M16m40M70n57N69m58K41l0
2128d2j42M57n83N27m60N26m19J66K2k30L98n71P86o36L79j85J19Lk88M53m27
2149a47M27n01N54l43N4J87k93N25q08P46n32L25j91MJ95l06L16l79N14o01N32
$$ plain form
2170 278 -116 30 114 -344 352 -336 238 -211 78 -7 -169 72 -192 169 -305 294 -321 39 -222 16 138
2191 138 -452 286 -356 170 -276 83 -68 -145 102 -141 130 -329 332 -310 115 -46 -84 236 -332 355 -228
2212 -228 214 -102 108 28 -18 179 -167 379 -243 366 -145 117 103 -67 281 -112 244 -125 332 -148 203
2233 203 148 -43 247 -234 392 -261 267 29 9 27 -88 236 -266 259 -177 244 -251 42 106 -277 139
2254 139 -323 330 -361 133 -132 4 -48 -192 159 -283 200 -368 176 -181 -83 58 -270 212 -348 121 -163
2275 -163 84 -161 33 56 -160 163 -246 304 -396 201 17 -75 115 -113 275 -213 201 -56 190 -161 125
2296 125 151 -181 269 -243 340 -210 204 94 -70 215 -100 259 -123 269 -126 184 -25 91 130 -154 359
2317 359 -279 339 -138 102 -19 -115 144 -155 190 -119 131 -222 106 -90 -80 82 -271 225 -342 184 -261
$$ packed form
2170B78l94J46Q4m58O96o88N74m49K89q5j62K41k64L61m74N99o15L60k61K38J22
2191A38n90P38o42N26m46L59j51p7K47k43K71m59O61o42M25j61l8L20n68O87n83
2212b28M42l16K10q0m6J97l46N46o22O09n11K62j4j70L48l93L56l69M57m80L51
2233B03n5j91K90m81O26o53N28k38k0J8j15L24n02N25m36M21m95K93O4l83M16
2254A39m62O53o91M94k65J36n2j44L51m42M83n68N44l57R8J41l28M82n60M69k84
2275a63K47k45J94K3k16L23m09N50p00N97j84r2J90k28L88m88M14k57K46l51K86
2296A25K6l32M50n12N83n50M14j10j64K85l15L59l82L92l95L10k09J16L9k84N13
2317C59o38O18m77K40j21r6K59k99L45l09K50l53L28j96J0J62l53M96n67N26m45
$$ plain form
2338 -261 -53 -26 -178 61 -252 161 -236 107 -247 87 -147 -168 178 -240 182 -317 256 -151 -16 0 -51
2359 -51 80 -266 281 -289 225 -122 71 61 -100 216 -159 309 -146 153 -46 172 43 -10 264 -153 267
2380 267 -264 266 -49 -9 177 -79 151 -157 337 -115 166 -86 171 28 -156 342 -216 276 -243 98
2400 98 2 -139 87 -124 168 -277 131 -249 183 -222 -40 84 -224 153 -254 235 -289 5 -95 -82 4
2421 4 -172 134 -285 112 -211 102 -216 -59 164 -257 138 -233 258 -192 71 -3 -19 46 -100 202 -205 235
2443 235 -60 172 -83 76 220 -108 278 -161 309 -80 154 95 -31 129 -89 294 -194 228 -123 151
2463 151 2 -5 200 -152 199 -202 242 -115 118 -82 23 163 -262 236 -209 118 -174 55 1 -108 58
2484 58 -142 115 -322 201 -189 -28 -76 -95 154 -385 163 -231 59 -202 -51 27 -125 45 -226 178 -272
$$ packed form
2338b61K08K7j52K39l13M13l97L43l54L34k34k1L46m18M22m99N73m07J35J6n1
2359e1J31l46N47n70N14l47J93j0j61L16l75M68m55K99j99K18j29n3K74m17M20
2380B67n31N30l15M0J86k56K30l08M94m52K81k52K57j43j84M98n58M92n19L41
2400I8r6j41K26k11K92m45M08l80M32m05J82J24l08L77m07M89n24K94j00J3Q6
2421Dj76L06m19L97l23L13l18J57K23m21L95l71M91m50K63p4j6O5j46L02m07M40
2443B35k95K32k55J59J44l28L86m39M70l89K34n9j26J60k18L83m88M22l51K74
2463A51j49pK05l52L51m01M44l57K33k00J05J40m25M98m45L27k92K29n4j09J66
2484E8k00K57m37N23l90J61m8j9K49n39N48l94K90k61J51P8j52J70k71M04m50
$$ plain form
2505 -272 181 -156 44 4 -111 183 -241 202 -158 170 -71 56 71 19 201 -108 214 -147 179 -112 93
2526 93 98 -100 295 -163 249 -112 249 25 1 149 -119 193 -134 263 -186 175 -122 -2 92 -143 213 -187
2548 -187 247 -162 96 -49 41 6 -120 133 -200 64 -191 67 -96 -43 98 -271 105 -240 148 -268 38
2569 38 -15 -154 27 -171 149 -282 112 -130 99 -164 -47 56 -162 186 -197 232 -172 74 -31 -42 116
2590 116 -164 234 -117 192 -134 176 -3 -33 195 -41 233 -214 330 -56 67 9 62 195 -162 226 -102
2611 -102 182 -49 151 76 -75 76 -111 227 -170 230 -128 48 -26 -119 136 -238 171 -229 114 -117 6
2632 6 -26 -93 81 -179 203 -209 158 -199 12 43 -191 86 -214 137 -245 88 -122 -64 11 -102 87 -219
2654 -219 229 -288 122 -122 -6 29 -131 226 -141 133 -168 85 -27 19 102 -24 105 -109 275 -185 156
$$ packed form
2505b72M53l37K00m0j15K94m24M43l60L28k41J27J5n2J82l09L22l61L26k91K05
2526I3Nj98L95m58M12l61L61k24k4J48k68L12l27L97m49L61k97J20R4k35L56m00
2548a87M34m09K58j45R0l5j26K53l33K64k55K58j63N3J41l69L76l45L88m16L06
2569C8n3j39J81j98L20m31L94k42K29k63J17J03k18L48l83M29m04K46j05j1J58
2590A16k80L98l51L09l26L10j79l0K28k36K74m47N44l86J23n8N3J33l57L88l28
2611a02K84k31K00p5j51J51j87L38l97M00l58J76p4r3K55l74M09m00L43k31J23
2632Fl2o7J74k60L82m12L67l57K11L1k34K77l00L51l82L33k10N8P5j13J89l06
2654b19M48n17M10k44J16L5j60L57l67K74l01K53j12M6Q3j26J29k14L84m60L41
$$ plain form
2675 156 -60 69 131 -137 326 -163 185 -90 139 33 73 73 -46 212 -92 262 -131 177 -58 -15 197 -183
2697 -183 171 -191 232 -143 52 -9 -51 -29 -150 210 -252 71 -149 31 -154 -70 104 -224 44 -195 156
2718 156 -244 28 -60 -94 49 -231 163 -216 57 -119 24 25 -4 37 -122 163 -233 186 -153 78 23 -73 183
2741 183 -215 225 -57 151 -51 94 11 30 120 -52 251 -224 285 -54 94 97 -78 216 -149 236 -43 86
2763 86 11 92 46 -24 121 -103 206 -242 206 -118 22 41 -175 158 -202 92 -161 33 -107 -5 -74 -45 26
2786 26 -226 198 -306 123 -147 -94 28 -175 88 -223 77 -185 107 -134 -35 6 -73 150 -200 239 -131 39
2808 39 -151 24 85 -118 147 -113 220 -147 184 -58 -15 93 -78 207 -200 155 -41 128 4 84 76 -51
2830 -51 186 -154 320 -124 144 54 -16 68 -143 241 -110 144 -42 114 -5 -4 58 -67 149 -241 239 -182
$$ packed form
2675A56k16J29O2k68M63m89L48k75K29j06M0%j19K58l04L54l93L08k35M3K12l80
2697a83L54l62M23l75J95o1m2K2j21L60m62L23k20J80j85Q4J74l28K68k39L51
2718A56m00K72q8l4J43k80L94l79K73j76J43Jk9M1j59K85l96M19l39K31n5r6K56
2741A83l98M40k82K08k02J45q3J9R0j72L03m75N09l39J48Lj75K94l65L85k79J29
2763H6p5Q1m6p0J45k24L09m48M48l24J40J9k16L33l60K94k53J94j40J02o9K9P1
2786B6k52M24n04M29k70N3J22k03K63l11L00k62K92k41R9M1p9K23l50M39l70J70
2808C9j90J75O1k03K65k60L33l67L31k42M3J08j71K85m07L55j96J69j24Q0qj27
2830e1K37l40M74m44K68r0p0Q4k11L84l51K54j86J56j19JO2j25K16l90M80m21
$$ plain form
2852 -182 9 -21 -76 111 -177 137 -174 105 -137 64 -139 -16 61 -234 204 -321 155 -172 -14 -23 -146 90
2874 90 -188 97 -139 88 -177 15 -66 -83 98 -173 226 -222 176 -109 0 27 -75 138 -127 213 -86
2895 -86 140 -90 117 3 -53 153 -128 201 -134 184 -39 52 38 -39 133 -124 226 -185 167 -61 5 83
2917 83 -60 135 -134 246 -71 99 -148 96 17 -75 153 -226 158 -194 128 -48 -78 56 -75 99 -188
2938 -188 134 -163 34 -179 34 1 -184 81 -237 188 -178 102 -55 -106 28 -122 91 -113 79 -160 169
2959 169 -77 42 43 -99 145 -226 257 -108 97 12 18 130 -95 196 -149 122 -114 176 -4 47 184 -60
2981 -60 246 -146 255 -129 94 27 4 60 -49 178 -172 186 -128 127 9 -24 181 -177 108 -136 193 -145
3003 -145 20 -18 -58 35 -188 179 -195 120 -200 15 -10 -120 56 -146 94 -192 121 -97 32 -136 -38 78
$$ packed form
2852a82J91l0n5J87k88L14l11K79k42K01k03J23P7k95M38n25M76l27J58rj23K36
2874I0k78K85k36K27k65J92q1j7J81k71L99m48L98k85J09K7j02K13k65L40k99
2895h6K26k30K07j14n6K06k81L29l35L18k23R1j4p7J72k57L50m11L52k28O6P8
2917H3j43J95k69L80l17J70k47K44p9r2K28l79L84l52L22j76l0J34j31J74k87
2938a88L22k97J97k13K13l3j85K65l18M25l66K80j57n1J34j50K13k04J92k39L29
2959A69k46J19Jj42K44l71M83l65K05q5OJ12k25K91l45K71k36K90j80N1J37k44
2981f0L06l92M01l84K23o7k3N6j09K27l50L58l14K55j18l3K05l58K85k44L29l38
3003a45J65l8m0R3k23L67l74L15l20K15k5j10J76k02K40k86L13k18J29j68R8J16
$$ plain form
3025 78 -225 141 -145 113 -160 -21 28 -70 39 -80 185 -219 121 -49 26 -16 -88 161 -112 182 -92 152
3047 152 42 121 106 8 227 -101 203 -106 167 -21 128 60 -54 169 -141 202 -143 200 18 10 72 -53
3069 -53 104 -145 169 -97 86 -107 10 69 -146 119 -195 166 -188 90 -64 -70 64 -179 58 -224 85
3090 85 -195 77 -88 -48 40 -137 138 -193 67 -133 84 -87 -30 67 -147 76 -224 120 -167 33 -49 -35
3112 -35 78 -144 152 -126 205 -84 90 23 16 97 -116 198 -135 184 -84 125 -22 -21 172 -90 191 -111
3134 -111 243 -106 62 125 -23 110 -87 204 -111 130 -108 64 -32 -28 107 -129 233 -212 91 -25 76
3155 76 -37 -88 121 -213 111 -173 102 -199 1 -57 -121 -12 -211 187 -195 64 -111 36 -41 -51 148 -210
3177 -210 93 -143 121 -40 -20 46 -100 70 -114 97 -157 132 -64 50 43 -50 134 -132 202 -119 146 -1
$$ packed form
3025G8l03L66k86K58k73J39M9r8J09j19K65m04L40j70P5m2p2K49k73K94k74K44
3047A52j10P9j5r8K19l28L04l09K73j88J49o8j14K23l10L43l45L43j82qO2j25
3069e3J57k49L14k66J83j93J17N9k15K65l14L61l54K78j54oJ34k43K37k82L09
3090H5k80K72j65M0Q8j77K75l31K60k00K17j71N7R7k14K23l00L44k87K00q2J4
3112c5J13k22K96k78L31k89J74o7pQ1k13L14l33L19k68K09j47JJ93k62K81l02
3134a11L54l49J68O3j48J33j97K91l15K41k38J72r6MJ35k36L62m45L03j16J01
3155G6j13n1K09l34L24k84K75l01K00n8o4J09j99L98l82K59j75J47p7j0J99l58
3177b10L03k36K64j61K0O6j46J70j84K11k54K89j96J14pr3J84k66L34l21K65j47
$$ plain form
3199 -1 20 88 -19 173 -133 226 -82 155 -37 93 71 -72 205 -120 170 -65 146 1 -9 97 -58 119
3221 119 -102 167 -69 76 -65 -52 44 -194 177 -156 115 -160 59 -34 -87 14 -95 111 -176 106 -131
3242 -131 64 -108 -75 99 -132 106 -154 94 -156 27 -2 17 65 -132 114 -180 128 -92 67 -1 -79 114
3264 114 -78 108 -133 108 -66 86 -29 14 144 -128 186 -123 166 -18 48 -21 9 70 -55 144 -103 154
3286 154 -84 87 0 -42 122 -120 169 -73 155 -10 -6 68 -44 82 -118 145 -95 123 -101 31 8 -124
3308 -124 64 -164 76 -183 33 -117 -6 -78 -43 52 -165 101 -216 59 -118 -11 70 -102 88 -133 97
3329 97 -132 67 -48 1 9 -47 143 -191 206 -144 62 -26 -6 75 -102 114 -69 99 -125 128 -43 39 54
3352 54 7 142 -156 142 -89 18 -12 -11 120 -81 135 -80 128 -111 169 -32 -16 53 -62 168 -150 146
$$ packed form
3199aK1O8j07J92l06L59l08K37j92J30k2j43K77l25K90k35K11j45j0J06j55J77
3221A19k21K69k36J45j41J3R6k38L71l33K71k75K19r3n3J01j09K06k87K82k37
3242a31J95j72L3J74k31K38k60K48k50J83k9J9M8j97K46k94L08k20J59o8p8J93
3264A14j92J86k41K41j74J52j15M3J30k72L14l09K89j84O6o9L0O1j25J99k47K57
3286A54k38J71q7m2J64k42K89k42K28j65MP4j12J26k00K63k40K18k24J32k3j32
3308a24J88k28K40k59K16j50J11p2L5R5k17K66l17K75j77J07Q1j72J90k21K30
3329I7k29J99j15M9Qn6J90l34L97l50K06q8K0Q1j77K16j83J68k24K53j71Q2J5
3352E4m7J35k98K98k31J07l0JJ31k01K16k15K08k39K80k01J6O9j15K30l18K96
$$ plain form
3374 146 -35 76 -64 -23 23 -63 66 -123 142 -159 48 -76 -80 59 -190 123 -145 13 -94 29 -60 -78
3396 -78 5 -92 76 -191 112 -118 -1 5 -92 53 -176 159 -66 115 -97 100 -33 -15 116 -119 214 -82
3418 -82 130 -37 47 59 -32 66 -47 135 -73 83 -42 85 35 -70 113 -131 151 -86 83 -63 27 52 -46
3441 -46 126 -72 100 -69 132 -80 41 53 -82 87 -93 161 -129 83 -68 63 15 -70 69 -160 85
3462 85 -166 15 -138 -36 -35 -140 58 -159 163 -140 9 -84 -65 73 -168 71 -67 104 -187 99 15 29
3484 29 75 -80 134 -143 120 -32 89 -76 6 66 -71 76 -119 186 -50 82 16 23 86 -69 96 -74 157
3507 157 -79 108 -42 -13 117 -90 110 -102 103 -57 64 45 -53 91 -104 64 -79 147 -129 86 -46
3528 -46 -28 38 -90 122 -130 122 -113 -26 -37 -37 22 -120 88 -171 89 -109 -2 -25 -102 76 -156 89 -169
$$ packed form
3374A46j81J11j40M1M6q6J29j89K65l01K07j24mJ39k49L13k68J58j07J23q9j8
3396g8Q3r7J68k67L03k30J17Or7J45k29L35k25J81k12J97j33J8J31k35L33k96
3418h2K12j67Q4J2r1R8j13J82k08J56j25J27n0j05J83k44K82k37J69j46R0K5r8
3441d6J72j98J72j69K01k12J21J2j35J69j80K54k90K12j51J31m8q5J39k29K45
3462H5k51J81j53J02Jj05J98k17L22l03J49r3J9J38k41K39j38J71k91K86q4J4
3484B9M6j55K14k77K63j52J21j65Q2O0j37J47j95L05k36J32o6PO3j55J65j70K31
3507A57k36J87j50K9J30k07K00k12K05j60J21j9r8J44j95J68j43K26k76K15j32
3528d6J8O6j28K12k52K52k35Q7j1%N9j42K08k59K60j98J07k3p7J78k32K45k58
$$ plain form
3551 -169 66 -85 -70 -23 11 92 -120 141 -101 119 -95 49 13 -55 57 -98 135 -127 145 -20 73 18 -42
3574 -42 147 -107 185 -82 103 -27 26 112 3 129 -82 130 -127 59 47 39 75 -68 152 -90 136 -92
3596 -92 98 -34 -13 -24 -54 121 -110 138 -132 52 -83 2 28 -132 72 -158 94 -102 25 -52 -56 -55 -65 37
3620 37 -118 67 -175 62 -40 -36 -29 -152 66 -194 75 -109 32 -38 -62 25 -72 68 -122 81 -60 70 -3
3643 -3 15 98 -92 114 -124 69 -45 71 -40 -33 99 -66 194 -93 151 9 83 -28 -12 81 -71 182 -116
3666 -116 203 -68 90 -19 -36 89 -21 99 -72 67 -119 36 -43 -59 93 -59 51 -115 117 -71 36
3687 36 -44 -53 19 -161 63 -103 63 -54 -24 9 -43 65 -145 95 -126 62 -102 -3 15 -108 70 -140 50
3710 50 -98 52 -91 -11 30 -49 67 -130 129 -84 71 -11 33 93 -50 172 -68 115 -66 102 -8 16 98
$$ packed form
3551a69K35j51J5M7L4Q1k12K61k42K20k14J44l6o8J12j55K33k62K72j65R3n5o0
3574d2J89k54K92k67J85j30N3Q6j09J26k11K12k57J86j2qL6j43K20k42K26k28
3596i2J90j32K1j1l0J75k31K48k70J84j35Q5K6j60K04k30K52j96J27p7mJj0J02
3620C7j55J85k42K37j02MPj23K18k60K69j84J41p0k4Q7r7J40j90K03j41J30p3
3643cJ8Q3j90K06k38J93j14J16j11PJ32j65K60k87K44j42P4j11J6R3j52K53k98
3666a16L19k71J58j09j7J25j10J20j71J39j86J55p9j6J52j52J10j66K32j88J07
3687C6q0rP2j80K24j66J66j17L0L3n2J08k10K40k21J88j64R9J8j23J78k10J90
3710E0j48J50j43Q0M1p9J16j97K59k13J55q2M4O0j43K22k40J83j81J68j10K4Q2
$$ plain form
3733 98 23 106 -62 149 -45 82 2 57 38 -76 134 -122 129 -3 40 -14 6 60 -71 92 -60 116 -135
3756 -135 117 9 -78 -8 -87 75 -123 96 -90 57 -20 -58 28 -52 66 -121 85 -114 28 -22 1 54 -193
3779 -193 50 -88 101 -71 -18 -5 -12 -3 -69 93 -132 80 -51 12 10 -25 97 -37 67 -100 121 -20 11 23
3803 23 -7 99 -103 122 -51 155 -46 79 75 -44 113 4 106 -48 103 -34 71 33 -32 101 -102 34
3825 34 -54 91 -79 -15 15 -33 27 -127 116 -135 83 -113 -28 -26 -84 50 -160 41 -143 61 -55 -53 6 -39 12
3850 12 -120 96 -68 59 -110 -28 23 -117 74 -126 108 -77 36 -33 18 30 13 116 -87 129 -145 75
3872 75 -41 -5 67 -65 82 -40 49 -72 62 -5 39 49 4 134 -115 110 -98 96 40 -27 76 -72 79
3895 79 -69 92 -49 84 -17 32 62 -97 121 -94 82 -43 37 -20 -74 24 -94 62 -111 66 -162 48
$$ packed form
3733I8p5Q3j68K11j94J27q0N5j9j14K10k56K51j32M3n4K0N4j31J63j52J76k51
3756a35K52j08q7P0p9J62j98K19j86J47p7l8Q6q0J18j87K06j99J42n0K3N3k47
3779a93K43j38J89j72N3J3pRo6J62k25K12j31O3kl5J22j34J04j67K21j41L1J2
3803B3l0J06k02K25j73K06k01J25mj19J57j09J02j54J51j37J05l8o5J33k03J36
3825C4q8J45j70O4L0m8O0j54K43k51K18j96Q5Kn8J34k10K01j84K04j16KN9m5N1
3850A2j32K16j64J27j69Q2N1j40J91k00K34j85J13o9N1J2j7J03k03K16k74K20
3872G5j16L6P2j32J47j22Q9j21J34o7M4J0m5J30k49K25k08J94n6o7J03j48J51
3895G9j48J61j41J33j01M9L0j59K18k15J76j25Q0n7n4R8j18J56j73J77k28K10
$$ plain form
3917 48 -11 -55 -17 -104 61 -99 47 -115 17 -77 -34 14 -97 81 -102 96 -68 51 -20 -70 76 -89 131
3940 131 -92 94 -55 52 30 48 40 -81 132 -98 125 -90 55 11 37 111 -67 85 -121 112 -26 62 17
3963 17 16 52 -93 78 -82 119 -73 1 70 -73 86 -113 68 -62 41 -12 28 -36 -88 58 -134 90 -85
3986 -85 27 -43 -90 -21 -55 66 -109 100 -65 75 -64 1 56 -145 85 -91 76 -68 -11 -70 -12 -19 -91 80
4010 80 -69 104 -103 116 -58 7 47 -52 99 -97 101 -22 55 -60 76 38 -13 92 -121 93 -91 67
4032 67 -14 -37 34 -54 132 -24 73 -68 98 -60 -5 57 -10 79 -89 142 -35 26 -6 33 49 -55 111 -91 47
4057 47 -68 30 -27 20 20 -78 126 -107 69 -56 -36 -29 -90 18 -69 -8 -94 40 -110 10 -31 -28 10 -136 111 -132
4083 -132 71 -44 17 -8 -7 37 -78 122 -28 103 -103 51 6 -4 117 -40 69 -88 116 -28 13 57 12
$$ packed form
3917D8n9m4L8q7J65j60J46j62J32r4M3M8j11J78j83J98j64J19p1n0J46j65K20
3940A31k23J86j49J07k2J8qj21K13k30K23k15J45m4K6P4j78J52k06K33j38Q8m5
3963A7jL6j45J71j60K01j92P4O9j43J59j99J81j30J03n3M0o4n2J46j92K24j75
3986h5J12p0m7O9l4J21j75K09j65J40j39O5N5k01K30j76J67j44N7n9N8pp2J71
4010H0j49J73k07K19j74O5M0r9J51j96J98j23P7j15J36l8n1J05k13K14j84J58
4032F7q1k3P1q8J86j56R7j41J66j58N5O2o7Q9j68K31j77O1l2L9J6j04J66k02J38
4057D7j15R8n7M7%r8K04k33J76j25K0Po1J08q7O1q6J34j50J20m1LL8j46K47k43
4083a32K03j15O1k5JM4j15K00j50J31k06J54m5j0J21j57J09j57K04j44M1M4m5
$$ plain form
4106 12 134 -74 124 -59 117 -39 2 34 -65 84 -51 54 -58 98 17 24 -11 14 109 -47 102 -123 16
4129 16 -21 -18 83 -59 84 -133 84 -94 31 -48 3 40 -109 72 -91 38 -91 13 -52 -10 -10 -66 58 -107
4153 -107 0 -46 17 -10 -38 16 -109 18 -136 109 -85 42 -6 -20 61 -131 105 -66 99 -64 56 23 -12
4176 -12 122 -78 87 -33 139 -39 74 63 -35 67 -52 132 -51 102 -97 21 -39 -24 67 -70 59 -110
4198 -110 71 -88 35 17 2 14 -72 72 -113 2 -47 50 -58 -53 14 -118 21 -128 85 -74 96 -38 -38 57
4222 57 -94 73 -66 65 -101 -5 -8 -61 56 -136 108 -90 77 -37 -21 -30 -115 76 -62 73 -60 120 -49
4245 -49 11 13 -38 46 -42 97 -121 53 -11 47 48 -34 137 -24 129 -83 117 -25 32 43 19 188 -38 36 -97
4270 -97 47 -1 8 26 -64 78 -95 42 -114 16 -58 -1 16 -55 63 -89 77 -112 30 -64 27 -69 -78 38 -113
$$ packed form
4106A2J22k08J98j83J76j56M1L2r9J49j35J05j12J56q1Pl5K5R5j56J49k25J39
4129A6l7LJ01j42J43k17K17j78J25p9N1L7j49J81j63J29j29J04o5M2%n6J24j65
4153a07J07m6O3k7k8N4j25J27j54K45j94J27m8j4Q1j92K36j71J65j63J20l3l5
4176a2J34k00J65j20J72j78J13j1r8J02j19J84j83J53j99J18o0J5R1j37J29j69
4198a10J81j59J23j8j5J2q6J44j85J15m9R7j08NO7j32J39j49K13j59J70j34%R5
4222E7j51J67j39J31j66R6ln3J17j92K44j98J67j14J6rq5J91j38J35j33J80j69
4245d9O0Kn1Q4q8J39k18J74o4N8Jq2J71j61J53k12K00j42N7J1k4J69k26P4j33
4270i7J44m8RJ8r0J42j73J37j56J30p4N7J7p1J18j52J66j89J42r4R1r6rJ16j51
$$ plain form
4295 -113 91 -146 40 -56 2 18 -58 110 -90 29 -101 46 -75 -36 19 -85 67 -68 67 -43 24 9 -55
4318 -55 23 -14 81 -81 87 -22 31 20 -1 45 -51 70 -62 103 -51 54 19 40 60 -35 122 -99 62 -80
4342 -80 60 19 -60 26 -42 80 -34 66 -60 -20 -19 -14 41 -45 93 -118 49 -93 19 20 -78 -34 -56 40 -109 7
4368 7 -25 -12 -33 -62 45 -80 14 -167 15 -67 -34 -5 -41 34 -69 34 -48 36 -83 -7 -38 -36 84 -42 72 -64
4394 -64 65 -3 9 6 -20 99 -102 104 -44 131 -35 7 54 14 102 -28 85 0 30 16 27 -2 -10 65 -4 90 -74
4421 -74 72 -20 -9 55 -60 41 -65 73 -66 43 -81 20 18 -24 48 -91 30 -56 -2 -18 -33 12 -96 -5 -111
4446 -111 38 -67 27 -62 -47 -5 -56 48 -107 68 -109 17 -21 -61 27 -50 83 -82 47 -48 -1 -31 -17 40 -19
4471 -19 90 -29 82 -58 55 -23 -40 63 -37 60 -102 30 -71 65 -7 -26 86 -75 67 -65 78 -45
$$ packed form
4295a13K04k37J86r6N8J6p6J68k00J19j30J47j21L9N5j04J52j35J35j10O7j5o4
4318e5P8l7R5j62J68j09N3j1k1M6r6J21j32J65j54J05l5K1K0r5J57k21J61j42
4342h0J40m1p9Q6o8J22j14J00j26M0JNN5q6J38k11J67j42J12Jr8M4k2R6j49J16
4368Gl2J3k1k9J07j25R4j81J82q2L3K9l6P5j03J03q2Q4j19P6l1KJ20j26J14j36
4394f4J29o8J2lk6J19k01K06j48J75j66M2M7m0Q8j30J13q5L0j4J1k9qP5o9R4j64
4421g4J46r2J1O4j15J01j06J38j39J09j24J01km2P2j39J21q6N4j6j5M5j08R1j06
4446a11J49j05R4q9J5M2n1J04j55J75j77J26l8m0Q8p7J33j65J29r5M7l0J4N7n9
4471a9J09j19J11j40J13p8j7J03j00R7j62J32j01J36p2j9J12j61J42j32J43j23
$$ plain form
4493 -45 9 -32 21 59 -15 64 -68 69 -61 10 -9 -31 69 -26 68 9 51 -55 12 -31 -101 78 -94 59 -81 39
4519 39 -49 19 -5 -61 42 -84 34 -112 6 -46 35 17 -44 19 -116 75 -49 19 -18 -18 11 -34 -4 -37 74 -42
4545 -42 77 -9 54 35 -69 85 -50 104 -30 49 -45 13 4 -54 31 -46 92 -47 85 4 -7 -29 -60 82 -37
4570 -37 21 -46 39 13 1 24 -26 51 -107 80 -18 38 14 -31 -10 -37 18 -62 13 -68 55 2 5 33 -26 58 -102 56
4598 56 -27 29 -65 -18 -13 -80 23 -79 64 -44 118 36 -29 43 -47 73 -83 62 -41 5 -5 -22 6 -25 66 -32
4624 -32 32 -49 5 17 -37 39 -42 104 -40 56 1 56 -13 -9 46 -118 86 -111 52 -52 28 2 -23 -2 -28 61 -111
4651 -111 58 -67 6 37 -21 44 -65 20 -48 51 -18 -44 30 14 21 -66 53 -91 19 -91 -2 -31 -43 64 -82 13
4677 13 -94 52 -53 34 12 -72 50 -85 22 -62 46 -91 -26 38 -59 46 -67 61 -48 69 -41 5 15
$$ packed form
4493d5N4m1N3L8p4P9j32J37j30P1j9k2J00r5R4n9M2j06O7m3p0J79j72J53j40J20
4519C9q8O8k4n6J03j26J18j46J18n2Q1j8o1O3j35J91j24O8l7%K9m5L0l3J11j16
4545d2J19q6O3j9j04J54j35J54j34P9r4N8rn8Q5p7J38j39J32q1j1k2l1J42j19
4570c7N8o7Q5k6j2K3n0P7j58J87r8N6k4m5K1k7N5q0P5q1J23n3LK8n9Q4j60J58
4598E6q3N6r4M7No7J03j02J43j08J62q2o5P2r0J20j56J45j03M6j0j7K8l1R1r8
4624c2O4q1N4J2n4P6q1J46j44R6n5N5o9MN5j64K04j97J63j04Q0k6k5K1k6Q9j72
4651a11J69j25P3L1n8O5j09Q5o8R9o9k6P4j6Pq7J19j44J10j10Q9k9j2J07j46R5
4677A3j07J46j05Q7k2q4J22j35J07q4J08j37O5O4r7J05j13J28j09J17j10M6J0
$$ plain form
4700 15 0 92 -72 126 -68 85 -54 -33 70 34 83 -61 75 -16 27 -4 80 66 -39 53 -34 107 -56 9 3
4725 3 -2 66 -35 73 -51 75 -41 16 1 -15 16 -13 63 -63 64 35 16 -31 -5 -23 -73 30 -64 19 -71 -62 -18 -68
4753 -68 46 -5 49 -75 26 -104 79 -22 -19 34 -75 86 -52 106 -66 -30 -38 -5 60 -137 26 -93 96 -35
4777 -35 72 54 -21 77 -75 72 -59 22 33 38 5 -31 70 -79 51 -29 82 -28 -2 16 -20 96 -135 98 -61
4802 -61 45 -25 -14 13 -26 7 -64 -9 -46 64 -35 -5 -11 -22 75 -89 22 -95 48 -72 -31 29 -107 26 -26 59
4828 59 -71 -23 -38 14 10 -51 33 -44 68 -63 -12 -38 -5 -4 -27 39 -46 61 -25 41 -29 31 57 -71 47 -79 62
4855 62 -30 30 -8 8 86 -13 74 -74 62 -45 84 -19 9 25 -13 82 -82 74 -49 70 9 -41 45 -75 42
4880 42 -60 45 -68 -12 -37 -47 -24 -125 66 -118 69 -62 -12 1 -95 40 -53 16 -120 41 -69 -20 -22 -40 15
$$ packed form
4700A5j5R2j64J98j94J53j39K1J03l6M9j44J36r1M3l1Q4j4j05R2q7J41j63O5o
4725CnO8j01J08j24J26j16N7j5j6L1k9P6j26J27k9j9m7K6j8n0J03r4Q3r0RM4n0
4753f8J14n1N4j24J01j30J83j01LN3j09J61j38J58j72L6qL3O5j97J63j19J89j31
4777c5J07j8p5R8j52J47j31Q1J1Nl3l6J01j49J30q0J11j10K6J8l6J16k31K33j59
4802f1J06p0J1K7l9L3p1N5l7J10r9L0oj1R7j64J11j17J43j20M1O0j36J33n2Q5
4828E9j30M8j5N2mo1Q4p7J12j31N1k6L3Jk3O6q5J07q6O6p0O0K6j28J18j26J41
4855F2r2O0l8J6P8r9Q7j48J36j07J29j03K8J6l8R5j64J56j23J19o1n0Q6j20J17
4880D2j02J05j13N6k5j0K3j01J91j84J87j31N0J3r6J35r3O9j36J61j10M9kj8N5
$$ plain form
4905 15 -95 45 -89 9 -49 4 -21 -62 27 -51 61 -83 57 -70 39 14 -23 117 -69 96 -49 34 -21 11
4929 11 13 -29 63 -33 49 2 28 -2 -2 34 -29 95 -53 68 -88 29 18 15 -24 -36 66 -34 91 -83 63 -32 -24
4956 -24 12 -93 31 -126 61 -75 7 -117 -26 -50 -80 33 -75 33 -79 -23 -15 -3 22 -61 -12 -43 35 -76 -15
4981 -15 -25 -7 17 -56 31 -107 91 -71 44 -42 34 19 -14 63 -18 90 -11 42 6 -7 3 -58 78 -97 -11 -51
5007 -51 66 -39 14 36 -14 66 -68 40 -40 24 -65 -16 -1 -31 75 -44 51 -42 15 15 -7 52 -52 85 -52 37
5033 37 -59 48 -23 -100 31 -112 16 -117 18 -60 4 -19 -62 5 -102 47 -138 9 -51 12 -60 -24 -1 -78 62
5058 62 -11 66 -39 -26 -21 -40 78 -41 49 -42 46 25 -8 38 -30 69 -54 106 -63 47 -51 17 38 -23 52 -119 44
5085 44 -51 69 13 -29 11 -52 93 15 12 -77 57 -18 17 35 -26 69 -111 80 -60 5 -75 10 56 -25 59 -80 63
$$ packed form
4905A5j10J40j34R8n8N3k5m1Q9p8J12j44J40j27J09k5l7J40j86J65j45Q3n5L2
4929A1Km2R2r6Q2m7K6l0%L6o3J24j48J21j56J17j1ll9j2J02j00J25j74J46r5Q
4956b4L6j05J24j57J87j36Q2j24R1k4l0J13j08J08j12N6QJ2K5q3M9l1P8j11O1
4981a5j0J8K4p3Q7j38J98j62J15q6P6j5l3P7q1J08j01N3l6j3J0o1J36j75Q6m0
5007e1J17j05N3K2n0Q0j34J08q0O4q9M9J5l0J06j19R5r3N7%k2N9j04J37j37Q9
5033C7r6J07p1p7J31j43J28j33J35p8O4k3m3O7j07J49j85J47o0O3p2L6K3p7J40
5058F2p3P7j05J3Nj9J18j19R0r1Q8k1l3M6o8R9j23J60j69J10r8O8K1o1P5j71J63
5085D4r5J20n6m2M0o3J45p8lq9J34p5L5J8o1R5j80J91j40O5q0Q5M6q1Q4j39J43
$$ plain form
5112 63 -83 29 -15 -29 -56 -87 5 -87 32 -80 23 -57 17 -59 -16 33 -78 -30 -68 22 -3 -23 13 -93 7 -62
5138 -62 66 -55 39 -18 -18 7 -21 63 -30 48 9 44 -5 39 46 5 16 -70 54 -12 19 18 -15 49 -72 91 -72 56
5166 56 -40 -13 15 -8 87 -37 79 -57 -11 -28 21 1 -12 35 -39 58 -13 59 -29 -21 11 -30 19 -22 51 -99 43 -4
5194 -4 -32 61 -92 13 -60 40 -114 -42 -44 61 -1 -38 54 -59 30 -115 68 -49 -44 -22 -43 57 -78 40 -38 -4
5220 -4 -53 13 24 -74 -3 -72 21 -107 70 -18 59 62 11 47 -9 118 -37 34 -26 -20 5 -47 33 -38 86 -88 30 -31
5248 -31 1 -42 -48 22 -75 14 -46 1 -55 -66 -33 -46 69 -61 32 -68 -4 -21 -59 14 -86 23 -59 9 -61 59 -20 -6
5276 -6 40 -64 10 -60 15 -71 29 -15 -23 21 -82 -20 -65 72 -96 -31 -17 -61 -15 -23 48 -40 -4 -23 19 -26 -12 15 -48
5305 -48 80 -44 55 39 26 24 -40 78 -29 77 -48 47 -6 26 54 -7 60 -40 11 -124 42 -16 -19 20 -3 36 -90
$$ packed form
5112F3j46J12m4j4k7l1R2r2J19j12J03q0P4p6M3M9j11M8l8R0k5k0L6j06J00o9
5138f2J28j21R4n7%K5k8Q4r3P8l9L5m9M4Pm1J1q6J24o6L1jl3O4j21J63j63J28
5166E6r6K7K8k3R5j24J16j36M6j7M9k0j3M7p4R7p1P2q8QL2m1M9m1P3j50J42m7
5194dk8R3j53J05p3J00j54P2kJ05o2l7R2j13Q9j45J83j17NK2k1J00j35J18p8L4
5220dm9O6J1r8P1o9R3j28J77q8P7Ln1L6n6J27j55P1o0OK5n2Q0p1J24j74J18o1
5248c1L2m3oP0r7Q9o0M7n6j1L3j3J15j30R3j00O4j7l8P3j00J09q2O8p0J20p9J4
5276fM6j04P4p0P5q6J00m4qM4j03O2m5J37j68O5J4m4M6qP1q8L6j9M2m5J4K7o3
5305d8J28j24R9j6j3ko4J18j07J06j25R5n3L2K8o1O7j00N1j35J66n8lL9k3L9j26
$$ plain form
5332 -90 65 -83 36 -51 -83 28 -39 -42 -51 45 -88 35 7 -5 15 -31 42 -48 4 -23 3 -54 12 -3 -62 -4 -44 43
5360 43 -79 2 -45 -24 -27 -40 73 -80 57 -50 29 -29 -9 54 -75 37 -27 49 3 5 -27 -10 24 -34 56 -13 33 -18
5388 -18 42 -13 11 30 -25 77 -28 48 -27 24 17 4 31 -36 56 -29 16 -36 43 -43 -19 30 -61 24 -47 37 -75 16 -73
5417 -73 -28 6 -44 35 -56 7 -58 14 -54 -24 3 -14 56 -21 65 -95 37 -25 -23 71 -100 37 -55 8 -41 -4 -1 -41 57
5446 57 -42 80 -31 70 -72 77 14 -11 50 -38 43 -36 38 -35 -43 -26 -32 79 -63 49 -47 29 -53 -15 0 -11 43
5473 43 -29 88 -42 96 -47 -4 -3 -34 44 -55 48 -41 39 3 -11 43 -96 32 -3 23 -82 -10 -21 -58 -18 -23 -19 -68
5501 -68 17 -76 20 -13 -12 49 -45 3 -34 35 -51 32 -8 -19 21 -23 27 -35 99 -86 31 -53 16 25 -11 58 -62 40 -28
5530 -28 15 -42 -25 40 -30 21 -26 45 -11 77 23 -46 120 10 32 38 45 -13 48 30 -41 53 -75 54 -46 62 1 -8 43
$$ packed form
5332i0J55j48J19q7l2J11o7lrR6j33J23k8j2K0m6P3r0N2k7K6n7O6j5n9N8m0Q7
5360D3j22Q1m7K1lj3J13j53J37j07P9n8K0O3j29J12o4P6m6Kl2J7L4n8R0o9M6n1
5388a8O0n5K4J9n5J02j05P6p5N1pj3K7o7R2q5M5n2P9q6K4M9r1Q5p1Q4j12R1q9
5417g3M5L4n0P9r1O3o5P2o8L0K7j7P0p7Q6j60J32o2KR4j71J37r2O3m9L7Lm0R8
5446E7r9J22j11J01j42J49o3k5O1q8Q1p9P4p3qJ7oJ11j42J12r6P6q2L8J5j1N4
5473D3p2J17j30J38j43M3Jl1P8r9J03q9Q0l6j4N4j39J28l5K6j05P2j1l7M0nMm9
5501f8Q5r3R6l3JO1r4M8l7O9q6Q3m0j1M0m4N0o2J34j85J17q4O9Rl6O9j20J02o8
5530b8M3n7J7O5p0N1m7P1n6Q8n4o9J66j10K2OPn8O1j8p1R4j28J29j00J08o1rN1
$$ plain form
5559 43 -26 -31 -37 26 -50 -50 -23 8 17 20 42 -32 57 -61 49 -22 11 10 -53 40 -69 0 -99 37 -49 -5 -34 -48 44 -76 28
5590 28 -69 29 -42 68 4 33 25 30 29 -38 97 -20 33 33 -32 20 -23 85 -14 31 -36 -11 17 -16 75 -40 62 -91 29
5619 29 -33 42 -8 -13 18 -51 61 -21 -1 -7 22 11 -50 28 -31 47 -28 21 -15 -30 18 -43 49 -21 14 -48 -26 -69 -43 -25 -68
5650 -68 4 -10 -16 -53 -35 -27 14 -25 -16 12 -39 9 -70 21 2 -5 31 -89 85 -46 8 -33 2 -27 -33 21 -8 23 -36 34 -23
5681 -23 35 -29 -5 81 -18 16 -9 36 -27 83 31 5 18 10 73 -56 1 -19 46 -31 1 13 -15 70 -47 32 8 90 24
5710 24 -18 0 -27 9 -19 28 20 3 -20 21 -1 -38 23 -62 69 -76 -23 0 -66 37 -35 9 -46 -13 -37 -8 18 -1 38
5739 38 -91 13 -107 31 -36 -36 36 -22 60 5 89 -25 40 -3 32 10 -28 -4 -53 46 -24 25 -24 -32 -14 10 77 -29
5767 -29 70 4 25 -50 -11 27 31 67 -43 80 -66 28 -14 -13 -43 -60 -14 -50 -21 -23 -4 5 -33 49 -8 70 -72 15 1 33
$$ packed form
5559D3o9noO3p6%K7L1RLK2p4Q9j18J10p1L3jo3R3j09O9r9J36q6M4k9j4R2j20J04
5590B8r7R8p1J10o4K9qNjo7J35j17N3%o5N2m3J08r9M5o7K5K8l3R1j15J02j53J20
5619B9o2P5n0nL1o9J12q2K0oK9j1o1P8n9P8p5M9l6j5M8o1R2p0L5o2K2m3K6J8m3
5650f8P2j4ol7J8QM1l9RK8n1M8p9R1j9pL6j20J74j31N4m1L5k9oN4k9L1n9P0n7
5681b3N8o4K4Q6r9L4k5M5o3J10n2k6J3qO3j29N7k0O5p7L2J2k8Q5j17P9k4Q2o6
5710B4m2J8k7L6k8M7qj7k3M1k2l7O1q5J31j45N3K3o6J03p2M4n5L3k4K9K6j9L9
5739C8j29J04j20J38o7%P2n8Q2n5Q4j14O5m3L5k2l8K4m9R9p0M9m9qJ8K4O7j06
5767b9R9o6K1p5L9L8ML6j10J23j46R4m2Jl0j7M6l6K9kJ9Rl8Q2n7P8j42Q7j4L2
$$ plain form
5797 33 -34 -20 21 -51 69 -28 -4 -83 -8 -3 -26 -55 -75 60 -57 -27 -38 10 25 -32 3 -34 76 -79 47 -15 15 3
5825 3 -10 3 -55 76 -36 58 10 58 4 32 47 -32 52 -43 29 -15 38 39 -82 58 -26 32 -64 29 12 68 -27 -37 13
5854 13 -74 14 -20 59 -88 -12 -36 -21 26 -87 31 -52 3 -10 45 -51 -62 32 -92 43 -114 4 -8 9 34 -51 40
5881 40 -58 70 3 39 14 -1 3 -68 41 -55 1 -83 44 16 -18 29 -54 1 -42 53 -58 19 -29 21 -28 -35 40 -41 33
5910 33 -17 -5 -17 32 90 -37 52 -2 67 -48 -1 22 18 -6 -5 67 -48 63 -4 37 -49 -34 3 -73 25 -9 -37 -51 7
5939 7 -35 -94 27 -25 -1 -20 11 -53 10 5 31 20 -38 40 -110 62 -54 5 -10 5 -11 -27 -8 -114 76 -12 12 -41
5967 -41 -21 -4 -50 26 -53 -9 -25 14 25 14 -27 -18 62 -27 38 6 -1 3 -2 72 -40 63 -35 94 -17 -13 71 -36 64 10
5997 10 89 -59 58 -15 15 -7 12 11 -29 24 -57 -32 -43 -86 -25 11 72 -38 33 -4 -10 -37 -52 -2 22 15 -64 56 -1 21
$$ packed form
5797C3o7J4M1p2J20r7K4p9P5Nk3k9k0J35j17L0j1M8J5n7L5l7J10j55J26o2L0j2
5825Cj3J3n8J31j12R4m8M8n4K8J5p9Q4r5P2m4N3Jj21J40q4N8r6R3j7N6r5j0N0
5854A3q7Q8l4P9j47P6k4J5M7j13J18q3N5j3N5r6j1R4j24J35j57J18j2J7K5q5R1
5881D0r8J28o7L6k5j5Mp1J09r6N6q4J27k8l4M7q3N5m3R5j11P7m8N0m9pP5q1P4
5910C3n0J2j2M9N8j27Q9n4O9j15M7K3mk4JP2j15J11o7M1q6J5L7p6R8l4k8j4N8
5939Gm2n9J21n2K4j9L1o4O3nK6j1n8P8j50J72j16N9j5J5j6j6J9j06J90q8K4n3
5967d1K0J7m6P6p9M4j6L9J1j1m1RQ0q9O5l2pMnP4j12J03r8J29j11MQ4j07J00n4
5997A0P9j48J17p3L0k2J9jm0N3q1K5j1m3O1L6O1j10P1l7ok7j5N0K4pp9J20n7K2
$$ plain form
6027 21 -74 -33 -3 5 -11 -58 -24 -62 57 -43 4 6 8 27 -112 23 -69 25 4 -10 26 -8 2 -32 45 -16 7 -25 25 25
6057 25 -13 7 -28 56 -37 50 -27 13 3 -15 23 -54 53 -26 23 21 13 17 -48 38 31 42 -44 51 -6 -2 13 -68 71 -21 50 -42
6089 -42 -14 -18 4 -1 -74 -44 -52 30 -31 -32 -51 -39 51 -54 37 -54 54 -24 3 9 -77 -43 -67 85 -34 72 6 38 -28 7
6119 7 39 -54 64 -33 33 -19 19 27 -30 81 -19 29 -35 28 -1 -24 32 -51 65 5 53 -45 24 -21 17 16 -86 1 -1 30
6149 30 -32 59 50 -8 57 17 40 8 10 -4 30 6 -14 23 -65 51 -60 11 -29 -6 -79 -36 -40 -60 34 -77 -6 -12 0 -26 15
6180 15 1 -28 -3 -93 35 -26 -15 9 -37 27 -13 -22 -25 96 -1 55 14 -10 22 -4 61 8 49 -11 78 2 -15 55 -21 66
6210 66 -63 95 39 17 -19 -15 16 -25 54 -37 35 -66 6 -75 -57 0 -10 61 -34 27 -36 -15 -68 18 41 49 32 -35 58 -46
6240 -46 26 -44 7 -44 -20 45 -37 11 -60 -9 -31 -32 1 -87 -4 -55 46 -21 -5 -56 -78 -21 -77 27 -15 -9 -16 -47 -15 16 39
$$ packed form
6027B1r5M1L0Qj6m7L4l8J19j00M7KKJ9j39J35r2R4k1j4L6l4J0l4P7o1K3l2N0%
6057B5l8K0l5Q4r3Q7p7M0j0j8L8p7J07p9M9kqMo5Q6pJ1q6R5n7MJ5q1J39r2P1r2
6089d2K8mK2np3L0qQ2o1jj9J2R0j05R1r1J08p8K7Oq6L4k4J52j19J06o6L2o6L5
6119GL2r3J18r7O6n2L8Qn7J11j00M8o4O3k9k3N6q3J16o0M8r8O9m5L8jj02Q7kL1
6149C0o2R1rn8O5m0K3l2Kj4L4k4k0L7q8J16j11P1m0K3p3M3mk0R4j11P1oJ2k6M1
6180A5j4k9K5r0J28o1J1K4m6O4m0rlJ21r7N6m1k4L2k6O5n3M1o0Q9p6j7P0p6Q7
6210F6j29J58n6k2l6ML1m1P9r1P2j01P2q1J8N7j0P1r5O1o3K1n3Q6K3Qj7o7R3j04
6240d6P2p0N1n1K4O5q2M8p1N1k2jL3q8Q3n1J01o7J6n1k2N7n6J04m2Opl1L2L1K3
$$ plain form
6271 39 -36 54 -41 31 21 -17 70 -32 49 -38 25 -25 94 -28 26 50 -29 44 -42 36 -45 8 40 -28 3 -28 57 -73
$$ packed form
6271C9p5R0r5P2j0l8Q7j02Q1q7O3n0J19j22N4K4p9P3q6P8q1N3L2o8L1l1Q5j30
$$ [...]
8191a7
##END NTUPLES=NMR FID
##END=
