##TITLE=1H_EC-3235x
 DMSO, 8 sc, 
 19.10.2020
##JCAMPDX= 6.0         $$ Bruker NMR JCAMP-DX V2.0
##DATA TYPE= NMR FID
##DATA CLASS= NTUPLES
##ORIGIN= UXNMR, Bruker Analytische Messtechnik GmbH
##OWNER= root
$$ XWIN-NMR		Version 3.5
$$ Mon Oct 19 10:44:38 2020 Russian Standard Time (UT+4h)  she@DPX200
##.OBSERVE FREQUENCY= 200.1315066352
##.OBSERVE NUCLEUS= ^1H
##.DELAY= (6, 6)
##.ACQUISITION MODE= SIMULTANEOUS
##.ACQUISITION SCHEME= undefined
##.AVERAGES= 8
##.DIGITISER RES= 18
##SPECTROMETER/DATA SYSTEM= spect
##.PULSE SEQUENCE= zg30
##.SOLVENT NAME= DMSO
##.SHIFT REFERENCE= (INTERNAL, DMSO, 0, 15.7039)
##AUDIT TRAIL= $$ (NUMBER, WHEN, WHO, WHERE, WHAT)
$$ ##TITLE= Audit trail, XWIN-NMR		Version 3.5
$$ ##JCAMPDX= 5.01
$$ ##ORIGIN= Bruker BioSpin GmbH
$$ ##OWNER= she
$$ F:/spectra/data/she/nmr/H-F/1/audita.txt
$$ ##AUDIT TRAIL=  $$ (NUMBER, WHEN, WHO, WHERE, WHAT)
(   1,<2020-10-19 10:43:41.85 +0400>,<she>,<DPX200>,
      <created by zg, POWCHK disabled, PULCHK disabled
       configuration hash MD5:
       00 E9 B6 7A A2 85 ED C7 34 08 36 98 17 FE 4E 26
       data hash MD5: 16K
       81 31 EB 37 A7 FC AF C3 57 F8 79 45 B8 D3 14 74>)
$$ ##END=
$$ 
$$ hash MD5
$$ 83 D6 34 C6 8B D5 E2 39 F5 7D 45 FE 3C CB BA 4C
##$RELAX= 
##$RELAX= 
##$RELAX= 
##$RELAX= 
##$RELAX= 
##$RELAX= 
$$ Bruker specific parameters
$$ --------------------------
##$DU= <F:/spectra>
##$EXPNO= 1
##$NAME= <H-F>
##$PROCNO= 1
##$TYPE= <nmr>
##$USER= <she>
##$AMP= (0..31)
100 100 100 100 100 100 100 100 100 100 100 100 100 100 100 100 100 100 
100 100 100 100 100 100 100 100 100 100 100 100 100 100 
##$AQSEQ= 0
##$AQ_mod= 1
##$AUNM= <au_zg>
##$AUTOPOS= <>
##$BF1= 200.13
##$BF2= 200.13
##$BF3= 200.13
##$BF4= 200.13
##$BF5= 200.13
##$BF6= 200.13
##$BF7= 200.13
##$BF8= 200.13
##$BYTORDA= 1
##$CFDGTYP= 0
##$CFRGTYP= 5
##$CHEMSTR= <none>
##$CNST= (0..31)
1 1 145 1 1 1 1 1 1 1 1 1 1 1 1 1 1 1 1 1 1 1 1 1 1 1 1 1 1 1 1 1 
##$CPDPRG= <>
##$CPDPRG1= <>
##$CPDPRG2= <>
##$CPDPRG3= <>
##$CPDPRG4= <mlev>
##$CPDPRG5= <mlev>
##$CPDPRG6= <mlev>
##$CPDPRG7= <mlev>
##$CPDPRG8= <mlev>
##$CPDPRGB= <>
##$CPDPRGT= <>
##$D= (0..31)
0 1.2 0 0 0 0 0 0 0 0.06 0 0.03 0 0 0 0 0.0002 0 0 0 0 0 0 0 0 0 0 0 0 
0 0 0 
##$DATE= 1603089821
##$DBL= (0..7)
120 120 120 120 120 120 120 120 
##$DBP= (0..7)
150 150 150 150 150 150 150 150 
##$DBP07= 0
##$DBPNAM0= <>
##$DBPNAM1= <>
##$DBPNAM2= <>
##$DBPNAM3= <>
##$DBPNAM4= <>
##$DBPNAM5= <>
##$DBPNAM6= <>
##$DBPNAM7= <>
##$DBPOAL= (0..7)
0.5 0.5 0.5 0.5 0.5 0.5 0.5 0.5 
##$DBPOFFS= (0..7)
0 0 0 0 0 0 0 0 
##$DE= 6
##$DECBNUC= <off>
##$DECIM= 32
##$DECNUC= <off>
##$DECSTAT= 4
##$DIGMOD= 1
##$DIGTYP= 9
##$DL= (0..7)
0 120 120 120 120 120 120 120 
##$DP= (0..7)
150 150 150 150 150 150 150 150 
##$DP07= 0
##$DPNAME0= <>
##$DPNAME1= <>
##$DPNAME2= <>
##$DPNAME3= <>
##$DPNAME4= <>
##$DPNAME5= <>
##$DPNAME6= <>
##$DPNAME7= <>
##$DPOAL= (0..7)
0.5 0.5 0.5 0.5 0.5 0.5 0.5 0.5 
##$DPOFFS= (0..7)
0 0 0 0 0 0 0 0 
##$DQDMODE= 0
##$DR= 18
##$DS= 0
##$DSLIST= <SSSSSSSSSSSSSSS>
$$ [...]
##$SUBNAM2= <"">
##$SUBNAM3= <"">
##$SUBNAM4= <"">
##$SUBNAM5= <"">
##$SUBNAM6= <"">
##$SUBNAM7= <"">
##$SUBNAM8= <"">
##$SUBNAM9= <"">
##$SW= 16.880792210976
##$SWIBOX= (0..15)
0 0 2 0 0 0 0 0 0 0 0 0 0 0 0 0 
##$SW_h= 3378.37837837838
##$TD= 16384
##$TD0= 1
##$TE= 0
##$TE2= 300
##$TE3= 300
##$TEG= 300
##$TL= (0..7)
0 120 120 120 120 120 120 120 
##$TP= (0..7)
150 150 150 150 150 150 150 150 
##$TP07= 0
##$TPNAME0= <>
##$TPNAME1= <>
##$TPNAME2= <>
##$TPNAME3= <>
##$TPNAME4= <>
##$TPNAME5= <>
##$TPNAME6= <>
##$TPNAME7= <>
##$TPOAL= (0..7)
0.5 0.5 0.5 0.5 0.5 0.5 0.5 0.5 
##$TPOFFS= (0..7)
0 0 0 0 0 0 0 0 
##$TUNHIN= 0
##$TUNHOUT= 0
##$TUNXOUT= 0
##$USERA1= <user>
##$USERA2= <user>
##$USERA3= <user>
##$USERA4= <user>
##$USERA5= <user>
##$V9= 5
##$VALIST= <valist>
##$VCLIST= <CCCCCCCCCCCCCCC>
##$VD= 0
##$VDLIST= <DDDDDDDDDDDDDDD>
##$VPLIST= <PPPPPPPPPPPPPPP>
##$VTLIST= <TTTTTTTTTTTTTTT>
##$WBST= 1024
##$WBSW= 4
##$XGAIN= (0..3)
0 0 0 0 
##$XL= 0
##$YL= 0
##$YMAX_a= 45185
##$YMIN_a= -52339
##$ZGOPTNS= <>
##$ZL1= 120
##$ZL2= 120
##$ZL3= 120
##$ZL4= 120
##$ABSF1= 10
##$ABSF2= 0
##$ABSG= 5
##$ABSL= 3
##$ALPHA= 0
##$AQORDER= 0
##$ASSFAC= 0
##$ASSFACI= 0
##$ASSFACX= 0
##$ASSWID= 0
##$AUNMP= <proc_1d>
##$AZFE= 0.1
##$AZFW= 0.1
##$BCFW= 1
##$BC_mod= 2
##$BYTORDP= 1
##$COROFFS= 0
##$CY= 11.3945322036743
##$DATMOD= 1
##$DC= 2
##$DFILT= <>
##$DTYPP= 0
##$F1P= 16.9975609425685
##$F2P= -3.02152046262296
##$FCOR= 0.5
##$FTSIZE= 0
##$FT_mod= 4
##$GAMMA= 1
##$GB= 0.15
##$INTBC= 1
##$INTSCL= 1
##$ISEN= 128
##$LB= 0.24
##$LEV0= 0
##$LPBIN= 0
##$MAXI= 10000
##$MC2= 0
##$MEAN= 0
##$ME_mod= 0
##$MI= 1.114404
##$NCOEF= 0
##$NC_proc= 0
##$NLEV= 6
##$NOISF1= 3.799351
##$NOISF2= 2.8
##$NSP= 1
##$NTH_PI= 0
##$NZP= 0
##$OFFSET= 15.70392
##$PC= 1
##$PHC0= -10502.51
##$PHC1= 28.80089
##$PH_mod= 1
##$PKNL= yes
##$PPARMOD= 0
##$PSCAL= 0
##$PSIGN= 0
##$REVERSE= no
##$SF= 200.130013532006
##$SI= 16384
##$SIGF1= 3
##$SIGF2= 2
##$SINO= 400
##$SIOLD= 16384
##$SREGLST= <1H.CDCl3>
##$SSB= 0
##$STSI= 0
##$STSR= 0
##$SW_p= 3612.71676300578
##$SYMM= 0
##$S_DEV= 0
##$TDeff= 0
##$TDoff= 0
##$TI= <>
##$TILT= no
##$TM1= 0
##$TM2= 0
##$TOPLEV= 0
##$USERP1= <user>
##$USERP2= <user>
##$USERP3= <user>
##$USERP4= <user>
##$USERP5= <user>
##$WDW= 1
##$XDIM= 8192
##$YMAX_p= 0
##$YMIN_p= 0
$$ End of Bruker specific parameters
$$ ---------------------------------
##NTUPLES= NMR FID
##VAR_NAME=  TIME,          FID/REAL,        FID/IMAG
##SYMBOL=    X,             R,               I
##VAR_TYPE=  INDEPENDENT,   DEPENDENT,       DEPENDENT
##VAR_FORM=  AFFN,          ASDF,            ASDF
##VAR_DIM=   8192,          8192,            8192
##UNITS=     SECONDS,       ARBITRARY UNITS, ARBITRARY UNITS
##FACTOR=    0.000296,      1,               1
##FIRST=     0,             0,               0
##LAST=      2.424536,      0,               0
##MIN=       0,             -52339,          0
##MAX=       2.424536,      45185,           0
$$ Real data points
##PAGE= N=1
##DATA TABLE= (X++(R..R)), XYDATA
$$ [...]
$$ plain form
768 -2925 1097 3305 -690 -3312 468 3289 76 -2912 -607 2633 1428 -2355 -2121 2437 2679 -2379
784 -2379 -2519 2039 2470 -1225 -2589 480 2945 174 -3334 -411 3514 540 -3256 -684 2623 1209
800 1209 -2004 -1980 1749 2563 -1731 -2840 1467 2700 -1098 -2664 403 2575 253 -2682 -978 2813
816 2813 1325 -2887 -1584 2542 1715 -2190 -2036 1614 2330 -1117 -2702 645 3004 -371 -3042 192
832 192 2908 265 -2633 -733 2212 1235 -1910 -1936 1847 2403 -1859 -2446 1613 2339 -988 -2251 306
849 306 2485 448 -2701 -772 3038 938 -2914 -777 2299 1199 -1472 -1792 1267 2568 -1090 -2656
865 -2656 1248 2779 -838 -2221 502 2188 582 -2021 -1095 2512 1582 -2306 -1449 2303 1743 -1650
881 -1650 -1776 1296 2166 -675 -2389 379 2639 -93 -2636 -222 2557 470 -2301 -774 1911 1185
$$ packed form
768b925M022K208l995k622L780K821l213k988K305L240j205l783K34M558K42n058
784b379j40M558M31l695j364L069K465k771l508K923L925k974l796K572L307j414
800A209l213K4L729Q14m294j109M307J233l798j566L067K172k322k935J704L791
816B813j488m212J303M126q27l905J54L650P16l447j585L347K359l375k671L234
832A92K716k643k898J900K945r77l145k6L783N56m262n87M059P26l327j263K557
849C06K179k037l149J929L810k100l852K137L076j100k671l20L059J301l658j566
865b656L904J531l617j383K723J686j606k603R26L607r30l888Q57L752n60l393
881a650j26L072Q70k841j714K768K260k732k543K414K779k087k771J527K685p26
$$ plain form
897 1185 -1625 -1886 1364 2194 -1509 -2408 1292 2101 -887 -1909 69 1916 623 -2374 -1042 2715
913 2715 988 -2524 -872 2040 1135 -1317 -1589 981 2290 -673 -2523 866 2501 -649 -2029 208
929 208 1930 566 -1912 -1027 1994 1413 -1981 -1546 1840 1515 -1424 -1628 827 1846 -434 -2245 150
946 150 2367 31 -2332 -264 2191 527 -1926 -801 1679 1181 -1292 -1472 1152 1967 -863 -2053
962 -2053 938 2123 -489 -1783 132 1787 589 -1803 -961 2069 1172 -2102 -990 1859 1026 -1204
978 -1204 -1380 533 1920 -434 -2357 482 2220 -537 -1981 98 1490 382 -1459 -1084 1455 1317
994 1317 -1659 -1491 1420 1493 -1126 -1575 696 1664 -345 -1844 -54 1940 282 -2002 -519 1892
1010 1892 664 -1716 -887 1333 1093 -1102 -1591 816 1832 -854 -1929 634 1690 -422 -1605 -119
$$ packed form
897A185k810k61L250Q30l703q99L700Q09k988j022J978J847j293k997J332L757
913B715j727l512J652K912r05k452k72K570J309k963j850L389J635l150j380K237
929B08J722j364k478Q85L021n81l394M35L386l25k939k04K455J019k280j811K395
946A50K217k336k363K068K455j664k453J125K480m98k473j80K624Q15k830j190
962b053K991J185k612j294J915J655j198k392Q42L030q97l274J112K849q33k230
978a204j76J913J387k354j923K839J738k757j444K079J392j108j841L75K539j38
994A317k976J68K911P3k619m49K271R68k009j499J790J994j658k284J483K411
1010A892j228k380Q29K220k40k195m89K407J016k686j075K563J056k112j183J486
$$ plain form
1026 -119 1429 575 -1566 -1094 1706 1217 -1727 -1101 1446 1093 -948 -1271 572 1626 -182 -1885 95
1043 95 2040 -29 -1843 -57 1542 496 -1288 -921 1219 1347 -1197 -1482 1229 1426 -981 -1398 465
1060 465 1375 -82 -1619 -293 1712 393 -1801 -620 1611 651 -1505 -874 1137 996 -892 -1392
1076 -1392 548 1590 -437 -1760 321 1776 -273 -1496 13 1191 556 -1198 -1062 1384 1100 -1407
1092 -1407 -1099 1233 999 -776 -1036 263 1399 14 -1730 -63 1788 13 -1547 -184 1265 536
1108 536 -1108 -865 893 1181 -835 -1425 893 1479 -752 -1350 507 1240 -120 -1290 -181 1326 572
1125 572 -1381 -725 1474 701 -1333 -719 909 909 -567 -1218 333 1449 -286 -1667 230 1479 -208
1142 -208 -1250 -101 951 565 -978 -1004 1057 1201 -1165 -1174 1028 1018 -731 -943 273 1082 154 -1409
$$ packed form
1026a19J548q54k141M72K800m89k944O26K547l53k041l23J843J054j808j703J980
1043I5J945k069j814J786J599j046j784L67K140J28k544k85K711J97k407m17J863
1060D65R10j457j537J326K005j319k194J181K231r60k156O31K011j41j888n00
1076a392J940J042k027j323K081J455k049j223J509J178o35j754J36K446k84k507
1092a407L08K332k34j775k60J299J136j385j744J667J851j775j560J363J449p29
1108E36j644K43J758K88k016n90K318N86k231n98J857P33j360j170J109J507p54
1125E72j953O56K199p73k034O14J628%j476o51J551J116j735j381J897J249j687
1142b08j042J149J052l86j543k6K061J44k366rK202j0j749k12J216Q09r28j563
$$ plain form
1160 -1409 -304 1616 301 -1476 -255 1189 435 -876 -752 609 1190 -610 -1363 675 1363 -592
1176 -592 -1186 405 1106 68 -1016 -340 1218 618 -1183 -744 1184 830 -1080 -763 861 739 -403
1193 -403 -937 88 1310 34 -1504 21 1481 -66 -1200 -103 866 413 -655 -961 700 1256
1209 1256 -949 -1180 895 865 -615 -893 85 922 194 -1200 -450 1355 422 -1384 -331 1066 413
1226 413 -679 -666 514 998 -376 -1206 363 1315 -399 -1243 383 993 -47 -851 -365 889 663 -963
1244 -963 -800 1074 873 -1014 -692 719 611 -289 -860 -67 1144 133 -1306 -120 1344 105 -1050
1261 -1050 -159 780 445 -571 -811 469 1198 -637 -1161 734 975 -507 -751 196 680 252 -856 -553
1279 -553 1103 624 -1214 -371 988 358 -551 -520 254 870 -181 -1135 210 1168 -217 -1107 138 933
$$ packed form
1160a409J105J920j315j777J221J444p54j311J24J361N81j800p53K038O88j955
1176e92n94J591P01j038j084O76J558o00j801M39J928l54j910L17J624j22j142
1193d03n34J025J222j276j538J525J460j547j134J097R69m53j068l06J661N56
1209A256k205k31K075l0j480k78R78Q37p28j394P50J805r33j806J053J397o53
1226D13j092J3J180M84j374q30J569R52j714q44J626O10j040q04M86J254k26j626
1244i63J63J874k01j887L22J411j08r00n71P93J211j011j439J186J464j239j155
1261a050Q91R39l35j016k40J280P29j835n24J895K41j482k44R47M84m28j108L03
1279e53J656m79j838Q43J359o30r09L1P74O16j051r54J345R58j385q90J245P95
$$ plain form
1297 933 -29 -795 -362 650 668 -770 -876 781 831 -817 -710 643 609 -340 -616 -94 871 298 -1090
1316 -1090 -254 1156 104 -976 -157 609 470 -421 -658 318 1005 -442 -1143 498 906 -413 -759 124
1334 124 630 282 -780 -461 876 563 -879 -512 891 363 -637 -435 313 691 -17 -944 19 1056
1352 1056 -66 -1086 90 868 -44 -638 -230 500 625 -580 -800 645 833 -627 -737 557 627 -308
1370 -308 -591 -19 729 302 -920 -293 979 230 -887 -215 620 268 -337 -613 157 864 -220 -1073 370
1389 370 950 -415 -706 215 562 163 -513 -495 655 615 -846 -570 807 459 -549 -432 321 565 -75
1408 -75 -749 -60 927 -2 -837 -71 795 83 -658 -257 410 570 -349 -712 466 837 -509 -734 476
1427 476 503 -292 -450 -133 505 327 -724 -433 835 325 -823 -255 621 306 -308 -492 170 761 -92
$$ packed form
1297I33r62p66M33J012J8j438j06J657N0j648J07J353l4r49k76N22R65n73j388
1316a090Q36J410j052j080Q19P66j39q91k37R76O87j447p01J641M08j319l46Q83
1334A24N06l48j062L19J337l13j442L67J403n28j000K02P48L78p08r27R63J037
1352A056j122j020J176P78r12n94M08P30J25j205k20J445J88j460j10J294P0r35
1370c08k83N72P48m27j222O27J272p49j117O72Q35l52o05k76P70P07j084q53J443
1389C70N80j365k91R21L47l99o76J8J150m0j461K76J377l48j008J17P53K44o40
1408g5o74O89R87r29q35P66Q66p12p41M01O67J60r19l63J178L71j346k25J210
1427D76K7p95j58L17O38j78j051K91J268n10j148N68Q76l15o14j84O62N91q53
$$ plain form
1446 -92 -880 190 877 -124 -713 127 522 149 -494 -480 524 640 -687 -580 668 475 -529 -388 256
1465 256 352 95 -652 -279 818 213 -947 -93 760 76 -533 -211 336 391 -256 -652 289 747 -434 -750
1485 -750 371 557 -232 -522 -1 494 261 -559 -395 686 305 -680 -251 501 240 -275 -414 17 618
1504 618 31 -813 47 810 -165 -715 160 424 87 -286 -341 307 607 -398 -642 512 553 -518 -430 278
1524 278 415 -23 -473 -115 563 187 -721 -204 637 112 -470 -245 261 416 -104 -625 229 769 -363 -670
1544 -670 401 526 -206 -257 -85 256 364 -425 -493 585 469 -596 -344 551 277 -354 -266 33 415 54
1564 54 -581 -122 693 41 -617 -48 426 132 -367 -339 287 531 -382 -602 446 460 -453 -328 207 199 89
1585 89 -364 -299 538 424 -720 -222 711 110 -493 -57 283 245 -83 -406 31 608 -68 -662 159 540 -121
$$ packed form
1446i2p88J070O87j001n89Q40L95l73o43J4J004J16j327J07J248j93j004J41O44
1465B56R6k57p47L73J097o05j160Q54Q53o84o09L22N47N5o47l96R41M58j181l16
1485g50J121J86p89k90N21M95k33q20J64J081l81r85M29P52k61n15j39M31O01
1504F18n87q44Q60P63r75n50Q75K64l37l73n5O48L00j005k44J154M1j071Q8P08
1524B78J37m38m50L58O78l76r08N17Q41n25n82K25N06J55n20n21Q54N40j132l07
1544f70J071J25p32n1J72L41J08p89o8J078j16j065K52Q95k74o31Q8K99L82l61
1564E4o35M59Q15o52o58N69M74k94m99K8O26K44r13k20J048J4r13J25N35qj10
1585H9m53O5Q37j14j144M98R33o01o03M36L40l8l28l23M37N77o76n94Q21L81o61
$$ plain form
1606 -121 -469 -9 422 188 -370 -361 433 373 -492 -300 386 167 -213 -249 -85 437 175 -646 -140 716 -5
1627 -5 -714 80 378 -16 -125 -215 78 459 -179 -608 250 672 -326 -573 340 367 -179 -289 -101 285 207 -449
1649 -449 -291 433 192 -454 -189 232 271 -96 -463 50 612 -159 -587 265 532 -218 -249 25 162 234 -197
1670 -197 -480 320 533 -473 -488 505 309 -340 -211 112 221 118 -293 -180 444 174 -518 -167 464 145
1690 145 -269 -278 174 333 -238 -528 244 418 -307 -318 133 216 53 -185 -235 312 430 -459 -343 554 295 -537
1712 -537 -75 302 68 -67 -227 -188 331 173 -558 -109 580 22 -471 42 242 129 -228 -289 206 344 -259
1733 -259 -342 301 236 -169 -197 -65 263 162 -483 -194 526 100 -555 43 421 -118 -178 -77 -18 298 101 -497
1755 -497 -41 621 -52 -530 203 402 -212 -242 41 121 207 -197 -276 292 315 -211 -298 193 214 -117 -354 -47
$$ packed form
1606a21l48M60M31k34n58RP94o0q65J92O86k19l80l6J64N22k62q21N06Q56p21
1627ep09P94K98l94j09r0K93L81o38m29Q58M22r98k47R13K7n46j10J88L86p8o56
1649d49J58P24k41o46K65M21L9l67l67N13N62p71m28Q52K67p50l1K74J37P2m31
1670a97k83Q00K13j006j5R93j96o49J29L23J09j03m11J13O24k70o92L51O31l19
1690A45m14rM52J59n71k90P72J74p25j1M51Q3j63k38n0N47J18q89J16Q97k59q32
1712e37M62L77k34j35j60L9N19j58p31M49O89n58m93N13K00j13l57o1M95J38o03
1733b59q3O43o5m05k8J32L28j01o45K89P20m26o55N98L78n39o0J01N9L16j97n98
1755d97M56O62o73m78P33J99o14l0K83Q0Q6m04p9N68K3n26q7M91K1l31k37L07
$$ plain form
1777 -47 459 10 -520 82 421 -156 -320 20 105 101 4 -377 116 529 -209 -540 357 403 -390 -221 269 106
1799 106 12 -87 -220 251 323 -349 -221 380 255 -289 -205 109 224 -71 -388 51 353 -180 -296 191 150 -50
1821 -50 -118 -300 169 358 -235 -398 419 346 -458 -140 359 83 -90 -47 -113 186 211 -332 -222 485 121 -462
1843 -462 -39 362 5 -193 -151 54 242 -155 -322 100 297 -72 -230 28 173 176 -268 -260 409 187 -465 -92
1865 -92 375 26 -219 32 14 135 133 -324 -116 510 19 -552 118 380 -108 -192 89 93 151 -49 -313 118 272
1888 272 -196 -313 118 216 -23 -296 -62 275 12 -354 7 361 -15 -242 28 89 114 5 -224 -32 395
1909 395 -17 -478 209 423 -239 -283 171 184 -44 -32 -147 110 343 -227 -300 268 250 -226 -159 212 222 -55
1931 -55 -241 -30 270 -99 -307 39 192 19 -109 -187 43 300 -145 -342 243 368 -329 -232 325 86 -168
$$ packed form
1777d7N06m49n30O02L39n77j64L40Q5mr7l81M93M13p38l31Q97M6p93J69M90j63
1799A06r4r9j33M71P2o72J28O01j25n44Q4L14J15k95l17M39L02n33j16M87m1k00
1821e0o8j82M69J89n93j63Q17p3q04L18M99k76j73M3o6K99K5n43J10P07l64n83
1843d62M23M01l57j98M2K05J88l97j67M22J97l69j58K58J45Lm44QO69k22o52L73
1865i2M67l49k45K51j8J21km57K08O26m91n71O70K62m88q4K81MN8k00k64M31J54
1888B72m68j17M31R8k39k73K34L37k63l66L61L54l76k27K70O1K5j09k29J92M27
1909C95m12m61O87K14o62m4M54J3k28J2j15K57K33n70p3N68j8m76O7L71J0k77
1931e5j86K11L00l69k08L46J53j73j28p8K30K57m45j97N85J25o97R7N57k39k54
$$ plain form
1952 -168 -5 -62 88 221 -178 -259 310 179 -404 -84 304 23 -177 -133 90 180 -34 -231 55 198 -45
1973 -45 -153 -64 121 110 -182 -170 225 201 -311 -202 322 68 -235 -61 46 38 132 -174 -213 325 180 -381 -7
1996 -7 355 -53 -218 70 96 109 -26 -164 44 214 -44 -270 154 178 -49 -188 -75 192 75 -285 -143 310
2018 310 16 -232 -46 89 12 -9 -108 -115 270 90 -408 35 370 -152 -259 134 98 -24 7 -132 52 195
2040 195 -66 -263 132 236 -114 -186 137 144 -80 -213 -55 234 56 -274 -35 176 -30 -132 -97 54 136 -28
2062 -28 -250 70 297 -100 -209 170 144 -186 -78 -2 17 123 -57 -229 194 222 -287 -169 263 77 -114 -67
2084 -67 84 149 28 -231 -4 163 16 -187 10 158 41 -123 -147 128 217 -125 -237 245 136 -226 -16
2105 -16 75 82 51 -83 -175 196 252 -284 -88 312 1 -234 47 142 15 -18 -113 5 226 14 -241 18 282
$$ packed form
1952a68J63n7J50J33l99q1N69j31n83L20L88k81k00M4K23R0k14j97K86J43k43
1973d5j08Q9J85j1k92J2L95k4n12J09N24k54l03J74J07qR4l06l9N38j45n61L74
1996gL62m08j65K88K6J3j35j38K08J70k58k26M24K4k27j39J13K67j17l60J42M53
2018C10k94k48J86J35p7k1r9pL85j80m98M43L35n22j07L93l6j22L1j39J84J43
2040A95k61j97L95J04l50p2L23Pk24j33J58K89j78l30K39K11k06j02L5J51Q2j64
2062b8k22L20K27l97j09L79k6l30J08P6J9J06j80j72M23K8n09J18M32j86j91M7
2084f7J51O5j21k59K27J67j47k03J97J48j17j64k4K75Q9l42j12M82j09l62K10
2105a6R1Pl1j34r2L71N6n36J96M00l11k35K81R5j27l3r5J18K21k12k55K59K64
$$ plain form
2128 282 -32 -168 -29 96 76 -103 -102 128 147 -212 -76 162 51 -90 -27 -35 122 112 -234 -76 301 -2 -278
2151 -278 98 188 -83 -9 -41 -16 170 -6 -216 108 223 -95 -157 118 139 -72 -72 -41 151 129 -194 -84 172
2174 172 26 -68 21 69 66 -29 -131 -15 219 -37 -249 85 164 -131 -41 28 4 76 1 -185 104 221 -226 -163
2198 -163 168 100 -110 -41 88 91 34 -122 -1 229 61 -243 -25 137 -41 -126 -51 -7 167 15 -251 94 156
2221 156 -152 -137 135 16 -1 -30 -168 39 167 -168 -145 249 93 -189 -42 98 40 11 -39 -91 176 61 -200
2244 -200 60 214 18 -137 71 130 -10 -74 -102 28 172 -150 -107 124 56 -128 -44 -50 52 67 -180 -138 167
2267 167 3 -255 -20 129 31 -79 -34 4 136 28 -168 -10 136 -105 -113 83 91 -62 -30 -38 84 135 -124 -106
2291 -106 163 83 -145 -33 67 -28 -11 -145 -70 143 35 -241 32 178 -83 -77 50 -24 54 -11 -189 85 194
$$ packed form
2128B82l14j36J39J25k0j79JK30J9l59J36K38j11j41O3qJ57j0l46J58L77l03k76
2151b78L76R0k71P4l2K5J86j76k10L24J15l18o2K75K1k11%L1J92k2l23J10K56
2174A72j46r4Q9M8lr5j02J16K34k56k12L34P9k95R0O9k4P2p5j86K89J17m47O3
2198a63L31o8k10O9J29Ln7j56J21K30j68l04K18J62j78q5P5M4J74j52k66L45O2
2221A56l08J5K72j19j7k9j38K07J28l35K3L94j56k82J47J40n8k9n0n2K67j15k61
2244b00K60J54j96j55K08N9j40o4k8J30J44l22M3K31o8j84Q4oJ02J5k47M2L05
2267A67j64k58K35J49r8j10M5L8J32j08j96J58J46k41qJ96Qj53L2qJ22N1k59J8
2291a06K69q0k28J12J00r5J7j34P5K13j08k76K73J46k61OJ27p4P8o5j78K74J09
$$ plain form
2314 194 -126 -165 117 55 -140 -73 29 9 74 -82 -107 126 121 -150 -26 198 -2 -92 -2 -56 135 -12 -155 46
2338 46 184 -35 -173 57 9 -70 -7 -94 15 141 -152 -180 89 82 -122 -28 32 50 2 -80 -88 107 96 -149 -35
2363 -35 169 -18 -124 42 55 -22 -28 -77 17 193 -20 -156 158 39 -120 -48 -1 -6 80 -66 -103 95 80 -127 -52
2388 -52 108 -18 -23 -38 25 48 31 -201 -47 183 -2 -173 41 118 -26 12 -62 24 116 -14 -126 114 111 -125 -54
2413 -54 97 32 1 -26 -42 89 66 -95 -37 231 3 -104 21 5 40 52 -146 -27 120 -47 -137 130 79 -90
2437 -90 -113 14 24 47 -16 -101 54 93 -101 -45 119 0 -29 -2 4 61 54 -115 3 191 20 -156 42 57 -73
2462 -73 -47 -25 -1 72 5 -144 73 62 -117 -74 79 80 -37 -5 1 55 73 -88 -85 146 14 -85 16 74 4 -1 -89 -32
2490 -32 133 55 -125 80 77 -68 -11 24 -9 68 -29 -82 82 91 -146 -45 110 29 -66 -22 -14 10 52 -92 31 113 47
$$ packed form
2314A94l20l9K82o2j95O7J02k0O5j56k5K33nk71J24K24k00r0R0n4J91j47j43K01
2338D6J38k19j38K30m8p9O3q7J09J26k93k8K69pk04R4O0J8m8q2qJ95j1k45J14
2363c5K04j87j06J66J3p7om9R4J76k13j36L14j19j59P2M7nQ6j46l7J98j5k07P5
2388e2J60j26nj5O3K3j7k32J54K30j85j71K14P7j44L8p4Q6R2j30j12K40lk36P1
2413e4J51o5l1k7j6J31k3j61N8K68k28j07J25j6L5J2j98J19J47j67r0K67n1j69
2437i0k3J27J0K3o3q5J55L9j94N6J64j19k9K7ON7pj69J18J88j71j76J98J5j30
2462g3K6K2K4P3o7j49K17j1j79M3J53Jj17L2ON4J8j61LK31j32r9J01N8p0nq8N7
2490c2J65p8j80K05lj45N7L5l3P7r7n3J64Rk37J01J55q1r5M4QK4M2j44J23Q2o6
$$ plain form
2517 47 -124 6 83 -26 -56 22 9 -11 19 -153 38 163 -114 -49 77 1 -12 -36 -11 9 88 -86 -120 138 -13
2542 -13 -125 -18 35 -10 -35 -49 -35 50 -44 -166 15 165 -73 -111 112 21 10 -6 26 39 101 -57 -96 131 81 -88
2568 -88 4 74 -29 26 -50 -69 108 36 -173 76 118 -57 -66 -34 18 3 16 -83 22 145 -34 -102 49 15 -48 -35
2594 -35 5 9 91 -79 -102 74 53 -110 48 71 17 3 -35 -67 100 11 -135 6 160 -78 -108 -1 40 -8 30 -32
2620 -32 40 84 -60 -92 119 57 -90 -23 37 -26 28 -36 -76 127 57 -115 -53 121 -15 -83 56 28 -12 75 -59 17
2646 17 91 -62 -124 98 41 -91 20 -16 50 84 -52 -79 88 79 -135 -4 81 -53 -9 23 -43 58 7 -136 4
2671 4 165 -14 -83 70 44 14 -32 -49 8 94 -7 -51 88 69 -18 12 86 -22 53 17 -104 69 55 -89 -43 93
2697 93 9 -35 37 17 -41 24 -105 -71 102 -55 -104 48 80 -58 -29 0 -38 89 83 -135 6 98 -179 2 123
$$ packed form
2517D7j71J30P7j09l0P8j3k0L0j72J91J25k77O5J26p6j3k4K5K0P9j74l4K58j51
2542a3j12J07N3m5k5j4J4Q5r4j22J81J50k38l8K23r1j1j6L2J3O2j58l9K27n0j69
2568h8R2P0j03N5p6j9J77p2k09K49M2j75rL2N2j5J3r9J05J23j79o8J51l4o3J3
2594c5M0MQ2j70k3J76k1j63J58K3n4j4l8l2J67q9j46J41J54k38l0J07M1m8L8o2
2620c2P2M4j44l2K11o2j47O7O0o3N4o4m0K03p0j72O2J74j36o8J39k8m0Q7j34P6
2646A7P4j53o2K22n7j32J11l6O6L4j36k7J67rk14J31Q5j34M4L2o6J01n1j43J40
2671DJ61j79o9J53k6l0m6j7N7Q6j01m4J39j9q7L0P4j08P5l6j21J73j4j44M6J36
2697I3q4m4P2k0n8O5j29L4J73j57m9J52L2j38K9K9l8J27ok18J41R2k77J81J21
$$ plain form
2722 123 -15 7 26 -40 73 105 -93 -75 125 14 -83 67 18 -14 11 -69 14 53 -11 -120 60 102 -106 -69 13
2747 13 -20 43 -37 -59 51 51 -174 -66 80 -21 -77 26 22 -40 -12 -62 -49 131 -7 -89 76 73 -32 -41 23 -43 31
2774 31 3 -88 46 98 -98 -55 105 29 -11 27 -30 -15 60 -66 -94 118 18 -141 9 56 -76 -16 -46 -21 103
2799 103 60 -99 49 104 -58 -23 35 45 -9 -9 -17 45 78 -81 -60 144 -12 -80 81 23 13 33 -94 -89 94 38 -127
2826 -127 26 100 -69 -43 70 -31 16 51 -98 1 69 -62 -94 74 -13 -47 20 -10 -53 76 -30 -119 79 46 -43
2851 -43 29 66 1 14 39 -37 40 38 -70 39 105 -87 -43 48 -39 -37 -18 -24 -39 132 -104 -86 71 8 -54 -60 9 -39 15
2880 15 -19 -88 94 72 -86 -17 109 -8 -36 52 -21 36 56 -57 6 93 -52 -88 38 35 -17 46 51 -20 106 -32 -95
2907 -95 24 -4 -145 -3 53 -25 17 -31 1 -3 73 -90 -15 114 31 -71 83 64 -55 2 -4 -28 44 40 -66 50 54
$$ packed form
2722A23j38K2J9o6J13L2j98J8K00j11r7J50m9l2K5q0Q3L9o4j09J80M2k08L7Q2
2747A3l3O3q0k2J10%k25J08J46j01n6J03mo2K8n0J3J80j38q2J65lj05rO4o6P4
2774C1k8r1J34N2j96M3J60p6m0L8n7J5P5j26k8K12j00j59J50M7j32O0l0K5J24
2799A03m3j59J48N5j62L5N8J0n4%qO2L3j59K1K04j56o8J61n8j0K0j27NJ83n6j65
2826a27J53P4j69K6J13j01M7L5j49R9O8j31l2J68q7l4O7l0m3J29j06q9J98l3q9
2851d3P2L7o5J3K5p6P7kj08J09O6j92M4R1q7KJ9oj5J71k36J8J57o3o2oO9m8N4
2880A5l4o9J82k2j58O9J26j17k8Q8p3N7K0j13O3Q7j45l6J26ln2O3Np1J26j38o3
2907i5J19k8j41J42N6p8M2m8L2mP6j63P5J29q3j02J54j9j19N7ok4P2mj06J16M
$$ plain form
2934 54 -100 19 79 -30 -37 -31 -46 35 95 -111 -27 99 -69 -76 51 -35 -26 4 -19 -33 87 -62 -44 26 39 -83 44
2961 44 31 -7 4 31 -47 45 54 -22 -23 63 -19 -39 38 -9 -11 78 -101 -16 96 -8 -161 57 66 -41 -50 -49 -48 48 -21 -77 31
2992 31 71 -50 -3 56 -26 -42 -10 -35 -19 48 -41 -35 125 0 -72 28 29 -64 39 11 -25 91 48 -71 45 89 -63
3019 -63 28 23 -25 -1 79 -82 11 73 -80 13 95 -2 -90 36 -35 5 14 -25 3 25 4 -81 63 56 -44 35 -7 -24 -34
3048 -34 -49 -109 55 94 -77 8 105 -23 -58 6 -46 -28 112 -3 -80 111 23 -100 26 -13 -87 35 -6 -62 70
3073 70 68 -29 66 120 -32 -64 39 21 6 94 30 -34 59 -29 -113 77 19 -98 -4 60 6 60 -11 -67 38 54 -62 4
3101 4 40 -87 20 45 -32 30 18 -70 -3 26 -67 -66 69 -6 -66 21 -6 -32 80 -52 -26 83 1 -67 35 58 -36 33
3129 33 18 -16 34 26 -31 9 89 -69 -17 49 -46 -3 117 21 4 58 -102 -81 44 -10 -28 56 13 -58 6 3 -30 45 -8
$$ packed form
2934E4j54J19O0j09pOj5Q1O0k06Q4J26j68pJ27q6RL0k3j4J20j49J8P0J3j22J27
2961D4j3l8J1K7p8R2Rp6jQ6q2k0P7m7kQ9j79Q5J12j04j53K18Rj07rJJR6o9n6J08
2992C1M0j21M7N9q2j6L2k5J6O7q9OJ60j25p2J00Jr3J03k8l6J16m3j19J16M4j52
3019f3R1nm8K4Q0j61R3O2j53R3Q2r7q8J26p1M0Rl9K8K2k1q5J44pj00P9m2j7j0
3048c4j5o0J64L9j71Q5R7j28l5O4n2J8J40j15p7J91q8j23J26l9p4J22m1n6J32
3073G0kr7R5N4j52l2J03j8j5Q8o4o4R3q8q4J90n8j17R4O4n4N4p1n6J05J6j16O6
3101DL6j27J07K5p7O2j2q8O7K9r3JJ35p5o0Q7k7k6J12j32K6J09q2o8J02K3r4O9
3129C3j5l4N0qn7M0Q0j58N2O6r5M3J20r6j7N4j60K1J25n4j8Q4m3p1O4ll3P5n3
$$ plain form
3158 -8 -93 7 71 -26 -39 -13 14 73 63 -17 -7 53 -47 -19 95 33 -61 24 12 -34 37 -64 -17 11 30 -85 8 54
3186 54 -8 -23 19 -64 1 58 -40 -48 80 -23 -36 -1 2 -53 -10 0 -31 102 -8 -72 54 116 -16 -1 18 -27 21 24 -33
3215 -33 35 45 -50 -27 74 13 -15 27 -21 -46 13 -2 -27 122 -28 -79 32 1 -36 5 34 -62 23 -14 -39 80 73 6
3243 6 -16 82 -17 -84 71 -48 -12 53 -23 -3 78 16 -42 40 55 -15 79 -43 -41 45 23 -29 -43 -12 -56 -14 60 -56 -29
3272 -29 17 1 -9 1 -49 -41 3 -13 -99 47 2 3 36 -23 -45 54 -4 -50 7 -1 -13 -40 -16 -26 -6 -17 -15 -34 73 -66 8
3303 8 87 -15 -60 12 -23 -22 23 -30 -39 87 -34 -69 43 35 -43 19 -9 -48 19 -14 -25 -9 90 -55 16 30 34 -18 10 9 4
3334 4 98 6 -22 78 1 -68 17 54 -4 28 -6 -19 -1 7 -78 3 59 -36 37 62 -59 -22 21 -19 12 31 11 -93 14
3363 14 1 -38 26 -46 -73 -17 -3 -41 46 8 -60 44 50 -5 14 48 -51 8 72 -77 5 10 18 22 48 15 -8 14 -57 -59 70
$$ packed form
3158hq5J00O4r7j3K6K7N9j0q0J0O0j00K8J14o2r4Q5j2m6P1j01M7K8J9j15R3M6
3186E4o2j5M2q3O5N7r8qJ28j03j3L5Ln5M3J0l1J33j10o4J26O2j32J5J9m5M8Ln7
3215c3O8J0r5K3J01o1k8M2m8k5N9j5k5J49j50n1J11l1l7M1K9r6Q5l7k5J19po7
3243Fk2R8r9o7J55j19L6O5p6K0Q1o2n8Q2J5p0R4j22KQ6k2n2j4L1m4M2P4j16K7
3272b9M6j6j0J0n0QM4j6q6J46m5JL3n9k2R9n8m6N7qj2k7K4j0K0j1Kj9J07j39P4
3303HP9j02m5P2l5JM5n3rJ26j21l5J12qp8O2k8l9O7l3j1J6R9j45P1J4Mn2K8jn
3334DR4r2k8J00p7o9Q5L7n8L2l4j3J8Qq5Q1N6r5P3K5j21L7M3m0L1J9k0j04J07
3363A4j3l9O4p2k7N6J4l8Q7l8o8J04On5J9L4r9N9O4j49Q2NQMK6l3k3K2p1kJ29
$$ plain form
3394 70 -40 -63 109 -20 -71 -19 83 23 -2 32 -19 0 42 -70 20 24 -10 -11 42 -25 3 1 -60 24 50 -47 -21 63 12
3423 12 -19 46 -11 -38 60 -63 -53 22 34 -83 11 33 -51 42 -11 1 22 92 18 -40 45 -24 -4 10 -2 -56 5 -22 -24 15
3453 15 -35 6 69 74 -43 22 10 25 3 26 -62 42 -19 -41 14 50 -31 -45 -15 -26 -31 34 -80 -33 17 -6 -7 -13 4 -79 36
3484 36 5 -52 -5 4 -56 54 44 -64 67 68 26 -23 2 -44 5 13 -36 -17 56 -14 -21 63 14 -57 4 6 -64 73 -12 -45 7
3515 7 37 -77 -2 68 -48 1 57 -47 22 22 -36 -47 4 11 -55 -11 -25 -18 35 -12 12 23 23 -13 59 -6 -127 42 8 -2
3545 -2 36 46 -9 -9 96 -41 0 45 -60 -42 81 -61 -60 -29 -4 -87 7 5 -45 0 -8 -11 -6 62 -44 17 29 -17 34 52 -19
3576 -19 7 11 -7 4 -47 0 40 3 -52 6 77 -66 -83 2 -20 -34 -14 -36 -52 21 -6 -23 -1 31 -45 -55 -31 2 -1 -12 -22
3607 -22 -2 68 -61 9 12 -5 -22 39 7 -2 100 -38 -30 103 9 -27 60 48 -28 54 -36 -70 60 83 -73 -27 59 -14 19
$$ packed form
3394G0j10k3J72j29n1N2J02o0k5L4n1J9M2j12R0Ml4jN3o7K8ko1Q4K6r7K6Q4n1
3423A2l1O5n7k7R8j23J0P5J2j17R4K2q4R3n3J2K1P0p4n8Q5o9K0J4j2n4O1k7kL9
3453A5n0M1O3Nj17O5j2J5k2K3q8J04o1k2N5L6q1j4L0j1nO5j14M7N0k3joJ7q3J15
3484C6l1n7M7Ro0J10j0j08J31Jm2m9K5m6M9Qm9J9P3p0pQ4m9p1O1Kp0J37q5l3N2
3515GL0j14P5P0j16M9N6j04O9%n8j1N1Po6M4j4PN3m7K4J1%l6P2o5j21J69l4j0
3545bL8J0n5%J05j37M1M5j05J8J23j42JL1K5q3R4kn0M5qlNO8j06O1J2m6N1J8p1
3576a9K6Mj8J1n1M7M0l7n5N8P1j43j7Q5k2j4K0k2j6P3k7j7K2L2p6j0K4L3lj1j0
3607b2K0P0j29P0Lj7j7O1l2rJ02j38QJ33r4l6Q7j2p6Q2r0l4J30K3j56M6Q6p3L3
$$ plain form
3636 19 71 -50 -40 -2 30 -38 35 9 -54 26 45 -47 -45 17 -18 -14 -37 -29 28 42 -29 30 35 -33 -36 52 -80 -1 44 -21 -68 83
3668 83 -2 -37 43 -47 -50 39 42 -30 59 2 -39 32 -19 -15 6 48 -18 -11 47 -41 38 41 -10 41 14 12 -2 45 -52 -39 4 0 -9 68
3702 68 4 -11 68 14 5 20 21 14 41 52 -33 33 -8 -77 20 30 -33 -32 34 -51 -32 22 -39 -1 46 9 -38 -4 21 -10 3 48
3734 48 -27 23 7 9 28 37 -15 -31 68 2 5 27 -35 -36 41 20 8 12 -41 -14 48 40 -45 -22 81 15 19 4 -121 -20 -21 -67 25
3767 25 26 30 -32 56 -36 -6 18 -1 19 54 -20 -12 59 6 -15 -23 57 -3 39 -2 -40 8 26 -60 -11 20 -55 -23 30 -66 -17 24
3799 24 -16 -4 76 -62 -72 45 -9 -43 18 -39 -22 28 -11 -36 27 36 -64 12 22 2 18 -16 -11 36 43 -22 -17 30 57 -18 -13
3830 -13 2 24 58 14 -55 -15 -6 -51 44 -58 -46 -25 3 -33 45 9 -16 6 2 -25 -49 -17 33 3 70 12 -8 27 -16 -28 94
3861 94 -2 44 62 -17 -20 25 -36 -19 42 34 -77 2 -2 -28 -10 -27 -35 -59 19 -103 -32 48 1 -28 -3 -21 24 -2 8 -15 17
$$ packed form
3636A9N2j21J0L8L2o8P3k6o3Q0J9r2KO2l5Mk3QN7J4p1N9No8lQ8j32P9M5o5m7J51
3668H3q5l5Q0r0lQ9Lp2Q9n7m1P1n1MK1M2o6PN8q8P9Ln1N1k7kj4M7r7J3M3mrP7
3702F8o4j5P9n4rJ5JpK7J1q5O6m1o9R7J0o3JO6q5J9N4o1L8M7l7m7L4K5l1J3M5
3734D8p5N0j6KJ9Rn2j6R9o6LK2o2jP7k1j2Mn3K7O2qq5K3J03o6Mj5j25J01jm6R2
3767B5JMo2Q8r2L0K4j9K0L5p4QP1n3k1qQ0o0M2m1l8M8J8q6M9L1p5L2N3r6M9M1
3799B4m0J2Q0j38j0J17n4l4O1n7J7N0l9k5O3Rj00P6J0k0J6l4NM7Po5NM7K7p5N
3830a3J5K2L4m4o9M0Rm5R5j02J2K1K8l6P8l6k5K2mk7k4L2N0l0O7n8k0L5m3j2J22
3861I4r6M6J8p9lM5o1J7O1qj11P9mk6J8j7qk4P8j22P1Q0m7k9K5j8M5k6J0k3L2
$$ plain form
3892 17 15 -38 -7 24 -49 4 3 -56 13 69 -24 13 1 -33 11 68 -3 -5 54 -28 -38 -9 -24 -47 35 25 -28 75 -46 -16 28
3923 28 35 -35 26 39 -37 45 10 -19 -16 19 -19 -37 -6 -29 -11 32 -56 26 68 -49 -17 18 -67 -68 51 -36 -75 41 -31 -7
3953 -7 -31 9 14 -16 36 -19 13 57 -41 16 22 -19 -32 10 -41 -60 13 7 -21 11 -8 15 48 -56 10 17 -15 -10 23 3 9 54 7
3986 7 -33 25 34 -37 22 14 -26 -57 48 -39 -9 34 -35 -14 64 11 -45 53 8 -37 34 6 -29 -18 -16 -50 4 -12 -46 50 45 -39
4018 -39 50 31 -19 14 -3 -17 -6 53 -5 -25 12 32 -25 -8 19 -41 55 20 -14 63 46 -42 -18 3 -53 32 -41 -27 11 3 -4
4049 -4 36 49 -48 -37 8 35 -28 -6 2 -17 25 -6 -23 -2 31 21 25 1 -11 35 57 -19 40 29 -17 11 48 -17 22 5 -25 -5
4081 -5 44 -68 -14 11 -27 -26 16 18 -21 12 -2 -29 -18 66 11 50 17 -16 1 9 -45 69 33 -104 -18 28 -76 -40 81 -12
4111 -12 -14 32 -9 10 8 -35 -95 41 -26 -107 23 -2 -27 -40 48 -16 -43 24 -60 -7 53 -5 -7 28 13 -1 17 0 -28 31 23
$$ packed form
3892A7kn3L1L1p3N3jn9O9N6r3L7j2l4M4N7p1kN9q2j0K9j5k3Q2j0n3J03j21L0M4
3923B8Pp0O1J3p6Q2l5k9LL5l8j8L1k3J8M3q8Q2M2j17L2L5q5jJ19q7l9J16p2K4
3953gk4M0Nl0N2n5L2M4r8N7Om1j3M2n1j9P3ok8L2j9K3L3j04O6Pl2NL3k0OM5m7
3986Gm0N8Rp1N9qm0l1J05q7L0M3o9K1P8n3n6R8m5m5P1k8l5J1Kl4N4j6l4R6nq4
4018c9Q9j9n0L3j7j4J1N9n8k0L7K0n7J7K7o0R6l5l4P7j7q8K4K1n6Q5p3J4L8qp
4049dM0J3r7J1M5K7o3K2Qj9M2l1j7K1L3j0Mk4j2M6K2p6N9j1m6K8L7o5L9j7l0K0
4081eM9j12N4K5l8JM2Kl9L3j4k7J1Q4n5L9l3l3J7Qn4J14l6j37Q6M6j04L6J21r3
4111a2kM6m1J9km3o0J36o7q1J30k5k5j3Q8o4k7O7q4N3O0n8kL5j5j4J8j7k8N9q
$$ plain form
4142 23 4 41 -20 -26 40 19 -63 3 28 10 48 52 -41 50 21 -42 5 36 -25 8 -47 -12 -64 -25 -40 -26 27 -18 -18 9 9 -52
4174 -52 3 42 -19 37 -17 -27 18 23 -35 3 66 13 -42 46 -49 -30 64 -26 19 12 15 -44 34 -13 -14 9 -27 -25 17 70 -10 23 -2
4207 -2 -36 -3 29 -30 -18 -1 1 -16 -28 9 -42 30 -48 43 -8 -17 -22 76 -56 -12 66 6 -34 -13 49 1 -10 27 3 -26 77
4238 77 -60 43 4 -111 -40 7 -13 -68 19 16 -30 5 10 7 21 19 -49 16 -12 -51 15 6 -7 16 43 -43 16 44 -7 20 35
4269 35 1 58 82 -58 11 2 26 -33 9 -4 -49 48 7 3 -3 -53 -44 -41 -25 -24 36 -6 1 10 -1 -10 -29 5 -18 18 4 19 59 19
4303 19 -10 -24 59 38 -26 65 -18 45 14 -31 -32 44 18 -33 27 23 -21 8 29 25 35 0 -52 -48 36 -85 -27 42 -19 -17 40 -52
4335 -52 -12 24 -24 -11 -2 21 -41 80 4 -1 15 32 -31 3 26 -6 -4 72 24 -3 -45 14 -28 44 -15 -26 21 -61 -44 -7 -17
4366 -17 -31 12 19 -50 19 -24 6 16 10 -30 23 5 -27 -2 5 -55 8 66 -40 -44 -1 7 8 42 -23 41 47 5 -29 -1 23 -27 35
$$ packed form
4142B3j9L7o1oO6k1q2O6K5j8L8Mr3R1k9o3M7L1o1L3n5L5n2L9j5J4N3m5%K7%o1
4174e2N5L9o1N6n4j0M5Nn8L8O3n3n5Q8r5J9R4r0M5pLn9P8m7jK3l6KM2N3q0L3k5
4207bl4L3L2n9J2J7Kj7j2L7n1P2p8R1n1rnR8j32M4P8o0m0K1O2m8j1L7k4k9J03
4238G7j37J03l9j15P1M7k0n5Q7lm6L5NlJ4ko8O5k8l9O6rj3K3K7q6N9K8n1K7J5
4269C5l4N7K4j40O9rK4n9M2j3m5R7m1mon0RLJ6JO0m2PRj1rj9L4k3L6j4J5M0m0
4303A9k9j4Q3k1o4R1q3O3l1m5jP6k6n1O0mm4K9K1mJ0l5n2MQ4j21N8O9o1KN7r2
4335e2M0L6m8J3RK3o2J21p6nJ6J7o3L4K3l2KP6m8k7m2N9m2P2n9j1M7q2J7L7j0
4366a7j4M3Po9O9m3L0J0om0N3j8l2K5Po0O3N8j06mM3QJL4o5O4Om2l4K8K4n0O2
$$ plain form
4399 35 10 -46 -22 22 -4 17 9 -41 -14 -20 5 -28 49 1 -48 74 -28 -55 35 -3 -25 31 -27 15 19 60 -34 33 106 -28
4429 -28 38 11 -10 1 53 -4 -18 45 -56 34 35 -77 -31 20 -35 -32 49 12 -82 44 -10 -65 7 0 19 30 34 -14 -7 28 -72
4460 -72 4 80 -69 30 -4 6 -12 8 14 6 6 -32 -32 39 23 -10 -1 3 19 27 -1 -31 26 13 6 24 11 -24 1 25 -21 -2 -4 -18
4494 -18 -16 14 24 -46 47 -26 -14 59 38 5 39 33 25 -1 40 -12 7 36 -4 47 19 -13 10 48 -27 -28 -15 37 -2 -16 -25 -32 47
4527 47 -10 -5 12 -3 -9 -23 88 -102 0 26 12 10 14 -4 -40 13 -67 11 84 -47 63 -22 -32 41 91 -2 -67 -2 -51 -45
4557 -45 41 1 -33 -12 -21 -41 70 26 -10 25 36 -33 14 36 -35 -32 -7 1 -21 -34 -31 13 12 -36 34 24 -5 -48 -2 -15 -79 36
4589 36 -8 -60 30 29 10 1 48 -54 -11 13 -33 7 35 -35 1 18 -16 22 17 21 37 20 -8 26 -22 -26 53 13 -6 -45 -20 -27 -13
4622 -13 -13 24 -26 51 -7 -69 16 28 18 11 43 47 -16 24 35 -10 -28 -18 -17 39 4 -47 19 7 -52 36 43 -7 -21 4 -31 -7 57
$$ packed form
4399C5k5n6K4M4k6K1qn0K7oK5l3P7m8m9J22j02k7R0l8k2N6n8M2MM1r4O7P3j34
4429b8O6k7k1J1N2n7j4O3j01R0Jj12M6N1n5LQ1l7r4J26n4n5P2pJ9J1Mm8PL5j00
4460g2P6P6j49R9l4J0j8K0Oq%l8%P1j6l3RMJ6Qk8l0N7j3pJ8j3l5K5K4m6J9kj4
4494a8KL0J0p0R3p3J2P3k1l3L4oqk6M1n2J9K9m0N1k8l2K3L8p5jJ3N2l9j4rpP9
4527D7n7NJ7j5oj4J11j90J02K6j4kMj8l6N3q0P8P3j31J10q5j0P3N0r3o5O5m9O
4557d5Q6m0l4K1rk0J11m4l6L5J1o9M7K2p1LK5Qk2j3LM4jm8P0j0k9m3M6j3o4J15
4589C6m4n2R0jj9rM7j02M3K4m6M0K8p0L6J7l4L8nMJ6j7k8L4m8mP9m0j9l9K5pJ4
4622a3%L7n0P7n8o2Q5J2j0pL2Mo3M0J1m5j8J0JN6l5n1O6j2n9Q8Pn0j4K5l5K4O4
$$ plain form
4655 57 -69 -34 21 -34 -2 55 -7 0 53 -28 -20 30 44 -56 72 46 8 14 50 9 -32 77 20 62 23 34 -17 -42 -19 81
4685 81 -28 -6 16 -32 -48 29 0 9 -7 2 -42 -10 34 -11 -24 28 -28 -9 41 32 9 17 33 -15 -16 -3 -31 16 79 -5 -12 10 -24
4718 -24 18 48 12 -40 -19 3 -11 47 49 16 14 -16 -8 -30 7 -44 -16 41 -31 -24 70 -51 11 31 -28 -11 39 16 25 -10 -36 -25
4750 -25 6 60 -24 30 16 -46 15 29 -51 0 33 -22 6 -14 -37 -23 21 4 -11 33 -68 -55 -8 -5 14 9 27 -20 -12 -38 26
4781 26 3 10 -36 27 88 -29 -7 3 6 16 -6 -14 26 -12 -1 -14 49 17 -17 40 -46 -3 -10 -7 -34 -4 -45 -22 -29 -35 -1 -29 32
4814 32 -33 40 -38 -16 17 6 -22 27 17 -23 -6 -1 -27 -22 23 50 -16 -1 -28 -27 28 3 23 14 0 -2 46 12 -22 23 21 -29 -22 -12
4848 -12 -30 -42 26 -69 -48 21 11 -52 -16 27 -26 -9 -6 -56 30 39 -102 55 29 11 8 34 -11 -27 58 -38 -4 13 2 13 -10
4879 -10 -22 17 30 -8 8 -1 -69 -28 27 -11 -60 37 -1 -29 -20 -54 -49 -18 -1 -52 4 -22 31 -5 23 -39 34 57 -9 13 7 -55
$$ packed form
4655E7j26L5N5n5L2N7o2PN3q1QN0J4j00J28k6l8OL6m1m1J09n7M2l9J1n1k5K3J00
4685H1j09K2K2m8j6P7k9Rj6Rm4L2M4m5j3N2n6J9N0rk3QJ6m8jJ3k8M7O3q4pK2l4
4718b4M2L0l6n2K1K2j4N8Kl3kl0Qk2L7n1K8N7p2PR4j21O2K0n9J7N0k3Rl5k6J1
4750b5L1N4q4N4j4o2O1J4q0N1L3n5K8k0k3J4M4j7j5M4j01J3M7LJ9nJ8m7Qk6O4
4781B6k3Pm6O3O1j17K2J0LJ0k2qM0l8J1j3O3l2l4N7q6M3pLk7L0m1K3poL4k8O1
4814C2o5P3p8K2L3j1k8M9j0m0J7Nk6NM5K7o6J5k7JN5k5K0rj4kM8l4l4M5kn0PJ0
4848a2j8j2O8r5K1O9j0o3L6M3n3J7Ln0Q6Rj41J57k6j8lK6m5j6Q5r6L4J7j1J1k3
4879a0j2L9J3l8J6ro8M1N5l8m9R7l8k8Rl4NL1J7n1N6k6N3l6K8o2P3K3o6K2oo2
$$ plain form
4911 -55 10 22 -22 5 61 -18 -10 -10 -34 -28 -28 -9 -22 -20 -15 13 -6 -8 -27 -19 60 2 -15 -20 -55 8 47 38 -11 67 -38 -9 51 71 -20
4946 -20 20 -30 -9 6 43 22 -13 -8 -25 32 16 46 8 27 -35 37 -7 19 -31 20 8 -80 54 16 16 40 29 -53 28 -33 -9
4977 -9 35 4 -10 47 11 -36 33 -25 7 23 57 24 58 17 16 -8 34 -55 -22 75 -23 -10 -12 -16 16 -18 -4 -53 26 -27 -10 5
5009 5 -9 -49 -11 1 -40 20 2 -41 -10 39 -32 -21 -17 -10 16 18 -14 -2 -12 -18 -4 5 22 20 66 48 37 19 -2 17 17 23 8 10 23
5044 23 -35 -19 23 -16 20 -4 2 -24 43 -1 23 33 -1 -48 18 4 -15 39 39 -70 14 28 18 15 43 -8 -5 40 -75 24 22 0
5076 0 -48 -21 -1 -35 -9 3 -6 53 -19 -30 -1 8 -50 43 25 -57 -6 0 -17 0 60 -28 38 -10 -44 14 2 15 -26 28 -18 -3
5108 -3 88 -23 3 42 37 -21 9 19 -55 24 39 -17 -19 -1 -24 17 -1 28 -27 -2 14 12 0 3 7 8 -26 -61 -9 -13 -40 1 1 -40
5142 -40 68 -19 24 7 7 -23 -44 42 -40 15 46 -15 29 -5 -22 -8 5 -15 15 41 59 40 56 51 2 60 -34 -16 8 -22 -75
$$ packed form
4911e5O5J2m4K7N6p9Q%k4O%J9j3KNK8j9kj9QP9n8j7nl5O3L9rm9P8j05K9O0K0r1
4946b0M0n0K1J5L7k1l5Nj7N7j6L0l8J9o2P2m4K6n0N1j2q8J34l8%K4j1q2Q1o1K4
4977iM4l1j4N7l6m7O9n8L2J6L4l3L4m1jk4M2q9L3R7r8J3kmL2l4J4m9P9n3J7J5
5009Ej4m0L8J2m1O0j8m3L1M9p1J1MPK6Kl2J2j0oJ4RJ7kM6j8j1j8k1J9%Oj5KJ3
5044B3n8J6M2l9L6k4Ok6O7m4K4J0l4m7O6j4j9N4%j09Q4J4j0lK8n1LM5j15R9kk2
5076@m8K7K0l4K6J2rN9p2j1K9Rn8R3j8q2N1Oj7J7O0q8O6m8l4N8j2J3m1N4m6J5
5108cR1j11K6L9nn8L0J0p4P9J5n6kJ8k3M1j8K9n5K5J6kj2LMJl4l5N2mk7M1%m1
5142d0J08q7M3j7%l0k1Q6q2N5L1o1M4l4j7J4J3k0L0K6J8j9J6nm9N8r4J8K4l0n3
$$ plain form
5173 -75 -24 -4 16 34 -31 14 42 49 -33 23 38 9 -29 -11 0 0 39 -26 -11 -13 -20 20 53 24 10 7 17 17 70 -3 15 -79 6
5206 6 -34 -10 17 -4 17 12 -10 -68 -7 -30 -30 60 -46 -19 4 2 -59 59 19 -33 3 -37 -66 0 -9 -6 34 0 -11 -3 19 7 39
5239 39 95 -21 -4 -12 -4 21 0 -6 -16 33 25 -64 45 12 -3 -18 -7 -24 -2 -3 -38 13 -1 7 -27 -12 -23 -31 3 -18 12 14 -36
5272 -36 -22 26 -33 -43 12 -22 4 41 15 5 72 -34 -11 23 19 -5 12 20 -18 3 -28 -24 -29 37 -8 -41 19 -57 13 49 24 30
5304 30 10 -6 4 4 -8 19 -16 75 29 0 -11 -13 19 47 22 26 4 -7 34 29 -36 3 5 -21 -14 42 -1 -7 -3 -29 -53 -12 -2 -36
5338 -36 34 -14 -87 24 1 2 -18 5 -13 12 1 -11 -2 28 -18 34 42 22 13 81 25 10 -1 23 -4 15 28 -20 -6 28 -47 8
5370 8 -8 -24 -20 40 -36 -36 -3 17 -5 -30 -37 -41 26 -16 -56 41 -3 21 7 20 -18 -1 98 -28 30 20 -25 52 44 -15 23 8 -40
5403 -40 -6 -56 -28 -47 19 11 -4 28 13 -11 -16 44 32 -7 -35 -5 16 37 -43 -17 13 2 -31 46 -10 -6 30 -9 -12 34 1 9 23
$$ packed form
5173g5N1K0K0J8o5M5K8Pq2N6J5k9l8J8J1%L9o5J5kpM0L3k9j4lJ0%N3p3J8r4Q5
5206Fm0K4K7k1K1nk2n8O1k3%R0j06K7K3ko1J18m0n2L6m0k9O6rLM0l4j1QK2j2L2
5239C9N6j16J7qQK5k1oj0M9qq9J09l3j5j5J1j7K2jl5N1j4Ql4J5j1qL4k1L0Kn0
5272c6J4M8n9j0N5l4K6L7k6j0O7j06K3L4mk4J7Ql8K1l1MnO6m5l3O0p6P0L6k5O
5304C0k0j6J0%j2K7l5R1m6k9j1kL2K8k5Mk2j1M1no5L9Kk6PN6m3oMk6k4M1J0l4
5338c6P0m8p3J11k3Jk0K3j8K5j1j2RL0m6N2Qk0rO8n6j5j1K4k7J9J3m8J4L4p5N5
5370Hj6j6MO0p6%L3K0k2k5pmO7m2m0R7m4K4j4J3l8J7R9j26N8j0m5P7qn9L8j5m8
5403d0L4n0K8j9O6qj5L2j5k4nO0j2l9k8L0K1K1q0K6L0j1l3P7n6ML6l9lM6l3QJ4
$$ plain form
5436 23 -21 -35 10 -1 -24 -13 10 -13 7 6 -38 43 -20 -13 -14 28 -54 41 -19 -19 -14 -13 -54 57 -19 -15 -37 -26 -22 -13 35 -1 23 36
5470 36 -27 27 -13 13 -13 -16 0 44 22 61 10 -8 -3 3 9 23 -28 -20 59 -57 -32 12 -2 -28 -14 -64 -50 1 -17 -23 12 6 41
5503 41 -17 -17 -7 -6 31 -13 47 -4 -22 41 35 -28 -2 29 22 8 57 4 -30 10 7 -12 28 -1 50 15 2 -30 13 45 -48 41 8
5536 8 -33 8 0 10 -30 22 13 23 -54 1 -14 76 -16 -36 59 -21 -30 50 53 -4 18 14 -64 6 10 -28 15 -50 -46 -46 56 -28 11 50
5570 50 -11 56 17 -23 -11 13 -58 -24 6 -37 13 12 -41 -19 -52 -10 9 14 5 -41 -7 -2 4 6 11 0 14 3 -26 37 36 14 -7 60
5604 60 -8 -13 41 -32 -43 -28 -3 -23 27 -22 5 28 30 -23 32 10 -48 25 10 33 -3 25 29 -25 47 -7 -27 -4 -12 -17 13 14 13 49
5638 49 -10 26 46 -6 -23 44 12 -35 7 -23 13 -42 12 -26 18 23 30 17 -24 -37 -45 14 -38 -38 19 5 -42 5 -4 -4 0 15 61 75
5672 75 -6 -2 11 -60 -43 -1 -10 11 38 15 10 33 22 -11 11 60 -8 -34 21 -9 -30 15 26 -26 -15 -15 19 53 -30 -86 59 -4
$$ packed form
5436B3m4j4M5j1k3J1K3k3K0jm4Q1o3PjM2q2R5o0%NJm1J11p6Mk2J1MRM8l6K4J3
5470C6o3N4m0K6k6lJ6M4k2L9n1j8NOOJ4n1QP9j16K5M4j4k6J4n0J4N1j8oL5oL5
5503D1n8%J0JL7m4O0n1j8O3oo3K6L1pj4M9n3l4M0lj9M0k9N1l5j3l2M3L2r3Q9l3
5536Hm1M1qJ0m0N2rJ0p7N5j5R0r2k0R5q0rQ0Ln7K2mp8P0Ml8M3o5M%J02q4L9L9
5570E0o1O7l9m0J2K4p1L4L0m3N0jn3K2l3M2J9Nrm6L4NOKNj1J4j1k9O3jk2k1O7
5604F0o8nN4p3j1J5K5k0N0m9K7K3Kn3N5k2n8P3j5K3l6K8Mn4P2n4k0K3qnL0JjL6
5638D9n9L6K0n2j7O7l2m7M2l0L6n5N4l8M4NPj3m1j3qN9n2%N7j4m7M7r%MJ5M6J4
5672G5q1MJ3p1J7M2rK1K7k3nK3j1l3K2M9o8k6N5l0k1M5J1n2J1%L4L4q3n6J45o3
$$ plain form
5704 -4 -9 11 31 3 18 -20 -4 17 35 48 -58 48 28 -16 5 24 40 25 21 -31 -14 56 -1 12 13 31 -24 35 -33 43 -22
5735 -22 -71 2 16 40 -5 24 20 -5 42 -1 -17 28 24 -42 -15 16 6 29 -10 27 -36 37 8 16 33 -6 -35 38 -47 -31 7 -4
5767 -4 -12 -18 -13 5 -11 -79 31 -2 -31 -42 -4 -16 -10 -9 -16 4 16 -4 32 1 39 1 15 13 -40 -17 52 -4 -16 7 -20 -34 -4 54
5801 54 -11 69 28 15 40 1 13 -18 48 30 -57 39 -19 -55 -25 -44 -25 4 16 24 -12 16 -6 2 -38 -24 33 17 -43 -2 7 -12
5833 -12 18 -10 26 34 44 -9 35 60 4 49 34 2 56 7 -19 -11 31 -15 55 46 40 2 13 -14 -63 -52 36 -11 6 7 -26 13 -31
5866 -31 -12 14 5 -23 23 10 18 -3 -28 1 34 32 -28 0 41 -47 11 29 7 12 -21 -7 -15 46 47 -26 -31 -15 16 -35 8 -68 -84 -7
5900 -7 -84 15 -2 30 -27 -50 -19 -9 22 -11 16 -13 -7 -27 -2 -25 -21 -24 -52 -22 36 1 5 -25 -2 -3 -16 -4 7 15 35 -43 -23 0
5934 0 14 24 -44 -51 -17 32 11 -68 42 11 0 33 -16 14 7 -24 -38 6 18 8 -69 24 -12 -41 -59 -19 -25 54 25 40 1 50
$$ packed form
5704dnK0K0k8J5l8J6K1J8J3j06J06k0m4K1J9J6j5mn2J7P0n7J3JJ8n5N9o8P6o5
5735b2m9P3J4K4m5K9mk5M7m3j6M5mo6K7L1j0K3l9L7o3P3k9QJ7l9k9P3q5J6L8j1
5767dqoNJ8j6o8J10l3k9j1L8j2OJpK0J2k0L6l1L8l8J4kn3K3O9n6j2K3k7j4L0N8
5801E4o5Q0m1j3K5l9J2l1O6j8q7R6n8l6L0j9J9K9J2Ql6K8k2Qm0J4N7j6o0M1Rj9
5833a2L0k8L6QJ0n3M4K5n6M5j5l2N4m9k6QM2m6P0rol8J1k7m9J1Q8m7J7Jl3L9m4
5866c1J9K6rk8M6j3Qk1k5K9L3ko0K8M1q8N8J8k2Nl3J4qO1Jp3nJ6L1n1M3p6j6P7
5900gp7R9j7L2n7k3L1J0L1l3K7k9Ok0K5k3Mlk8L0N8l5Ml0K3jj3J2J1QK0p8K0K3
5934@J4J0o8pL4M9k1p9J10l1j1L3m9L0pl1j4M4J2j0p7R3l6k9j8M0oP9k9J5l9M9
$$ plain form
5966 50 21 -8 -18 15 10 6 -19 -17 -14 -25 -47 -5 40 14 8 36 -26 -11 5 14 -5 -28 0 -13 3 -48 87 34 -18 -11 -5 -30 15 11
6000 11 28 31 3 5 13 4 11 9 22 -8 -13 25 8 29 -11 -3 9 13 -44 20 28 -54 -35 -57 41 -12 -9 34 -12 32 -25 -48 54 23 -24
6035 -24 -27 -2 -19 14 26 -22 19 16 35 -51 63 20 -31 -25 13 35 -5 45 -33 -38 17 52 -30 40 18 -9 14 -15 -33 5 -40 19
6067 19 12 -50 33 -35 33 -32 -30 -17 31 4 -26 49 59 -8 16 28 5 -27 13 56 3 -8 -33 5 0 -27 -45 10 8 6 -19 51 -7
6100 -7 2 -60 15 -8 -21 -27 -37 -3 4 -62 -9 4 -5 44 -5 -27 -10 -29 -24 2 -1 -2 19 42 -3 36 16 3 8 -40 -29 29 7 5 -30
6135 -30 -30 -51 -41 -5 8 -36 -9 -11 30 25 -33 -69 50 33 16 -29 -19 14 10 -8 -99 -22 12 2 -24 24 -2 -7 35 40 22 53 44
6168 44 5 -30 -16 -18 1 43 14 50 -17 -10 -16 17 18 -29 14 -17 0 26 -10 2 -44 -17 5 -51 -7 -23 8 -2 -49 45 -38 -34 -1
6201 -1 16 20 5 52 7 28 36 58 11 41 -23 75 -37 -21 -2 -22 23 2 -28 -10 6 -31 -30 -8 -37 11 -26 14 21 -29 14 -20
$$ packed form
5966E0k9k9j0L3nmk5KLj1k2M2M5k6oK8o2J5J6Rj9k3K8j3J6n1J35n3n2POk5M5m
6000A1J7Lk8KQrPkJ3l0nL8j7K1m0QJ2Mn7O4Qq2J9k2R8n3LM3m6M4n7k3J02l1m7
6035b4lK5j7L3J2m8M1lJ9q6J14m3n1OL8K2m0N0p8nN5L5q2P0k2k7K3k9j8L8m5N9
6067A9po2Q3o8O8o5KJ3M8k7l0P5J0o7K4J2k3l2M0M3n3j1k5L8nk7j8N5kkk5P0n8
6100gRo2P5k3j3oj0L4Po6N3J3rM9m9k2J7j9NK6ljK1K3m5L9k0j3Nm8J1N8k2kl5
6135c0%k1J0L6J3m4K7kM1nn8l6J19j7j7m5J0L3mj8r1P7L4j0k6M8k6nM2Nj8L1r
6168D4l9l5J4kJ9M2k9L6o7PoL3Jm7M3l1J7K6l6J2m6K7K2n6M4j6L1j0m7R4q3ML3
6201aJ7Mj5M7m5K1QK2m7L0o4R8j12J6J9k0M5k1l0J8J6l7JK2k9M8l7M0Pn0M3l4
$$ plain form
6233 -20 55 0 12 5 16 15 22 41 -13 72 -21 26 7 -20 18 -53 -15 20 9 36 21 28 45 71 -56 3 -26 7 10 4 10 -38 -40 36
6267 36 9 44 35 -29 10 -9 3 -2 9 6 -2 53 -10 -34 67 50 -13 1 11 2 44 -21 0 4 -16 -11 19 -14 59 26 7 11 37 -6
6301 -6 -42 34 -46 -7 10 -25 29 -25 7 17 -6 43 -24 -26 -33 -18 -5 -11 36 12 24 -11 -41 -20 3 31 56 21 7 24 2 -14
6333 -14 -6 -17 31 -12 -10 10 24 4 68 -3 -13 -53 10 49 45 -68 -14 5 16 14 45 13 1 -1 -2 35 -1 -10 -26 21 14 -17 8 27
6367 27 4 23 29 27 14 16 23 18 33 36 9 -12 15 -31 8 -24 -18 -1 -21 -7 -57 16 -34 -10 -2 -4 58 48 -37 24 23 47 -80 -42 8
6402 8 -37 -17 -44 8 41 -42 1 47 6 23 6 7 -6 -35 4 -47 25 -18 -34 6 -15 -50 -1 50 5 27 -41 -18 -1 24 -28
6433 -28 -50 -21 -5 8 10 -3 -41 14 22 22 12 -20 19 52 -40 -7 10 78 -8 -31 8 -16 36 -8 -14 -11 0 -37 -27 -15 -22 -46 -15
6466 -15 -15 -21 -8 -42 3 19 -39 -59 -22 -6 0 -7 2 -13 29 22 17 -16 -28 44 50 66 44 -14 48 54 -18 19 -39 10 -13 67 17 -5 -10
$$ packed form
6233b0P5n5J2pJ1jPJ9n4Q5r3M7j9k7L8p1L8L5j1K7j5PJ7K6j27N9k9L3LoOm8kP6
6267C6k7L5ro4L9j9J2nJ1lqN5o3k4J01j7o3J4J0rM2o5K1Mk0NL0l3P3l3j9MK6m3
6301fl6P6q0L9J7l5N4n4L2J0k3M9o7kpJ5J3oM7k4J2l5l0K1K3K8K5l5j4J7k2j6
6333a4Qj1M8m3KK0J4k0O4p1j0m0O3L9mj13N4J9J1kL1l2j2kjL7l6rj6M7pl1K5J9
6367B7k3J9Okj3KPnJ5Lk7k1K7m6L9l2OJ7k0J4n0P3n0K4QkO2j0q5O1jK4j27L8N0
6402Hm5K0k7N2L3q3M3M6m1J7j7Jj3k9L9n1P2m3j6M0k1l5M9N1m5K2o8K3J7K5n2
6433b8k2K9J6J3Kj3l8N5Q%j0l2L9L3r2L3J7O8q6k3L9k4N2m4oLJ1l7J0J2pk4L1
6466a5%oJ3l4M5J6n8k0L7J6OpRj5M2pnl3j2P2OJ6k2n8O2Op2L7n8M9k3Q0n0k2n
$$ plain form
6501 -10 -65 -24 -36 -7 -42 6 -37 7 -40 -44 20 29 -22 -26 7 19 18 39 -7 -7 15 37 -16 -5 22 18 -4 3 26 22 30 35 -11 4 -29
6536 -29 18 62 -35 -2 10 -4 -22 -3 40 -18 -24 -39 -23 -31 -48 -29 -20 -12 -39 50 9 45 -11 22 -7 8 -15 -46 3 19 8 -4
6568 -4 2 30 50 47 39 22 10 15 -6 -41 19 23 -6 -29 -19 -5 9 -50 12 14 -19 10 17 14 -51 61 -4 23 11 -74 55 17 -54 -10
6602 -10 -16 -7 3 34 22 9 -3 9 69 54 -33 -20 12 34 14 -4 -4 -23 -52 -5 1 1 7 19 38 8 -27 -30 -15 1 -7 4 -30 25
6636 25 -55 1 -45 -1 -5 28 33 5 13 0 15 44 -4 26 55 -25 15 -12 41 15 31 20 16 2 -18 -10 -19 -15 -27 -38 -29 2 -8 -29
6670 -29 2 26 25 -4 -24 -14 24 -23 -10 13 52 25 36 28 63 25 -23 -42 -12 -6 -11 -16 -1 -3 -15 14 -14 -26 -7 -19 28 -23 -41
6703 -41 3 -39 -1 26 -23 -13 -52 29 44 10 -5 6 -47 -4 32 -64 -1 35 23 15 -31 20 29 5 52 -65 6 10 7 0 -17 3
6735 3 -30 -7 65 -46 32 -25 31 26 28 6 14 -17 5 16 19 3 29 -21 -21 28 -22 -51 -30 -8 -1 11 -18 -36 -26 12 32 28 -7 15
$$ packed form
6501a0n5M1j2K9l5M8m3M4m7mO4Rn1mL3J2jK1m6%K2K2n3J1K7mk2PK3mQNm6J5l3
6536b9M7M4r7L3J2j4j8J9M3n8oj5J6qj7J9RQk7Q9m1L6n6L3k9J5k3l1M9J6j1j2
6568dOK8K0lqj7j2Nk1l5O0Mk9k3J0J4J4n9O2Kl3K9Plo5J12o5K7j2q5J29l8p1M4
6602a0oRJ0L1j2j3j2J2O0j5q7J3L2K2k0j8%j9k9M7O%OJ2J9l0l5lJ5J6qJ1l4N5
6636B5q0N6m6M4mL3Nk8Qj3J5K9m8L0K9q0M0k7N3k6J6j1mj4k0QrMj2j1RL1j0k1
6670b9L1K4jk9k0J0L8m7J3K3L9k7J1qL5l8m8j9L0OnnJ5kj2K9k8j2J9j2M7n1j8
6703d1M4m2L8K7m9J0l9Q1J5l4j5J1n3M3L6r6O3L6j2qm6N1Rk4M7j17P1Mlpj7K0
6735Cl3K3P2j11P8n7N6nKk2Ql1K2J1Lj6K6n0%M9n0k9K1K2PJ2k9j8J0L8K0ml5K2
$$ plain form
6769 15 -18 2 74 1 4 -2 5 44 75 46 44 -34 -1 -20 37 -39 -30 -20 -55 -2 18 -18 -39 3 -44 14 15 -17 -15 33 -21 22 11 25
6803 25 23 15 6 -9 -32 56 -51 23 -12 -9 19 -27 3 32 32 12 62 -26 -13 10 18 -8 2 43 -44 21 -28 24 -24 -24 21 -49 -14
6836 -14 23 40 -14 -19 -28 -27 -1 15 24 47 24 -41 83 -19 28 51 3 55 43 13 56 50 52 -12 12 -6 6 -17 -16 7 19 -3 29
6869 29 -12 -37 -17 18 -23 -43 11 -74 -4 -37 53 -54 5 0 11 -38 4 34 48 84 27 -2 6 19 35 9 -15 8 28 37 -9
6900 -9 -10 3 -18 3 -1 -35 -11 25 -60 -20 20 -17 -41 -25 12 -2 11 53 0 -26 37 2 29 5 -51 -49 56 32 61 45 10 35
6932 35 13 -16 -8 31 1 20 -22 2 38 7 3 -8 41 18 19 1 -49 -1 4 47 -25 7 0 -57 -58 44 14 6 -38 30 -50 -60 -23
6965 -23 4 40 14 -13 45 23 21 18 17 -13 3 49 4 38 22 5 -31 47 8 16 -3 -9 -41 20 51 13 7 -57 -24 69 -13 -25 12
6998 12 15 0 -8 0 -13 -27 43 6 15 -8 19 28 -9 -3 -38 14 7 37 -30 -9 19 10 15 9 4 65 -24 21 62 8 -75 5 -28 -58 -2 -16
$$ packed form
6769A5l3K0P2p3LoPL9L1k9kp8L3j9N7p6RJ0l5N3K0l6k1M2m7N8Jl2KM8n4M3j1J4
6803B5kqrj5k3Q8j07P4l5LK8m6L0K9%k0N0q8J3K3Qk6J0M1q7O5m9N2m8%M5p0L5
6836a4L7J7n4nrJK6J6RK3k3o5J24j02M7K3m8N2j2l0M3oKo4K4j8J2k3JK3J2k2L2
6869B9m1k5K0L5m1k0N4q5P0l3R0j07N9nJ1m9M2L0J4L6n7k9QJ3J6k6k4K3K0Rm6
6900ijJ3k1K1ml4K4L6q5M0M0l7k4J6L7j4J3M2n3k6O3l5K7k4n6KJ05k4K9j6l5K5
6932C5k2k9QL9l0J9m2K4L6l1mj1M9k3Jj8n0M8NM3p2L2pn7jJ02l0qm4O8q0j0L7
6965b3K7L6k6k7N8k2kljl0J6M6m5L4j6j7l6P8l9Qj9ol2O1L1l8oo4L3R3q2j2L7
6998A2Lj5qQj3j4P0l7Rk3K7Rl7Ol5N2pL0o7K1K8rNonO1q9M5M1n4q3Q0l3l0N6j4
$$ plain form
7034 -16 -5 -15 -31 -9 -13 50 -21 25 -64 3 3 -1 -3 34 -23 -5 13 -25 4 -38 39 32 23 12 6 -13 12 20 -20 31 52 -50 -48 -18
7068 -18 8 -30 -17 20 9 -1 -6 2 -17 -13 -5 -67 -10 -3 -63 66 5 -13 26 -25 42 21 -2 -52 50 -10 17 7 5 12 17 34 -8
7101 -8 35 48 10 37 -25 32 -41 -31 -40 5 -18 11 -36 -38 21 -27 15 14 4 -38 12 22 -34 32 -18 -36 12 46 -7 45 62 5
7133 5 2 -18 -3 7 1 6 36 18 27 -1 43 -21 -7 19 -34 -25 -47 6 0 -54 5 24 44 7 39 -24 -17 18 0 -33 -23 20 8 -6
7167 -6 14 13 9 -30 13 22 2 41 30 -8 23 24 1 -16 -3 -3 -41 -16 -60 7 -15 13 -13 -38 -9 9 40 -2 -51 16 25 -27 -4 3
7201 3 -21 24 27 -29 18 13 9 -23 27 -14 12 39 41 -11 41 9 29 3 -34 -20 44 -9 41 30 -3 -16 39 11 -40 -29 -43 -74 -20
7234 -20 -48 -18 20 26 -36 6 23 -70 -37 5 -25 19 18 35 -1 1 6 22 17 -2 58 17 -15 59 -17 9 -45 -35 19 36 42 -31 -1
7267 -1 37 38 15 -14 -15 18 -57 -3 19 -17 5 -57 16 76 42 6 -17 -41 -31 6 21 27 -51 95 42 -21 -1 24 11 68 -17 26
$$ packed form
7034a6J1j0j6K2mO3p1M6q9O7%mkL7n7J8J8l8K9m2P7prj1oj9K5Qm0N1K1j02KL0
7068a8K6l8J3L7j1j0nQj9MQo2N7Po0J29o1j8L9n1O7k1k3n0J02o0K7j0kPNJ7m2
7101hM3J3l8K7o2N7p3J0rM5k3K9m7kN9m8M2jj0m2N0J0n6O6n0j8M8L4n3N2J7n7
7133Elk0J5J0oNL0j8Rk8M4o4J4K6n3Rk2N3on4N9J9K0l7L2o3PL5j8l3J0M3j2j4
7167fK0jml9M3Rk0L9j1l8L1Jk3j7J3%l8K5m4O7k2K8k6k5K9J8L1m2m9O7Rn2K3P
7201Ck4M5Ln6M7nml2N0m1K6K7Kn2N2l2K0k6l7J4O4n3N0j1l3j3N5k8n1J1j4l1N4
7234b0k8L0L8Oo2M2J7r3L3M2l0M4jJ7l6KNJ6nj9O0m1l2P4p6K6n4J0N4J7Op3L0
7267aL8Jk3k9jL3p5N4K2l6K2o2P3O0l4l6k3k4J0L7J5Op8J46n3o3K0K5j3N7q5M3
$$ plain form
7299 26 -17 -39 4 -6 -5 -35 17 8 -58 -12 36 64 -7 6 12 34 -5 -3 -3 17 -26 -11 -16 -1 -31 -31 26 11 3 -6 18 43 4 -12 77
7334 77 -5 42 -4 82 32 11 -33 -28 61 37 10 47 19 0 -52 -4 -4 -61 33 2 -12 -26 -42 -63 6 27 -51 35 7 9 22 -47
7366 -47 12 -26 12 13 -26 33 -24 -33 -29 -68 40 -12 8 11 -15 -9 -33 7 1 -23 -17 33 -40 33 -31 36 -4 -35 -53 30 24 -44 -42 -30
7400 -30 36 -27 -28 49 49 -35 9 19 -4 4 20 -17 12 40 13 -16 43 36 -13 24 72 12 36 -5 21 -51 25 18 5 25 -7 -13 -23
7433 -23 -22 -14 -26 -37 23 -64 -47 -5 -26 -4 41 -19 15 -20 -13 -48 -19 31 31 13 -27 5 47 -37 20 -24 -4 -11 22 10 8 13 27 -3
7467 -3 12 -11 -22 22 31 -19 0 11 -48 7 -10 -61 -58 -8 14 21 33 -5 -30 -48 -1 -40 0 48 4 10 35 40 18 38 5 73 8
7500 8 51 -13 -29 -30 36 -19 24 -27 4 -53 -51 -3 21 -32 19 -44 -34 -8 -58 -35 -21 -16 2 -30 -26 -25 -42 6 -38 34 32 28 -29 17
7534 17 -5 20 7 -19 83 -20 25 -3 17 16 -41 -4 42 -16 66 -52 -59 -9 17 -36 -54 33 -7 18 11 28 -3 28 17 8 40
$$ packed form
7299B6m3k2M3j0Jl0N2ro6M6M8K8p1J3OK2l9K%K0m3J5nJ5l0%N7j5qrK4K5l9j6Q9
7334G7q2M7m6Q6n0k1m4NQ9k4k7L7k8j9n2M8%n7R4l1j4j4j6k1O9K1p8Q6k8KJ3o9
7366d7N9l8L8Jl9N9n7rMl9J08n2K0Lk6Ok4M0ok4ON0p3P3o4O7m0l1j8Q3oo8KJ2
7400c0O6o3jP7%q4M4J0k3QJ6l7K9K8k7k9N9pm9L7M8o0K4m1K6p2P6pj3K0l2oj0
7433b3JQj2j1O0q7J7M2k1K2M5o0L4l5Pl5K9N0%j8m0L2M2q4N7m4K0pL3j2kNJ4l0
7467cJ5k3j1M4Rn0J9J1n9N5j7n1LN0K2PJ2l8k5j8M7l9M0M8m4OK5Nk2K0l3O8o5
7500HM3o4j6jO6n5M3n1L1n7KM8K4n3N1o3J0K6n0K3J4NJ8l2MJj7M8m4P2kmn7M6
7534A7k2K5j3k6J02j03M5k8K0jn7L7M6n8Q2j18pN0K6n3j8Q7m0K5pJ7l1L1j1rL2
$$ plain form
7565 40 3 19 -27 -8 -44 30 14 0 18 53 1 2 30 16 -18 29 11 1 10 -2 37 -49 -5 -22 8 -13 27 33 -60 -14 3 -17
7597 -17 11 -51 -62 -3 41 -39 -79 -1 -31 3 1 7 23 -2 -42 -9 56 -5 -49 -50 83 -44 37 14 -15 0 54 -20 30 31 -27
7628 -27 -46 5 10 9 27 -23 -36 10 -31 -45 -12 -50 42 6 -25 -20 19 13 41 23 -3 0 2 49 -38 -8 -14 19 -4 43 51 -8 31 7
7662 7 32 -8 8 -37 -31 -4 9 53 -55 31 -28 13 52 31 -4 -11 -41 -1 -20 -34 -40 -30 -1 -38 -3 -80 -11 17 -14 -20 -1 41
7694 41 38 35 30 14 -14 -23 41 30 -4 14 5 1 35 6 7 -28 -1 21 32 2 -50 -28 9 26 -9 -2 8 35 -23 42 57 -53 1 -16
7728 -16 -18 -59 -2 20 -20 -28 -1 27 -14 3 46 36 -24 31 36 3 13 10 5 -2 17 8 -20 -12 -38 7 36 -23 -23 16 -12 -57 -13 7 -15
7763 -15 26 8 -25 -22 44 14 8 9 -33 6 61 -56 36 2 0 27 -2 34 40 29 28 15 9 15 10 39 -35 11 8 -24 -22 24 -2 -38 -31 -14
7799 -14 -43 -38 22 -62 -14 4 -6 -12 13 -9 -22 -9 5 -14 18 1 4 16 -9 25 10 16 47 41 64 4 -27 -4 -3 52 -19 17 22 -20
$$ packed form
7565D0l7J6m6J9l6P4j6j4J8L5n2JK8j4l4M7j8j0Rj2L9q6M4j7L0k1M0Or3M6J7k0
7597a7K8o2j1N9M4q0m0P8l0L4kOJ6k5m0L3O5o1m4jJ33j27Q1k3k9J5N4p4N0Jn8
7628b7j9N1NjJ8n0j3M6m1j4L3l8R2l6l1NL9oK8j8k6LKM7q7L0oL3k3M7Qn9L9k4
7662GK5m0J6m5OK7J3M4j08Q6n9M1L9k1l5pl0M0j9j4oJ0K9l7L5p7O9K8l1oJ9M2
7694D1llnj6k8rO4j1l4J8rmL4k9Jl5K7K2J1l0n2K2L7J7l5PJ0K7n8O5J5j10N4j7
7728a6km1N7K2m0qK7K8m1J7M3j0o0N5Nl3J0lnpJ9rk8Qk6M5K9n9%L9k8m5M4K0k2
7763a5M1j8l3LO6l0oJm2L9N5j17R2l4kK7k9L6Oj1jj3oOnK9p4M6ll2KM6k6l6PJ7
7799a4k9NO0q4M8J8j0oK5k2j3J3J4j9L2j7LJ2k5L4j5OL1oK3o0l1K3JN5p1L6Nm2
$$ plain form
7833 -20 -15 -49 -7 13 -3 -26 9 -29 -4 -11 25 -46 9 33 -26 -29 -53 -37 -24 34 11 13 1 38 41 -4 13 10 32 11 13 48 6 7
7867 7 -11 61 8 0 41 -14 63 -16 -15 14 -18 12 9 2 21 29 -15 -42 38 42 -41 31 -3 24 -14 -25 3 2 56 91 18 54 55 2 -4
7902 -4 -8 36 34 -2 21 -23 -17 -14 -23 19 43 9 8 -6 -23 9 2 12 1 31 -24 -17 12 3 -10 -12 -5 -17 11 -38 9 22 24 -10 -43 84
7938 84 22 61 -22 29 10 68 22 -25 33 7 24 -2 11 -10 -13 25 26 -3 1 19 -29 20 -41 0 22 32 5 -13 -38 -13 5 13
7970 13 7 -62 24 36 20 -14 74 12 30 -17 43 9 -49 -15 24 -28 26 8 0 78 4 -29 38 -39 -3 40 -15 19 -8 -18 -20 28
8002 28 -39 -12 15 -1 -9 -19 17 -15 -21 -3 -11 8 -37 -11 -3 42 38 31 6 45 28 25 24 -38 2 -10 37 3 8 -4 -6 30 26 1 24 52
8038 52 -9 -17 0 9 -1 -36 48 20 16 -46 -68 -23 3 -12 19 12 44 2 42 -17 -20 50 -44 17 -13 44 35 11 7 18 52 -15 7 17
8072 17 -54 -9 16 60 -6 65 -20 -3 53 22 -8 -31 16 -2 32 36 8 -15 -16 -7 19 2 -28 11 30 0 28 8 5 22 40 25
$$ packed form
7833b0Nl4M2K0j6k3L5l8K5pL6p1N5K4n9lk4J6J3N8k3Kj2L7Lm5J7lK2k1KL5m2J
7867Gj8P2n3qM1n5P7p9JK9l2L0lpJ9Qm4k7Q0Mq3P2l4K7l8j1K8jN4L5p3L6Jn3o
7902dmM4kl6K3m4OLrM2K4l4jj4j7L2pJ0j1L0n5PK9rj3kPj2K8m9M7J3Kl4l3J27
7938H4o2L9q3N1j9N8m6m7N8k6J7k6J3k1lL8Jk9MJ8m8M9o1M1K2J0k7j8k5K5J8Q
7970A3oo9Q6J2j6l4Q8o2J8m7O0l4n8L4L9n2N4j8qP8p4l3O7p7L6M3n5L4k7j0kM8
8002B8o7K7K7j6qj0L6l2oJ8qJ9m5K6QM5mpk5L9j7ljo2M0j2M7l4Nj2kL6mk5K3K8
8038E2o1qJ7Rj0l5Q4k8mo2k2M5K6j5L1pL2m2M0n9lP0r4O1l0N7rk4mJ1L4o7K2J0
8072A7p1M5K5M4o6P1q5J7N6l1l0k3M7j8L4Mk8k3jRK6j7l0L9J9l0K8k0lJ7J8j5
$$ plain form
8104 25 -24 47 13 31 0 -10 26 44 -32 -20 47 44 47 9 -29 -7 -18 -38 4 -29 -37 2 -37 11 8 -23 -29 7 9 -8 1 -43 -37 -4
8138 -4 4 46 -8 12 53 30 16 81 52 43 37 4 -2 15 4 -28 4 -42 -18 -21 -57 37 30 -26 -37 -46 -30 6 -13 -27 24 22 -17 4 5
8173 5 5 -16 43 -14 27 2 -23 28 -25 10 -6 -19 6 20 6 11 31 9
$$ packed form
8104B5m9P1l4J8l1j0L6J8p6J2O7lLl8l8K2j1k0M2l3qL9l9M8ll1oL6Kj7Rm4OL3
8138dQM2n4K0M1k3j4O5k9rol3oJ7j1l2L2m6K4ll6R4pn6j1rJ6L6j9j4N1kl9K1J
8173E%k1N9n7M1k5k5N1n3L5j6j3K5J4j4NK0k2
8191I
$$ Imaginary data points
##PAGE= N=2
##DATA TABLE= (X++(I..I)), XYDATA
$$ plain form
0 0 0 0 0 0 0 0 0 0 0 0 0 0 0 0 0 0 0 0 8 -8 8 -8 8 -8 16 -16 16 -19 24 -24 32 -32 40 -43 48 -56 64 -71 79 -88
40 -88 96 -104 119 -129 144 -159 175 -192 213 -235 258 -284 314 -346 384 -426 473 -527 591 -668
60 -668 759 -875 1020 -1216 1486 -1888 2546 -3813 7060 -31993 -52339 45185 13658 -22631
74 -22631 -10088 -7036 16246 12384 -35992 -1939 37115 -4613 -27405 -1839 13254 15152 -13372
87 -13372 -25258 15434 23111 -15838 -20214 4699 18379 -862 -22331 -270 22623 3354 -18968
100 -18968 -11535 20475 21944 -20861 -17670 26910 12763 -20952 -5697 12760 9792 -2982 -17325
113 -17325 -199 21444 -1275 -24095 -5319 19624 7585 -22842 -12413 17786 6366 -16515
125 -16515 -9894 9423 15264 -9288 -23447 10341 23240 -10798 -18904 3980 16507 5446 -20732
$$ packed form
0@%%%%%%%%%%%%%%%%%%Qj6J6j6J6j6K4l2L2l5M3m8N6o4P2q3R1j04J20j35J50j67
40h8J84k00K23k48K73l03L34l67M05m48M93n42N98o60P30q10Q99j000J118j259
60f68J427j634J895k236K702l374M434o359J0873l9053k0346R7524l1527l6289
74b2631J2543L052K3282l862m8376L4053L9054m1728k2792K5566J5093J898k8524
87a3372j1886M0692P677l8949m376K4913J3680j9241k1469K2061K2893j9269k2322
100a8968P433L2010J469m2805L191M4580j4147l3715J5255J8457k968j2774j4343
113a7325J7126K1643k2719k2820J8776K4943j2039l0427J0429L0199j1420k2881
125a6515O621J9317N841k4552j4159L3788J2899l4038q106K2884J2527j1061k6178
$$ plain form
138 -20732 -10230 24874 5350 -24915 -1547 15201 1156 -8570 -12407 1904 17971 -4966
150 -4966 -21844 3537 17738 -2194 -18885 -2873 19624 2523 -19583 -2224 13923 5034
162 5034 -8488 -12705 7475 19239 -10614 -19270 12358 13242 -9080 -9822 137 12768 5439 -19750
176 -19750 -4197 21055 -132 -14331 -938 5924 8947 -2324 -17737 5202 22474 -9389
188 -9389 -20243 12170 15562 -8595 -11357 1152 11117 4880 -13872 -7994 15246 7746 -15401
201 -15401 -7995 12407 8085 -8864 -10867 5178 13867 -4741 -15289 5102 13609 -2638 -10267
214 -10267 -1835 9721 7793 -10874 -10887 13660 11594 -13783 -10149 11120 10282 -7551 -11969 5887
228 5887 12545 -5300 -11448 1756 9658 3256 -11241 -7744 13818 8276 -15086 -6597 12335 5530
$$ packed form
138b0732J0502L5104j9524l0265K3368J6748j4045r726l837J4311J6067k2937
150d966j6878K5381J4201j9932j6691J6012K2497j7101k2106J7359J6147q889
162E034j3522m217K0180J1764k9853q656L1628Q84k2322p42R959J2631p329k5189
176a9750J5553K5252k1187j4199J3393O862L023j1271j5413K2939J7272l1863
188i389j0854L2413L392k4157k762J2509R965o237j8752N878K3240p500k3147
201a5401P406K0402m322j6949k003J6045Q689j8608j0548K0391Q507j6247p629
214a0267Q432J1556j928j8667j3K4547k066k5377L634K1269q38j7833m418J7856
228E887O658j7845o148J3204P902o402j4497L497K1562n542k3362Q489J8932o805
$$ plain form
242 5530 -7299 -7961 3255 11998 -2933 -14247 3496 13260 -1579 -11611 -2611 11938 6022
255 6022 -13891 -6978 14333 5751 -12474 -5176 8865 6798 -5445 -9101 3819 10890 -1990
268 -1990 -11093 -359 11787 2937 -12679 -3413 13369 3309 -11565 -3174 8389 5476 -5276
281 -5276 -9435 4011 12519 -4434 -13248 4470 11992 -2861 -10553 252 10194 2407 -10761 -4120
295 -4120 11496 4476 -10253 -4050 6983 5857 -2789 -9378 1228 13025 -2149 -13896 3626
308 3626 12126 -3065 -9168 -73 7559 4429 -8144 -7265 9269 7671 -8661 -7521 6551 8327
322 8327 -4311 -9675 3444 10763 -2875 -10449 1920 9064 294 -7698 -3477 7352 6048 -7771
336 -7771 -7239 7549 7579 -6480 -8295 4890 8888 -3802 -9906 2284 9792 -1522 -9178 -317
$$ packed form
242E530j2829o62J1216Q743j4931j1314J7743R764j4839j0032R000J4549n916
255F022j9913O913K1311q582j8225P298J4041k067j2243l656J2920P071j2880
268a990r103J0734J2146q850j5616R266J6782j0060j4874Q391J1563k913j0752
281e276m159J3446Q508j6953q814J7718P522j4853p692J0805R942p787j3168O641
295d120J5616p020j4729O203J1033j126q646o589J0606J1797j5174j1747J7522
308C626Q500j5191o103R095P632l130j2573Q79J6534j598j6332J140J4072J776
322H327j2638n364J3119P319j3638p574J2369P144q770p992M221J0829j304j3819
336g771N32J4788L0j4059j815J3185L998j2690o104J2190P508j1314p656Q861
$$ plain form
350 -317 7368 2916 -7051 -6335 7636 7360 -9460 -7286 8446 5466 -6275 -5982 2116 7206 -321
365 -321 -10095 -806 9815 -64 -8879 -2006 6848 4250 -7375 -6665 7875 6681 -8005 -6509 5738
380 5738 6132 -3273 -7354 1003 8463 -97 -8746 -794 8150 2442 -8117 -4170 8559 4630 -8263
395 -8263 -4348 6321 4538 -3427 -6059 1228 8432 -717 -10009 1323 9387 -1107 -7639 -861
409 -861 6697 3613 -6763 -5066 7238 5413 -6564 -5086 4937 5280 -2632 -6292 681 8121 285
424 285 -9486 -161 9104 57 -7858 -1246 5741 2744 -4788 -5375 4222 6513 -4901 -7333 3974
439 3974 6583 -3106 -7155 743 7062 -52 -7783 -1205 7054 1589 -6378 -3033 5286 4384 -4936
454 -4936 -5714 4764 6071 -3815 -6015 2268 6857 -732 -7431 337 7551 110 -6522 -1122 5268
$$ packed form
350c17P685m452r967P16J3971k76j6820K174J5732k980j1741K93Q098N090p527
365c21r774R289J0621r879q815O873Q854k598j1625P10J4540j194j4686J496J2247
380E738L94r405m081Q357P460q560q649P952Q944n708j0559L947J2729l929j2893
395h263L915J0669j783p965k632P287P204r149r292J1332Q064j0494o532O778
409h61P558l084j0376J697J2304j825j1977J478J0023L43p912l660O973P440p836
424B85r771R325R265r047p915O612O987k997p532n87R597K291j1414k432J1307
439C974K609r689m049P898O319p114p731O578Q259n465p967L345Q319r02r320
454d936p78J0478J307r886k200Q283M589p589o699P768P214p441o632N400O390
$$ plain form
469 5268 2875 -4591 -5147 4605 6327 -5519 -6411 4896 5133 -3484 -5217 859 5737 504 -6949
484 -6949 -1410 7263 1657 -6763 -2035 5558 3272 -4088 -4399 4074 5997 -3322 -5567 3673 6380
499 6380 -1731 -5206 1194 6147 1351 -5320 -1794 6496 3587 -5542 -3140 5906 4203 -4445 -3855
514 -3855 3807 4687 -2103 -5141 1175 6104 -259 -6529 -359 6232 666 -5833 -1772 4610 2757
529 2757 -4376 -4364 3818 4837 -3837 -5194 2920 4850 -1857 -4886 318 5360 972 -6031 -1399 6499
545 6499 1809 -5709 -1808 4922 2925 -3477 -3655 2814 5067 -1967 -5385 2151 5678 -1195 -4977
560 -4977 461 5119 958 -4775 -1655 4795 2895 -4333 -3409 4379 3953 -3327 -3913 2617 4810 -1455
576 -1455 -4821 1099 5415 170 -5125 -317 5593 1175 -4469 -1401 4024 2921 -3123 -3557 3206
$$ packed form
469E268k393p466n56R752J722j1846q92J1307K37q617j733O076M878n233p453
484f949N539Q673n606q420M728P593k286p360l11Q473J923r319k245R240K707
499F380q111l475O400M953m796o671L526Q290k909r129K402R046j703q648N90
514c855P662Q80o790l038O316M929o363o270O170O591n566o499M061O382j853
529B757p133J2Q182J019q674j357Q114J930o707l029N204N042m388p003M632P898
545F499m690p518L901O730j997o402j78O469K253p034l418P536L527o873l782
560d977N438M658m161n733L120O450j900p228R24P788m26p280n86O530K193o265
576a455l366N920M316n245n295M808N910m418n644L068N425j103o044m34O763
$$ plain form
591 3206 4461 -2465 -4689 2308 4830 -1398 -4390 267 4423 1053 -4787 -1778 4959 2035 -4595
606 -4595 -2607 3988 3019 -3327 -3547 2465 4204 -1775 -4656 1322 4890 -663 -4597 59 4520 962
622 962 -3944 -1721 3698 2842 -3347 -3431 3429 3743 -2914 -3627 2130 3906 -1060 -4226 157 4589 416
639 416 -4869 -1012 4625 1179 -4141 -1843 3218 2610 -2917 -3517 2370 3757 -2143 -4067 1414 3984
655 3984 -789 -4028 -79 3888 992 -3927 -1842 3976 2312 -3819 -2528 3354 2949 -2588 -3201 1951
671 1951 3655 -1109 -4055 549 4391 -209 -4199 -227 3773 971 -3436 -1843 3109 2505 -2829
686 -2829 -3136 2466 3488 -2153 -3550 1537 3492 -659 -3772 -209 3948 671 -3949 -1286 3861
701 3861 1660 -3562 -1876 2929 2320 -2088 -2990 1658 3579 -1416 -3674 1017 3614 -396 -3504 -257
$$ packed form
591C206J255o926k224O997K522o228k992M657M156l370n840L009O737k924o630
606d595J988O595r69o346k20O012J739n979k881N978L568n553l934M656M461l558
622I62m906K223N419q56o189q4O860L14o657p13N757J776m966l166M383M432m173
639D16n285L857N637l446n320K298N061o08n527o00N887J387n900j924N481K570
655C984m773l239L949L967k896m919K085N818j664o131J291N882m05n537o13N152
671A951J704m764k946M604L842m600l990L972M000k802m407J593M952o04n334
686b829l07N602J022n641j397N087J955m151l113L563M157l277m620K663N147
701C861k201n222J686M805o09m408r02M648J921m995k258M691K597m010l108L247
$$ plain form
717 -257 3218 1130 -3087 -1905 3171 2361 -3096 -2516 2596 2810 -2051 -3036 1390 3200 -722 -3554
733 -3554 85 3820 226 -3816 -501 3259 1011 -2825 -1621 2413 2278 -2093 -2945 1876 3255 -1791
749 -1791 -3129 1186 2966 -277 -3203 -535 3361 1052 -3416 -1387 3315 1633 -2990 -1863 2403
764 2403 2217 -1777 -2722 1258 3136 -936 -3278 561 3350 -221 -3104 -255 2841 1003 -2395 -1821
780 -1821 2405 2479 -2450 -2591 2318 2560 -1617 -2453 912 2839 -46 -3183 -266 3533 539 -3395
796 -3395 -515 3031 936 -2236 -1553 1958 2435 -1651 -2649 1644 2902 -1209 -2708 827 2730 -25
812 -25 -2571 -620 2816 1313 -2831 -1439 2829 1732 -2317 -1857 1963 2183 -1373 -2457 847 2855
828 2855 -492 -3098 247 3029 -2 -2775 -520 2407 885 -2086 -1631 1770 2215 -1876 -2522 1751
$$ packed form
717b57L475k088m217J182N076q10n457N80N112K14m861r85M426J810l922k832
733c554L639L735l594m042L315L760k248l836J204M034j35m371q52M821J379n046
749a791j338M315J780l243k926K668L896k309m468K029M702j682m623J127M266
764B403j86l994r45L980J878m072k342L839K789l571k883K849L096j838l398N74
780a821M226P4m929j41M909K42m177q36L365J927k885l137K917L799k994l934
796c395K880L546k095l172O83L511M77m086r98M293J258m111j499L535J903k755
812b5k546J951L436j503m144J392M268j097m049M60L820K20l556j084L304K008
828B855l347k606L345K782l031k773K255K927j522k971M55L401M45m091o46M273
$$ plain form
844 1751 2392 -1374 -2382 601 2291 13 -2598 -744 2914 861 -3030 -825 2680 922 -1874
859 -1874 -1466 1343 2276 -1101 -2626 1229 2800 -1093 -2461 791 2219 93 -2012 -826 2346 1361
875 1361 -2371 -1479 2368 1609 -1941 -1752 1448 1979 -922 -2257 565 2499 -269 -2625 -66 2573
891 2573 384 -2438 -658 2137 993 -1716 -1513 1471 2100 -1410 -2314 1459 2287 -1107 -1921 628
907 628 1892 350 -2098 -904 2575 1098 -2664 -870 2335 960 -1709 -1321 1083 1871 -848 -2489
923 -2489 680 2440 -885 -2351 360 1820 94 -2023 -987 1777 1068 -2116 -1620 1802 1400 -1745
939 -1745 -1686 969 1641 -706 -2141 162 2298 -32 -2392 -193 2327 423 -2100 -655 1867 1011
955 1011 -1489 -1291 1267 1796 -981 -2017 917 2097 -767 -1946 386 1721 190 -1791 -811 1870
$$ packed form
844A751O41l766j008K983J690k278k611J854L658k053l891K205L505j758k796
859a874M08K809R33l377j525L855J571l893j368L252J428k126k105J186L172r85
875A361l732Q92L847p59l550J89L200N31k901j335K822J934k768k356K559K639
891B573k189k822J780K795j144k709K03K984O29l510r04L773Q28l394q14K549
907F28J264j542k448J194L479j477l762J794L205j375k669L88K404P88k719j641
923b489L169J760l325j466K711J460j726k117J036K764p09l184M96L422m02l145
939a745N9K655O72k347j435K303K136k330k360K199K520j904k523J445K522q56
955A011k500J98K558N29k777j036K934J180k864j179K332J335j531j981R80K681
$$ plain form
971 1870 1007 -2120 -1146 1964 944 -1516 -1162 826 1611 -513 -2283 430 2305 -565 -2127 314
987 314 1755 168 -1475 -721 1449 1283 -1584 -1452 1582 1503 -1315 -1497 899 1602 -531 -1742 71
1004 71 1802 174 -2040 -482 1905 514 -1879 -880 1478 904 -1280 -1399 793 1628 -885 -1972
1020 -1972 754 1798 -645 -1673 152 1475 424 -1506 -854 1567 1183 -1749 -1180 1699 1060 -1247
1036 -1247 -1148 750 1459 -330 -1747 120 2005 -71 -1987 30 1665 229 -1391 -707 1135 1165
1052 1165 -1213 -1410 1166 1375 -1110 -1394 703 1336 -300 -1500 -197 1604 331 -1691 -529 1787
1068 1787 683 -1601 -776 1316 919 -940 -1104 728 1522 -443 -1702 416 1853 -271 -1645 210
1084 210 1336 269 -1110 -840 1328 1140 -1434 -1146 1312 1053 -992 -1039 491 1236 -73 -1572 -93
$$ packed form
971A870q63l127R74L110j020k460L54J988P85k124j770K713J875k870j562K441
987C14J441j587j643P54K170j66k867J32L034p9k818j82K396P03k133j211J813
1004G1J731j628k214J558K387j391k393R99K358n74k184j19K192Q35k513j087
1020a972K726J044k443j028J825J323j051j930O52K421l84k932N69K879o39k307
1036a247R9J898P09j789j417J867J885k076j916K017J635j436j620O84J842L0
1052A165k378j97K576K09k485k84K097O33j636j200J303J801j273k022J162K316
1068A787j104k284Q25K092l97j859j64J832P94j965j259K118J437k124j374J855
1084B10J126j067j379K70K168j88k574K88K458k59k045m7J530P45j309j499J479
$$ plain form
1101 -93 1801 40 -1747 -22 1457 338 -1162 -670 973 1033 -865 -1280 874 1453 -827 -1415 670
1118 670 1270 -293 -1270 -66 1346 439 -1375 -670 1411 749 -1405 -766 1098 810 -729 -1059 365
1135 365 1377 -301 -1582 272 1538 -255 -1405 25 1098 367 -932 -843 988 1082 -1121 -1160 1198
1152 1198 1130 -901 -973 473 983 -57 -1218 -298 1551 292 -1597 -250 1399 277 -999 -574 749
1169 749 945 -639 -1189 629 1405 -738 -1272 505 1114 -185 -1033 -202 1088 560 -1177 -651 1225
1186 1225 801 -1181 -834 989 758 -643 -858 211 1111 -2 -1409 -52 1458 -8 -1389 6
1202 6 1033 210 -703 -675 654 1235 -851 -1233 996 988 -854 -830 330 830 87 -1009 -320 1281 431
1221 431 -1389 -323 1233 310 -831 -574 604 883 -470 -1076 390 1301 -401 -1318 384 1088 -240
$$ packed form
1101i3J894j761j787J725J479j119j500M92J643O0j898m15K154N79k280n88K085
1118F70O00j563r77J204J412r07j814P05K081o62k154O39J864k88j539l30J424
1135C65J012j678j281J854J266j793j150J430J073p31j299Q9J831R4k203l9K358
1152A198o8k031p2J446N10j040j161R20J849j259j889J347J649j122j276M25J323
1169G49J96j584n50J818P76k143n34J777O09j299q48Q31J290n28j737N26J876
1186A225m24j982L47J823k31j401k15J069R00j113j407J357J510j466j381J395
1202FJ027q23r13K8J329N81k086l82K229qj842K4J160N00p43j096O89J601q50
1221D31j820J066J556r23j141K57J178K79j353o06J466R11j702r17J702P04j328
$$ plain form
1238 -240 -875 -170 838 549 -942 -812 1027 827 -1059 -805 837 622 -516 -732 59 989 102 -1252
1256 -1252 -107 1268 57 -1213 -123 1007 269 -616 -625 489 985 -579 -1203 713 1074 -681 -840
1273 -840 414 741 80 -743 -396 995 580 -1186 -488 1162 280 -827 -454 489 697 -208 -982 206
1291 206 1146 -210 -1161 229 1073 -111 -811 -205 684 540 -679 -743 789 859 -802 -747 746 657 -448
1310 -448 -604 109 731 279 -964 -358 1175 211 -1102 -119 823 283 -483 -624 336 883 -373 -1103 465
1329 465 1039 -528 -829 308 648 25 -673 -427 777 540 -889 -634 976 457 -777 -395 462 570
1347 570 -124 -804 8 1021 39 -1139 120 1028 -105 -791 -80 527 496 -477 -729 660 836 -648
1365 -648 -759 580 663 -420 -554 93 573 219 -862 -338 939 305 -949 -234 760 321 -495 -414 225
$$ packed form
1238b40o35P05J008k89j491J30J839k00j886K54J642k15j138k16P91R30q87j354
1256a252J145J375j211j270J090J130p38q85rJ114M96j564o24J916L61j755j59
1273h40J254L27o61q23L47J391m15j766O98J650q82j107L73R43K08r05p74J188
1291B06R40j356r51J390Q44j184p00O06Q89j44j219o4J532P0j661N5J493q9j105
1310d48j56P13O22m52j243O06J533r64j313R83R42n40p66j41R60N47j256p30J568
1329D65N74j567l01J137L40o23o98K46J204k37j429K55J610n19j234L82Q57J08
1347E70o94o80Q12J013r82j178J259R08j133o86P11O07l1r73k52J389J76j484
1365f48j11J339Q3j083j34O47M80l54j081N24J277o34j254P15R94m39q16Q1O39
$$ plain form
1384 225 728 -148 -985 314 1063 -393 -797 341 573 46 -483 -370 604 629 -747 -622 798 491 -648
1403 -648 -401 464 471 -126 -648 -8 782 48 -906 -95 830 -1 -734 -130 497 383 -411 -633 432 796
1423 796 -540 -789 492 624 -368 -491 110 443 255 -628 -384 826 460 -883 -272 745 281 -419
1441 -419 -350 197 601 -116 -790 139 890 -153 -789 131 638 16 -463 -300 445 533 -572 -573 710 505
1461 505 -652 -395 380 310 -73 -467 -221 710 185 -861 -135 852 55 -691 -56 445 280 -281 -539 223
1481 223 721 -379 -761 332 657 -267 -575 128 466 157 -549 -310 605 377 -722 -324 609 216 -374
1500 -374 -301 135 483 25 -747 -2 931 -145 -820 228 608 -76 -285 -235 293 601 -340 -643 540 617
1520 617 -534 -527 403 432 -182 -407 -35 516 223 -620 -267 710 173 -592 -127 337 308 -187 -542 204 703
$$ packed form
1384B25N03q76q37J299P49j456m04J138K32n27n29J13R74K5j376J25J420l07j139
1403f48K47Q65Pn97n22O40P90p34r54Q11R25q31p33O04O27j14p94k22J065L64
1423G96j336k49J281J32r92j23O01L33j88q83K44J210l66j343O11J017m64p00
1441d19O9N47M04p17o74R29P51j043o36R20N07o22m79J63P45Q8j105jJ283k05
1461E05j157K57P75p0l83l94K46R31n25j046P26R87p97p46O35N01j65n61k58P62
1481B23M98j100l82J093L25r24l08P03L38l09p06K39R15k28j099L98R33l93n90
1500c74P3M36L48m58p72P45R33j076o75J048L80o84k09N0N28L08r41l03J183P7
1520F17j151PR30K9o14k25L72N51k93q43L53R77n37p65M65M64k9m95l55P46M99
$$ plain form
1541 703 -259 -798 374 577 -279 -386 139 298 294 -360 -442 514 506 -571 -407 641 300 -427 -218 203 346
1562 346 -53 -506 -89 654 98 -685 -80 549 57 -450 -187 305 425 -313 -596 420 538 -447 -395 360
1582 360 314 -84 -266 -223 421 366 -652 -318 763 177 -617 7 449 132 -133 -293 25 587 -27 -649
1602 -649 154 656 -102 -598 77 401 65 -366 -308 408 395 -476 -381 474 203 -324 -238 -19 354 158 -564
1623 -564 -173 700 75 -750 117 578 -65 -273 -97 134 294 -99 -574 210 669 -297 -575 326 500 -219
1643 -219 -301 -27 317 192 -407 -251 432 322 -421 -237 293 194 -151 -393 53 605 -94 -670 196 554 -250
1664 -250 -393 122 175 110 -151 -361 258 578 -435 -539 490 403 -430 -211 257 195 19 -215 -141 372 236
1685 236 -516 -146 548 91 -360 -204 198 317 -155 -407 245 464 -270 -398 229 266 -82 -162 -126 224 340
$$ packed form
1541G03r62n39J172K03q56j07N25J59mo54q2R56qj077J64J048l41p27K09M21J43
1562C46l99m53M17P43n56p83O05O29m92n07K63M92J20p38k83J016J18r85N2P55
1582C60m6l98j82M3O44n5j018L34J081n86p94O24M42l17k65j60L18N62o14o22
1602f49Q03N02p58m96O75L24l36m31N8P16j3q71R5Q55k71n27Q6K19L73j96p22
1623e64L91Q73o25q25Q67M61o43k08J76K31J60l93m75P84M59r66k78R01J74p19
1643b19q2K74L44j25n99J56O83j10p43J84N30r9l45k42M46N52o99n76Q66L58q04
1664b50j43N15N3o5k61k10O19L20j013j04J029q7q33K19M68o2j76k34P4N13j36
1685B36p52L70O94m57m51J56M02J19m72k52O52K19p34j28O27L7l48q0L6L50J16
$$ plain form
1706 340 -390 -373 555 240 -539 -119 466 53 -187 -101 6 235 192 -469 -112 582 34 -546 52 437 61
1727 61 -192 -211 259 308 -247 -314 279 322 -231 -227 151 189 151 -384 -240 515 204 -572 -24 555 -33 -262 44
1750 44 101 150 116 -353 -75 569 17 -581 146 514 -232 -307 114 161 96 -160 -271 218 315 -317 -275 262 271 -172
1774 -172 -221 32 404 44 -507 39 455 -134 -335 161 209 42 -31 -236 12 421 -83 -481 307 567 -351
1795 -351 -310 343 167 -79 -52 -134 152 353 -296 -299 400 249 -369 -173 259 201 -181 -315 98 393 -157 -378
1817 -378 163 164 -66 -109 -186 126 287 -192 -355 312 407 -456 -212 466 113 -238 -34 24 133 184 -237 -278 463
1840 463 218 -491 -45 398 18 -272 -56 146 156 -129 -297 148 254 -180 -254 39 239 102 -247 -181 290
1861 290 261 -430 -115 426 45 -287 -1 101 7 119 -156 -177 442 78 -537 69 479 -98 -247 126 154
$$ packed form
1706C40p30J7R28l15p79M20N85m13k40Q6J07K29m3o61L57O94n48n80N98L85l76
1727F1k53j9M70M9n55o7N93M3n53ML78L8l8n35J44P55l11p76N48N79n88k29L06
1750D4N7M9l4m69K78O44n52n98P27L68p46p5M21M7o5k56j11M89R7o32M2N37Rm43
1774a72m9K53L72l60n51N46M16n89k01M96M8j67p3k05K48M09n04l98P88K60r18
1795c51M1O53j76k46K7q2K86K01o49lO99j51o18J96M32n8l82j34M13K95n50k21
1817c78N41Jk30m3p7L12J61m79j63O67R5q63K44O78l53l51K04N8J09N1m21m1P41
1840D63k45p09M46M43l80k90K16K02J0k85j68M45J06m34p4K93K00j37l49O6M71
1861B90k9o91L15N41l81l32K86J02r4J12k75k1O19l64o15O06M10n77j49L73K8
$$ plain form
1882 154 62 -81 -258 59 276 -195 -235 152 244 -24 -242 26 289 40 -315 -57 383 2 -304 21 219
1903 219 -10 -25 -158 -36 298 14 -457 152 457 -225 -305 288 191 -93 -50 -71 49 209 -124 -332 261 241
1925 241 -261 -175 209 146 -125 -211 31 273 -97 -295 27 238 -68 -157 -47 26 239 -88 -338 148 351 -316
1947 -316 -292 331 114 -236 -36 85 56 143 -190 -236 303 240 -407 -182 319 64 -217 -66 121 127 -47 -304
1969 -304 19 249 -70 -197 12 159 80 -166 -209 161 241 -318 -210 341 120 -259 -121 109 24 58 -102 -138
1991 -138 283 195 -423 -88 418 -59 -342 93 116 25 -55 -143 29 262 -24 -277 52 258 -41 -233 37 145
2013 145 77 -214 -131 202 59 -265 -17 204 -18 -46 -98 -14 225 47 -326 -7 406 -71 -343 161 198 -126
2035 -126 -77 -23 -14 199 -33 -270 93 243 -154 -179 237 176 -56 -151 27 157 23 -225 -12 199 74 -159
$$ packed form
1882A54r2j43j77L17K17m71m0L87R2k68k18K68K63k49l55K58M40l81l06L25J98
1903B19k29j5j33J22L34k84m71O09L05o82q0N93r7k84M3k1J20J60l33k08N93k0
1925B41n02Q6L84o3k71q6K42K42l70j98L22K11l06q9J10P3K13l27k50M86K03o67
1947c16K4O23k17l50K00J21k9Q7l33m6N39o3o47K25N01k55k81J51J87Oj74k57
1969c04L23K30l19j27K09J47p9k46m3L70Q0n59J08N51k21l79J38K30q5L4j60l6
1991a38M21q8o18L35N06m77k83M35K3r1q0q8J72K33k86k53L29K06k99j92K70J08
2013A45o8k91Q3L33j43l24K48K21k22k8n2Q4K39j78l73L19M13m77k72N04L7l24
2035a26M9N4RK13k32k37L63J50l97k5M16o1k32r5J78J30j34k48K13K11j25k33
$$ plain form
2057 -159 -57 125 108 -94 -207 33 298 -74 -348 210 181 -192 -127 95 2 65 -10 -226 130 242 -281 -184
2079 -184 293 112 -185 -60 92 89 -9 -107 -12 212 -20 -192 -10 148 21 -135 -101 134 166 -71 -231 201
2101 201 152 -195 -130 128 12 -44 -6 -90 194 173 -218 -163 345 53 -274 10 145 -2 -18 -45 -32 173 11
2124 11 -203 -27 254 12 -123 -17 73 -26 -69 -121 143 178 -111 -176 201 157 -96 -41 14 58 53 -182 -74 306
2148 306 103 -297 65 161 -114 -64 31 45 93 31 -236 75 227 -123 -197 107 165 -46 -64 -2 73 90 -137 -137 165
2173 165 48 -205 -67 81 66 -10 -105 -12 178 -31 -271 61 158 -156 -125 129 64 -20 -59 -135 49 203 -114
2196 -114 -229 190 143 -181 -98 101 31 7 -92 -64 148 98 -178 -85 174 3 -139 -28 9 84 -24 -187 30
2219 30 195 -101 -211 84 9 -37 -55 -69 17 193 -172 -182 232 120 -286 -22 160 1 -28 -38 -25 187 78
$$ packed form
2057a59J02J82j7k02j13K40K65l72k74N58k9l73O5K22r3O3p5k16L56J12n23R7
2079a84M77j81k97J25J52lr8r8R5K24k32j72J82J58j27j56L4K35L2k37j60M32
2101B01m9l47O5K58j16n6L8q4K84k1l91N5N08k92l27K84J35j47j6k7J3K05j62
2124A1k14J76K81k42j35J06R0r9m3n2K64L5k89o5L77m4k53N5N5M4nk35J08L80
2148C06k03m00L62R6k75N0R5J4M8o2k67L11J52l50p4L04N8k11j8O2P5J7k27%L02
2173A65j17k53J38J48j5p6r5R3J90k09k40L32R7l14L1K54o5q4l9p6J84J54l17
2196a14j15M19m7l24Q3J99p0k4r9K8K12n0k76R3K59j71j42J11L7P5j08j63K17
2219C0J65k96j10K95p5m6j8j4Q6J76l65j0M14j12m06K64J82j59k9j0J3K12j09
$$ plain form
2242 78 -215 17 232 -31 -152 -2 89 27 -45 -104 131 183 -131 -147 101 72 -109 -11 20 41 80 -39 -130 193
2266 193 65 -218 6 190 -17 -115 1 18 27 50 -162 3 195 -47 -156 123 67 -90 -63 33 89 139 -123
2289 -123 -120 163 146 -166 -35 87 33 -41 -2 -73 139 83 -186 -8 198 -107 -154 81 47 -42 -5 -76 -9 174 -73
2314 -73 -168 95 169 -135 -66 72 -8 6 -78 -89 112 97 -142 -76 160 8 -108 4 34 92 42 -140 -4 146
2338 146 -43 -135 70 110 -54 -23 -4 -3 111 -46 -171 100 107 -135 -101 75 61 -69 -12 -70 104 92 -177 -19
2362 -19 198 31 -103 33 100 26 -75 -102 40 182 -28 -133 84 119 -77 -27 42 28 58 -5 -117 93 89 -137
2386 -137 -59 154 61 -104 -25 32 35 46 -98 -3 154 38 -101 36 151 -3 -55 43 28 116 -37 -92 84 147 -102
2411 -102 -62 110 4 -63 -67 -47 56 76 -151 -56 145 -60 -179 2 103 -23 -21 -26 -12 94 -28 -123 46 97 -30
$$ packed form
2242G8k93K32K15k63j21J50R1o2p2n9K35N2l14j6K48k9j81R8L1K1L9j19r1L23
2266A93j28k83K24J84k07r8J16J7RK3k12J65J92k42j09K79n6j57K7R6N6N0k62
2289a23LK83j7l12J31J22n4p4L9p1K12n6k69J78K06l05m7K35l4q9L7p1O7J83k47
2314g3r5K63P4l04O9J38q0J4q4j1K01j5k39O6K36j52j16J12L0N8n0j82J36J50
2338A46j89r2K05M0j64L1J9JJ14j57j25K71Pk42L4J76j4j30N7n8J74j2k69J58
2362a9K17j67j34J36O7p4j01k7J42J42k10j05K17L5j96N0O9j4L0o3j12K10mk26
2386a37P8K13r3j65P9N7LJ1j44R5J57j16j39J37J15j54n2R8j5Q8j53n5J76O3k49
2411a02M0J72j06o7mK0J03K0k27R5K01k05j19J81J01j26KnJ4J06j22r5J69N1j27
$$ plain form
2436 -30 -54 81 31 34 81 -7 81 98 -109 -87 121 70 -117 -1 45 7 67 -100 -52 142 -13 -149 10 108 -43
2461 -43 -42 27 -14 78 -32 -96 24 121 -101 -68 79 -9 -107 -46 -24 53 70 -87 -45 148 18 -119 -4 94 -12 -5
2487 -5 -24 6 57 31 -129 6 147 -130 -52 113 33 -20 -27 -32 21 84 -107 -138 146 32 -76 -4 10 -50 24 -41 -101
2514 -101 98 61 -127 -31 146 -48 -34 45 -1 13 40 -83 26 126 -59 -123 119 52 -66 15 -44 30 45 -74
2538 -74 -149 136 91 -82 10 145 18 -35 15 -24 35 31 -111 -2 99 -40 -124 55 58 -25 -16 -86 34 88 -82 -114
2564 -114 96 39 -109 34 15 -43 4 -58 -65 64 35 -122 0 156 -23 -101 28 11 -11 23 -34 35 121 -31 -129
2589 -129 78 77 -130 -56 21 -8 82 -21 -113 98 104 -106 21 110 36 25 27 -2 24 27 -148 -53 162 -21 -114 115 7
2616 7 -40 22 -43 -22 122 -20 -101 95 58 -104 -32 94 -37 -52 22 -35 56 63 -86 -76 138 22 -124 37 67 -15
$$ packed form
2436c0k4J35n0LM7q8Q8J7k07K2K08n1j87J16M6l8O0j67M8J94j55j36J59R8j51
2461d3JO9m1R2j10o4J20R7k22L3J47q8r8O1K2P7J7j57M2J93j30j37J15R8j06P
2487ej9L0N1k6j60J35J41k77P8J65q0n3pnN3O3j91l1K84j14j08P2J4o0P4o5o0
2514a01J99l7j88R6J77j94J4P9m6J4K7j23J09J00j85o4K42o7j18Q1n9P4J5j19
2538g4p5K85m5j73R2J35j27n3N0l9N9mj42J09J01j39q4J79Lq3Rp0J20N4j70l2
2564a14K10n7j48J43j9n8M7o2pJ29k9j57J22J56j79p8J29j7k2L4n7O9Q6j52r8
2589a29K07jk07P4P7k9R0j03r2K11Ok10J27Q9p4j1Kk9K6Lj75R5K15j83r3K29j08
2616Gm7O2o5K1J44j42q1J96l7j62P2J26j31j5P4n7R1Pj49J0K14j16j46J61L0q2
$$ plain form
2642 -15 31 -35 -16 160 66 -94 100 102 -50 -51 -9 12 78 4 -60 77 93 -128 -62 104 -11 2 8 -60 95 79 -66
2669 -66 -1 159 12 -164 10 37 -56 8 3 -52 33 -17 -69 47 132 -44 -91 96 32 23 33 -59 -24 71 -115 -15 87
2696 87 -3 -108 25 0 -18 -11 -48 -77 82 -1 -142 59 113 -75 -28 69 -48 -4 69 -98 -14 139 -98 -8 110
2721 110 -11 -105 17 -52 2 40 -25 -70 117 35 -124 0 104 -89 -1 41 28 96 49 -99 30 111 -93 -65 58
2746 58 19 -15 16 -52 2 51 -45 -107 106 -16 -75 -6 16 -43 47 -24 -40 43 35 -78 46 63 -69 -39 88 4 -17 22
2774 22 -53 46 83 -45 -63 75 5 -57 45 25 3 65 -31 -50 71 59 -62 14 34 -56 9 27 -8 86 21 -60 20 91
2802 91 -93 -42 32 12 -35 -31 -14 8 26 -37 -42 118 16 -73 -14 52 -6 34 8 -40 26 -14 -146 48 121 -40 -40 27 20
2831 20 -34 0 -38 1 130 -42 -60 61 3 -103 20 60 2 41 6 6 66 90 -61 -22 44 -24 -14 12 -31 16 41 -63
$$ packed form
2642a5M6o6J9J76r4j60J94Kj52jM2K1O6p4o4J37J6k21O6J66j15J3Oo8J55j6j45
2669f6O5J60j47j76J74K7r3O4nn5Q5n0n2J16Q5j76m7J87o4rJ0r2L5R5j86J00J02
2696H7r0j05J33k5j8Pl7k9J59q3j41K01N4j88M7R7j17M4P3j67Q4J53k37R0J18
2721A10j21r4J22o9N4L8o5m5J87q2j59J24J04j93Q8M2j3O8m7j48J29Q1k04K8J23
2746E8l9l4L1o8N4M9r6o2K13j22n9O9K2n9R0p1j6Q3qj13J24J7j32L0J27q4k1L9
2774B2p5R9L7j28j8J38p0o2J02k0k2O2r6j9J21j2j21P6K0r0O5J8l5R4o5q1Q0P1
2802I1j84N1P4k0m7MJ7K2J8o3nJ60j02q9N9O6n8M0k6m8O6m0j32J94P3j61%O7p
2831B0n4L4l8L9J29j72j8J21n8j06J23M0n8L9l5%O0K4j51L9O6o8J0K6m3M7K5j04
$$ plain form
2859 -63 -48 86 -10 -88 89 50 -35 6 -22 -33 23 -38 -88 85 70 -96 4 74 2 -17 -2 -65 3 17 -83 -79 107
2886 107 -37 -35 37 30 34 97 -41 -9 71 -42 -103 16 50 -66 7 16 -40 15 29 -88 7 98 -62 -8 95 -31 -67
2913 -67 -17 -51 24 37 -74 -62 101 -15 -93 58 59 -61 -32 -34 -65 52 36 -57 56 66 -56 19 44 35 -27 -60 -36 2
2941 2 65 -73 -80 94 48 -58 2 20 17 -4 13 -53 16 -14 -73 79 26 -71 -19 66 -37 1 24 -28 23 88 -37 -103 41
2970 41 32 -125 58 36 -23 21 38 -78 73 7 -58 14 38 -62 -34 46 6 30 27 -44 11 69 -53 -93 81 -15 -60 33
2998 33 15 -14 59 -30 -35 69 16 -91 42 65 -24 27 -6 -36 58 12 -34 -1 91 -72 -42 65 -33 0 59 -35 -29 42 -39
3027 -39 -76 53 23 -63 10 -10 -8 38 11 -50 15 68 -44 66 66 -12 -9 47 -51 -7 63 -37 23 71 -18 -70 107 9 -134
3056 -134 39 35 -63 44 -16 -33 56 63 -84 6 37 -51 37 -26 7 -9 71 -88 2 112 -65 -33 70 -50 -59 74 -17
$$ packed form
2859f3J5J34r6p8J77l9q5M1k8j1N6o1n0J73j5j66J00P0p2j9J5o3O8J4j00MJ86
2886A07j44KP2pMO3j38L2Q0j13o1J19L4j16P3Rn6N5J4j17R5R1j60N4J03j26l6
2913f7N0l4P5J3j11J2J63j16p8J51Jj20K9kl1J17j6r3J13J0j22P5K5ro2l3K4L8
2941BO3j38pJ74m6j06O0J8lk1J7o6O9l0n9J52n3r7N2Q5j03L8K3n2N1O5j25o6J44
2970D1rj57J83k2n9M4J7j16J51o6o5P2K4j00K8Q0m0K4lp1N5N8j22m0J74r6m5R3
2998C3j8k9P3q9nJ04n3j07J33K3q9N1l3l0R4m6m6L3R2j63L0J07r8L3N9r4OP1q1
3027c9l7J29l0q6P3k0KM6k7o1O5N3j12J10%p8LN6r8M4P0j00O0M8q9n2J77r8j43
3056a34J73mr8J07o0j7Q9Pj47R0L1q8Q8o3L3j6Q0j59R0J10j77L2J03j20rJ33r1
$$ plain form
3083 -17 -35 48 3 -51 51 23 -77 19 37 -40 8 6 -53 29 9 -50 -6 34 -31 -1 48 -2 -51 11 -73 -45 70 2 -64
3112 -64 17 5 -83 -37 10 -23 20 -15 -59 57 42 -51 -11 75 -41 -25 14 -41 -7 101 -106 -6 56 8 -69 85 8
3139 8 -42 30 -10 -18 41 -3 -105 75 -2 -72 35 -4 7 8 25 -18 8 88 -77 -50 41 -36 -73 26 -3 -64 25 6 -13 93
3169 93 -24 -43 33 -15 -96 24 -26 -51 -12 -11 -85 7 131 -37 -9 73 -32 11 13 -7 -53 0 -56 -70 72 37 -63 55
3197 55 47 -47 -23 42 -72 -1 68 -76 14 64 -60 -30 66 -6 -44 -8 -5 -9 56 -56 -63 46 -46 -37 63 54 -46 27 -8 -37
3227 -37 50 1 -101 3 27 -52 -16 38 -15 5 18 -7 -15 57 -43 -58 86 3 -19 48 -1 5 39 14 -70 47 44 -45 63
3256 63 5 -52 -16 14 -12 19 3 -36 42 103 -53 -59 71 -12 -91 22 -18 28 26 -39 -71 45 21 -91 5 -7 -19 5 8
3285 8 -73 77 39 -57 -8 65 -33 -34 17 -31 -41 -30 -66 25 75 -40 -45 73 -18 -44 -14 -4 14 64 6 -64 -13 37 -62 -14
$$ packed form
3083a7j8Q3m5n4J02k8j00R6J8p7M8kn9Q2k0n9M4M0o5L0M9n0m9O2q4K8J15o8o6
3112f4Q1j2q8M6M7l3M3l5m4J16j5r3M0Q6j16J6L9n5L4J08k07J00O2m8p7J54p7
3139Hn0P2m0qN9m4j02J80p7p0J07l9J1JJ7m3K6Q0j65K7R1p7l7R9k9o1Q9j9j9J06
3169I3j17j9P6m8q1J20n0k5L9Jp4R2J24j68K8Q2j05M3Kk0m6N3n6j4J42l5j00J18
3197E5qr4K4O5j14P1O9j44R0N0j24L0R6p2l8L6LmO5j12pJ09r2RJ00rj00P3l5k9
3227c7Q7m9j02J04K4p9L6N4n3K0J3k5qP2j00j5J44q3k2O7m9OL4k5q4J17lq9J08
3256F3n8n7L6L0k6L1j6l9P8O1j56oJ30q3p9J13m0M6ko5l2J16k4j12R6j2j2K4L
3285Hq1J50l8r6M9P3r8jN1m8j0J1l6R1N0j15nJ18r1k6L0J0J8N0n8p0N1N0r9M8
$$ plain form
3315 -14 0 -83 -29 38 15 70 41 -73 -13 70 -3 -81 14 -13 2 -25 -25 -49 79 -19 -55 44 19 -63 20 12 -25 -33 -29 -5 -7 34
3347 34 -71 -4 73 -9 -4 82 -58 -46 62 -26 -48 3 -18 -45 27 7 -54 -10 40 -31 -22 -25 -76 20 26 -50 -8 105 -35 -52
3377 -52 76 7 46 61 -9 -76 35 3 -55 50 17 -103 19 -14 -17 73 -47 -99 -6 35 -40 10 35 -15 -76 38 11
3404 11 1 20 -48 0 9 -2 -30 49 9 5 13 28 -7 74 -37 -30 78 -8 -27 -13 34 -23 0 18 -1 0 -47 -32 4 67 -48
3435 -48 1 11 -41 25 12 -49 -59 9 30 -63 32 60 -27 25 -2 -4 46 27 -54 -20 -36 -50 12 41 31 -22 19 -13 -5 52 -13
3466 -13 -37 48 -27 -36 4 -28 -66 47 -16 -37 34 -61 -71 51 11 -77 -33 11 -13 -10 39 -65 35 53 -5 -45 35 -53 -17
3495 -17 18 -25 -13 19 -11 -66 23 -8 -65 3 15 -47 45 22 -64 60 3 -58 -33 71 -29 -60 84 20 -40 11 -8 -1 -38
3524 -38 21 11 -3 26 -39 11 53 -67 12 58 -9 78 7 -34 20 51 -44 33 54 -40 61 34 17 -59 36 -59 -16 6 -24
$$ packed form
3315a4J4q3N4O7k3N5k9j14O0Q3p3p8R5k7J5k7%k4J28r8l6R9k5q2Q3ql7qMK4kM1
3347C4j05O7P7q2NQ6j40J2J08q8k2N1k1k7P2k0o1M4N0p1Rln1R6Op6M2J13j40j7
3377e2J28o9L9J5p0o7J11l2n8J05l3j20J22l3lR0j20n2R3M1p5N0K5n0o1J14k7
3404A1j0J9o8M8Rj1k8P9m0mQJ5l5Q1j11PJ08q6j9J4M7n7K3J8j9Jm7J5L6O3j15
3435d8M9J0n2O6j3o1j0O8K1r3R5K8q7N2k7kN0j9q1L4j6j4O2K9j0n3M1l2QN7o5
3466a3k4Q5p5rM0l2l8J13o3k1P1r5j0J22m0q8M4M4k4LM9j04J00J8n8m0Q0q8L6
3495a7L5m3J2L2l0n5Q9l1n7O8J2o2R2k3q6J24n7o1K5J04j00l1J44o4o0N1j9Pl7
3524c8N9j0j4K9o5N0M2j20P9M6o7Q7p1m1N4L1r5P7K1r4J01k7j7p6R5r5M3K2l0
$$ plain form
3553 -24 -12 33 25 -6 14 15 -71 41 1 -42 31 64 -21 -7 1 -14 28 39 26 -13 9 -56 -2 26 -7 9 64 -12 -1 42 -42
3584 -42 -33 57 -1 -38 6 30 -25 12 5 -63 2 -6 -39 -31 73 -11 0 12 14 -5 45 17 -37 15 -37 3 36 55 -34 -13 -6 -32 24
3617 24 52 -5 74 47 -99 -5 -23 -2 23 56 -59 -39 21 -25 16 80 -38 -36 16 75 -117 2 16 -23 4 -30 -75 -21
3645 -21 28 -36 -3 20 9 3 24 -21 2 2 -39 -30 49 -14 -50 37 -2 1 60 13 -52 37 18 -64 84 29 -89 48 33 -22 -51
3676 -51 -15 1 -1 50 -29 15 44 -66 -44 59 -4 16 -39 -40 -23 53 -15 -16 22 27 -9 11 -18 -23 10 22 -76 12 20 -59 35 25
3708 25 -22 -3 19 -38 0 76 -34 -33 -9 -51 23 77 -5 -29 44 5 -37 7 64 -59 4 29 -36 -3 38 -35 25 53 -24 23
3738 23 36 -81 -5 54 -38 -22 8 6 -31 21 -17 -22 37 -31 -74 -11 69 -30 -12 -5 -11 1 14 -40 -2 26 -30 -58 -28 -7 -38 -5
3770 -5 -33 39 -40 35 -30 34 45 -28 6 12 27 23 -15 -19 -20 -19 -26 41 53 -58 5 32 -37 -5 -3 -32 12 78 33 -77 26 3 14
$$ packed form
3553b4J2M5ql1K0Jq6J12m0m3P3L3q5J4Qj5M2J1j3l9K2o5N4K8l3J6N5p6J1M3q4
3584d2RR0n8l7M4K4n5L7po8O5ql3QJ04q4J1J2Kj9N0k8n4N2n2M0L3J9q9K1Pk6N6
3617B4K8n7P9k7j46R4j8K1K5L3j15K0O0m6M1O4j18KN2N9j92J19J4l9K7l4m5N4
3645b1M9o4L3K3j1oK1m5K3%m1RP9o3l6Q7l9LN9m7o5Q9j9q2J48n5j18J37j5n5k9
3676e1L6J6kN1p9M4K9j10K2J03o3K0n5jJ7P6o8jL8Nl6K0k9nL3J2r8Q8Qp9R4j0
3708B5m7J9K2n7L8P6j10JK4m2P4N4q2k4P3l9m2M4N7j23O3K5o5L3M1p3O0K8p7M7
3738B3J3j17P6N9r2J6L0kl7N2l8nN9o8m3O3Q0r9J8PoJ2J3n4L8K8n6k8L0K1l1L3
3770ek8P2p9P5o5O4J1p3L4OJ5ml8mjJpO7J2j11O3K7o9L2Kk9M4O6m5j10J03k3J1
$$ plain form
3803 14 11 -69 -47 -1 66 -24 33 56 -3 -34 48 13 0 6 -2 -41 60 -5 -5 55 -12 11 52 -27 14 38 -3 -74 17 -39 -41 60
3835 60 -2 -57 35 32 -4 32 47 -43 -4 36 -5 12 15 13 -60 59 8 -23 30 -9 26 50 -41 -43 46 22 -16 27 6 -24 73 42
3867 42 -61 41 40 -56 -64 35 8 -20 -17 -19 -43 13 -20 -93 28 -25 -40 38 20 -61 21 -2 -24 34 -24 -13 39 7 14 -13 39
3898 39 26 -17 22 -24 -4 17 -57 16 26 -103 -28 63 -39 -32 47 -20 -33 -68 -24 -3 3 49 -70 -20 54 -28 24 22 -54 -5
3928 -5 68 -21 6 33 23 -7 56 6 -58 72 -22 19 32 -19 33 16 17 -52 -4 32 -18 38 35 -70 3 35 -30 -37 18 -44 -19
3959 -19 37 -72 28 24 -24 -89 -6 34 6 42 -43 -22 1 1 -23 36 -50 -22 7 9 -68 -23 -21 -16 -29 -9 -17 -26 43 -3 -52 8 -50
3992 -50 -80 36 -42 -62 59 -33 -69 59 31 -41 41 15 -42 31 6 13 -20 22 -48 -4 38 5 -24 28 15 5 30 -2 -14
4021 -14 25 -24 -69 -4 9 -39 26 27 -26 21 16 -30 36 2 -95 22 22 -66 35 7 -34 -27 31 -34 -14 68 -31 -11 53 12 -48
$$ packed form
3803A4lq0K2M6O7r0N7K3n9l1Q2l5j3Oql9J01o5%O0o7K3M1p9M1K4m1p1R1n6kJ01
3835F0o2n5R2ll6L6J5r0L9M0m1J7Lkp3J19n1l1N3l9L5K4r1kQ9k4l8M3k1l0R7l1
3867D2j03J02jr6qR9k7k8Lkk4N6l3p3J21n3j5P8j8q1Q2k3k2N8n8J1N2l2Pk7N2
3898C9j3m3L9m6K0K1p4P3J0j29P5R1j02PP9o7j3l5M4K1OM6j19N0P4q2N2kp6M9
3928eP3q9K7K7j0l0O3n0o4J30r4M1J3n1N2j7Jo9M8L6n0N6lj05P3L2o5pN5o2K5
3959a9N6j09J00mm8o5Q3M0k8L6q5K1K3%k4N9q6K8K9Kp7M5KNj3K0qrO9m6m9O0n8
3992e0l0J16p8k0J21r2l6J28k8p2Q2k6n7P3k5Pl3M2p0M4M2l3k9N2j3j0K5l2j2
4021a4L9m9m5O5J3m8O5Jn3M7nm6O6l4r7J17%q8J01k8m1PN8o5K0Q2r9K0O4m1o0
$$ plain form
4052 -48 53 -29 -54 17 -26 -49 8 2 5 4 14 -22 16 -11 -54 4 27 1 16 27 -67 -23 -3 9 -8 -32 -36 -49 3 48 9 16
4084 16 -3 -48 -13 -28 20 -2 13 -98 -11 -9 -50 -20 7 1 10 27 16 -30 54 -14 -7 -4 -88 -20 32 -43 -78 -24 13 40 -11 24
4116 24 -37 12 23 -21 -29 32 4 -31 58 -29 16 39 4 -11 6 -63 11 35 4 5 10 11 -44 24 16 -6 7 -17 7 39 26 -36 15
4149 15 16 2 15 -14 -44 -31 39 -60 -39 30 -4 -1 -13 17 -20 57 1 -43 72 13 -63 10 -33 -96 -15 12 11 -4 32 -35 -11
4180 -11 29 -61 -16 30 21 -44 -12 -3 -3 32 0 -45 37 21 -111 -8 8 -40 -22 28 -40 24 38 -72 -34 43 -43 -1 81 -16
4210 -16 -37 -27 23 -26 6 -11 -52 25 6 -3 6 2 3 60 -14 -1 16 45 -37 -29 27 3 11 59 -14 -14 12 -7 -35 9 -33 -41 -8 4
4244 4 -26 2 27 -26 -4 17 -93 4 -51 -7 5 14 -24 37 -12 -20 -39 59 -50 -12 10 -53 -29 58 -32 -12 10 13 -14 45 18
4275 18 -79 5 15 -52 -22 39 -35 11 18 -36 -43 29 14 -50 28 -5 -24 -15 10 2 -6 -49 -10 -41 -59 -24 29 -44 -4 -3 -11 -55 -19 70
$$ packed form
4052d8J01q2k5P1m3k3N7oLjJ0l6L8k7m3N8K3k6J5J1r4M4K0J2j7k4mj3N2M5l9P
4084A6j9m5L5j5M8k2J5j11Q7Km1L0K7oRJ7j1m6Q4o8PLq4O8N2p5l5N4L7K7n1L5
4116B4o1M9J1m4qO1k8l5Q9q7M5K3l5j5J7o9P4K4l1JNJn5O8qk2J3k4K4L2j3o2N1
4149A5Jj4J3k9l0J3P0r9K1O9l4Lj2L0l7P7n6m4J15n9p6P3m3o3Q1K7jj5L6o7K4
4180a1M0r0M5M6ro5L2R%L5l2m5Q2j6j32J03J6m8J8N0o8O4J4j10L8P7q6M2Q2r7
4210a6k1J0N0m9L2j7m1P7j9rRmJN7p4J3J7K9q2QN6k4QM8p3%K6j9k8M4m2qL3J2
4244Dl0K8K5n3K2K1j10R7n5M4J2Rl8O1m9qj9R8j09L8K2o3K4Q7r0K0K2Lk7N9k7
4275A8r7Q4J0o7L0O1p4M6Pn4pP2j5o4P8l3j9RK5qqm3L9l1j8L5N3p3M0Jqm4L6Q9
$$ plain form
4309 70 -34 -27 -34 -81 -41 3 -50 -16 -4 -27 -8 -31 -40 -27 51 -65 -46 -23 4 -9 -28 24 -18 -19 16 -32 52 8 -38 89 -26
4340 -26 -2 -26 -31 -24 17 33 -25 5 5 28 -5 2 -12 -31 10 20 3 -9 -13 -14 57 53 -18 26 -26 -46 27 -21 -81 6 2 -38 -58 36
4374 36 18 32 14 -47 -5 54 -10 -36 53 -20 -60 36 8 -5 -9 20 -37 -53 48 -18 -4 -28 -104 -2 12 -37 -15 32 22 -5
4404 -5 24 20 30 14 18 -40 51 -23 -38 4 1 -12 28 -7 17 30 35 -61 -23 21 0 60 -35 -47 31 68 -34 -19 106 -35 -60
4435 -60 44 -41 -6 14 -9 -23 31 8 -52 -35 59 -28 0 -13 -48 27 0 4 2 28 -7 -81 -6 -31 -24 -16 -16 21 44 -1 -31 -17
4467 -17 39 -41 -28 33 -43 57 4 3 11 25 -20 -15 74 -44 -82 25 25 8 -21 -24 -45 70 34 -23 24 37 -39 22 21 -28 13
4498 13 23 -74 21 -11 -20 -22 -31 -45 -1 30 -84 -4 -6 -46 32 45 3 -19 18 -28 -16 -11 35 -25 27 -5 -44 43 -20 -46 8 27
4530 27 -55 -13 17 -45 21 -39 12 33 27 -55 -18 26 -23 38 54 -27 13 125 5 -4 0 0 3 14 -40 -27 20 -16 -50 26 -15 -51
$$ packed form
4309G0j04Ppm7M0M4n3L4J2k3J9k3rJ3P8j16J9K3K7j3j9N2m2jL5m8Q4m4m6J27j15
4340b6K4k4nPM1J6n8L0%K3l3Pj4j9M1J0j7j2mjP1mp1M4n2k0P3m8o0Q7mm0k0R4
4374C6j8J4j8o1M2N9o4k6Q9p3m0R6k8j3mK9n7j6J01o6J4k4p6J02J4m9K2M7j0k7
4404eK9mJ0j6Mn8R1p4j5M2lj3M0l5K4J3Nr6L8M4k1O0r5j2P8L7j02J5J25j41k5
4435f0J04q5L5K0k3j4N4k3o0J7R4q7K8j3l5P5k7MkK6l5p4P5k5PQ%L7K3m5l0J4
4467a7N6q0J3O1p6J00n3jQJ4m5NQ9j18l8J07%j7k9lk1J15l6n7M7J3p6O1jm9M1
4498A3J0r7R5l2rkrj4M4L1j14Q0km0P8J3m2k2L7m6J2NM6o0N2l2l9Q7o3k6N4J9
4530B7q2M2L0o2O6o0N1K1oq2L7M4m9O1J6q1M0J12j20rM%LJ1n4J3M7l6l4P6m1l6
$$ plain form
4562 -51 -28 24 -37 -42 -14 -12 -23 1 -39 -10 11 36 -14 11 0 -42 9 48 23 51 4 -37 40 54 -8 13 34 4 37 -13 -55
4593 -55 -23 23 -50 54 51 -30 14 41 -65 -26 26 -24 -66 44 22 -40 62 -15 -34 -41 3 -49 42 -9 2 49 -10 -50 -25
4622 -25 -2 -73 21 65 -43 -19 6 -37 -6 25 -6 -9 0 3 -16 33 25 -1 -14 36 -26 -10 -33 -57 24 13 -44 -24 18 5 -16 6
4654 6 -33 -3 62 13 -30 45 -9 -45 22 38 1 5 -9 7 -6 18 -46 13 43 18 -34 51 -23 7 -12 -15 -26 -5 51 35 19 -6
4686 -6 -26 -9 0 -12 31 -39 -24 -48 88 -16 -35 -15 9 13 30 -33 21 17 21 -28 46 -23 34 43 -69 5 22 29 -11 5 20 -26
4718 -26 -40 15 -6 -14 51 -38 -11 49 -13 -16 -21 7 -9 -35 -4 -45 82 13 -13 52 -15 -16 42 -21 -43 68 25 7 0 -40 45 -2
4750 -2 -12 39 42 7 -47 -15 6 -12 0 -5 1 12 -4 -4 -37 14 -5 -14 38 16 7 22 22 -50 -10 -19 -10 57 38 28 -21 16 -34 9 57
4785 57 -9 29 12 21 27 51 -34 -20 22 -12 27 18 21 -12 7 -26 -12 12 37 -37 12 30 -20 -38 12 -42 -8 -8 -4 48 5 26 -92
$$ packed form
4562e1K3N2o1nK8Kj1K4m0K9K1K5n0K5j1m2N1L9k5K8m7m1P7J4o2K1K1l0L3n0m2
4593e5L2M6p3J04lq1M4K7j06L9N2n0m2J10k2o2J02p7j9pM4n2R1n1J1M7n9m0K5
4622b5K3p1R4M4j08K4K5m3L1L1l1lRLj9M9qk6j3N0o2J6k3k4Q1j1n7K0M2j3k1K2
4654Fl9L0O5m9m3P5n4l6O7J6l7Mj4J6j3K4o4N9L0k5n2Q5p4L0j9lj1K1N6j6j6k5
4686fk0J7Rj2M3p0J5k4J36j04j9K0K4MJ7o3N4mMm9P4o9N7Rj12P4J7Pm0J6J5m6
4718b6j4N5k1qO5q9K7O0o2lnK8j6k6L1m1J27o9k6O5o7jN8o3k2J11m3j8pm0Q5m7
4750bj0N1Ll5n4L2K1j8J2nOJ1j6%l3N1j9rN2k2rJ5%p2M0rRO7j9j0m9L7n0M3M8
4785E7o6L8j7ROK4q5J4M2l4L9rLl3J9l3J4K4K5p4M9J8n0j8N0n4L4%MN2m3K1j18
$$ plain form
4818 -92 42 11 -7 48 -13 20 -10 -13 -40 64 13 29 11 -55 -60 4 44 -38 -12 28 0 68 15 -15 -16 19 1 -3 21 58 34
4849 34 -4 8 -8 39 -2 -11 32 -1 -53 44 -30 -24 -6 -38 -28 21 1 -25 57 12 6 -17 9 -81 2 66 3 -59 -13 11 -13 60
4881 60 -21 -8 26 -4 -58 15 -27 -64 -1 -42 39 48 59 -6 -5 62 -1 -37 64 -7 36 -54 -44 -3 -8 24 -7 -33 7 -44 15
4912 15 4 -28 -39 5 -32 8 10 -9 6 -5 -8 -34 16 22 -13 20 -9 -27 17 -13 -22 14 6 -16 41 50 16 51 78 22 13 82 21 -22
4946 -22 33 -43 -18 13 51 11 11 4 1 4 2 26 -16 14 -51 -10 13 -25 23 0 -45 3 -26 -13 2 -2 -7 58 -5 13 -21 30 -40 -16
4980 -16 55 1 24 11 43 -34 45 15 -7 22 35 -34 26 -2 -68 -24 38 -11 37 -6 -53 25 -38 11 12 0 -13 11 9 -12 -26
5011 -26 21 13 -43 55 20 -50 39 -5 -33 15 -16 -10 -7 44 -15 -23 -27 -73 10 -8 -10 0 67 -51 -4 -39 44 -58 38 -1 -32 14
5043 14 -22 -46 -10 33 35 34 0 -22 38 28 -12 14 -12 -25 1 18 5 39 30 11 -11 59 -41 -14 39 -6 1 -1 4 3 16 6 36
$$ packed form
4818i2J34l1j8N5o1L3l0lk7J04n1J6j8o6nO4M0q2K6M0k8O8n3l0jL5j8mK4L7k4
4849C4l8J2j6M7m1rM3l3n2R7p4OJ8l2J0M9k0k6Q2m5ok3K6r0Q3O4o3o2M6K4k4P3
4881F0q1J3L4l0n4P3m2l7O3m1Q1RJ1o5JO7o3l6J01p1M3r0J0M1nL2l1k6M0n1N9
4912A5j1l2j1M4l7M0Kj9J5j1lk6N0Ol5L3k9j8M4l0rL6qk2N7Rl4L5K7n6rO9o1m3
4946b2N5p6K5L1L8m0%plLkK4m2L0o5M1K3l8M8k3m5M8k9J3J5mnO5o3J8l4N1p0K4
4980a6P1n4K3j3L2p7P9l0k2K9J3o9O0k8o6M4O2m9M8m3m7P8o3M9Jj2j3K4kk1j4
5011b6M7qn6R8l5p0Q9m4k8M8l1OLN1n9qmm6Q3j8kJ0O7j18M7l5Q3j02R6l9l1M6
5043A4l6k4L6M3Kjl4k2O0j0m0K6k6j3K6J7j3L4rj9k2P0j00K7N3m5PkNjJ3j0L0
$$ plain form
5076 36 62 41 -4 21 -3 -27 -17 10 -10 32 -7 -49 17 -8 -28 -32 -11 -14 -35 21 -41 12 9 -15 46 -41 -15 8 -8 46 -7 93
5108 93 8 14 12 19 21 3 -22 -33 45 19 -39 2 11 20 4 65 -18 -38 6 -40 -9 9 -32 -27 52 1 12 62 -33 11 -55 9 -46 42
5142 42 81 9 24 -23 -9 1 -24 -8 25 29 6 2 13 -7 -5 30 12 -30 -11 -5 -5 11 -2 -66 3 51 -61 56 -14 -8 21 2
5174 2 65 23 33 -2 -38 42 -1 10 11 -1 13 -14 -5 -34 -38 -21 -38 19 -23 -10 13 57 -20 16 -10 -11 1 31 -46 -11 44 -40 -48
5207 -48 -4 -3 14 44 -41 5 -32 -8 -45 16 -24 -33 43 12 28 48 15 -5 -7 12 -55 27 37 -8 21 3 13 -20 37 7 -1 58
5239 58 12 -37 -6 -22 2 28 -26 -68 66 -24 -45 44 62 -64 15 -60 -1 -14 47 1 19 5 -15 -54 36 49 6 5 -26 25
5269 25 59 45 -56 27 -18 -25 7 5 34 40 68 -42 -9 33 50 8 36 -9 -47 -25 -33 -10 7 -40 7 18 -23 -7 29 -9 -36
5300 -36 -8 9 7 8 24 -45 -34 1 21 9 55 -22 19 -7 -2 30 -9 6 20 13 -33 -62 -2 -31 -2 31 29 -33 -5 28 19 -21 -16 -17
$$ packed form
5076C6K6k1m5K5k4k4J0K7k0M2l9m2O6k5k0mK1lk1N6o2N3lk4O1q7K6K3j6N4n3J00
5108I3q5OkPKj8k5j1P8k6n8M1RRj6O1q3k0M4m6L1J8m1NP9n1J1N0r5M4o6O4n5Q8
5142D2L9p2J5m7J4J0k5J6L3Mk3mJ1k0KL5j8m2J9O%J6j3o4O9M8j12J17p0OK9j9
5174BO3m2J0l5l6Q0m3J1Jj2J4k7Rk9mJ7j7N7m2J3K3M4p7L6k6jJ2L0p7L5N5q4q
5207d8M4JJ7L0q5M6l7K4l7O1m0rP6l1J6K0l3k0kJ9o7Q2J0m5K9j8J0l3N7l0qN9
5239E8m6m9L1j6K4K6n4m2J34r0k1Q9J8j26P9p5N9j3O1m6J8j4k0l9R0J3m3jl1N1
5269B5L4j4j01Q3m5pL2kK9OK8j10L3M2J7m2K8m5l8K2qK3J7m7M7J1m1J6L6l8k7
5300c6K8J7kJJ6o9J1L5K0j2M6p7M1k6NL2l9J5J4pm6k9O0k9K9L3ko2K8L3rm0Nj
$$ plain form
5334 -17 21 40 -41 12 44 9 -37 -7 -1 -22 15 31 3 -24 -4 14 33 -18 3 20 -30 -1 44 -25 -113 -19 -21 -43 -29 56 -4
5365 -4 34 1 -51 45 -24 20 70 -6 8 -19 8 -38 -43 6 -33 -20 -3 -6 -15 42 -9 32 2 -44 -62 16 26 -50 4 14 19 -17 40
5398 40 1 -15 -54 -16 -52 -14 23 -13 75 -4 3 26 8 -30 54 -1 -29 -11 15 -24 47 -24 -6 7 22 -26 -32 -44 -12 44 18
5429 18 -11 37 29 -29 -5 -10 19 -39 9 25 -30 -4 -2 -33 1 48 -9 -46 20 -40 -6 7 -34 -28 37 6 -12 -16 -8 3 6 -26 33 3
5463 3 -42 2 -38 4 -30 45 7 -36 42 -14 -28 56 26 -24 6 33 3 -3 31 21 -7 -1 29 -18 8 27 -17 4 13 14 51 -66
5495 -66 -17 30 17 -75 -9 11 -32 17 16 -1 -55 14 -37 16 39 -9 -38 33 -32 -2 5 23 11 0 20 -62 7 -4 -10 29 -44 -3
5527 -3 13 60 -20 -11 -6 -14 -19 0 0 2 -18 -27 -7 -13 -24 22 -15 7 -37 -33 18 -28 -7 7 8 1 -9 -50 -3 18 22 67 -23 -26 -6 -20 32
5564 32 38 38 -8 66 39 -9 25 7 18 -63 50 -32 -17 -24 -27 -30 48 -23 -59 23 -14 8 -10 15 -35 52 -9 32 39 18 31 -36 17
$$ packed form
5334a7L8J9q1N3L2l5m6L0Ok1L7J6k8k7K0J8J9n1K1J7n0K9M5o9q8R4kk2J4Q5o0
5365dL8l3n2R6o9M4N0p6J4k7K7m6nM9l9J3J7lrN7n1M1l0m6j8P8J0p6N4J0Nl6N7
5398D0l9j6l9L8l6L8L7l6Q8p9PK3j8l8Q4n5k8J8K6l9P1p1J8J3J5m8oj2L2N6k6
5429A8k9M8qn8K4nK9n8M8J6n5K6Kl1L4M7n7l7O6o0L4J3m1OO5l1j8mQJ1Ll2N9l0
5463Cm5M4m0M2l4P5l8m3P8n6j4Q4l0n0L0K7l0oL4j0k8OL0m7K6J9m4K1RJL7j17
5495f6M9M7j3r2O6K0m3M9jj7n4O9n1N3K3m8k9P1o5L0PJ8j2j1K0q2O9j1oL9p3M1
5527cJ6M7q0RNqnJ9%Kk0rK0oj1M6l7K2m4MN1m6K1J4Jpj0m1M7K1MM5r0lK0j4N2
5564C2O%m6P4k7m8L4j8J1q1J13q2J5pllP8p1l6Q2l7K2j8K5n0Q7o1M1Pk1J3o7N3
$$ plain form
5597 17 -34 -57 36 11 24 3 -22 14 -6 -2 25 -28 3 -19 -23 11 -14 -10 14 33 -52 45 9 33 -15 1 -27 -18 14 -8 -6 -31 -40
5630 -40 60 61 7 -6 33 8 13 15 41 -19 35 21 18 45 -36 -38 -26 -10 -12 -37 -33 -24 14 29 -9 18 15 -7 35 -32 12 29 17 -38
5664 -38 -1 31 51 14 17 -67 -10 -31 23 10 53 -12 -15 22 21 12 5 -14 -29 -8 11 9 -3 -46 -4 -43 1 2 45 7 8 33 35 -14 17
5699 17 -16 0 58 -1 39 16 5 30 -9 -13 -16 -15 -4 25 -8 -3 -21 -19 -43 5 -16 -26 45 9 -3 0 19 -68 8 -20 -6 6 -15
5732 -15 -7 3 -3 -23 31 -3 1 7 -16 11 -2 -4 -20 3 31 -17 0 -33 -28 73 40 64 -36 11 -17 -47 -35 37 3 -22 -14 9 59
5765 59 -28 -41 7 -20 23 -4 -40 12 6 48 -88 20 11 -58 4 53 -2 61 30 -16 36 38 10 -25 -20 13 32 25 1 25 11 36
5797 36 -42 -11 -22 -49 -33 10 -11 -24 33 41 2 -16 -34 -18 24 -4 17 28 -44 -32 12 16 -4 40 7 -3 -20 41 25 10 -36
5828 -36 -14 -2 9 -16 -2 -21 -27 -7 37 -14 7 3 -20 -17 -17 16 -11 42 -1 -21 0 -30 9 1 30 29 52 13 -23 4 -1 -10 -4 10 11
$$ packed form
5597A7n1k3R3k5J3k1k5L6k0MK7n3L1k2mL4k5MK4J9q5R7l6K4m8J6k8RL2k2Kk5r
5630d0J00Jn4j3L9k5NKK6o0N4j4lK7q1kJ2J6kk5MRL8J5l8K7lk2M2o7M4J7j2n5
5664c8L7L2K0l7Lq4N7k1N4j3M3o5lL7jrpj9j5K1J9kj2m3M2l9M4JM3l8JK5Km9L1
5699A7l3J6N8n9M0k3j1K5l9mlJJ1K9l3Nj8Kk4M8k1j0P1l6j2LJ9q7P6k8J4J2k1
5732a5QJ0ok0N4l4MOk3K7j3kj6K3K8m8J7l3NJ01l3K4j00M7k8l0J2P2l4k5QK3N0
5765E9q7j3M8k7M3k7l6N2oM2j36J08ro9O2M9n5O3l1m6N2Kk8l5NL3J9pk4K4j4K5
5797C6p8L1j1k7J6M3k1j3N7Ql9j8j8J6M2k8K1J1p2J2M4Mk0M4l3j0j7O1j6j5m6
5828c6K2J2J1k5J4j9oK0M4n1K1mk3L%L3k7N3m3k0K1l0L9qK9jK3l9l6K7nrOJ4J
$$ plain form
5863 11 -40 -52 -26 -13 6 -13 27 42 -31 11 58 -22 -23 41 -2 35 -8 -10 -22 -2 67 -42 -13 39 -32 13 45 -33 -29 7 -40
5894 -40 -33 13 -30 14 -30 13 41 -4 34 -24 -8 -8 19 -28 -15 -59 -35 60 30 25 21 4 -3 -3 25 53 -21 -16 -2 2 -38 16 24 -16 -1
5929 -1 14 21 -24 49 9 -31 -40 21 -34 6 -1 -27 49 7 -8 5 48 -57 35 -14 11 62 1 12 -6 29 10 33 -20 -8 19 -13
5961 -13 -47 -25 -30 60 54 -1 -11 6 -20 -24 -51 9 -5 24 -40 36 -45 3 25 -33 -1 32 -43 41 4 -8 46 -36 -5 -54 44 -14
5993 -14 16 -9 33 -30 46 4 -5 39 40 -4 -10 24 5 15 61 -37 0 19 -12 53 1 59 70 70 41 14 27 7 -16 -16 -44 -6 19
6026 19 -20 17 16 4 27 18 18 6 -6 -26 -24 24 13 -64 37 7 -11 -22 57 -65 -20 14 -8 -12 -38 14 -79 -15 20 -15 3 12
6058 12 10 -18 -9 31 25 1 -51 -32 27 -56 16 15 -33 11 16 6 -67 66 11 1 -40 48 -46 -16 -14 -52 -56 6 -35 -6 23 -41 26
6091 26 -26 -20 -49 66 24 -4 -15 -3 -22 8 28 8 34 9 -36 12 10 19 13 20 -6 42 28 -26 46 8 0 39 26 -56 22 -7 -21
$$ packed form
5863A1n1j2K6J3J9j9M0J5p3M2M7q0jO4m3L7m3kj2K0O9j09K9N2p1M5L2p8ML6m7
5894d0PM6m3M4m4M3K8m5L8n8J6%K7m7J3m4K4R5l0nmj7p%K8K8p4NJ4Mm0N4Qm0J5
5929aJ5Pm5P3m0m0rO1n5M0pk6P6m2j5J3M3j05R2m9K5N1o1J1j8L5j9K3n3J2K7l2
5961a3l4K2nR0on5j0J7k6mk7O0j4K9o4P6q1M8K2n8L2L3p5Q4l7j2N4q2L1m9R8n8
5993a4L0k5M2o3P6m2rM4Jm4oL4j9J0M6r8L7J9l1O5n2N8J1%k9k7J3k0k3%k8L8K5
6026A9l9L7jj2K3r%j2j2k0KM8j1p7J01l0j8j1P9j22M5L4k2mk6N2r3O4L5l5J8R
6058A2kk8RM0ok4n2J9N9q3P2jm8M4Nj0p3J33n5j0m1Q8r4L0Kl8mO2m1K9K9o4O7
6091B6n2Ok9J15m2k8j1J2j9L0K0k0K6k5m5M8kRoPk6M8j4n4P2l8qL9j3q2P8k9j4
$$ plain form
6124 -21 -55 -56 -32 21 44 0 36 57 13 5 -11 -19 25 41 6 -24 0 -40 6 -27 -7 6 -51 4 22 -10 45 1 19 44 4 -7
6156 -7 -7 18 -4 20 41 -27 64 21 -22 15 4 9 18 -33 -78 -48 53 -22 5 39 -38 -24 -3 -1 -8 -18 0 -41 -20 -23 -7 67 4
6189 4 28 -4 49 -12 -28 9 57 32 11 -26 28 39 -6 -1 -12 0 -14 51 -13 -5 -35 -49 -44 7 26 -25 11 -10 13 -21 -14 -35 17
6222 17 59 -5 -12 22 -3 -48 41 35 25 15 24 -1 43 1 5 46 -17 -35 -18 -8 -1 47 19 -23 6 -54 -28 6 65 -46 18 40
6254 40 -67 14 9 29 33 16 -25 -9 23 37 -2 15 7 5 -14 35 -49 42 27 -37 -23 -24 13 20 28 29 16 38 -69 15 -8 -5 17 6
6288 6 -36 -70 76 -64 -32 33 -1 -7 14 15 28 24 0 -13 -18 26 48 -37 -25 -7 38 15 26 -7 41 3 11 63 -23 5 -12 24
6320 24 25 57 58 37 56 15 -2 20 -3 21 5 15 -10 -7 16 -39 7 -9 -15 -15 -29 4 35 24 -22 -2 -24 -30 -22 26 -15 0 27 9
6354 9 -34 58 3 29 58 43 -19 -6 7 -2 16 -44 -1 22 15 12 6 54 21 -38 16 -13 7 9 -48 32 28 1 -45 51 11 -48 47 19
$$ packed form
6124b1l4jK4N3K3m4L6K1m4qj6qM4J6l5l0K4m0M6l3K0J3n7N5J8l2N5m4J8K5m0j1
6156g%K5k2K4K1o8R1m3m3L7j1NRn1m5L0J01p5K7L4p7J4K1Kpj0J8m1K1lJ6P4o3
6189DK4l2N3o1j6L7M8k5k1l7N4J1m5Nj1J2j4O5o4Ql0j4NN1J9n1L6k1K3l4Pk1N2
6222A7M2o4pL4k5m5Q9oj0j0Rk5M4m2MM1o3j8J7J0PM8k8m2K9o0K6L4N9j11O4K2
6254D0j07Q1nK0Mj7m1J6L2J4l9J7qkj9M9q4R1j5o4J4jL7PQJj3K2j07Q4k3LK2j1
6288Fm2l4J46j40L2O5l4oK1JJ3mk4j3nM4K2q5J2J8M5k3J1l3M8l8QN2q6K8j7L6
6320B4JL2Jk1J9m1j7K2k3K4j6J0k5LK3n5M6j6o%j4L3L1j1m6K0k2oQM8m1J5K7j8
6354Im3R2n5K6K9j5o2J3J3rJ8o0M3K3ploM8l3n9N4k9K0Kn7Q0mk7m6R6m0n9R5k8
$$ plain form
6388 19 -34 -3 58 -30 26 8 -23 -32 -12 -46 11 -35 -27 2 25 17 17 12 -19 11 11 28 -45 -19 -18 -31 12 18 -23 74 11 46 -22 -27 -46
6423 -46 -36 -66 -11 -3 -10 -7 39 56 -7 -41 28 -22 -7 15 20 50 31 -8 -16 64 -19 -2 -4 20 -37 43 4 -31 35 37 37 9 18 -21 41
6458 41 -16 31 -16 41 -25 -28 0 -31 12 5 -35 39 26 -32 -21 -1 16 -41 -12 21 5 -45 49 15 -43 -17 -52 22 -9 -85 -25
6489 -25 37 5 -10 50 14 -17 21 -51 -4 43 -41 -35 5 32 -57 -15 -19 5 -33 64 9 21 -6 32 1 1 -35 -51 -16 14 -24 64
6521 64 39 4 24 3 41 17 20 1 7 1 0 33 17 -18 32 26 -12 -28 3 4 -25 -4 29 11 2 5 -10 43 -15 -3 24 -7 -18 28
6555 28 23 49 16 35 -15 20 8 -1 35 73 -2 38 1 -42 24 7 -10 -51 -15 25 -40 53 -5 -17 37 -27 -25 3 22 19 -6 18
6587 18 -53 55 17 8 -71 26 20 12 12 -18 18 -23 19 -12 47 -4 -1 44 20 -18 58 -19 -32 -29 -8 -35 3 -6 35 27 -11 -27 46 -22
6621 -22 -7 -16 8 9 12 15 -21 -16 -16 -29 4 64 -12 -27 -34 -9 41 19 18 -8 -25 -38 -74 -29 14 -21 -29 36 25 -21 23 36 33 13 2
$$ packed form
6388A9n3L1O1q8N6j8l1rK0l4N7m6QK9K3q%nl1L0%J7p3K6Jj3M3Om1R7o3L5o8nj9
6423d6J0l0N5QpLM6J7o3l4O9n0J5K2NL0j9l9qQ0q3J7kK4n7Q0l9l5O6K%k8Rl9O2
6458D1n7M7m7N7o6lK8l1M3pm0P4j3n8J1K0J7n7K9L3j6n0R4l4n8K6l5P4l1p6O0
6489b5O2l2j5O0l6l1L8p2M7M7q4OM0K7q9M2mK4l8R7n5J2k7L8l1%l6j6L5L0l8Q8
6521F4k5l5K0k1L8k4Lj9OojL3j6l5N0ol8j6L1Jk9K1L3j8rLj5N3n8J2K7l1j1M6
6555B8nK6l3J9n0L5j2rL6L8p5M0l7m3O6j7j7m1L6M0o5R3n8j2N4o4KK8J9lk5K4
6587A8p1J08l8rp9R7oq%l0L6m1M2l1N9n1LM5k4l8P6p7j3LK1k7L8rM1ql8j6P3o8
6621b2J5rK4JLLl6N%j3L3O0p6j5pK5N0k2jk6j7j3l6M5M3l5qO5j1m6M4J3lk0j1
$$ plain form
6656 2 4 -8 5 -39 -42 -10 -16 6 60 -12 -52 25 -8 35 -13 5 -14 17 0 2 -9 58 10 12 0 1 -8 -47 -22 -3 -10 -39 28 -27 -19
6691 -19 10 -6 -16 33 -4 -15 25 -16 -55 7 -28 -19 -27 6 -25 -9 20 -34 27 -17 50 -44 11 -6 24 -8 -4 20 -22 33 -54 44
6723 44 33 14 -16 15 -13 -3 7 -64 -15 25 -12 54 11 -24 -12 -17 -1 7 -1 -28 -51 -13 15 -10 41 -26 0 61 7 -38 16 -5
6755 -5 35 19 8 40 -24 -16 -32 1 33 26 21 25 11 20 -65 -4 -18 -3 40 -20 -8 32 -15 1 19 1 27 17 -12 39 15 17 1 4
6789 4 2 1 12 -44 -20 51 22 19 3 29 0 0 3 44 54 6 -4 60 8 -34 15 1 21 16 41 16 -19 1 0 -14 -1 -47 3 13
6823 13 19 -18 -25 23 -49 48 46 15 40 -3 -35 -26 42 30 -32 36 -56 -3 -18 18 -40 24 -22 -25 -8 -31 7 19 38 15 44 49 14
$$ packed form
6656BKj2J3m4lL2oK2N4p2m0P7l3M3m8J8j9L1j7Kj1O7m8Kj2Jrl9K5J9pk9O7n5Q
6691a9K9j6j0M9l7j1M0m1l9O2l5RqL3l1J6K9n4O1m4O7r4N5j7L0l2MK4m2N5q7R8
6723D4j1j9l0L1k8J0J0p1M9M0l7O6m3l5J2nJ6Qqk7k3L8K8k5N1o7K6O1n4m5N4k1
6755eM0j6j1L2o4Qj6L3L2pnMj4Rq5O1j4J5M3o0J2M0m7J6J8j8K6j0k9N1k4Kj6L
6789DkjJ1n6K4P1k9lj6K6k9%LM1J0m8j0O4n2m2M9j4K0nK5k5l5K0jj4J3m6N0J0
6823A3Ol7pM8p2R7kl1K5m3l2RO8j2o2O8r2N3j5L6n8O4m6lJ7k3L8J2J9k3K9Nl5
$$ [...]
8191a4
##END NTUPLES=NMR FID
##END=
