##TITLE=1H_EC-3235x-Y
 DMSO, 8 sc, 
 20.10.2020
##JCAMPDX= 6.0         $$ Bruker NMR JCAMP-DX V2.0
##DATA TYPE= NMR FID
##DATA CLASS= NTUPLES
##ORIGIN= UXNMR, Bruker Analytische Messtechnik GmbH
##OWNER= root
$$ XWIN-NMR		Version 3.5
$$ Tue Oct 20 12:00:08 2020 Russian Standard Time (UT+4h)  she@DPX200
##.OBSERVE FREQUENCY= 200.1315066352
##.OBSERVE NUCLEUS= ^1H
##.DELAY= (6, 6)
##.ACQUISITION MODE= SIMULTANEOUS
##.ACQUISITION SCHEME= undefined
##.AVERAGES= 8
##.DIGITISER RES= 18
##SPECTROMETER/DATA SYSTEM= spect
##.PULSE SEQUENCE= zg30
##.SOLVENT NAME= DMSO
##.SHIFT REFERENCE= (INTERNAL, DMSO, 0, 15.7039)
##AUDIT TRAIL= $$ (NUMBER, WHEN, WHO, WHERE, WHAT)
$$ ##TITLE= Audit trail, XWIN-NMR		Version 3.5
$$ ##JCAMPDX= 5.01
$$ ##ORIGIN= Bruker BioSpin GmbH
$$ ##OWNER= she
$$ F:/spectra/data/she/nmr/H-F/1/audita.txt
$$ ##AUDIT TRAIL=  $$ (NUMBER, WHEN, WHO, WHERE, WHAT)
(   1,<2020-10-20 11:58:27.95 +0400>,<she>,<DPX200>,
      <created by zg, POWCHK disabled, PULCHK disabled
       configuration hash MD5:
       00 E9 B6 7A A2 85 ED C7 34 08 36 98 17 FE 4E 26
       data hash MD5: 16K
       C3 20 74 00 E8 BD 65 BB 47 82 91 AB 19 95 47 0C>)
$$ ##END=
$$ 
$$ hash MD5
$$ D5 3D 91 FA 58 AF A4 DA EA A8 E0 38 A6 6B 71 73
##$RELAX= 
##$RELAX= 
##$RELAX= 
##$RELAX= 
##$RELAX= 
##$RELAX= 
$$ Bruker specific parameters
$$ --------------------------
##$DU= <F:/spectra>
##$EXPNO= 1
##$NAME= <H-F>
##$PROCNO= 1
##$TYPE= <nmr>
##$USER= <she>
##$AMP= (0..31)
100 100 100 100 100 100 100 100 100 100 100 100 100 100 100 100 100 100 
100 100 100 100 100 100 100 100 100 100 100 100 100 100 
##$AQSEQ= 0
##$AQ_mod= 1
##$AUNM= <au_zg>
##$AUTOPOS= <>
##$BF1= 200.13
##$BF2= 200.13
##$BF3= 200.13
##$BF4= 200.13
##$BF5= 200.13
##$BF6= 200.13
##$BF7= 200.13
##$BF8= 200.13
##$BYTORDA= 1
##$CFDGTYP= 0
##$CFRGTYP= 5
##$CHEMSTR= <none>
##$CNST= (0..31)
1 1 145 1 1 1 1 1 1 1 1 1 1 1 1 1 1 1 1 1 1 1 1 1 1 1 1 1 1 1 1 1 
##$CPDPRG= <>
##$CPDPRG1= <>
##$CPDPRG2= <>
##$CPDPRG3= <>
##$CPDPRG4= <mlev>
##$CPDPRG5= <mlev>
##$CPDPRG6= <mlev>
##$CPDPRG7= <mlev>
##$CPDPRG8= <mlev>
##$CPDPRGB= <>
##$CPDPRGT= <>
##$D= (0..31)
0 1.2 0 0 0 0 0 0 0 0.06 0 0.03 0 0 0 0 0.0002 0 0 0 0 0 0 0 0 0 0 0 0 
0 0 0 
##$DATE= 1603180707
##$DBL= (0..7)
120 120 120 120 120 120 120 120 
##$DBP= (0..7)
150 150 150 150 150 150 150 150 
##$DBP07= 0
##$DBPNAM0= <>
##$DBPNAM1= <>
##$DBPNAM2= <>
##$DBPNAM3= <>
##$DBPNAM4= <>
##$DBPNAM5= <>
##$DBPNAM6= <>
##$DBPNAM7= <>
##$DBPOAL= (0..7)
0.5 0.5 0.5 0.5 0.5 0.5 0.5 0.5 
##$DBPOFFS= (0..7)
0 0 0 0 0 0 0 0 
##$DE= 6
##$DECBNUC= <off>
##$DECIM= 32
##$DECNUC= <off>
##$DECSTAT= 4
##$DIGMOD= 1
##$DIGTYP= 9
##$DL= (0..7)
0 120 120 120 120 120 120 120 
##$DP= (0..7)
150 150 150 150 150 150 150 150 
##$DP07= 0
##$DPNAME0= <>
##$DPNAME1= <>
##$DPNAME2= <>
##$DPNAME3= <>
##$DPNAME4= <>
##$DPNAME5= <>
##$DPNAME6= <>
##$DPNAME7= <>
##$DPOAL= (0..7)
0.5 0.5 0.5 0.5 0.5 0.5 0.5 0.5 
##$DPOFFS= (0..7)
0 0 0 0 0 0 0 0 
##$DQDMODE= 0
##$DR= 18
##$DS= 0
##$DSLIST= <SSSSSSSSSSSSSSS>
$$ [...]
##$SUBNAM2= <"">
##$SUBNAM3= <"">
##$SUBNAM4= <"">
##$SUBNAM5= <"">
##$SUBNAM6= <"">
##$SUBNAM7= <"">
##$SUBNAM8= <"">
##$SUBNAM9= <"">
##$SW= 16.880792210976
##$SWIBOX= (0..15)
0 0 2 0 0 0 0 0 0 0 0 0 0 0 0 0 
##$SW_h= 3378.37837837838
##$TD= 16384
##$TD0= 1
##$TE= 0
##$TE2= 300
##$TE3= 300
##$TEG= 300
##$TL= (0..7)
0 120 120 120 120 120 120 120 
##$TP= (0..7)
150 150 150 150 150 150 150 150 
##$TP07= 0
##$TPNAME0= <>
##$TPNAME1= <>
##$TPNAME2= <>
##$TPNAME3= <>
##$TPNAME4= <>
##$TPNAME5= <>
##$TPNAME6= <>
##$TPNAME7= <>
##$TPOAL= (0..7)
0.5 0.5 0.5 0.5 0.5 0.5 0.5 0.5 
##$TPOFFS= (0..7)
0 0 0 0 0 0 0 0 
##$TUNHIN= 0
##$TUNHOUT= 0
##$TUNXOUT= 0
##$USERA1= <user>
##$USERA2= <user>
##$USERA3= <user>
##$USERA4= <user>
##$USERA5= <user>
##$V9= 5
##$VALIST= <valist>
##$VCLIST= <CCCCCCCCCCCCCCC>
##$VD= 0
##$VDLIST= <DDDDDDDDDDDDDDD>
##$VPLIST= <PPPPPPPPPPPPPPP>
##$VTLIST= <TTTTTTTTTTTTTTT>
##$WBST= 1024
##$WBSW= 4
##$XGAIN= (0..3)
0 0 0 0 
##$XL= 0
##$YL= 0
##$YMAX_a= 85838
##$YMIN_a= -53617
##$ZGOPTNS= <>
##$ZL1= 120
##$ZL2= 120
##$ZL3= 120
##$ZL4= 120
##$ABSF1= 10
##$ABSF2= 0
##$ABSG= 5
##$ABSL= 3
##$ALPHA= 0
##$AQORDER= 0
##$ASSFAC= 0
##$ASSFACI= 0
##$ASSFACX= 0
##$ASSWID= 0
##$AUNMP= <proc_1d>
##$AZFE= 0.1
##$AZFW= 0.1
##$BCFW= 1
##$BC_mod= 2
##$BYTORDP= 1
##$COROFFS= 0
##$CY= 11.3945322036743
##$DATMOD= 1
##$DC= 2
##$DFILT= <>
##$DTYPP= 0
##$F1P= 16.9975609425685
##$F2P= -3.02152046262296
##$FCOR= 0.5
##$FTSIZE= 0
##$FT_mod= 4
##$GAMMA= 1
##$GB= 0.15
##$INTBC= 1
##$INTSCL= 1
##$ISEN= 128
##$LB= 0.24
##$LEV0= 0
##$LPBIN= 0
##$MAXI= 10000
##$MC2= 0
##$MEAN= 0
##$ME_mod= 0
##$MI= 1.114404
##$NCOEF= 0
##$NC_proc= 0
##$NLEV= 6
##$NOISF1= 3.799351
##$NOISF2= 2.8
##$NSP= 1
##$NTH_PI= 0
##$NZP= 0
##$OFFSET= 15.70392
##$PC= 1
##$PHC0= -10484.6
##$PHC1= 4.200893
##$PH_mod= 1
##$PKNL= yes
##$PPARMOD= 0
##$PSCAL= 0
##$PSIGN= 0
##$REVERSE= no
##$SF= 200.130013532006
##$SI= 16384
##$SIGF1= 3
##$SIGF2= 2
##$SINO= 400
##$SIOLD= 16384
##$SREGLST= <1H.CDCl3>
##$SSB= 0
##$STSI= 0
##$STSR= 0
##$SW_p= 3612.71676300578
##$SYMM= 0
##$S_DEV= 0
##$TDeff= 0
##$TDoff= 0
##$TI= <>
##$TILT= no
##$TM1= 0
##$TM2= 0
##$TOPLEV= 0
##$USERP1= <user>
##$USERP2= <user>
##$USERP3= <user>
##$USERP4= <user>
##$USERP5= <user>
##$WDW= 1
##$XDIM= 8192
##$YMAX_p= 0
##$YMIN_p= 0
$$ End of Bruker specific parameters
$$ ---------------------------------
##NTUPLES= NMR FID
##VAR_NAME=  TIME,          FID/REAL,        FID/IMAG
##SYMBOL=    X,             R,               I
##VAR_TYPE=  INDEPENDENT,   DEPENDENT,       DEPENDENT
##VAR_FORM=  AFFN,          ASDF,            ASDF
##VAR_DIM=   8192,          8192,            8192
##UNITS=     SECONDS,       ARBITRARY UNITS, ARBITRARY UNITS
##FACTOR=    0.000296,      1,               1
##FIRST=     0,             0,               0
##LAST=      2.424536,      0,               0
##MIN=       0,             -53617,          0
##MAX=       2.424536,      85838,           0
$$ Real data points
##PAGE= N=1
##DATA TABLE= (X++(R..R)), XYDATA
$$ plain form
0 0 0 0 0 0 0 0 0 0 0 0 0 0 0 0 0 0 -8 8 -8 8 -8 8 -16 16 -16 24 -24 28 -32 40 -40 48 -56 64 -72 80 -88 100
38 100 -112 124 -140 156 -172 190 -212 234 -257 284 -312 343 -379 418 -460 507 -560 620 -688 767
58 767 -857 963 -1090 1246 -1442 1695 -2039 2536 -3317 4750 -8241 36862 34746 -11507 -21450
73 -21450 -47694 31657 65096 2680 -37055 -33280 -1503 59747 32762 -39558 -41764 -2769 28328
86 28328 38330 -11504 -45380 -14908 21224 31387 7106 -36043 -28929 12480 29872 10588
98 10588 -20817 -21792 3633 14949 16026 -1046 -26144 -6964 23662 9828 -3606 -2554 -9273
111 -9273 2061 15926 2202 -7718 -2995 3137 6418 1878 -992 -1472 -3548 1925 1935 -3510 1452
126 1452 594 -3960 1153 -1710 -3438 3872 -2526 -6621 -11 -1331 3754 3780 -12710 -4274 10240
$$ packed form
0@%%%%%%%%%%%%%%%%qJ6j6J6j6J6k4L2l2M0m8N2o0P2q0Q8j04J20j36J52j68J88
38A00k12K36k64K96l28L62m02M46m91N41n96O55p22P97q78R67j067J180j308J455
58G67j624J820k053K336k688L137l734M575n853Q067j2991M5103k116m6253r943
73b1450k6244P9351L3439o2416l9735L775L1777O1250k6985p2320k206L8995L1097
86B8328J0002m9834l3876L0472L6132J0163k4281m3149P114M1409J7392j9284
98A0588l1405r75K5425J1316J077j7072k5098J9180L0626j3834j3434J052o719
111i273J1334J3865j3724r920M723O132L281m540k870m80k076N473J0n445M962
126A452q58m554N113k863j728P310o398m095O610j320N085K6j6490Q436J4514
$$ plain form
141 10240 -3356 -3363 4256 -8690 -3559 11683 302 -7975 -2567 -370 4087 2837 -3487 -3330 -2335
156 -2335 3370 5160 -4548 -4094 139 -2000 4909 3134 -8815 -1959 4438 -1288 1197 -1953 -6339
171 -6339 3767 1100 -3105 4649 -5374 -5740 10360 -2596 -8325 7864 -1819 -6815 8093 -217
185 -217 -7414 5190 1137 -5092 3207 231 -2274 3383 -2287 -2546 3891 -817 -1170 1294 -3097 225
201 225 3745 -1518 -1641 477 -2643 805 5283 -2885 -5919 2977 3383 -1548 66 -258 -3579 255
217 255 5089 536 -4504 -1578 2394 2717 133 -1413 -1224 -1438 2779 3863 -3108 -2302 1889 -375
233 -375 2147 2628 -4502 -1404 4474 -141 -612 998 -2468 376 2324 -646 754 -1515 -1690 4684
249 4684 -652 -4317 3954 153 -4156 3832 632 -4570 2862 1927 -3018 702 556 -786 1334 -748
$$ packed form
141A0240j3596pP619j2946N131J5242j1381q277N408K197M457j250o324J57R95
156b335N705J790r708M54M233k139O909j775j1949O856O397n726K485l150m386
171f339J0106k667m205P754j0023l66J6100j2956n729J6189r683m996J4908q310
185b17p197J2604m053o229Q299k976k505N657n670k59O437m708l53K464m391L322
201B25L520n263j23K118l120L448M478q168l034Q896M06m931J614l24l321L834
217B55M834m553n040K926L972L23k584j546J89k14M217J084o971Q06M191k264
233c75K522M81p130L098N878m615m71J610l466K844J948k970J400k269j75O374
249D684n336l665Q271l801m309P988l200n202P432r35m945L720j46j342K120k082
$$ plain form
265 -748 -881 756 -236 1140 229 -2110 1120 1048 -1126 1558 -247 -2605 2038 1900 -1564 -552 12
282 12 754 863 -771 757 -646 -2302 3277 1925 -4341 74 2728 -1716 700 1917 -3259 -508
298 -508 3187 -855 -690 639 -1951 572 2126 -988 -672 -120 -532 1428 383 -1632 614 -53 -1498
315 -1498 2304 478 -3361 1413 1827 -2710 689 1840 -2367 -492 1912 -964 -749 1020 -515 -509
331 -509 0 -330 869 -464 -1351 791 -473 -559 1601 -1118 -1645 1438 -95 -1017 1130 -903 -1886
348 -1886 1382 871 -1453 -532 -147 -147 277 -221 -70 -911 -1171 1370 694 -2358 -365 1241 -1351 139
366 139 1458 -2367 -992 2095 -724 -870 646 -1252 -224 1613 -587 -1050 273 -350 392 696 -1155
383 -1155 -181 431 -782 1238 354 -2303 851 1412 -1340 363 925 -1552 -63 1472 -311 -746 294
$$ packed form
265g48j33J637r92J376r11k339L230p2k174K684j805k358M643j38l464J012N64
282A2P42J09j634J528j403j656N579j352o266M415K654m444K416J217n176K751
298e08L695m042J65J329k590K523J554l114L16N52m12J960j045k015K246o67j445
315a498L802j826l839M774M14m537L399J151m207J875K404k876K15J769j535O
331e09N09l30J199j333q87K142j264q6K160k719n27L083j533r22K147k033r83
348a886L268n11k324R21L85%M24m98J51q41k60K541o76l052J993J606k592J490
366A39J319l825J375L087k819j46J516j898J028J837k200m63J323o23P42L04j851
383a155R74O12j213K020q84k657L154N61k752J703N62k477J489J535j783m35J040
$$ plain form
400 294 232 199 38 474 -3 -776 1005 706 -1066 964 666 -992 1101 748 -908 900 606 -690
418 -690 844 463 -419 835 -211 -421 1537 -403 -571 1621 -771 -879 2080 -247 -1457 1356 182
435 182 -925 1486 208 -1339 880 806 -343 664 136 -245 681 763 460 142 44 547 990 374 206
454 206 490 8 547 1262 -107 -303 666 333 218 425 -49 -224 -48 294 258 -534 -494 328 -233 -600 502
475 502 -445 -1147 843 -158 -1273 755 -76 -1170 837 191 -1153 639 454 -839 617 296 -580
492 -580 925 108 -492 1090 -24 -344 1248 -122 -583 1211 73 -584 984 23 -762 869 226
509 226 -762 451 125 -501 239 -18 -490 -126 151 -220 -391 -93 -19 -220 -198 -62 -230 -239 86 -7 -40 -112
531 -112 -288 323 138 -369 246 176 -373 321 362 -434 121 553 -376 176 693 -687 -2 847 -551 -195
$$ packed form
400B94o2l3j61M36m77p73J781k99j772K030k98j658K093l53j656J808k94j296
418f90J534l81q82J254j046k10J958j940j68K192k392j08K959k327j210K813j174
435A82j107K411j278j547K219p4j149J007n28l81R26Q2l03l18r8N03M43o16j68
454B06K84m82N39P15j369j96R69l33j15K07m74j75J76L42l6p92M0Q22n61l67J102
475E02r47p02J990j001j115K028q31j094K007o46j344J792j85j293J456l21q76
492e80J505q17o00J582j114l20J592j370m61J794j138o57J568r61p85J631o43
509B26r88J213l26o26P40k57m72L64K77l71j71K98P4k01K2J36j68rL25r3l3p2
531a12j76O11j85n07O15p0n49O94M1p96N55M32r29N52N17j380O85Q49j398L56
$$ plain form
551 -195 683 -507 -232 710 -176 -412 495 -89 -313 566 -277 -318 634 -332 -166 660 -290 -296 535 -87 -316
572 -316 500 0 -534 411 189 -519 389 -119 -486 345 55 -440 -160 41 -347 -308 259 -446 -589 179 -152
593 -152 -363 -4 -257 -459 -38 92 -461 -171 -80 -452 305 189 -786 43 344 -514 193 281 -551 -62 437
614 437 -281 -20 343 -519 -91 616 -532 -307 499 -450 -335 480 -300 -534 212 -231 -536 140 -279 -531
634 -531 185 -229 -452 249 -141 -561 158 -74 -563 185 107 -469 -57 149 -279 106 212 -344 36 379 -206
655 -206 48 229 -329 143 452 -259 -159 264 21 -89 203 51 -286 173 87 -109 247 -163 -219 343 78
676 78 -194 42 47 -199 46 318 -306 -145 296 -131 47 196 -306 89 234 -185 -2 237 -211 -212 516 -22
698 -22 -249 415 -235 -110 472 -178 -168 253 -116 -1 363 -68 -349 315 73 -411 381 27 -473 259 107
$$ packed form
551a95Q78j190K75R42q86k36R07n84k24Q79q43m1R52r66J66Q26r50oQ31o22k29
572c16Q16n00n34R45k22p08R08n08l67Q31k90m95K80K01l88L9N67p05j43P68l31
593a52k11L59k53k02M21J30n53K90R1l72P57j16r75Q29L01q58P07Q8q32M89M99
614D37p18K61L63q62M28P07j148K25Q06r49J15Q15p80k34P46m43l05O76m19k52
634e31P16m14k23P01l90m20P19k32m89P48p8n76M12K06m28L85J06n56L80L43n85
655b06K54J81n58M72L09p11J00M23k43j10K92j52l37M59q6j96L56m10n6N62k65
676G8k72K36Nk46K45K72o24J61M41m27J78J49n02L95J45m19J83K39m48jP28n38
698b2k27O64o50J25N82o50J0M21l69J15L64m31k81O64k42m84P92l54n00P32j52
$$ plain form
719 107 -236 212 -76 -262 239 110 -184 40 103 -342 115 353 -307 -61 150 -116 109 120 -84 -181 155
740 155 142 -85 91 18 -224 259 145 -271 88 229 -241 124 369 -233 -148 265 -132 -101 305 -267 -100 378
762 378 -286 -114 439 -330 -267 507 -204 -318 391 -148 -300 315 -72 -330 324 -37 -305 361 -94 -308 324
783 324 -27 -228 234 57 -230 119 142 -168 54 130 -230 37 186 -187 26 92 -192 -30 119 -39 -128 113
805 113 36 -277 54 91 -294 57 -15 -214 44 12 -281 0 117 -190 -57 119 -363 -27 229 -302 -14 149
827 149 -290 -59 233 -199 -84 181 -183 -33 332 -225 -168 343 -184 -77 281 -136 -112 144 12 -8 121
848 121 -126 -77 205 -42 -104 185 -68 -119 166 -63 -146 14 -19 19 25 38 -26 -80 36 -33 -18 136 -62 -35 238
873 238 96 -178 216 136 -136 295 241 -165 247 254 -93 288 236 -133 304 179 -189 353 331 -274 273 322 -213
$$ packed form
719A07l43M48k88j86N01j29k94K24O3m45M57K38o60K46K11k66K25J1k04r7L36
740A55j3k27J76p3k42M83j14m16L59J41m70L65K45o02Q5M13l97L1M06n72J67M78
762C78o64J72N53p69O3P74p11j14P09n39j52O15l87k58O54l61k68O66m55k14O32
783C24l51k01M62j77k87L49K3l10K22P6l60K67J49l73K13O6k84J62J49j58q9K41
805A13p7l13L31L7l85L51p2j99K58l2k93K81J17l07J33J76m82L36K56n31K88J63
827A49m39K31K92m32J15K65l64J50L65n57N7N11n27J07L58m17K4K56j32k0J29
848A21k47M9K82k47o2K89k53n1K85k29q3J60l3L8OJ3o4n4J16o9J5J54j98K7K73
873B38j42k74L94q0k72M31n4m06M12Pl47L81n2l69M37j25l68N42k2o05N47M9n35
$$ plain form
896 -213 260 224 -231 238 196 -140 167 232 -198 123 310 -219 1 207 -135 -71 209 53 -117 126 69 -88
918 -88 105 97 -94 175 182 -77 105 146 -21 119 199 -140 19 260 -117 1 270 -92 -88 251 -1 -43 213 -109
942 -109 -220 283 -84 -337 280 13 -371 214 45 -393 123 118 -290 126 52 -300 124 103 -263 97 83 -210
964 -210 119 135 -229 111 56 -172 44 22 -163 -7 13 -195 -33 -53 -89 -92 -66 -86 -184 -73 74 -190 -146 139
988 139 -204 -75 147 -150 -150 127 -103 -120 134 -134 -113 266 -146 -81 301 -242 -19 301 -153 -22 200 -125
1010 -125 -109 304 -105 -155 278 -166 -226 337 -221 -244 221 -61 -146 89 -76 -210 54 -57 -238 14 -40 -246
1032 -246 130 25 -226 138 -21 -181 42 62 -63 48 142 -87 29 148 -58 -58 154 -16 -19 125 -36 -177
1054 -177 149 135 -242 71 136 -280 117 155 -268 -30 183 -239 -38 238 -260 -39 271 -299 -25 277 -320
$$ packed form
896b13M73l6m55M69m2l36L07O5m30L21J87n29K20K06l42O4K80j56j70K43n7j57
918h8J93qj91K69Pk59J82M1j67J40Q0l39J59K41l77J18K69l62ML39k52m2K56l22
942a09j11N03l67k53O17k67l84N85j69m38N16nm08M16p4l52M24k1l66L60j4k93
964b10L29J6l64L40n5k28K16k2j85J56K0k08J62k0l6lK6k0r8J11J47k64M4K85
988A39l43J29K22k97%K77k30j7K54k68K1L79m12O5L82n43K23L20m54J31K22l25
1010a25J6M13m09n0M33m44o0N63n58k3M65k82q5K35j65j34K64j11j81K52n4k06
1032b46L76j05k51L64j59j60K23K0j25J11R4k29J16J19k06%K12j70lJ44j61j41
1054a77L26j4l77L13O5m16L97L8m23K38K13m22K01K76m98K21L10n70K74L02n97
$$ plain form
1075 -320 -11 310 -307 -67 248 -239 -42 282 -212 -79 303 -185 -78 207 -132 -187 216 7 -94 144
1095 144 -46 -143 123 91 -107 52 59 -142 -35 100 -60 -123 178 -69 -125 249 -37 -175 190 -42 -113 225
1117 225 30 -240 263 24 -216 193 67 -278 247 192 -255 233 154 -273 113 234 -269 10 197 -247 66
1138 66 257 -300 45 243 -225 29 174 -191 -44 216 -147 -5 238 -166 -97 198 -128 -62 181 -145 -87
1159 -87 139 -36 -103 119 27 -145 112 19 -127 55 74 -71 47 83 -55 -48 153 -57 -146 207 -79 -160 208
1182 208 -28 -146 196 -46 -118 188 -30 -251 176 -53 -240 211 25 -262 168 3 -257 183 68 -222
1202 -222 135 75 -247 90 42 -238 131 139 -230 67 113 -194 60 78 -151 -11 142 -100 -16 140 -123 -109 194
1225 194 -44 -65 128 -20 -160 187 52 -136 56 93 -168 163 128 -205 87 188 -149 29 185 -190 -37
$$ packed form
1075c20L09L21o17K40L15m87J97L24m94J33L82m88J07K85l39n5M03k09j01K38
1095A44j90r7K66l2j98J59Pk01J07J35j60o3L01k47n6L74k86j38L65k32p1L38
1117B25j95k70N03k39k40M09j26l45N25n5m47M88p9m27L86J21n03K79J87m44L13
1138F6J91n57L45J98m68K54J45l65J47K60l63J42K43m04O9K95l26O6K43l26N8
1159h7K26j75o7K22r2j72K57r3j46J82J9j45J18L6j38PK01k10q9L53k86q1L68
1182B08k36j18L42k42p2L06k18k21M27k29j87M51j86k87M30j65k60M40j15k90
1202b22L57o0l22L37m8k80L69Ql69K97M6l07K54J8k29J40J53k42Q4J56k63J4L03
1225A94k38k1J93j48j40L47j35j88J92L7k61L31l5l33K92J01l37J78J56l75J53
$$ plain form
1246 -37 265 -103 -3 229 -172 -104 311 -126 -139 256 -114 -149 289 -9 -205 219 -50 -232 259 12 -237
1267 -237 184 39 -177 170 93 -261 162 130 -175 86 117 -172 70 131 -137 -4 139 -101 -13 166 -98 -139
1289 -139 145 -83 -139 208 -69 -176 110 92 -198 112 30 -233 156 112 -188 130 94 -193 71 142 -214 -32
1311 -32 186 -220 -2 210 -200 -64 254 -184 -70 229 -159 -128 150 -54 -96 214 -37 -186 189 -49 -158
1332 -158 120 -39 -151 241 -2 -165 52 103 -136 70 109 -148 41 122 -213 73 159 -163 8 155 -63
1353 -63 -19 140 -98 -77 181 10 -112 141 -33 -68 170 -48 -182 130 27 -141 139 64 -166 104 129 -174
1375 -174 77 105 -212 102 108 -212 73 159 -253 15 242 -122 -42 213 -140 -44 214 -54 -78 198 -26 -80 223
1398 223 -45 -120 185 -27 -51 176 6 -171 153 75 -199 74 61 -216 52 123 -203 8 144 -243 -47 229
$$ packed form
1246c7L02l68J00K32m01O8M15m37j3L95l70l5M38k98j96M24k69j82M91k47k49
1267b37M21j45k16L47p7l54M23l2l05K61L1k89K42O1k68J33J43k40Q8J79k64m1
1289a39K84k28n6L47k77j07K86j8k90L10q2k63L89m4l00L18l6k87K64P1l56J82
1311c2K18m06K18K12m10J36L18m38J14K99l88L1K78k04m2L10k51j49L75k38j09
1332a58K78j59j12L92k43j63K17N1k39K06L9k57J89Q1l35K86Q6l22J71J47k18
1353f3M4J59k38K1K58j71j22K53j74l5K38k18j34L12j03j68K80p5k30K70K5l03
1375a74K51K8l17L14Ol20K85Q6m12K68K27l64Q0K55l53R6K58k68k4K76k24n4L03
1398B23k68p5L05k12k4K27j70j77L24p8k74K73j3k77K68P1l26K11J36l87J96K76
$$ plain form
1420 229 -175 -90 215 -104 -146 257 -98 -192 206 -94 -148 192 25 -192 169 33 -201 92 36 -167 141 86
1442 86 -222 152 37 -209 136 171 -297 -44 186 -169 -38 172 -175 -72 205 -261 -108 199 -103 -136 231
1463 231 -43 -176 188 -12 -215 121 21 -166 120 78 -173 89 48 -142 76 25 -172 121 82 -182 33
1484 33 159 -190 13 149 -166 -55 169 -82 -173 189 -98 -154 178 2 -175 166 51 -172 135 86 -109
1505 -109 93 74 -124 40 46 -135 156 83 -102 138 48 -102 54 64 -157 80 134 -185 49 202 -196 -73
1527 -73 173 -133 -91 175 -102 -104 186 71 -201 130 42 -138 106 63 -129 81 60 -51 112 -22 -61 73 38
1550 38 -108 106 103 -161 127 118 -198 59 126 -198 -20 222 -131 -142 200 -96 -175 200 -45 -202 179 27 -193
1573 -193 113 57 -144 32 95 -119 12 32 -184 102 71 -117 104 1 -160 122 78 -198 77 159 -222 9
$$ packed form
1420B29m04Q5L05l19m2M03l55r4L98l00n4L40j67k17L61j36k34K93n6k03L08n5
1442H6l08L74j15k46L45L5m68K53K30l55J31K10l47J03K77m66J53L07l02l3L67
1463B31k74j33L64k00k03L36j00j87K86m2k51K62m1j90K18n1j97K93l9k64K15
1484C3J26l49K03J36l15J11K24k51r1L62k87n6L32j76j77L41j15k23L07m9j95
1505a09K02j9j98J64Oj81K91p3j85K40r0j50J56J0k21K37N4l19K34J53l98J23
1527g3K46l06M2K66k77kK90j15k72L31q8j80K44m3j92K10k1j11J63j34l9J34l5
1550C8j46K14lk64K88rl16K57O7l24J78K42l53j1L42k96p9L75k45j57L81j52k20
1573a93L06n6k01J76O3k14J31K0k16K86l1j88K21j03j61K82m4k76K75Q2l81K31
$$ plain form
1595 9 192 -158 -117 241 -146 -147 293 -80 -252 213 44 -242 99 122 -211 64 167 -199 1 98 -107 36
1617 36 136 -68 12 95 -85 10 -10 -96 5 58 -109 24 156 -173 -23 202 -127 -105 231 -101 -205 258 -2
1640 -2 -197 100 70 -286 81 162 -208 -26 145 -150 -43 101 -73 -40 101 -43 -49 9 -84 -19 165 -179 26
1663 26 80 -172 72 203 -172 -67 224 -62 -109 255 -48 -204 250 40 -272 129 72 -224 75 179 -129
1684 -129 -118 108 -106 -99 153 12 -67 21 -44 11 10 -50 0 58 -106 77 86 -187 -45 214 -144 -104 259 -57 -184
1709 -184 265 -25 -255 136 71 -228 64 159 -184 -20 173 -94 -39 119 -95 -84 65 -58 -2 77 -86 -12
1731 -12 16 -51 20 21 -134 54 148 -181 -69 252 -108 -181 284 -11 -232 244 74 -242 160 172 -261 26 196
1754 196 -173 -87 176 -93 -63 125 -7 -29 45 -7 -60 27 -53 -97 42 -105 -4 93 -163 14 175 -149 -106 205
$$ packed form
1595IJ83l50M1L58l87jM40l73j72M65j69k86L41K3l33K75J03l66K00R7k05J43
1617C6J00k04Q0Q3j80R5k0q6J01N3j67J33J32l29J50K25l29K2L36l32j04M63k60
1640bj95K97l0l56L67Q1l70J82J71k95J07J44j74L3J41j44oN8r3O5J84l44K05
1663B6N4k52K44J31l75J05K91k86m7L64l03j56M54k10l12M01n7k96K99J04l08
1684a29J1K26k14PK52j41p9Q8o5N5jo0N0N8j64J83Rk73J42K59l58M0L63l16j27
1709a84M49k90k30L91o5k99K92R5l43J64J93k67N5J58k14J1J49j23N6P9j63P4
1731a2K8o7P1Jj55J88R4l29J12L21l60p3M65k95k21M76j70l16M02J2m33K87J70
1754A96l69Q6K63k69L0J88j32k2P4n2n3Q7q0m4J39j47J01R7k56J77J61l24M3L11
$$ plain form
1778 205 -70 -206 225 24 -262 190 131 -261 78 205 -180 -34 241 -116 -75 235 -62 -175 82 6 -90
1799 -90 85 -20 -86 -12 -52 -9 41 -86 -45 67 -104 -73 223 -117 -156 165 11 -185 182 35 -238 115 193
1822 193 -233 -11 223 -188 -69 186 -56 -97 234 34 -61 110 31 -116 34 74 -39 6 22 -2 34 -74 -9
1845 -9 82 -92 -49 151 -77 -194 170 12 -219 170 117 -203 64 184 -144 -54 223 -151 -84 217 -13 -91 105
1868 105 1 -112 100 87 -82 46 36 33 26 -18 24 77 -19 -19 85 -68 -70 171 -37 -147 138 35 -159 98 122
1893 122 -235 11 141 -193 -16 219 -147 -151 119 11 -117 76 -33 -111 127 34 -79 -4 37 27 19 -53 28 66
1917 66 -107 -27 114 -18 -112 162 63 -138 147 88 -221 81 213 -176 -39 203 -178 -92 261 -76 -119 154
1939 154 4 -132 91 106 -110 25 84 -124 55 -6 -51 47 -34 -74 117 -41 -67 143 -23 -144 143 62 -141
$$ packed form
1778B05k75j36M31k01k86M52n9l92L39J27l85J46K75l57M1L10k97j13K57p6r6
1799i0J75j05o6P4m0M3N0j27M1J12j71L1K96l40l9L21j54j96L67j47k73L53P8
1822A93m26K22K34m11J19K55k42m1L31k00r5J71p9j47J50M0j13M5J6k4L6j08O5
1845iR1j74M3K00k28j17L64j58k31L89n3l20K67J20l28R0K77l74O7L01k30p8J96
1868A05j04j13K12j3j69J28j0lpm4M2N3r6%J04j53kK41k08j10K85j03j94K57K4
1893A22l57K46J30l34J77K35l66mK70j08j28J93j09p8K38r3j13P5M1j0qp2Q1L8
1917F6j73Q0J41j32r4K74r9k01K85n9l09L02J32l89J37K42l81Q6L53l37m3K73
1939A54j50j36K23J5k16J35N9k08J79o1m5R8q1m0J91j58k6K10j66j21K87q1k03
$$ plain form
1962 -141 51 98 -198 52 154 -206 -63 204 -62 -98 170 -63 -115 136 22 -164 41 85 -80 21 67 -49
1984 -49 -14 10 -20 24 -31 -88 80 44 -116 111 14 -141 87 87 -169 50 121 -190 20 227 -147 -38 213 -46
2008 -46 -129 165 -24 -183 135 52 -140 45 84 -62 6 84 -38 17 35 -2 71 -37 -12 63 -5 -79 159 25 -172
2033 -172 55 160 -158 35 190 -226 -51 180 -70 -48 193 -62 -164 169 3 -64 90 77 -117 24 32 -83
2055 -83 8 110 -81 61 20 -58 116 -37 -113 109 12 -135 95 73 -164 45 79 -147 -7 176 -143 -92 220
2078 220 -74 -72 138 -37 -140 104 51 -84 60 60 -90 132 31 -103 20 23 -62 62 3 -58 105 -12 -110 83
2102 83 -1 -113 87 54 -141 -2 103 -137 10 124 -82 -79 205 -52 -98 166 13 -147 27 34 -123 60 50
2125 50 -134 65 63 -38 34 43 -22 16 -38 -89 70 20 -125 99 105 -69 4 106 -111 -31 136 -92 -13 133 -44
$$ packed form
1962a41J92M7k96K50J02l60J43K67k66l6K68k33n2K51j14j86K05M4j65J01M6j16
1984d9L5K4l0M4n5n7J68l6j60K27r7j55K28%k56K19P1l11K10K07l74J09K51k59
2008d6q3K94j89j59L18q3j92J85L9j46O8P8j22N5J8l7P3j08K5P5o8p4K38j34j97
2033a72K27J05l18J93J55m16J75K31k50K2K41k55j02L33j66o7J54j3j94J41Qj15
2055h3R1J02j91J42m1p8J74j53p6K22r7j47K30k2k37K09L4k26J40J83l19N1L12
2078B20k94KK10j75j03K44n3j35J44%j50K22j01j34J23Lq5J24n9o1J63j17r8J93
2102H3q4j12K00l3j95J39J05k40J47J14k06LK84k57m6K64j53j60J74Pj57J83j0
2125E0j84J99kj01P2Ro5L8n4n1J59n0j45K24Oj74P3J02k17Q0J67k28P9J46j77
$$ plain form
2150 -44 -123 150 -8 -153 134 54 -117 142 36 -130 77 65 -65 -3 40 -142 31 59 -74 29 44 -114 44
2173 44 52 -106 23 17 -71 14 87 -108 -24 84 -74 -54 114 -59 -76 89 -17 -74 69 60 -110 44 60 -100 17
2198 17 64 -59 15 12 -79 9 28 -59 34 3 -123 55 25 -56 63 36 -72 -29 125 -96 -32 90 -80 -10 142 15
2224 15 -109 110 68 -105 93 18 -129 40 49 -69 -26 58 -90 32 47 -49 40 17 -72 69 47 -67 -25 63 -111
2249 -111 14 118 -85 6 18 -50 -12 68 -15 -46 55 -6 -124 90 -4 -75 123 30 -97 9 38 -46 43 27 -37
2274 -37 0 68 -22 43 65 -50 9 65 -39 -5 54 -16 -45 50 -13 -60 109 -34 -95 95 -31 -67 82 46 -41 83
2300 83 20 -133 54 13 -53 71 65 -53 31 101 -60 27 61 -99 44 53 -79 10 61 -88 -40 83 -57 48 108
2325 108 -58 -31 97 13 -59 53 7 -53 97 47 -82 69 20 -43 4 35 -46 64 70 -79 28 116 -36 12 121
$$ packed form
2150d4p9K73j58j45K87q0j71K59j06j66K07j2j30O2M3j82J73K8j33J03J5j58J58
2173D4Qj58J29oq8Q5P3j95Q4J08j58K0J68j73j7J65j06n7J43rj70J54J6j60J17
2198A7M7j23P4lr1Q8J9q7R3l1j26J78l0q1J19k7j08M3J54k21O4J22j70P0J52j27
2224A5j24K19m2j73J98p5j47J69Rj18M3Q4j48J22J5r6Q9k3q9J41k2j14M2Q8j74
2249a11J25J04k03R1J2o8L8Q0q3l1J01o1j18K14r4p1J98r3j27J06K9q4Q9j6o4
2274c7L7O8r0O5K2j15N9N6j04L4N9p0k9R5o3m7J69j43o1J90j26l6J49l6q7J24
2300H3o3j53J87m1o6J24oj18Q4P0j61Q7L4j60J43Rj32Q9N1j49M8J23j40J05O0
2325A08j66K7J28q4p2J12m6o0J50n0j29J51m9o3M7L1q1J10Oj49J07Q8j52M8J09
$$ plain form
2350 121 -9 -27 88 -12 -36 108 -48 -98 44 -17 -52 101 -35 -21 29 9 -71 16 12 -42 68 -22 -35 58 8 -109
2376 -109 23 77 -75 22 90 -11 0 58 -57 71 91 -61 -17 123 -49 -64 114 -46 -69 30 -23 -47 118 -11
2400 -11 -63 50 -73 -66 46 -22 -106 38 35 -88 47 58 -75 -34 70 -88 -26 8 -69 -36 42 -26 -13 67 -51 -75
2426 -75 131 9 -43 67 0 -43 107 -67 -108 52 28 -81 -2 11 -109 54 18 -67 26 35 -113 73 61 -59 10
2451 10 42 -67 31 131 -116 -13 23 -66 -66 92 -48 -9 149 -28 -47 110 -19 -98 78 51 -55 86 42 -15
2475 -15 72 23 -24 40 73 -78 74 47 -59 27 86 -38 -33 68 -48 -59 61 -22 -14 66 -45 -9 128 -16 -79 44
2501 44 -8 -69 45 56 -68 98 -21 -66 96 65 -102 92 6 -58 80 29 -126 22 45 -79 -30 76 -61 -28
2525 -28 72 -84 -15 111 -4 14 79 -22 -26 62 -16 0 28 -27 -105 -2 8 -72 36 35 -54 71 75 -53 -23 26 -42
$$ packed form
2350A21j30j8J15j00k4J44j56n0J42o1l5J53j36J4N0k0q0Q7mn4J10r0j3R3n0j17
2376a09J32N4j52R7O8j01J1N8j15J28K0j52M4J40j72j5J78j60k3R9n3k4J65j29
2400a1n2J13j23PJ12o8q4J44lj23J35J1j33M1J04j58O2L4p7L3P8o8J3Q0j18k4
2426g5K06j22n2J10o7m3J50j74m1J60k4j09P9J3j20J63l6q5R3Rj48J86j2j20O9
2451A0L2j09R8J00k47J03L6q9%J58j40L9J58j77j9J57j29p9J76k7j06J41m4n7
2475a5Q7m9m7O4L3j51J52k7j06Q6N9j24NJ01j16j1J20q3QQ0j11L6J37j44o3J23
2501D4n2o1J14J1j24J66j19m5J62l1j67J94q6o4J38n1j55J48K3j24M9J06j37L3
2525b8J00j56O9J26j15J8O5j01mQ8p8J6K8n5p8J03J0q0J08jq9J25Mj28L0M9o8
$$ plain form
2552 -42 24 51 -72 -3 36 -48 -47 55 -42 21 88 -16 -27 91 -54 -47 119 -28 -37 51 -14 -65 75 -7 -101 21 7
2579 7 -63 74 65 -65 79 76 -52 61 56 -121 8 35 -57 34 12 -102 -61 151 -130 -8 49 -97 -39 50 -37 -62
2605 -62 64 -52 -26 43 -13 -57 95 -8 -17 38 18 -37 11 58 -87 -3 70 -106 -3 90 -65 43 57 -69 5 60
2631 60 -26 22 52 -17 -4 75 -41 -9 69 -27 -69 97 -7 -43 22 22 -55 21 -19 -102 18 118 -60 64 67 -73 12
2658 12 70 -63 -17 53 -63 -8 55 -72 2 59 -28 27 81 -9 -75 77 -64 -25 85 -32 -93 96 -22 -39 43 12
2684 12 -28 52 11 -95 31 13 -65 19 99 -101 -4 33 -67 -13 71 -33 12 62 -27 -22 62 -91 -10 80 -31 -11 42
2711 42 -72 -32 31 29 4 56 -42 -89 21 65 -63 71 32 -51 -20 98 -72 73 65 -143 9 37 -65 -17 91 -52
2737 -52 -31 65 -62 -56 99 -6 17 88 16 -45 72 0 -8 60 15 -59 51 26 -69 101 -1 -59 31 -4 -37 64 74
$$ packed form
2552d2O6K7j23O9L9q4JJ02r7O3O7j04j1J18j45PJ66j47rQ8o5n1J40q2r4J22j4
2579Gp0J37rj30J44lj28J13nj77J29K7r2R1k2j14M1K12k81J22N7j46N8Q9q7k5
2605f2J26j16K6O9n6m4J52j03rN5k0n5M8M7j45Q4P3j76J03R3j55J08J4j26P4N5
2631F0q6M8L0o9J3P9j16L2P8r6m2J66j04l6O5%p7P6m0q3J20J00j78J24Lj40Q5
2658A2N8j33M6P0j16N5O3j27P4N7q7N5N4r0o6J52j41L9J10j17o1J89j18j7Q2l1
2684A2m0Q0m1j06J26j8p8Q4Q0k00R7L7j00N4Q4j04M5N0q9NQ4j53Q1R0j11K0N3
2711D2j14M0O3kk5N2r8m7J10M4j28J34l9q3L1J18j70J45qk08J52K8j02M8J08j43
2737e2K1R6j27OJ55j05K3P1p2o1J17p2qO8m5p4J10k5r5J70j02n8R0l5l3J01J0
$$ plain form
2764 74 -53 -7 109 -33 -10 30 -48 -20 44 6 11 53 -41 -45 63 -12 -80 26 9 -46 38 10 -34 45 67 -31 37 75 -17
2793 -17 68 11 -107 6 86 -121 -11 27 -86 11 93 -12 -23 96 -16 -37 71 -84 -39 108 -61 -13 87 69
2817 69 -18 62 -51 -79 -6 50 -58 34 42 -54 36 40 -31 -4 63 -60 28 62 -57 -49 53 -23 11 50 -56 -37 97 -34
2845 -34 -90 47 -6 -28 49 43 -56 69 7 -55 39 -10 -102 46 58 -41 31 39 -72 14 52 -93 -11 26 -22 26 33 3 9 44
2875 44 6 -21 52 -12 -60 76 -7 -16 82 6 -48 45 35 -69 20 0 -34 43 8 -77 51 29 -57 6 31 -14 -6 81 -14 9
2905 9 54 -41 13 72 -56 4 56 -34 -9 100 12 -74 70 4 -63 58 32 -39 46 0 -42 -27 16 -60 46 -20 -96 37
2933 37 17 -48 29 23 -18 43 56 9 24 71 -50 15 33 -8 -47 36 14 -16 68 7 -46 60 -31 -102 58 37 -17 22 33
2962 33 -82 44 52 -85 30 8 -85 24 95 -99 57 24 -39 -44 67 -6 -31 44 22 -14 64 -15 -16 89 -63 -28 70
$$ packed form
2764G4j27M6J16j42K3M0p8K8O4l8NM2r4mJ08p5o8J06j7n5Q4k8m4P9K2r8O8L8r2
2793a7Q5n7j18J13Q0k07J10L8j13R7Q2j05j1J19j12k1J08j55M5J47j69M8J00j8
2817F9q7Q0j13k8P3N6j08R2Qr6R0Mp1K7O7j23Q8L4j19QJ02p6L4L9j06J9J34j31
2845c4n6J37n3k2P7or9J25o2o2R4m9r2J48J2r9P2Qj11Q6L8j45Q2L7m8M8Pl0OL5
2875D4l8k7P3o4m8J36q3rR8p6n4R3j0j04Q9k0l4P7l5q5J28k2q6O3K5m5QQ7r5K3
2905IM5r5N4N9j28O0N2r0K5J09q8q6J44o6o7J21k6p1Q5m6m2J5M3p6J06o6p6J33
2933C7k0o5P7om1O1J3m7J5M7j21O5J8m1l9Q3k2l0Q4o1n3J06r1p1J60k1n4L9J1
2962C3j15J26Qj37J15k2r3J09P1j94J56l3o3nJ11p3k5P5k2l6P8p9jJ05j52L5R8
$$ plain form
2989 70 -24 -128 38 18 -71 68 22 -69 61 -26 -52 76 38 -51 14 70 -81 4 67 -57 -5 101 -59 -1 35 3
3015 3 -54 113 -34 -52 91 -22 -13 99 -16 -15 48 30 3 60 45 -57 8 59 -1 -40 15 -59 -36 -2 -44 -23 43 -4
3043 -4 -32 52 -56 -34 54 -51 -44 85 -41 10 20 -50 -68 42 35 -85 47 -37 -46 54 -7 -63 26 33 -38 22 48 -69
3071 -69 37 63 -19 1 33 -39 1 62 -40 -30 68 -44 -12 32 -40 -5 79 -54 10 43 -64 -40 29 15 -116 62 -7
3098 -7 -27 80 -8 -30 61 -16 -63 15 21 -47 39 66 -99 28 89 -60 -38 75 -52 -42 102 -24 -51 101 -3 -66
3124 -66 -2 -12 -28 69 -10 -97 78 0 -108 63 -22 -58 21 36 -38 21 45 -49 38 59 -87 -14 138 -50 18 34 -41
3151 -41 -23 54 -57 -40 47 -24 -41 53 39 -27 -2 -42 -112 111 3 -70 97 61 -49 76 -5 -84 46 54 -35 28 69
3178 69 -26 -17 49 -70 -20 59 -42 60 30 -22 -55 30 10 -11 51 3 -46 72 1 -17 27 -38 -47 62 92 -84 25 30
$$ packed form
2989G0r4j04J66k0q9J39m6r1J30q7k6J28l8q9O5N6j51Q5O3j24N2J06j60N8L6l2
3015Cn7J67j47j8J43j13RJ12j15JO3j8k7N7j5j02O5N1o0l9N5p4K3L4m2K1O6m7
3043dk8Q4j08K2Q8j05PJ29j26N1J0p0j8J10pj20J32q4rJ00o1n6Q9Pp1O0K6j17
3071f9J06K6q2K0L2p2M0O1j02J0R8j12L2M4p2L5Q4j33O4L3j07K4O9j4j31J78o9
3098gk0J07q8k2R1p7m7P8Oo8Q6K7j65J27O1j49K2J13j27J0J44j26k7J52j04o3
3124f6O4j0j6R7p9q7J75p8j08J71q5l6P9J5p4N9K4r4Q7K1j46P3J52j88O8J6p5
3151d1J8P7j11J7Q7p1j7R4j4o6K5m0p0K23j08p3J67l6j10J25q1p9J30Qq9O3M1
3178F9r5RO6j19N0P9j01J02l0n2l3Q5k0k1O2m8m9J18p1j8M4o5rJ09L0j76J09N
$$ plain form
3206 30 -49 7 59 -35 52 57 1 9 81 -26 -27 50 -64 -30 40 25 -3 66 -23 -86 128 0 -15 52 26 -38 6 -24 -22 29
3236 29 27 -82 40 30 -21 -31 76 -44 1 39 -2 50 28 -61 -54 32 1 -27 1 -10 -69 53 -22 -24 23 8 7 72 -43
3265 -43 -66 14 -34 -56 38 29 -80 58 4 -96 -12 37 -6 68 44 -9 24 54 -8 -11 67 -69 3 53 -34 -2 11 -20 -41
3294 -41 65 -37 -55 64 -3 -42 56 5 -10 57 2 -25 11 7 -31 -9 41 -57 37 87 -77 -11 55 -42 9 40 -41 -24 27
3323 27 -63 -46 66 -17 -15 15 -19 8 33 13 -114 12 9 -34 -19 19 -52 50 51 -29 30 33 -45 65 71 -48 -12 82 -32
3352 -32 -64 71 -78 0 37 -31 -5 43 -26 -58 115 -70 2 25 -10 -26 84 16 -53 66 -7 -18 39 23 -106 30
3378 30 -7 -65 6 57 -21 83 29 -23 41 30 -36 8 78 -40 6 68 -8 40 32 -27 -56 37 32 30 -25 -8 -65 25 -45 -74 36
3409 36 17 -57 60 37 -60 40 17 -39 4 33 -46 -43 72 -74 28 19 -56 -19 88 -61 5 138 18 -71 45 -27
$$ packed form
3206C0p9N6N2r4Q7Nn6QP2j07jP7j14L4P0j5k8O9q9o3K14j28j5O7k6o4M4l0KN1
3236B9kj09J22j0n1j0J07j20M5L8m1N2k2q9PQ6l1k8K8j1n9J22p5kM7j5jO5j15
3265d3k3Q0m8k2R4rj09J38n4j00Q4M9m3P4k4n3L3L0o2lP8j36P2N0q7L2J3l1k1
3294d1J06j02j8J19o7l9R8n1j5O7n5k7L6ml8K2N0r8R4N0j64O6O6r7N1L1q1J7N1
3323B7r0J7J12q3KL0l4K7K5k0j27J26lm3J5L8p1J02Jq0N9Lp8J10Oj19L6R4j14
3352c2l2J35j49P8L7o8K6M8o9l2J73j85P2K3l5j6J10o8o9J19p3j1N7j6j29J36
3378C0l7n8P1N1p8J04n4n2O4j1o6M4P0j18M6O2p6M8qn9k9R3nkn5J7n7R0p0k9J10
3409C6j9p4J17k3r7J00k3n6M3K9p9LJ15j46J02rp5L7J07j49O6J33j20q9J16p2
$$ plain form
3435 -27 -30 65 -11 -17 46 -16 -40 26 15 46 51 -25 -31 14 -11 -8 -16 11 -59 0 61 -13 -23 33 -39 8 50 -28 -27 36 -24 -34 -4 -24
3469 -24 -54 71 -19 1 27 -22 -67 46 -87 -29 43 23 -51 4 79 -19 38 25 -21 -32 26 19 -6 49 -58 -40 38 -32 -8
3498 -8 0 -7 -54 93 32 -46 68 37 -34 56 3 -2 79 28 -49 33 -12 1 63 78 -59 9 10 -24 -44 95 26 -52 41 -95
3528 -95 55 35 29 7 72 -39 -44 42 -20 -16 10 11 -4 85 5 -42 2 30 -73 32 18 7 -19 -14 -11 7 81 -89 8 22 -66
3559 -66 0 50 -30 -24 21 -18 -59 54 25 -15 84 12 -39 -26 -31 -51 102 -15 -24 56 26 -50 28 58 -56 12 21 -28 61 54 -49
3590 -49 1 33 -38 36 71 -67 -10 72 -78 29 43 -42 -25 54 3 -53 36 -3 -45 56 -6 -4 -7 -33 -24 85 5 -50 -9
3619 -9 4 4 3 -37 -48 10 43 58 37 23 -18 51 88 -15 38 13 -24 1 87 16 -4 14 -2 -63 61 -13 0 44 -39 -16 43
3650 43 -24 -54 51 0 -64 -4 5 -8 34 95 -39 -13 71 -18 52 42 -32 3 50 -39 3 50 -35 -32 2 24 5 56 -5 -11 79
$$ packed form
3435b7lR5p6oO3o2k4O6j1L1Np6oM5k5LqK7p0N9O1p4j0N6p2M7M2p8JO3o0j0L0k0
3469b4l0J25r0K0K6m9m5J13j33N8P2k0p4N5P5r8N7j3m6j1N8pk5N5j07J8P8p0K4
3498hQpm7J47o1p8J14l1p1R0n3nQ1n1p7Q2m5J3O2J5j37O8Jl4k0J39o9p8R3j36
3528i5J50k0ok2O5j11nQ6o2MK6Jj5Q9q0m7M4K8j03J05j4j1k6NLJ8P4j70R7J4q8
3559f6O6N0q0OM5l9m1J13k9m0R9p2n1J3nk0J53j17rQ0l0p6P8L0j14O8Rm9Q9pj03
3590d9N0L2p1P4L5j38N7Q2j50J07J4q5J7P9n1n6Q9l9m2J01o2Klk6RJ09q0n5M1
3619iJ3%jm0j1N8L3J5k1j4m1O9L7j03N3k5l7K5Q6p1k0J8j6o1J24p4J3M4q3K3N9
3650D3o7l0J05n1o4O0Rj3M2O1j34K6Q4q9P0j0p4L5M7q9M2M7q5LL4K2j9N1o1oR0
$$ plain form
3681 79 39 -74 47 -5 4 12 39 -58 30 31 -29 36 39 -22 77 60 -38 -6 16 -51 -39 -3 -28 -18 21 -33 -42 40 -10 0 63 -11
3713 -11 1 59 12 -36 58 57 2 55 -15 -10 7 89 -4 1 54 -18 -8 54 -55 2 -10 -71 39 -1 -75 15 39 -24 -78 20 -7
3744 -7 -25 34 4 -45 45 -33 -54 48 -28 -28 64 21 -82 3 12 -8 26 16 -81 -16 -5 -36 2 -3 -54 -10 7 -28 5 47 -8
3775 -8 18 50 -37 -33 -5 -12 -31 11 -1 15 29 -54 -39 -29 64 6 -6 83 -52 -4 49 6 -21 27 -44 1 75 -3 -35 36 -61
3806 -61 14 -4 -45 -42 18 11 -5 88 -31 -38 36 -31 -24 26 -19 -53 -26 25 -57 17 -8 -13 25 -19 -20 31 10 -51 -9 43 -54 8 75
3839 75 -42 42 17 -45 -26 7 -17 -3 41 -39 -35 30 31 -30 119 -3 -41 50 -46 -26 74 13 -26 -19 4 -40 -24 36 -69
3868 -69 35 85 -44 -44 64 -72 7 3 30 30 53 -31 -19 62 -35 -64 16 -18 -5 24 -15 -33 12 -37 -5 -3 17 0 52 32
3898 32 -38 -1 95 -49 5 27 -37 53 39 -23 0 -28 -40 25 11 -25 -4 14 76 8 101 1 -59 16 -20 -6 -4 42 28 48
$$ packed form
3681G9m0j13J21n2RQK7r7Q8Jo0O5Lo1R9j7r8L2K2o7J2L6k5J0L9n4rQ2n0J0O3p4
3713a1J2N8m7m8R4jn5N3p0NJ7Q2r3NN3p2J0O2j09N7j2o1J10m0p4R0K4o3n4R8k7
3744gj8N9l0m9R0p8k1J02p6%R2m3j03Q5Rk0L4j0r7O5J1l1L8nn1M4J7l5L3M2n5
3775hK6L2q7MK8pj9M2j2J6J4q3J5J0R3n8j2Q9j35M8N3m3k7M8p1M5P4p8l2P1r7
3806f1P5j8m1LO0pj6R3j19pP4o7PN0m5l4K7N1q2P4k5nL8m4jN1k1o1M2N2r7O2O7
3839G5j17Q4k5o2J9L3k4J4M4q0MO5Jo1J49j22l8R1r6K0J00o1l9PK3m4J6O0j05
3868f9J04N0j29%J08j36P9mK7%K3q4J2Q1r7k9Q0l4J3K9l9j8M5m9L2KK0j7N2k0
3898C2p0L7R6j44N4K2o4R0j4o2K3k8j2O5j4l6K1J8O2o8R3j00o0P5l6J4KM6j4K0
$$ plain form
3928 48 27 -30 -9 59 -61 -1 -11 -37 10 42 8 -7 12 29 41 47 -11 -41 57 -35 -35 44 7 -9 66 -18 -29 39 31 -27 46
3959 46 48 13 40 15 -21 57 18 -23 12 10 -59 62 28 -8 25 -2 -28 49 80 -36 27 57 13 -6 -7 0 -32 16 16 11 55 -6
3991 -6 -12 30 -10 -20 79 46 31 50 27 -34 -8 63 3 21 -12 -16 -20 56 -28 -18 35 29 2 27 -55 62 39 17 -10 57 0 -30
4023 -30 12 -11 -25 -12 2 -34 48 38 -29 -11 50 -8 52 13 -39 46 81 -58 47 47 -2 23 37 -69 5 53 -11 -13 17 -15
4053 -15 -31 43 14 6 12 51 -39 118 -23 -44 36 -35 -82 17 22 -38 26 60 -3 17 -6 -73 -13 27 -38 -13 10 -29 -35 36 -31
4084 -31 -7 33 -60 23 59 13 -63 0 -2 -25 -3 -40 -46 40 -2 24 6 12 24 63 9 -21 -10 22 -48 -20 39 -41 -54 68 -39
4115 -39 -7 29 -30 10 22 -38 13 19 4 40 14 -29 17 -25 -47 -23 -13 -61 -8 11 -9 -12 74 -24 -21 31 -15 -2 -37 -7 -55 -7
4147 -7 10 -21 32 99 13 66 10 -14 0 10 -43 0 40 -33 -23 9 -20 -17 26 18 -10 17 -30 -36 -10 12 3 65 63 -34 -3 31 -57
$$ packed form
3928D8k1n7K1O8j20O0j0k6M7L2l4j5J9J7J2On8l0R8r2%P9l7j6P5q4j1O8qn8P3
3959D6Kl5K7k5l6P8l9m1L5ko9J21l4l6L3k7k6P7L1j16O3L0m4j9jPl2M8%nM4o1
3991foM2m0j0R9l3j5J9k3o1K6P1o0J8l3mmP6q4J0N3ok7K5q2J17k3k2k7O7n7l0
4023c0M2k3j4J3J4l6Q2j0o7J8O1n8O0l9n2Q5L5j39J05%m9K5J4j06P4M8o4kL0l2
4053a5j6P4k9qOL9r0J57j41k1Q0p1m7R9No0O4L4o3K0k3o7O0M0o5K5K3l9oP1o7
4084c1K4M0r3Q3L6m6p6O3kk3K2l7oQ6m2K6j8OJ2L9n4l0J1L2p0K8N9q0j3J22j07
4115c9L2L6n9M0J2o0N1Oj5L6k6m3M6m2k2K4J0m8N3J9k0lQ6r8LN2m6J3l5L0m8M8
4147gJ7l1N3O7q6N3n6k4J4J0n3M3M0p3J0L2k9LM3qk8K7m7oK6K2rO2kr7L1L4q8
$$ plain form
4180 -57 -11 48 3 84 3 29 14 8 18 -9 56 -39 6 2 -24 -41 74 -12 -81 45 -2 -20 58 -4 -42 -29 54 -26 59 18
4210 18 -16 -39 56 -58 16 21 -30 -23 15 -30 -31 9 -53 48 28 19 -46 23 16 -60 9 5 5 29 38 -39 20 -32 -9 29 -12 53 25
4243 25 26 1 -22 -24 -42 39 -45 -3 -13 23 -20 -3 -12 -28 34 -9 -40 -67 57 -37 -5 -26 -65 -17 -1 29 -4 61 19 14 32 35
4275 35 -51 56 -14 -13 -52 -5 34 -24 30 13 4 18 4 -42 19 -61 -20 26 -48 12 -31 3 -29 11 -21 -8 40 -25 -23 7 -39
4306 -39 -88 6 31 -26 15 -26 -25 42 11 -5 21 9 -30 26 -28 -41 -15 46 -30 -27 22 -15 56 -48 -7 3 19 -6 31 85 -3
4337 -3 -13 42 24 -38 48 32 -44 1 19 -60 -15 12 -45 65 12 -31 -5 17 -56 60 2 7 37 90 -5 -12 17 -58 15 -27 -35
4368 -35 0 8 -5 -49 44 -31 -38 80 5 -42 36 -25 -23 -29 -6 -2 41 33 -18 41 7 -29 -9 -10 -16 32 24 -16 7 83 -6 -71 37 -32
4402 -32 64 -6 0 -3 7 -20 32 51 10 34 -11 20 -25 9 64 -10 31 -5 -40 -16 20 -22 25 82 -44 -38 43 6 27 50 -34
$$ packed form
4180e7M6N9m5Q1q1K6j5oJ0k7O5r5M5mk6j7J15q6o9J26m7j8P8o2l8J3Q3q0Q5m1
4210A8l4k3R5j14P4Nn1PL8m5jM0o2J01k0ro5O9pp6O9m%K4Rp7N9n2K3L8m1O5k8
4243B5Jk5k3kj8Q1q4M2j0L6m3J7rj6O2m3l1k7J24r4L2k1l9M8J6L0l3O5m2nJ8L
4275C5q6J07p0Jl9M7L9n8N4j7rJ4j4m6O1q0M1M6p4O0m3L4l2M0l2J3M8o5KL0m6
4306c9m9R4K5n7M1m1JO7l1j6K6j2l9N6n4j3K6O1p6LM9l7P1j04M1J0J6k5L7N4q8
4337cj0N5j8o2Q6j6p6M5J8p9M5K7n7J10n3m3K6K2p3J16n8NL0N3r5pK9p5P3m2q
4368c5L5Qj3m4R3p5pJ18p5m7P8o1KoK3MM3qn1N9l4l6K0joM8qm0K3P6q9o5J08o9
4402c2R6p0OlJ0k7N2J9m1K4m5L1m5L4N5p4M1l6l5K4L6m2M7N7j26OQ1l7K1K3q4
$$ plain form
4433 -34 -38 0 20 -60 37 39 14 18 9 -23 15 38 -48 31 15 -4 52 0 -61 9 -10 5 -39 39 -33 5 54 28 -6 32 33 -12 17
4466 17 24 -17 -5 -15 -6 24 -65 -39 49 4 -62 1 29 -62 2 -70 -22 25 -2 -11 62 -20 -53 10 53 -65 25 32 -3 21 -1 -30
4498 -30 17 14 -20 -35 30 26 10 72 -31 47 7 47 23 25 -40 17 27 36 22 20 26 -60 -31 3 -40 40 81 -63 82 1 -18 0
4530 0 5 29 23 9 -3 -31 0 4 16 21 -14 -11 66 -22 -20 46 -38 -15 31 -35 46 28 -15 -4 2 23 -34 3 5 -10 -12 5 -54 4 29
4565 29 -2 19 4 -9 25 19 13 4 79 -8 -56 3 6 -33 5 60 -43 25 3 33 -1 17 -24 23 20 9 0 7 -67 -17 15 -13 20
4598 20 -22 -49 -6 39 -28 -4 9 -80 34 36 24 -20 60 28 -26 67 9 -31 40 -12 -9 9 25 43 10 14 -22 19 -4 -6 0 37
4630 37 15 26 14 -58 18 19 9 8 -11 -49 31 18 33 -44 43 8 -21 3 31 -23 20 4 -43 0 -12 -23 3 10 -45 -6 -46 6
4662 6 9 0 -11 -3 58 -6 23 6 -45 28 18 -99 -19 5 -4 -21 7 -30 -11 9 12 28 2 29 -30 14 -10 -20 -19 17 -21 43 -35
$$ packed form
4433c4mL8K0q0R7Kk5Mrl2L8K3q6P9j6j9N6n2o1P0j9J5m4P8p2L8M9k6l4L8Jm5K9
4466A7Pm1J2j0RL0q9K6Q8m5o6O3K8r1O4p2M8M7k7rP3q2l3O3M3j18R0Pl5K4k2k9
4498c0M7ll4j5O5mj6O2j03P8m0M0k4Ko5N7J0Rj4kOq6K9L4m3Q0M1j44J45q1j9J8
4530@NK4oj4j2k8L1MJ2Nl5LP7q8KO6q4K3M6o6Q1j8m3J1OK1n7L7Kj5kJ7n9N8K5
4565B9l1K1j5j3L4oorP5q7m8N9Ll9L8N5j03O8k2L0l4J8m1M7lj1rPp4N0L2k8L3
4598B0m2k7M3M5o7K4J3q9J14Kj2m4Q0l2n4R3n8m0P1n2LJ8J6J8l3Ml6M1k3kOL7
4630C7k2J1j2p2P6Jj0jj9l8Q0j3J5p7Q7l5k9K4K8n4M3j6m7M3j2j1K6Pn5L9m0N2
4662FLrj1QO1o4K9j7n1P3j0j17Q0K4rj7K8l7J9K0LJ6k6K7n9M4k4j0JL6l8O4p8
$$ plain form
4695 -35 -23 18 -28 15 22 1 -43 -15 3 -33 35 -7 -21 40 -7 19 -64 43 -23 20 32 -32 48 49 -36 -23 -17 -47 -32 58 50 -62
4727 -62 6 12 -9 10 -15 -19 -57 47 -32 -43 6 -49 -12 8 23 -6 1 -38 21 -15 9 -12 20 20 -69 44 -9 -13 24 2 3 -3 33
4760 33 7 8 46 16 51 13 -42 -18 15 -75 32 29 30 17 9 -9 -6 85 8 2 38 -1 1 4 19 18 60 23 33 -7 23 -25 40 -15
4794 -15 27 76 -2 -36 -52 13 19 -27 -2 0 2 -33 3 45 4 -1 -15 66 -53 0 21 -50 -4 52 -18 34 11 -26 37 6 28 -15
4826 -15 46 4 -2 21 -25 -24 6 39 -37 18 4 -9 -18 -29 10 55 -6 15 52 66 -13 17 20 -95 2 43 -33 -16 0 15 -21 49
4858 49 66 11 14 -27 -34 18 25 -59 -4 28 -38 14 57 30 22 60 -48 21 1 -8 -4 32 -18 41 -51 -21 -13 44 -21 10 2 -25 -25 -42
4892 -42 -24 -9 -3 9 -33 25 19 -9 63 0 -1 7 -22 -6 74 9 -40 -42 18 -8 10 22 -35 -11 20 11 -31 0 -25 -57 -10 -38 -42 -19
4926 -19 -51 -28 11 -17 -32 -14 -15 23 -6 5 -3 53 1 -46 26 -48 -12 22 -1 -100 -47 38 9 -42 0 19 17 34 -19 22 -1 9
$$ packed form
4695c5J2M1m6M3Pk1m4K8J8l6O8m2j4O1m7K6q3J07o6M3J2o4Q0Jq5J3Ol0J5R0qj12
4727f2O8Ok1J9k5ml8J04p9j1M9n5L7K0J5k9Pl9N9l6K4k1L2%q9J13n3mL7k2JoL6
4760C3k6JL8l0L5l8n5K4L3r0J07lJj3qj8LR1p7oL6l9KLJ5jM2l7J0m0L0m8O5n5
4794a5M2M9p8l4j6O5Om6K5KKl5L6M2m1nj4Q1j19N3K1p1M6N6p0N2k3l7O3l1K2m3
4826a5O1m2oK3m6JL0L3p6N5j4j3rj1L9M5o1K1L7J4p9L0Lj15R7M1p6J7J6J5l6P0
4858D9J7n5Lm1pN2Pq4N5L2o6N2M3k7qL8j08O9k0rML6n0N9r2L0QN7o5L1qk7%j7
4892d2J8J5OJ2m2N8ok8P2o3jQk9J6Q0o5m9kO0k6J8J2n7K4L1rm2L1k5l2M7k8mK3
4926a9l2K3L9k8j5J8jL8k9J1qN6n2m7P2p4L6L4k3r9N3Q5k9n1M2J9kJ7n3M1k3J0
$$ plain form
4958 9 0 22 -9 -69 -3 4 -11 71 -5 -44 71 -11 17 26 16 34 36 -13 -48 9 32 19 -26 15 -42 -37 38 -26 4 9 11 13 80 -19
4992 -19 -3 13 12 2 -14 -7 -41 50 -25 -13 0 21 -7 -61 35 -46 17 -26 -21 2 23 -3 -8 26 15 17 -30 14 5 2 -32 -6 38 2
5026 2 26 -15 -4 19 16 -19 -34 -20 14 -38 61 15 15 35 18 -38 16 -3 -28 -8 -18 -18 54 23 -21 8 9 -11 -3 -4 -28 50 46 -50
5060 -50 -14 29 6 18 2 13 26 20 9 -49 -14 -9 -48 24 -6 -21 0 45 -5 25 -31 19 -18 40 2 26 -12 -25 23 -2 37
5091 37 -28 -15 39 -15 67 50 -4 -13 1 6 -17 -11 -48 -5 3 9 -16 30 31 6 -27 14 -19 25 26 -33 43 -18 41 81 10 35 -6 44
5125 44 -34 -57 12 -12 0 -50 23 36 1 12 44 -7 -7 32 27 -23 16 34 -74 -49 -20 -32 37 39 37 -38 19 28 -76 30 15
5156 15 -8 37 47 6 -28 -7 -36 30 -38 12 65 31 -5 21 -7 61 80 -18 -1 33 -27 -20 27 63 11 26 0 -26 -10 33 -25
5187 -25 -30 -50 -46 -20 16 29 -12 23 39 -29 59 -26 9 11 30 29 -37 5 -7 38 6 -38 0 -13 -10 73 15 36 -6 -67 -38 -37 38
$$ packed form
4958IrK2l1o0O6Pj5Q2p6l9J15q2K8Rj0J8Km9l5N7K3j3m5M1n7NP5o4L0NKKO7r9
4992a9J6J6jj0j6Pl4R1p5J2J3K1k8n4R6q1O3m3NK3K1k6nL4j1Km7M4rll4K6M4l6
5026BK4m1J1K3ll5j5J4L4n2R9m6%K0j7n6N4j9k5K0j0%P2l1m4K9Jk0Qjk4P8mr6
5060e0L6M3k3J2j6J1J3oj1n8L5Nl9P2l0j5K1M5n0L0n6N0l7N8l8K4l8j3M8k5L9
5091C7o5J3N4n4Q2j7n4rJ4Nk3Ol7M3QOk5M6Jk5l3M1l3M4Jn9P6o1N9M0p1K5m1N0
5125D4p8k3O9k4J2n0P3J3l5J1L2n1%L9nn0L9J8j08K5K9j2O9Kkp5N7Rj04J06j5
5156A5k3M5J0m1l4K1k9O6o8N0N3l4l6K6k8O8J9r8J7L4o0PM7L6n2J5k6k6J6M3n8
5187b5nk0MK6L6J3m1L5J6o8Q8q5L5KJ9jo6M2j2M5l2m4L8j3LQ3n8K1m2o1K9JP5
$$ plain form
5220 38 -14 7 12 10 6 35 -37 -18 20 -63 -11 4 23 24 48 -33 71 -26 10 -12 -5 -46 -38 -18 18 -17 4 -18 -13 38 9 -21 18
5253 18 -5 -14 38 19 13 4 35 17 4 -16 42 27 17 1 -1 21 -39 -25 57 -9 2 75 -28 -33 43 -3 35 17 43 -27 -45 -17
5285 -17 -19 -2 -14 -62 29 9 -32 12 -9 5 7 58 8 40 5 -2 7 43 -13 22 -3 -34 28 30 -9 -52 11 -28 -21 -7 -23 -36 13
5318 13 15 -11 28 23 34 16 -10 -9 1 -48 -6 -7 89 -6 2 23 -19 38 6 20 21 -12 25 -6 -5 -32 32 57 -13 -22 23 24 2 12 5
5353 5 -2 76 -2 6 -15 -13 -5 26 32 20 -5 17 -9 -51 43 33 18 12 -45 -21 -2 -5 -26 -12 14 29 20 6 36 70 -8 -2 31 24 30 50
5389 50 18 -30 20 -29 -29 -27 2 -30 10 9 -50 27 10 -20 37 79 -21 1 47 -26 -26 12 29 20 23 15 -47 15 13 -30 45 23 4 33
5423 33 -20 -17 -12 -1 -64 8 12 38 12 -8 6 22 65 -5 -39 6 -50 23 11 9 65 -39 8 -24 -4 -14 -33 38 4 -26 9 39
5455 39 -14 4 -11 12 -9 17 -15 -23 -29 -49 32 5 -5 7 31 -12 0 -1 1 -21 27 -46 -20 5 -6 2 29 -1 28 -50 -23 -21 32
$$ packed form
5220C8n2K1NkmK9p2J9L8q3N2J5J9JK4q1J04r7L6k2Pm1QK0L6l5K1k2NN1k9l0L9
5253A8k3rN2j9orL1j8j3k0N8j5j0j6kK2o0J4Q2o6J1P3j03nP6m6L8j8K6p0j8K8
5285a7kJ7j2m8R1k0m1M4k1J4KN1n0L2l5pRL6n6L5k5l1O2Kl9m3O3l9PJ4j6j3M9
5318A3Kk6L9nJ1j8k6JJ0m9M2jR6r5QK1m2N7l2J4Jl3L7l1Jk7O4K5p0rM5Jk2J0p
5353EpP8p8Qk1KQL1Oj2k5K2k6m2R4j0j5on7K4J9lk1J4K6J5rj4L0L4p8OL3pOK0
5389E0l2m8N0m9%KK9l2M0jn9P7j7l0N7M2j00K2M6p3%L8J7rLqo2O2km3P5k2j9K9
5423C3n3LNJ1o3P2MK6k6k0J4J6M3p0l4M5n6P3j2kN6j04M7l2K0j0j9P1l4l0L5L0
5455C9n3J8j5K3k1K6l2qok0Q1k7j0J2K4m3J2jKk2M8p3K6K5j1QK7l0K9p8K7KN3
$$ plain form
5488 32 9 -2 47 25 -7 45 3 28 -27 -16 -12 9 25 -47 -34 -4 -57 -11 -29 15 5 -4 32 13 40 -8 24 5 27 -44 -6
5519 -6 -6 54 30 38 62 12 24 -8 -26 -14 3 -4 -9 -76 -25 29 38 42 -31 -5 -6 -5 -19 27 42 -41 -25 11 -46 -11 -3 -18 -60 -39 -58
5554 -58 -4 -1 2 -16 -24 -9 23 24 12 40 22 0 -31 -1 -19 -5 -31 12 24 44 44 -16 1 -4 19 -25 51 -57 14 -14 12 1 43
5587 43 -6 21 31 -1 -32 18 15 1 20 18 8 29 38 -44 26 6 21 -31 -4 8 47 -27 -34 -8 -7 -8 40 33 8 15 31 46 -12 -10 -1
5622 -1 21 13 -18 12 21 -1 15 47 12 -36 15 72 16 16 -44 25 15 -25 18 3 -43 13 -34 6 -6 6 -26 -16 0 57 5 22
5654 22 34 0 27 54 17 -24 25 19 8 29 -13 -9 20 32 3 20 40 -63 27 5 39 -8 11 -12 2 10 -38 17 39 -13 15
5685 15 26 -4 22 21 18 0 24 9 -4 43 -25 2 8 -17 3 20 37 -10 -10 -11 25 -1 -13 -22 -15 29 -38 -40 16 -26 10 5 9 8 -20 20
5721 20 21 13 -44 6 37 -44 -17 -53 -35 37 9 -49 -40 22 -36 33 40 23 11 -16 21 25 -12 53 -19 9 -8 72 -9 -21 2 -14 41
$$ packed form
5488C2k3j1M9k2l2N2m2K5n5J1MK1J6p2J3L0n3M6j8M4j0rL6j9K7m8L2j9K2p1L8
5519f%O0k4QK4n0J2l2j8J2J7pno7N1N4RMp3K6jJj4M6J5q3J6L6n7L5Qj5m2K1j9
5554e8N4LLj8qJ5L2Jj2K8j8k2l1L0j8J4k6M3J2K0%o0J7nK3m4P6j08P1k8K6j1M2
5587D3m9K7J0l2l1N0lj4J9kj0K1Rq2P0k0J5n2K7J2L9p4pK6JjM8pk5PJ6J5n8KR
5622aK2ql1L0Rk2J6L2l5m8N1N7n6%o0O9j0m0M3j5m6N6m7M0j2J2l2J0J6N7n2J7
5654B2J2l4K7K7l7m1M9oj1K1m2MK9J2k9J7K0j03R0k2L4m7J9k3J4Qm8N5K2n2K8
5685A5J1l0K6jlj8K4j5j3M7o8K7Ok5K0J7J7m7%jL6k6j2rPM4o7kN6m2L6nMjk8M0
5721B0Jqn7N0L1q1K7l6J8P2k8n8RO2n8O9Pj7j2k7L7Ml7O5p2K8j7Q0q1j2K3j6N5
$$ plain form
5754 41 26 -11 -34 -22 49 70 9 -18 10 20 10 -20 15 37 17 5 -30 36 -16 20 21 -14 2 1 46 -56 68 -3 -29 48
5784 48 -7 -1 -22 28 -25 -49 41 -14 15 6 6 0 23 -8 -31 14 5 19 -14 -27 -17 -16 34 -44 4 -18 -14 -18 13 -2 13 33 25 -43 -16
5819 -16 -9 27 20 28 -19 -9 -3 6 59 -21 -1 -1 -25 23 -15 33 -22 14 26 -9 40 -15 20 -5 43 -80 -34 23 -9 38 4 -12 -12
5852 -12 -12 -34 16 -17 63 -25 6 7 34 71 -9 5 -3 -11 21 -35 -65 69 39 5 2 -36 40 32 37 -7 7 32 -30 -39 -17 29 -22 -18
5886 -18 12 -64 -28 40 -2 -8 -1 35 -38 -14 3 -23 15 36 16 27 -2 -11 10 -3 14 31 -24 -5 19 34 -4 38 -5 -40 2 -5
5918 -5 28 -56 -33 69 -2 59 41 6 -8 -4 8 -37 -21 -19 -25 -17 14 28 -4 -19 -18 -28 -35 -16 -40 33 -30 9 44 11 31 -6 40
5951 40 20 -11 -8 23 -26 18 7 0 16 63 24 5 27 -23 -26 40 9 -20 51 -14 -46 -46 31 18 21 -38 -13 14 17 -24 -14 -44 -35 15
5985 15 -19 26 -24 4 1 -14 47 -54 -7 3 33 -9 13 4 1 15 31 -13 13 -36 62 21 25 7 28 3 -55 -49 48 2 -2 29 -31
$$ packed form
5754D1j5l7k3J2P1K1o1k7K8J0j0l0L5K2k0j2l5O6n2L6Jl5J6jM5j02J24p1k6P7
5784D8n5Ok1N0n3k4R0n5K9r%oK3l1k3M5rJ4l3j3J0JN0p8M8k2MmL1j5J5K0qo8K7
5819a6PL6pQm7J0ORN3q0K0%k4M8l8M8n5L6J2l5M9n5L5k5M8j23M6N7l2M7l4j6%
5852a2%k2N0l3Q0q8L1JK7L7q0J4qqL2n6l0J34l0l4ll8P6qNm4J4K5o2rK2M6n1M
5886a8L0p6L6O8m2oPL6p3K4J7k6L8K1k0J1k9rK1j3J7J7n5J9K4J5l8M2m3l5M2p
5918eL3q4K3J02p1O1j8l5j4MJ2m5J6KoQL1J4l2j5Jj0pJ9k4P3o3L9L5l3K0l7M6
5951D0k0l1LL1m9M4j1pJ6M7l9j9K2n0lO6l1k9P1o5l2%P7j3Ln9K5K7Lm1J0l0RN0
5985A5l4M5n0K8lj5O1j01M7J0L0m2K2rlJ4J6m4K6m9R8m1Mj8K1k5n8OR7m6mL1o0
$$ plain form
6018 -31 -12 38 -45 12 38 -20 -35 57 38 -1 19 -27 -28 32 -17 -23 32 12 13 8 -31 -29 46 -18 2 3 6 -20 -15 59 -9 -1 -27 48 11
6053 11 -2 -10 34 23 -6 -1 41 39 -22 34 -28 17 -26 0 -36 23 -9 60 35 -22 -12 10 -2 -18 -2 26 19 14 -11 -55 14 -36 -26
6086 -26 16 -2 -9 -13 41 -17 12 33 -9 -38 22 21 -52 -23 -37 -34 37 8 3 -48 11 -14 20 -49 -18 4 33 -17 10 20 -19 -19 14
6119 14 -2 16 -20 6 42 42 -6 68 60 2 -33 59 -3 46 7 1 24 -50 -3 5 -44 -8 2 -6 17 -60 42 -9 -14 -43 41 -63
6151 -63 24 -6 -7 -6 4 45 22 45 24 -35 21 -3 -12 -4 30 -20 10 14 -26 10 -1 -14 -9 -11 19 23 11 -19 43 -15 -76 -13 2 -48
6185 -48 6 11 -12 2 21 55 10 7 20 -8 4 40 12 -3 -18 -44 13 8 -32 5 32 19 -8 68 -6 48 -18 21 24 -39 -20 12
6217 12 38 8 -10 -1 8 25 -7 22 -4 -38 -12 53 21 35 11 6 -6 22 21 0 57 3 -8 -25 -16 54 63 39 51 3 -26 -19 -40 -1
6251 -1 -24 -5 35 1 -47 -28 -21 28 -38 -54 -9 2 41 1 3 -6 -71 22 -13 11 1 13 16 34 37 6 4 26 -32 -8 34 15 -20 15
$$ packed form
6018c1J9N0q3N7K6n8j5R2j9l9K0m6jO0m9oN5k0Jnl9KP5o4K0JLk6NP4o8Qk6P5l7
6053A1j3qM4j1k9NM2ko1N6o2M5m3K6l6N9l2O9k5n7J0K2j2j6J6K8pnk5m4O9n0J0
6086b6M2j8pmN4n8K9K1m2k9O0jp3K9j4LP1k9nn1N9k5L4o9L1K2K9n0K7J0l9%L3
6119A4j6J8l6K6L6%m8P4qn8l5R2o2M9l9oK3p4M7Qm9L6J0qK3p7J02n1nk9Q4j04
6151f3Q7l0jJJ0M1k3K3k1n9N6k4rQL4n0L0Mm0L6j1j3NkL0Mj2l0O2n8o1O3J5n0
6185d8N4Nk3J4J9L4m5lJ3k8J2L6k8j5j5k6N7nm0L7K7j3k7P6p4N4o6L9Lo3J9L2
6217A2K6l0j8RRJ7l2K9k6l4K6O5l2J4k4nj2K8jk1N7n4j1j7RP0Rk4J2m8k9Pk1L9
6251ak3J9M0l4m8J9PM9o6j6M5J1L9m0Kro5R3l5K4j0J2LJ8Ll1kK2n8K4M2j9l5L5
$$ plain form
6285 15 -22 22 6 35 48 -28 -9 33 27 3 1 -29 -16 38 -44 52 -27 -32 -35 33 0 29 55 -14 1 -39 -8 -3 -10 -5 -3 3 25 -19 23
6320 23 -24 9 14 -31 17 -8 -9 57 3 14 8 -2 -23 52 -35 -19 -22 -38 -4 6 16 -58 -20 28 -40 17 48 -17 8 -6 -6 21 6
6353 6 5 -52 18 15 63 15 -62 -23 0 -21 -17 -5 0 -3 34 36 -53 21 -35 -13 -1 19 0 -41 -3 -44 -63 64 23 -32 -1 40 -22
6386 -22 -4 21 44 -6 27 -20 20 53 8 6 18 -8 -24 -4 1 -28 -29 11 -14 36 -9 -29 1 -15 1 8 -2 29 16 13 -52 53
6418 53 -23 2 64 -44 -11 39 -31 -7 -31 -9 -15 -25 -40 6 -16 -7 -26 -26 47 -29 -19 51 -26 13 -11 7 -5 43 51 -34 -34 -12
6450 -12 5 -12 -8 -26 4 14 -14 9 7 14 7 -12 33 19 -23 1 14 2 0 4 15 40 -28 -32 -45 24 21 -51 38 13 14 52 -42 28 16
6485 16 6 -5 37 53 -32 18 4 22 -16 27 5 33 6 -52 45 6 18 -20 -20 3 -2 13 2 32 28 23 31 39 -10 3 37 48 15
6518 15 -1 4 -21 11 -8 26 -5 -12 18 16 -37 -14 -8 47 21 -23 59 9 25 -16 -3 50 -16 3 7 -27 16 24 -1 -41 -41 -7 -17 -6
$$ packed form
6285A5l7M4j6K9J3p6J9M2ok4kl0J3N4q2R6p9nlO8l3K9K6o9J5m0L1NpNKOK2m4M2
6320B3m7L3Nm5M8k5jO6n4J1oj0k1P5q7J6lj6L4J0J0p4L8M8o8N7L1o5K5j4%K7j5
6353Fjn7P0lM8m8p7L9K3k1MJ2NlL7Kq9P4n6K2J2K0j9m1L8m1j9J27m1n5L1M1o2
6386b2J8K5K3n0L3m7M0L3m5kJ2k6j6K0Nk9jM0k5N0m5k0L0j6J6Pj0L1j3lo5J05
6418E3p6K5O2j08L3N0p0K4k4K2oj0j5M6k2Rj9%P3p6J0P0p7L9k4J8j2M8Qq5%K2
6450a2J7j7Mj8L0J0k8K3kPpj9M5j4m2K4J3j2kMJ1K5o8mj3O9lp2Q9k5JL8r4P0j2
6485A6j0j1M2J6q5N0j4J8l8M3k2K8k7n8R7l9J2l8%K3nJ5j1L0mnQQm9J3L4J1l3
6518A5j6Nk5L2j9L4l1pL0kn3K3ON5k6m4Q2n0J6m1J3N3o6J9Ml4M3Qk5m0%L4j0J1
$$ plain form
6552 -6 -23 10 22 12 10 4 -24 18 42 -29 -32 -28 -59 22 -5 -26 14 -35 6 -34 12 -33 29 31 -1 -50 16 -30 16 45 -3 25 12
6585 12 25 -24 -5 12 -20 27 18 -3 16 -37 24 -10 57 26 13 16 -7 21 38 -21 15 45 48 59 41 -4 -1 29 -26 18 17 -39 14
6618 14 -15 -74 -20 16 -15 -19 -2 -56 -12 -3 -38 49 6 2 4 -76 23 -19 -2 2 -54 -2 -26 14 3 -7 -8 8 -12 38 -9 -37 22
6651 22 22 5 -29 -22 38 41 2 -34 12 -31 -9 -45 -8 58 -5 -10 -15 10 -10 -3 -1 -19 -33 -24 -29 43 12 -13 -4 6 10 45 14 -14 60 -42
6687 -42 18 42 -3 -47 -3 39 -24 -13 -13 10 10 47 9 -1 -17 12 -40 -6 -3 11 5 -32 33 19 63 15 9 -20 36 -18 -46 -27 -23
6720 -23 -5 -11 10 -3 -42 -22 5 -33 -45 -22 1 50 -33 -10 22 -15 -32 -5 54 -6 -38 49 43 -6 -12 34 -33 44 -27 38 1 19
6752 19 6 -25 -5 25 7 14 20 58 -3 -13 19 -10 10 -1 33 -28 -14 -21 -13 -4 5 47 1 44 -17 20 22 -2 18 -2 -20 1 40 13
6786 13 -32 2 -38 54 31 -16 -14 5 -3 -52 -15 30 -1 40 -42 3 -34 0 -17 11 -30 -5 -11 6 -9 25 -21 -13 11 -2 -5 -55 9
$$ packed form
6552fj7L3J2j0kok8M2K4p1lMl1Q1k7k1M0m9M1m0M6m5O2Kl2m9O6m6M6K9m8K8j3
6585A2J3m9J9J7l2M7rk1J9n3O1l4O7l1j3Lk3K8J7n9L6L0LJ1j8m5LL0n5M4jn6N3
6618A4k9n9N4L6l1mJ7n4M4Rl5Q7m3mKq0R9m2J7Mn6N2k4M0j1j0jJ6k0N0m7k8N9
6651B2%j7l4PO0Ll9l6M6m3K2l6L7O6o3nnK5k0PKj8j4RnP2l1k5RJ0ML5l1k8P4j02
6687d2O0K4m5m4M4M2o3J1%K3%L7l8j0j6K9n2L4LJ4ol7O5j4M4m8ok9N6n4k8J9M
6720b3J8oK1j3l9K0K7l8j2K3K3M9q3K3L2l7j7K7N9o0l2Q7om9oM6o7P7p1O5l7J8
6752A9j3l1K0L0j8POL8o1j0L2k9K0j1L4o1J4pQRRM2m6M3o1L7Kk4K0k0j8K1L9k7
6786A3m5L4m0R2k3m7KJ9qm9L7M5l1M1q2M5l7L4j7K8m1K5oJ7j5L4m6QK4j3ln0O4
$$ plain form
6819 9 8 16 0 18 -3 -7 2 0 -5 51 3 15 15 44 1 15 -27 -12 51 31 36 -8 -29 -18 -3 21 -5 -4 -36 -13 -8 60 -12 0 53 40
6855 40 -7 -6 -6 -14 33 19 -15 -21 -43 13 30 -18 -3 -17 -19 -18 -37 33 44 16 -32 -15 28 -12 -38 52 -14 1 -7 15 -30 9 15 -31
6889 -31 -13 -30 3 4 31 -16 -28 11 -18 45 -36 -19 -11 16 65 -5 -41 -10 22 -22 -44 10 -43 -23 17 26 9 45 27 9 15 -27
6921 -27 -14 -20 -28 60 -7 8 -26 -37 -23 -17 -2 13 19 38 28 26 37 4 57 -17 56 7 20 10 -29 12 -21 0 9 -47 -18 -26 -22 -18 41
6956 41 -17 -28 65 33 -18 34 -9 -45 -19 3 16 21 31 -10 -43 -15 51 -13 -31 26 2 4 -17 8 10 -15 48 48 20 43 8 8 23
6989 23 22 49 36 -31 -15 -3 21 -8 -2 -22 -2 -47 50 -34 39 -3 18 0 71 -3 -36 -12 20 -60 -15 17 10 31 50 -52 34
7020 34 -26 -46 -14 7 8 -6 22 -10 15 -7 6 -25 4 9 20 -17 19 -29 -4 -10 -8 101 -19 -24 -6 -32 13 -6 11 38 6 5
7052 5 2 -41 30 -12 8 5 -17 -9 -26 17 -12 16 -31 -9 -11 28 10 -21 -54 16 34 -24 -27 38 -64 41 54 -44 -28 11 -1 -5 16
$$ packed form
6819IjQj6J8k1mRknN6m8J2%K9m3J4m2J5O3k0Nm4k1J1J5K4k6Jl2K3NO8p2J2N3j3
6855D0m7J%qM7j4l4ok2N6J7m8J5j4kJj9P0J1k8m8J7M3m0k6R0o6J5qK2m5L9Om6
6889c1J8j7L3JK7m7j2L9k9O3q1J7QK7M9p0l6L1L2m4k2N4n3K0M0Rj7L6j8j8Om2
6921b7J3oqQ8o7J5l4j1J4OJ5J5OJ9j0kJ1l3N3p4P3m9J3j0l9M1l3K1Rn6K9qMMN9
6956D1n8j1R3l2n1N2m3l6K6K2J3NJ0m1l3K8O6o4j8N7k4Kk1K5Kk5O3%k8K3l5%J5
6989B3jK7j3o7J6J2K4k9Ok0K0m5R7q4P3m2K1j8P1p4l3K4L2q0M5L2pK1J9j02Q6
7020C4o0k0L2K1Jj4K8l2K5k2J3l1K9NJ1l7L6m8K5oKJ09j20nJ8k6M5j9J7K7l2j
7052Elm3P1m2K0lk2Qj7M3k9K8m7K2kL9j8l1l3P0J8n8lO5j02J05J3r8J6L9j2mK1
$$ plain form
7085 16 18 -6 -16 16 17 -1 0 17 -19 50 6 68 -26 -1 47 14 22 -14 -26 -20 10 -4 -36 2 57 -32 41 25 -40 21 15 41 -22
7118 -22 11 -34 -70 -15 60 -44 9 26 -32 24 -12 16 7 45 54 41 44 -56 36 35 -27 -13 10 -19 -7 -24 -17 -62 -12 35 -57 -19
7150 -19 8 -9 -21 -25 -45 -32 4 -6 -12 42 -7 25 -18 -24 -29 -15 -19 18 -3 9 -6 -15 56 13 5 50 -6 -43 49 7 15 4 -13 -20 23
7185 23 -18 21 -8 11 52 -81 -2 -2 13 36 -19 15 -16 9 -28 -66 -15 -53 15 -17 42 52 47 15 3 -8 3 4 -31 34 10
7216 10 3 12 41 10 -14 31 -5 -22 38 -23 36 -10 -8 -25 12 35 -9 -39 18 18 -54 39 -3 -29 15 -12 -24 -13 4 -41 -16 3
7248 3 15 11 51 8 -15 0 -46 32 -2 -1 39 -8 -11 -5 4 0 -31 27 -26 -5 -23 20 -1 -51 28 14 24 20 -14 8 -42 10 -20 63
7282 63 -29 -31 11 -6 -40 -34 27 63 34 -19 -26 -16 26 7 -2 39 -18 24 25 0 -9 33 38 4 33 -58 8 61 -6 -22 -25 13 15 15 -47
7317 -47 -47 -12 -23 1 -19 30 9 -6 7 -7 33 10 -6 -35 29 -6 -3 -19 9 8 -6 -19 21 -18 -5 33 41 41 -3 7 -39 -8 7
$$ packed form
7085A6Kk4j0L2Jj8JJ7l6O9m4O2r4K5M8l3Ql6j2OL0j4l2L8N5q9P3j6o5O1oK6o3
7118b2L3m5l6N5P5j04N3J7n8N6l6K8rL8Rj3Lj00R2jo2J4K3k9J2j7Pm5N0M7r2L8
7150a9K7j7j2mk0J3L6j0oN4m9L2m3onJ4mL7k1J2j5rP1m3qM5n6l7R2m2Qj1j7pM3
7185B3m1L9k9J9M1j33P9%J5K3n5L4l1K5l7l8N1l8O8l2N9J0nl2j2j1J1Jl5O5k4
7216A0pRK9l1k4M5l6j7O0o1N9m6Kj7L7K3m4l0N7%p2R3m2k6M4k7j2J1J7m5K5J9
7248CJ2mM0m3k3J5m6P8l4JM0m7lORml1N8n3K1j8M3k1n0P9j4J0ml4K2n0N2l0Q3
7282F3r2kM2j7l4OO1L6k9n3pJ0M2j9rM1n7M2Jk5rM2Nl4K9r1O6N3o7j6lL8K%o2
7317d7%L5j1K4k0M9k1j5J3j4M0k3j6k9O4l5Lj6K8jj4j3M0l9J3L8Q%m4J0m6L1J5
$$ plain form
7350 7 21 9 -7 -20 -9 31 25 3 2 0 -31 -28 -8 45 30 47 18 -35 9 15 15 -38 14 23 61 43 -6 5 1 -15 -64 40 6 -3 -31
7385 -31 -51 17 -80 19 -29 4 0 -4 12 48 -48 21 -1 9 -20 8 -11 -23 9 -24 9 7 0 -7 10 17 -25 -21 0 13 21 -24 14 -27
7419 -27 42 -16 5 12 18 11 16 14 0 -17 15 24 -18 -1 4 22 -16 41 7 -42 2 -5 -6 22 34 26 19 -34 -23 5 38 -33 -4 4 -32 -16
7455 -16 -1 2 -5 51 18 26 20 1 -6 32 -8 2 -6 44 9 -49 66 -7 19 8 -24 -11 -28 -9 -31 6 -8 -9 26 -67 -3 -32 -46
7488 -46 -10 1 -20 -56 72 25 -84 -11 -6 -23 -26 -30 5 14 1 -8 31 -23 25 24 25 -44 -26 -15 70 -53 41 36 -36 28 15 -14 24
7521 24 43 2 -3 -25 13 2 19 10 -52 -8 -41 -52 6 13 5 -11 -22 36 -2 34 -3 -38 0 19 43 19 -14 -1 -46 -69 -4 1 0
7554 0 8 10 18 -4 31 61 -12 -7 -4 41 14 -4 1 1 21 4 19 -11 37 12 -50 -56 -18 -22 41 -17 24 25 18 -15 30 5 -5 -25 3 -42
7590 -42 1 3 19 43 21 -2 58 -15 -20 3 39 -63 -14 42 24 -31 13 -1 -27 1 -20 5 31 38 21 -3 13 17 13 15 -23 45 28
$$ packed form
7350GJ4j2j6j3J1M0ok2jkl1LK0N3j5J7k9n3M4O%n3N2RL8j8m9J1mj6m9J04l4rk8
7385c1k0O8r7R9m8L3mmJ6L6r6O9k2J0k9K8j9j2L2l3L3kppJ7Pm2MK1J3Qm5L8m1
7419b7O9n8K1POpNkj4j7L2Rm2J7NJ8l8N7l4m9M4pjK8J2qpn3J1K8L3p1K9Ql6J6
7455a6J5LpN6l3Qoj9pL8m0J0qN0l5n8J15p3K6j1l2J3j7J9k2L7j4jL5r3O4k9j4
7488d6L6J1k1l6J28m7j09P3Nj7lmL5Rj3rL9n4M8jJo9J8J1Q5j23R4np2O4j3k9L8
7521B4J9m1nk2L8j1J7ro2M4l3j1N8Pqj6j1N8l8L6l7l5L8J9K4k4l3J3m5k3O5Nj
7554@QKQk2L5L0p3NLM5k7j8N%K0j7J5l0M8k5o2oL8mO3n8M1Jpl3M5k5j0k0K8m5
7590d2M3KJ6K4k2k3O0p3nK3L6j02M9N6j8n5M4j4k6K8k1K5K6Pj7k4J6MmKl8O8j7
$$ plain form
7623 28 -21 -36 -5 24 37 -13 12 17 -2 -46 29 -22 -29 25 -30 12 -28 27 -48 18 -8 18 29 -85 21 -13 -38 -24 21 10
7653 10 18 1 35 6 24 44 -3 -41 13 -30 30 39 20 6 -15 15 -17 -1 -10 -39 -55 3 -19 -11 14 -3 -17 -43 15 14 -30 44 -75
7686 -75 32 22 -14 -48 19 -51 -23 -13 0 1 6 2 11 42 12 -31 22 46 -11 32 2 42 7 -9 -54 -61 12 -17 -2 -3 -2 35 21
7719 21 27 -18 8 8 17 -9 9 12 14 -44 -18 16 -2 -17 34 -9 21 26 -4 -30 8 -15 16 2 -15 20 24 25 35 20 -19 5 10 -5 7
7754 7 17 28 7 12 28 -1 5 68 -36 5 31 5 -48 -7 -7 -3 -36 49 -1 20 36 3 10 43 -14 19 13 10 13 28 -27 -13 17 -24
7788 -24 11 56 36 27 -35 -24 11 -16 35 -11 -4 18 -8 25 -38 67 33 -7 -6 32 -11 4 3 -8 -17 21 33 -3 -42 49 -25 -9
7820 -9 45 -21 37 -8 24 5 36 4 33 25 -2 -19 34 43 -32 14 -59 -14 42 19 -62 14 -14 44 20 -12 -20 23 25 -9 11 -2 -14
7853 -14 2 46 0 -11 -21 -16 -16 18 52 -30 37 5 19 37 -15 26 3 57 -2 -7 35 -8 -11 -13 -8 15 -19 30 -34 14 -8 0 -22 15
$$ packed form
7623B8m9j5L1K9J3n0K5Nj9m4P5n1pN4n5M2m0N5p5O6k6K6J1j14J06l4k5J4M5j1
7653A0Qj7L4k9J8K0m7l8N4m3O0Rj9j4k1L0l2J6rk9j6N8k2QK5j7j4k6N8jm4P4j19
7686g5J07j0l6l4O7p0K8J0J3JNmRL1l0m3N3K4n7M3l0M0l5j6m5pP3k9J5jJL7j4
7719B1Om5K6%Rk6J8LKn8K6L4j8j5N1m3L0Nl0k6L8k3L1j4j7L5MJJ0j5l9K4Nj5J2
7754GJ0J1k1NJ6k9OO3j04M1K6k6n3M1%Ml3Q5n0K1J6l3PL3n7L3olLJ5n5J4L0m1
7788b4L5M5k0ro2J1L5k7N1m6PK2k6L3o3J05l4m0JL8m3J5jj1rL8J2l6l9R1p4J6
7820iN4o6N8m5L2j9L1l2K9qk7j7N3Rp5M6p3M5N6k3q1P6k8N8k4l2qM3Kl4K0j3j2
7853a4J6M4m6j1j0N%L4L4q2O7l2J4J8n2M1k3N4n9nM2m3lkNK3l4M9o4M8k2Qk2L7
$$ plain form
7887 15 13 -3 9 2 31 18 -21 5 -1 31 -35 -16 -32 11 -9 -26 50 -14 -16 36 -28 8 -46 106 60 32 34 7 13 36 -14 -4 19
7920 19 51 3 8 -11 -55 -4 36 47 -7 20 -11 -28 11 -8 30 -17 -33 -4 61 36 22 21 -30 26 -6 -25 38 74 -27 7 22
7951 22 97 -20 -47 -25 27 -27 -8 -8 -35 15 29 -6 -36 9 43 -1 27 -11 -14 17 43 5 24 54 -63 9 41 21 -1 15
7981 15 15 0 -23 47 16 -19 -19 21 18 45 -25 4 -33 61 47 15 -12 0 1 -18 -5 27 7 52 0 11 3 -9 22 21 -35 75 31
8014 31 19 -23 -14 16 -15 27 -11 -57 20 -8 -13 -4 13 31 -9 37 45 -41 -18 55 7 12 24 -19 -29 38 22 -8 0 -6 -1 36 -8 -2 30
8049 30 -52 -26 -26 -19 -6 -13 -27 9 46 -30 3 6 -14 -23 10 37 -3 16 -27 14 18 -7 3 57 -16 34 -6 -36 8 41 -12 -34 -44
8082 -44 -2 2 -11 37 52 27 -37 21 21 52 -2 -11 -21 36 -2 7 -9 -22 -23 32 5 -12 -45 -21 -10 37 -4 29 33 26 -10 51 -17 -51
8116 -51 6 -3 -4 -34 49 64 -27 35 21 -22 31 13 53 -11 16 -30 -3 1 4 -6 4 30 -9 -48 31 -31 7 -25 -77 -46 7 -15
$$ packed form
7887A5kj6J2pK9j3l9K6oL2o6J9j6M3k0j7P6o4kN2o4L6n4J52m6k8Kk7OK3n0J0K3
7920A9L2m8Nj9m4N1M0J1n4K7l1j7L9j9L8m7j6K9O5k5j4jn1N6l2j9O3L6j01L4J5
7951B2P5j17k7K2N2n4J9%k7N0J4l5l0M5L4m4K8l8lL1K6l8J9L0j17P2L2k0k2J6
7981A5%j5k3P0l1l5%M0lK7p0K9l7R4j4l2k7J2Jj9J3L2k0M5n2J1qj2L1jn6J10m4
8014C1j2m2RL0l1M2l8m6P7k8nRJ7J8m0M6Qq6K3P3m8NJ2m3j0O7j6l0QoNL7m4OL2
8049C0q2K6%PJ3pj4L6L7p6L3Lk0rL3K7m0J9m3M1Mk5J0N4p3N0m0l0M4L3n3k2j0
8082d4M2Mj3M8J5k5o4N8%L1n4rj0N7l8Rj6j3jN5k7j7l3K4J1M7m1L3Mpl6O1o8l4
8116e1N7rjl0Q3J5r1O2j4m3N3j8M0o4K7m6K7MLj0J0K6l9l9P9o2L8l2n2L1N3k2
$$ plain form
8148 -15 0 28 7 -27 41 -7 -17 -4 11 1 13 12 26 -6 -24 54 -33 -4 -11 32 35 -34 -27 2 -22 25 36 29 0 -7 -26 11 -35
8181 -35 -12 37 43 8 11 -17 13 -16 5 -33
$$ packed form
8148a5J5K8k1l4O8m8j0J3J5j0J2jJ4l2j8P8q7K9pM3Lo9PK9k4M7J1pk9pj9L7m6
8181c5K3M9Ol5Lk8L0k9K1l8
8191c3
$$ Imaginary data points
##PAGE= N=2
##DATA TABLE= (X++(I..I)), XYDATA
$$ plain form
0 0 0 0 0 0 0 0 0 0 0 0 0 0 0 0 0 0 0 -8 8 -8 8 -8 8 -16 16 -16 24 -24 25 -32 36 -40 48 -53 59 -66 75 -84 96
39 96 -104 117 -129 144 -159 177 -195 213 -236 260 -287 316 -349 384 -424 467 -520 577 -642 717
59 717 -810 919 -1053 1223 -1447 1755 -2203 2918 -4244 7476 -31784 -7052 85838 5190
73 5190 -53617 -34084 -4219 41755 40565 -38821 -46775 -536 26868 37774 2165 -50241 -20881
86 -20881 28602 32288 7840 -29569 -30824 17481 33560 10194 -16937 -27337 -3529 24031 19094
99 19094 -6608 -28393 -9628 23828 13388 -8774 -10321 -14752 -284 22895 3181 -18736 -6079
112 -6079 3175 5668 5740 -5413 -9187 -1566 6109 6639 -3197 -4458 1367 -400 2039 2526 -3087 2002
128 2002 2281 -4216 2809 4025 -2019 714 -3472 -2670 7536 -554 -3314 5013 -7075 -5518 13005
$$ packed form
0@%%%%%%%%%%%%%%%%%qJ6j6J6j6J6k4L2l2M0m8M9n7O8p6Q8j01J12j25J41j59J80
39I6k00K21k46K73l03L36l72M08m49M96n47O03o65P33q08Q91r87J097j219J359
59G17j527J729j972K276k670L202l958N121p162J1720l9260K4732R2890q0648
73E190n8807J9533K9865M5974j190p9386p954M6239K7404J0906l5609n2406K9360
86b0881M9483L686k4448l7409j255M8305J6079k3366k7131j0400K3808K7560m937
99A9094k5702k1785J8765L3456j0440k2162j547m431J4468K3179j9714k1917J2657
112f079R254K493P2j1153l774P621P675N30r836j261N825j767K439M87n613N089
128B002K79o497P025J216o044K733m186Q02J0206q090k760Q327j2088J557J8523
$$ plain form
143 13005 -60 -12189 1406 1713 -1055 5487 -1816 -7591 -1200 3219 4686 -1724 -6699 -229
157 -229 2281 3885 3281 -7364 -3826 6780 846 -67 1996 -5687 109 7064 -1146 -571 -908 -4750
173 -4750 6810 2913 -7825 4745 678 -8381 8008 2512 -11165 4320 4207 -7808 2728
186 2728 3373 -6538 1179 1806 -4932 1811 1068 -3234 1946 -1282 -2730 3981 105 -2958 414 -1200
202 -1200 933 4376 -1944 -4100 3030 2061 -1479 2653 160 -4876 1864 6232 -878 -4211 490
217 490 1978 624 1538 -109 -2611 -721 2865 2970 -2266 -3320 1519 816 779 2152 -3537 -2352 4465
234 4465 560 -1844 1424 -2233 -1356 4551 235 -2657 334 -333 1962 1509 -2860 1474 939 -3176
250 -3176 3849 2049 -5649 2264 3773 -4112 930 3101 -2906 485 1989 -1887 410 906 -496
$$ packed form
143A3005j3065j2129J3595L07k768O542p303n775O391M419J467o410m975O470
157b29K510J604o04j0645L538J0606n934r13K063p683N796O955q210N75l37l842
173d750J1560l897j0738J2570m067r059J6389n496j3677J5485j13j2015J0536
186B728O45r911P717O27o738O743p43m302N180l228j448O711l876l063L372j614
202a200K133L443o320k156P130r69l540M132k493n036O740M368p110l333M701
217D90J488j354R14j647k502J890L586J05n236j054M839p03l7J373n689J185O817
234D465l905k404L268l657Q77N907m316k892K991o67K295m53m369M334n35m115
250c176P025j800p698P913J509p885N042K171o007L391J504l876K297M96j402
$$ plain form
265 -496 617 -1029 -321 1771 -482 -19 59 -2217 1515 2418 -2480 -782 1091 -926 1106 1371 -1423
282 -1423 -1167 -220 2188 1536 -3247 -269 2444 -1896 656 2913 -3326 -1725 3877 -291 -1749 1488
298 1488 -1434 -854 2963 -568 -1738 944 -472 281 1239 -1250 -605 707 -471 986 412 -2331
314 -2331 963 2036 -2271 289 2144 -2598 -54 3089 -1661 -1522 2173 -107 -1151 1223 115
329 115 -632 573 -106 371 262 -813 1023 228 -1270 1354 510 -1226 1097 17 -1557 1514 933
346 933 -1868 111 877 -721 604 778 -1031 -706 365 1123 351 -1603 -113 1158 -511 460 1351
363 1351 -1958 -1036 2788 60 -1435 1089 -773 -768 2353 28 -1612 571 122 -26 1278 -419 -1273
380 -1273 443 224 337 627 -1499 -93 1523 -1048 160 1096 -2008 -283 2045 -819 -1035 985
$$ packed form
265d96J113j646P08K092k253M63P8k276L732R03m898J698J873k017K032K65k794
282a423K56R47K408o52m783K978K713m340K552K257o239J601N602m168j458L237
298A488k922N80L817l531j170K682j416P53R58k489O45J312j178J457n74k743
314b331L294J073m307K560J855m742K544L143m750J39L695k280j044K374j108
329A15p47J205o79M77j09j075J836p95j498K624q44j736K323j080j574L071n81
346I33k801J979P66j598J325J74j809L25J071P58p72j954J490J271j669R71Q91
363A351l309R22L824k728j495K524j862NL121k325j640K183m49j48J304j697q54
380a273J716k19J13K90k126J406J616k571J208R36l104J725K328k864k16K020
$$ plain form
396 985 -193 -563 835 188 -513 -194 466 460 -613 251 774 -1036 372 1151 -1169 217 1034 -1154
414 -1154 177 994 -804 127 491 -880 458 527 -732 724 -157 -1130 1646 152 -1693 1262 482
431 482 -1309 1525 887 -1612 806 1377 -720 733 887 -783 673 1224 -5 233 392 364 719 449
449 449 191 201 91 392 799 -113 -510 492 118 -265 524 -204 -731 229 300 -202 -437 -289 121 -34 -156
470 -156 235 -242 -630 708 492 -889 479 545 -923 939 921 -1031 532 970 -671 658 1054 -782
488 -782 297 823 -496 531 495 -870 535 292 -828 695 -47 -1356 429 108 -1184 333 -90
505 -90 -1610 75 330 -1163 -313 -185 -1094 -205 98 -736 -628 -314 -393 -290 -136 -321 -696 -397 130 -54
525 -54 -494 -389 -230 -122 48 -285 -318 -164 -473 112 303 -660 -334 224 -460 -201 251 -753 -548 559
$$ packed form
396I85j178l70J398o47p01L19O60oj073Q64N23j810J408P79k320J386Q17k188
414a154J331Q17j798R31L64j371J338O9j259J456q81r73K776j494j845K955p80
431D82j791K834o38k499K418N71k097J453J54j670J456N51j229K38J59k8L55k70
449D49k58J0j10L01M07r12l97J002l74l83P89p28n27R60P1n02k35J48M10j55j22
470a56L91m77l88J338k16j381J368O6j468J862j8j952J563M38j641J329L96j836
488g82J079N26j319J027l6j365J405k43j120J523p42j309J785l21j292J517m23
505i0j520J685K55j493Q50J28r09Q89L03q34J08L14p9J03J54j85l75K99N27j84
525e4m40J05J59J08J70l33l3J54l09N85J91r63L26N58o84K59M52j004K05J107
$$ plain form
545 559 -501 -615 456 -728 -682 693 -263 -747 352 -131 -665 271 58 -655 215 -31 -568 554 -82
564 -82 -608 484 -90 -482 464 -13 -613 215 162 -554 214 290 -692 116 315 -534 100 110 -452 -22 256
585 256 -193 -271 312 76 -308 334 167 -304 275 258 -25 179 309 -13 204 452 -52 183 649 -246 208
606 208 716 -315 52 695 -224 -78 643 -86 -114 531 -250 -328 617 -237 -437 479 -217 -487 546 47
626 47 -573 223 180 -321 266 119 -506 213 221 -341 258 212 -378 376 468 -387 57 425 -180 207 523 -250
648 -250 -51 441 -17 75 390 -247 -24 480 -154 -128 356 -148 -170 345 11 -225 -5 172 -122 40 79 -268
670 -268 156 104 -270 202 54 -219 146 194 -162 -134 269 -81 -131 396 -103 -183 297 -173 31 261 -200 -74
692 -74 304 -48 -240 299 72 -497 301 66 -336 310 -97 -382 323 -40 -218 171 -24 -381 211 282 -455
$$ packed form
545E59j060j14J071j184M6J375r56m84J099m83n34R36k13p13Q70k46n37J122o36
564h2n26J092n74l92R46m77o00Q28n3p16P68P6r82Q08J99q49O34J0n62M30K78
585B56m49p8N83k36l84O42j67m71N79j7k83K04J30l22K17K48n04K35M66q95M54
606B08N08j031L67O43r19J46P21p29k8O45p81p8R45q54k00R16o96k70J033m99
626D7o20P96m3n01N87j47o25P19Qn62N99m6n90P54R2q55M44L68o05L87L16p73
648b50J99M92m58R2L15o37K23N04o34K6M84n04k2N15l34k36K20J77k94J62L9l47
670b68M24n2l74M72j48k73L65M8l56K8M03l50n0N27m99q0M80m70K04K30m61J26
692g4L78l52j92N39k27n69P98k35m02O46m07k85P05l63j78L89j95l57N92P1p37
$$ plain form
713 -455 89 305 -446 146 233 -360 144 215 -213 37 63 -229 19 263 -258 -174 380 -230 -116 346 -133 -159
735 -159 138 2 -54 -26 1 -111 58 161 -274 -40 159 -236 48 186 -389 -90 373 -144 -275 199 -153
756 -153 -270 332 -92 -346 344 -149 -225 452 -145 -441 426 89 -414 317 78 -414 309 200 -333 207 100
777 100 -348 326 187 -317 276 246 -238 253 227 -230 42 269 -60 14 264 -41 -8 250 -67 13 212 -147
799 -147 41 231 1 -50 114 151 -155 108 324 -137 37 178 -25 115 116 -80 23 256 12 62 297 -121
821 -121 -56 427 -123 -87 380 -103 -12 319 -48 -95 243 -3 -52 366 -39 -209 365 -1 -172 295 -82 -179
843 -179 237 42 -33 21 -40 -165 140 51 -187 87 -81 -270 153 -3 -218 27 -26 -87 -12 -31 -82 -99 46 -54
867 -54 -22 69 -53 -146 106 123 -155 40 164 -259 150 237 -280 -3 201 -169 25 185 -278 6 219 -261
$$ packed form
713d55N44K16p51N92Q7n93N04P1m28K50K6k92K48K44n21Q4N54o10J14M62m79k6
735a59K97j36n6K8K7j12J69J03m35K34J99l95K84J38n75K99M63n17j31M74l52
756a53j17O02m24k54O90m93p6O77n97k96Q67l37n03P31k39m92P23j09n33N40j07
777A00m48O74j39n04N93l0m84M91k6m57K72K27l29P4K50l05L3K58l17Q0J99l59
799a47J88J90k30n1J64L7l06K63K16m61J74J41k03J40Jj96J03K33k44N0K35m18
821a21O5M83n50L6M67m83R1L31l67m7L38k46m9M18m05j70N74l66j71M67l77r7
843a79M16j95p5N4o1j25L05q9k38K74j68j89M23j56k15K45n3o1P5j9n1j7J45j00
867e4L2R1j22r3K52J7k78J95J24m23M09Q7n17K77K04l70J94J60m63K84K13m80
$$ plain form
889 -261 38 213 -473 -58 239 -364 -101 141 -371 -51 133 -283 -111 140 -254 -145 219 -237 -204 243 -116
910 -116 -141 223 1 -137 78 164 -81 26 142 -52 94 216 -68 90 178 -55 32 184 -53 -135 180 -130
932 -130 -154 245 -52 -212 155 -93 -194 84 -47 -213 180 78 -315 114 131 -349 121 219 -301 43 155
953 155 -243 68 200 -220 -15 204 -197 4 216 -221 -6 146 -166 -10 168 -221 -38 98 -167 -68 -23
974 -23 -125 -79 40 -139 -166 -22 -60 -128 -70 146 -192 -106 143 -58 -116 157 -52 -194 182 22 -160 166 -44
997 -44 -198 251 -57 -213 243 -107 -222 268 -82 -264 128 -87 -208 176 -59 -289 165 -57 -341 193 -48
1018 -48 -367 178 15 -208 105 -25 -161 73 132 -118 45 116 -137 98 202 -129 85 113 -61 127 145 -74
1040 -74 -9 163 -3 0 139 -16 -42 168 49 -74 70 47 -108 92 98 -227 11 251 -187 -29 231 -191 -115
$$ packed form
889b61K99J75o86M15K97o03K63K42n12L20J84m16J72K51l94J09L64m56L3M47l59
910a16k5L64k22j38K15Q6k45J07J16j94J46J22k84J58Q8k33Q7J52k37q2L15l10
932a30k4L99k97j60L67k48j01K78j31j66L93j02l93M29J7m80M70R8n20L44J12
953A55l98L11J32m20K05K19m01K01K12m37K15J52l12J56J78l89J83J36k65R9M5
974b3j02M6J19j79k7J44l8o8N8K16l38Q6K49k01n8K73k09j42L76j60j82L26k10
997d4j54M49l08j56M56l50j15M90l50j82L92k15j21L84k35k30M54k22k84N34k41
1018d8l19N45j63k23L13j30j36K34N9k50J63P1k53K35J04l31K14K8j74J88J8k19
1040g4O5J72j66LJ39j55k6K10j19j23J44k3j55K00Ol25K38K40m38J58K60m22P6
$$ plain form
1063 -115 270 -129 -147 257 -152 -99 350 -136 -170 373 -169 -136 419 -130 -179 351 -81 -107 364 -93 -186 280
1085 280 -11 -165 286 10 -195 235 103 -153 23 77 -172 13 107 -79 -37 122 -3 -16 172 18 -114
1106 -114 111 6 -106 200 15 -218 198 86 -180 146 98 -208 146 180 -237 115 157 -243 112 302 -332
1127 -332 66 261 -303 23 238 -227 -114 257 -184 -112 287 -190 -126 274 -181 -88 230 -110 -141 176 -96
1148 -96 -188 230 -37 -191 251 -41 -188 140 -10 -169 115 -17 -149 64 68 -111 78 118 -114 20 134 -30
1170 -30 -32 107 -88 -57 70 -67 -157 127 -20 -199 151 37 -129 164 33 -223 138 93 -212 101 59 -255
1192 -255 114 98 -293 85 121 -288 32 101 -269 41 208 -238 -30 192 -164 -8 213 -210 -26 193 -142
1213 -142 21 188 -156 -135 131 -18 -117 172 37 -156 149 -14 -208 64 41 -183 69 92 -208 -28 158
$$ packed form
1063a15L85l99j8M04m09N3M49m86l4N43n42L3N55n49m9N30m32k6M71m57r3M66
1085B80k91j54M51k76k05M30j32k56J76N4k49J85R4j86M2J59j25j3J88j54j32
1106a14K25j05j12L06j85k33M16j12k66L26m8l06L54L4m17L52M2m00L55J90o34
1127c32L98J95n64L26K15m65J13L71m41P2L99m77O4M00m55R3L18l40l1L17k72
1148i6r2M18k67j54M42k92j47L28j50j59K84j32j32K13Mj79J89M0k32J34J14j64
1170c0kJ39j95L1J27j37r0K84j47j79L50j14j66K93j31k56L61m5l05L13m2l14
1192b55L69j6l91L78L6m09L20O9l70L10J67m46K08K22l56J56K21m23J84K19l35
1213a42J63J67l44K1K66j49r9K89j35j93L05j63j94K72k3k24K52K3l00J80J86
$$ plain form
1234 158 -153 -48 128 -202 -57 212 -123 -39 196 -94 -176 228 -78 -195 229 -62 -166 280 2 -258 236
1255 236 33 -210 200 92 -298 127 153 -249 158 167 -219 121 166 -178 67 188 -241 19 256 -185 19
1276 19 192 -189 -35 225 -102 -43 228 -14 -81 226 -3 -165 175 3 -144 143 73 -189 100 74 -122 65
1298 65 75 -167 62 217 -210 -16 195 -146 -25 206 -121 -17 245 -122 -71 205 -38 -122 213 -28 -172
1319 -172 216 -67 -175 173 47 -166 143 10 -160 121 141 -267 96 118 -124 129 52 -163 69 115 -90
1340 -90 -19 106 -185 -12 125 -76 -64 166 -133 -52 148 -35 -63 89 29 -144 180 59 -142 50 5 -183
1362 -183 100 -3 -236 107 51 -126 34 111 -177 22 163 -154 -45 240 -242 -93 189 -148 -76 218 -170
1383 -170 -120 265 -89 -116 211 -63 -128 220 -50 -176 143 0 -170 176 1 -160 144 90 -124 118 15
$$ packed form
1234A58l11J05J76l30J45K69l35Q4K35k90q2M04l06j17M24k91j04M46k78k60M94
1255B36k03k43M10j08l90M25K6m02M07Rl86L40M5l44K45J21m29K60K37m41K04
1276A9J73l81J54K60l27N9K71k42o7L07k29j62L40j72j47K87p0k62K89k6j96J87
1298F5J0k42K29J55m27J94K11l41J21K31l27J04K62l67N1K76k43q4L35k41j44
1319a72L88k83j08L48j26k13L09j33j70K81K0m08L63K2k42K53p7k15K32M6k05
1340i0P1J25k91J73J37k01J2K30k99Q1K00j83k8J52o0j73L24j21k01J92m5j88
1362a83K83j03k33L43n6j77J60P7k88J99J41l17J09K85m82J49K82l37P2K94l88
1383a70N0L85l54k7L27k74o5L48k70j26L19j43j70L46j75j61L04n4k14K42j03
$$ plain form
1404 15 -179 36 109 -142 20 94 -167 -21 192 -139 -52 224 -100 -67 246 -47 -177 251 -63 -167 223 44
1426 44 -239 196 126 -159 121 68 -155 89 67 -169 35 121 -204 131 153 -250 51 191 -187 -3 162 -174
1448 -174 -64 232 -148 -86 266 -136 -159 249 -11 -236 244 3 -192 205 78 -257 91 84 -149 73 103 -206
1470 -206 62 111 -98 30 84 -141 12 121 -168 30 77 -144 -6 235 -152 -78 196 -65 -147 235 -54 -229
1492 -229 190 33 -180 152 114 -196 159 136 -142 71 108 -137 51 118 -125 -40 120 -138 21 55 -102 18
1514 18 64 -145 31 167 -112 -77 251 -125 -50 234 -70 -105 218 -2 -254 182 16 -162 106 100 -192 99
1536 99 115 -140 28 89 -125 9 38 -115 54 70 -103 58 136 -95 58 129 -120 12 177 -133 -90 185 -142
1559 -142 -110 197 -15 -148 211 61 -196 174 145 -239 154 181 -183 12 182 -108 -28 177 -103 -2 125
$$ packed form
1404A5j94K15P3k51J62P4k61J46K13l31Q7K76l24L3L13k93j30M28l14j04L90j79
1426D4k83M35p0k85K80n3k23K44k2k36K04Q6l25L35K2m03L01J40l78J84J65l36
1448a74J10K96l80O2L52m02k3M08k60k25M80k41j95L97j27l35L48pk33K22L0l09
1470b06K68M9k09J28N4k25J53J09k89J98M7k21J38K41l87P4K74k61q2L82k89j75
1492b29M19j57k13L32l8l10L55k3k78K13L7k45J88O7k43Q5J60k58J59L4j57J20
1514A8M6k09J76J36k79L5L28l76P5K84l04l5L23k20k52M36j66j78K68ok92K91
1536I9J6k55J68O1k14J34K9j53J69J6j73J61P8k31J53P1k49J32J65l10M3K75l27
1559a42L2L07k12j33L59j50k57L70k9l84L93K7l64J95J70k90Q0K05k80J01J27
$$ plain form
1580 125 -84 -57 111 -95 -12 116 -172 -12 120 -223 -29 207 -130 -106 206 -67 -200 291 -43 -256 204
1601 204 52 -277 147 139 -247 61 114 -158 48 167 -99 -63 173 -100 -26 191 -109 -20 104 -61 44 107
1623 107 -97 -61 106 -98 -64 149 -148 -150 249 -56 -184 260 11 -205 165 96 -194 45 222 -155 27 262
1645 262 -161 -97 211 -43 -111 128 -44 -32 80 9 -66 80 -74 64 143 -75 -13 113 -148 -44 189 -124
1667 -124 -120 151 19 -153 212 88 -255 181 113 -203 42 215 -182 -48 227 -114 -78 132 -2 -81 124 10
1689 10 -105 70 74 3 46 -80 -12 46 -67 45 92 -134 -33 184 -89 -114 176 -30 -204 143 119 -325 66
1712 66 188 -256 19 236 -197 -89 213 -30 -139 121 -17 -92 79 114 -45 0 -5 22 77 -41 9 137 -105
1735 -105 -22 134 -112 -103 251 -35 -179 170 17 -288 142 133 -293 64 203 -205 -32 226 -112 -157 125 -77
$$ packed form
1580A25k09K7J68k06Q3J28k88J60J32l43J94K36l37K4L12k73j33M91l34k13M60
1601B04j52l29M24ql86L08N3k72K06J19k66L6K36k73P4K17l00Q9J24j65J05O3
1623A07k04L6J67k04L4K13k97kL99l05j28M44k49k16L70o9k90K39J77l77J82K35
1645B62m23O4L08k54o8K39j72J2J12p1p5J46j54J38P9k18O2J26k61J04K33l13
1667a24MK71j32j72L65j24l43M36o8l16K45J73l97J34K75l41L6K10j34p9K05j14
1689A0j15J75Mp1M3j26O8N8j13J12M7k26J01K17k73k5K90k06j74L47k4m44L91
1712F6J22m44K75K17m33J08L02k43j09K60j38p5J71L5j59M5nK7N5j18N0J28k42
1735a05Q3J56k46RL54k86j44L49j53l05M30rm26L57J39m08J73K58l38m5K82k02
$$ plain form
1757 -77 -152 194 27 -87 37 99 -66 23 24 -59 24 -12 -42 152 -42 -43 142 -22 -73 193 -12 -193 173 119 -207
1782 -207 79 175 -281 22 305 -151 -103 270 -101 -179 230 13 -207 83 74 -128 47 13 -77 35 32 -2 0 -20
1806 -20 -30 116 -42 -104 129 -5 -171 152 62 -230 153 104 -285 25 233 -169 -83 272 -85 -139 224 -45
1828 -45 -206 134 91 -144 94 108 -127 19 106 -54 14 36 -20 72 -38 -67 65 19 -84 47 34 -127 179 108
1852 108 -187 59 165 -206 -29 290 -160 -99 244 -45 -207 168 56 -306 89 51 -140 -4 109 -116 -30
1873 -30 121 -1 4 33 -47 68 -29 -88 108 -9 -73 233 24 -174 133 176 -246 35 194 -179 -52 233 -129
1896 -129 -122 231 -45 -178 149 66 -80 56 86 -134 -33 55 -106 5 28 5 46 -16 6 -3 -32 -108 116 28 -141
1921 -141 156 57 -187 63 151 -157 -51 212 -172 -167 265 -29 -115 217 22 -180 143 82 -161 68 112 -192
$$ packed form
1757g7p5L46j67j14J24O2j65Q9Jq3Q3l6l0J94j94jJ85j64n1K66k05j81L66n4l26
1782b07K86R6m56L03K83m56M8L73l71p8M09k17k20K90rk02J75l4r0J12ll4Kk0
1806b0j0J46j58o2K33j34j66L23r0k92L83m9l89L10K08m02Q6L55l57n4L63k69
1828d5j61L40m3k35K38J4k35J46Q7j60O8K2n6R2j10k9J32m6j03J31j3j61L06p1
1852A08k95K46J06l71J77L19m50O1L43k89j62L75j12l62L95l8j91J36J13k25Q6
1873c0J51j22NK9q0J15r7n9J96j17o4L06k09j98L07M3m22K81J59l73J27K85l62
1896a29PL53k76j33L27q3j46J36L0k20J01Q8j61J11K3k3M1o2K2rk9p6K24q8j69
1921a41K97r9k44K50Q8l08J06K63l84NM32k94q6L32j95k02L23o1k43K29M4l04
$$ plain form
1943 -192 72 129 -65 -37 89 -79 22 34 -104 64 33 -70 60 25 -123 84 123 -180 58 151 -184 1
1965 1 213 -140 -94 245 -46 -178 150 48 -107 123 4 -170 36 157 -64 -32 64 -69 -29 31 4 30 16
1988 16 -96 29 64 -118 9 32 -113 11 176 -86 -28 149 -157 -72 232 -48 -129 232 -30 -122 148 40
2010 40 -195 93 143 -118 37 88 -10 -34 60 -47 -14 59 -58 49 41 -57 41 29 -126 53 70 -133 37 114 -151
2035 -151 -35 120 -78 -92 182 -9 -154 135 42 -132 86 50 -107 33 80 -138 10 98 -109 -13 47 27 -19
2058 -19 19 -70 4 30 -60 67 52 -132 76 71 -103 -43 116 -97 -98 150 -79 -127 176 -34 -180 115 80 -149 83
2083 83 85 -143 -30 116 -51 34 114 -109 -15 38 -19 18 42 -95 -20 25 -99 64 55 -96 -26 121 -110 -81 114
2108 114 -122 -82 174 -44 -147 176 33 -138 86 49 -147 55 47 -135 40 74 -102 25 41 -13 39 37 9 -12
$$ packed form
1943a92K64N7j94K8J26j68J01J2j38J68l1j03J30l5j48K07L9l03K38R3l35J85
1965AK12l53M6L39k91j32L28j02j55K30j19j74K06J21k21L2R6j33M0O0k7K6j4
1988A6j12J25L5j82J27K3j45J24J65k62N8J77l06Q5L04k80q1L61k62r2K70j08
2010D0k35K88N0k61J55N1r8k4R4j07L3P3j17J07qr8R8j2j55J79J7k03J70P7k65
2035a51J16J55j98j4K74j91j45K89r3j74K18l6j57J40M7k18J48Q8k07R6O0k0m6
2058a9L8q9P4K6r0J27j5j84K08nj74O0J59k13jK48k29m8L03k10j46K95l5k29K32
2083H3Kk28J13J46j67Q5Q0k23R4N3n7L7K4j37P5M5j24J63rj51P0J47k31K9J95
2108A14k36M0K56k18j03L23j43j71K24l7j96K02qj82J75L4j76J27J6n4N2kk8k1
$$ plain form
2132 -12 47 -55 20 72 -63 26 67 -48 -30 97 -95 -64 154 -59 -122 108 -9 -135 140 112 -144 93 112 -135
2156 -135 31 83 -106 -59 86 -118 -19 44 -82 -12 88 1 40 63 -77 -27 68 -52 23 82 -92 -23 111 -61
2180 -61 -74 155 -51 -55 117 -21 -160 81 55 -118 41 82 -96 -4 48 -77 -25 99 -20 17 52 -29 26 64 -2
2205 -2 -7 49 -5 -1 89 -26 -55 78 -78 -89 70 -76 -73 29 1 -41 125 10 -60 49 30 -59 11 69 -145 4 49
2232 49 -62 2 47 -97 13 59 -60 27 30 -46 46 95 -59 -57 45 -17 -24 159 -53 -10 151 -51 -97 91 2 -143
2258 -143 14 31 -107 39 85 -105 -6 28 -66 9 33 -9 11 69 -40 -14 97 -32 7 111 -31 -25 58 -31 -46 87
2284 87 -28 -92 108 10 -79 53 -30 -109 121 -6 -136 107 28 -99 50 50 -27 -1 136 -100 -13 51 -121 -14
2308 -14 73 -47 -14 57 -34 -46 40 -15 -22 108 -50 -79 158 -51 -47 58 -1 -36 28 -27 -106 66 41 -80 -10 69 -85
$$ packed form
2132a2N9j02P5N2j35Q9M1j15J8J27j92L1K18k13o3K30j17j26K75k8k56K37J9k47
2156a35J66N2j89M7J45k04R9O3j26P0J00q7L9K3j40N0R5j20P5N9j74O9J34j72
2180f1j3K29k06mJ72j38j39K41k6j73J59M1j78R2N2j25N2J24j19L7L5q1N5L8o6
2205bnN6n4MR0j15k9J33j56j1J59j46LJ02k8m2J66j15p0J09j9q9P0N8k14J49M5
2232D9j11O4M5j44J10M6j19Q7Lp6R2M9j54KJ02o2pJ83k12M3J61k02m6J88q9j45
2258a43J57J7j38J46M6j90R9L4r4P5K4m2K0N8j09K6J11j29L9J04j42OQ3q9j5J33
2284H7j15o4K00r8q9J32q3p9K30j27j30K43p9j27J49%p7K6J37k36Q7O4j72J07
2308a4Q7j20L3P1r1j2Q6n5pJ30j58k9K37k09MJ05n9l5O4n5p9J72k5j21P0P9j54
$$ plain form
2335 -85 -59 37 -79 -71 48 -39 -103 61 -18 -52 59 -79 -20 2 -4 -45 58 32 -10 19 -54 -108 45 -14 -40 -4 10 -78
2363 -78 33 55 -104 24 44 -69 20 43 -54 -97 85 -61 3 47 -33 -51 45 31 -42 68 -69 -26 68 9 -41 40
2389 40 -30 -79 35 20 -1 49 -17 -45 78 41 -101 11 30 -73 -8 45 -79 8 78 -2 27 81 -28 -20 96 14 -49
2416 -49 6 -58 -29 115 -22 -97 33 -6 -52 65 -20 -92 89 5 -47 116 0 -143 -36 25 -37 33 49 -72 -24
2441 -24 97 -106 47 105 -108 19 51 -80 29 59 -66 -56 124 -67 -53 125 -28 -25 121 28 -82 65 -34
2464 -34 -63 -19 53 -52 58 36 -45 65 30 -58 7 72 -70 -9 49 -77 -23 57 -50 18 35 -57 -39 59 -38 -34 48 -52
2492 -52 -90 52 15 -44 108 26 -91 61 19 -58 -2 -4 -55 24 98 -113 -6 101 -77 -10 63 -99 9 74 -90
2517 -90 -17 33 -31 -29 76 -24 -22 82 -61 -34 74 44 -55 25 -6 -23 85 3 -75 72 50 -105 34 38 -110 18
$$ packed form
2335h5K6R6j16QJ19q7o4J64p9l4J11j38N9K2om1J03k6m2K9p3n4J53n9k6L6J4q8
2363g8J11K2j59J28K0j13Q9K3r7m3J82j46O4M4q0j8R6j4p3J10j37M3R4n9n0Q1
2389D0p0m9J14j5k1N0o6k8J23l7j42J12J9j03O5N3j24Q7P0q0K9N4j09QJ16q2o3
2416d9N5o4K9J44j37p5J30l9m6J17q5p2J81q4n2J63j16j43J07O1o2P0J6j21M8
2441b4J21k03J53N8k13J27L2j31J09L0j25J0J80j91J4J78j53LJ46r3j10J47r9
2464c4k9M4P2j05J10k2q1J10l5q8O5O5j42O1N8j26N4Q0j07O8J7r2J8R8r7MQ2j00
2492e2l8J42l7n9J52q2j17J52m2p7N6kn1P9P4k11J07J07j78O7P3j62J08O5j64
2517i0P3N0o4KJ05j00KJ04j43K7J08l0r9Q0l1j7J08q2p8J47k2j55J39Mj48J28
$$ plain form
2543 18 42 -94 -18 11 -62 9 117 -29 -31 50 -47 -23 102 -39 -71 63 -51 -39 35 -4 -43 55 3 -15 71 64 -50
2570 -50 36 34 -61 46 44 -65 -15 42 -70 -26 47 -61 -16 59 -92 -50 83 -89 -21 67 -20 1 63 -29 -57 82 -65
2597 -65 -92 97 4 -28 89 -1 -83 75 -18 -42 48 -13 -71 83 119 -63 -1 45 -62 71 45 -34 -1 114 -61 -26
2623 -26 26 -68 -68 122 -70 -37 106 43 -76 42 -30 -143 22 10 -64 44 14 -59 74 29 -94 12 78 -69 63
2648 63 60 -53 22 119 -59 43 46 -70 16 37 -35 -46 69 -31 -50 102 -47 -63 95 11 -109 41 -8 -78 38
2673 38 3 -87 46 8 -84 10 23 -88 23 47 -49 61 55 -108 9 60 -26 2 71 -67 -11 82 -20 -13 21 -58 -92
2700 -92 49 -60 -44 24 -31 -46 39 -15 -57 25 39 -38 11 -29 -73 24 17 -63 80 78 -124 14 48 -59 -11 85 -13 17
2728 17 92 -50 -22 83 -14 -82 36 -2 -32 57 -20 -20 133 -15 -21 58 22 -55 -14 1 -22 9 41 -73 21 25 -93 0
$$ packed form
2543A8K4j36P6K9p3P1J08j46kQ1r7K4J25j41l2J34j14J2P4l9l9R8n2j8Q6pj14
2570e0Q6kr5J07kj09N0N7j12M4P3j08M5P5j51M2J33j72O8Q8q7K1O2r2k8J39j47
2597f5k7J89r3l2J17r0q2J58r3k4R0o1n8J54L6j82O2M6j07J33k6p9L3J15j75L5
2623b6N2r4%J90j92L3J43o3j19J18p2j13J65j2p4J08l0p3J33m5j23J06O6j47J32
2648F3lj13P5R7j78J02Lj16Q6K1p2j1J15j00j9J52j49j6J58q4j20J50m9p0J16
2673C8l5r0J33l8r2R4J3j11J11K4r6J10oj63J17N1q6K8O9j38N6R3j02PL4p9l4
2700i2J41j09J6O8n5j5Q5n4m2Q2J4p7M9m0m4R7pq0J43kk02J38L4j07M8R6r8L0
2728A7P5j42K8J05r7o8J18l8l0Q9p7%J53j48oP9l6p7M1J5k3L1L2j14R4Mj18R3
$$ plain form
2756 0 21 -76 14 60 -66 -44 48 -32 -70 96 -43 3 65 -17 -59 42 -3 -48 56 -7 -33 15 -14 -80 104 18 -104
2783 -104 38 81 -75 -35 61 -84 -33 49 -33 6 39 -65 -37 38 -16 -30 67 25 -30 59 10 -48 53 19 -7 43 19
2810 19 -37 89 26 -58 37 31 -21 -30 -8 -81 85 14 -44 -16 12 -39 -2 76 -102 -45 44 -39 -8 76 -28 -9 44 -33 -49
2839 -49 8 -29 -56 98 -48 -29 50 19 -31 69 35 -30 -27 16 -99 10 23 -71 52 28 -67 -23 22 -108 -19 64 -59
2866 -59 17 53 -77 -67 48 0 -44 34 -46 -84 74 -15 -45 24 -15 -74 70 18 -31 22 33 -22 24 3 -84 42 72 -28
2894 -28 11 53 -24 -38 41 -45 -22 109 -37 -48 73 1 -66 94 -6 -61 45 -53 -43 85 7 -76 58 70 -58 0
2920 0 25 -38 21 54 -52 28 29 -31 -11 42 -52 -12 62 20 28 85 -10 -41 78 -33 -33 53 -12 -10 19 -43 -67 57 31 -55 35
2951 35 -24 -28 46 51 -133 -13 33 -44 36 54 -76 -35 87 -72 -48 -15 -12 -13 44 -53 -27 105 -22 -49 34 -11 -86 43
$$ packed form
2756@K1r7R0M6j26K2R2q0l8J66j39M6O2q2m2J01m5m5J04o3k6M8k9o6J84q6j22
2783a04J42M3j56M0R6j45N1Q2q2L9L3j04K8P5n4j4R7m2n5Q9m9n8J01l4k6N0k4
2810A9n6J26o3q4R5on2rK2p3J66p1n8K8K8n1L7P8j78N7Q9q3L1Q4j04J9N3p7j6
2839d9N7l7k7J54j46J9P9l1n0J00l4o5LM3j15J09J3r4J23k4r5M4M5j30Q9Q3j23
2866e9P6L6j30J0J15m8m4P8q0l8J58q9l0O9l9n9J44n2m9N3J1n5M6k1q7J26L0j00
2894b8L9M2p7j4P9q6K3J31j46j1J21p2o7J60j00n5J06r8J0J28p8q3J34J2j28N8
2920@K5o3N9L3j06Q0Jo0K0N3r4M0P4m2QN7r5l1J19j11%Q6o5KK9o2k4J24k6q6R0
2951C5n9mP4Nj84J20M6p7Q0J8j30M1J22j59K4L3LjN7r7K6J32j27k7Q3m5p5J29
$$ plain form
2979 43 21 -36 47 15 -22 8 2 -67 48 -2 -12 70 44 -64 15 32 -93 4 54 -74 -24 42 -45 -3 30 -63 -26 89
3007 89 -50 -37 66 10 -65 41 -39 -28 53 33 -63 71 -24 -61 77 -33 -80 -10 40 -79 -47 65 -1 -39 49 -35
3033 -35 21 71 -41 -6 55 -68 -34 82 -6 -32 55 2 -22 57 -38 1 14 28 -77 35 -8 -68 31 53 -83 25 56
3060 56 -78 40 42 -101 -28 63 -64 9 13 -42 -31 44 -79 -56 82 -45 -74 65 -23 -48 71 -31 -53 25 -52 -93
3086 -93 -16 41 -43 88 35 -40 -5 4 -48 5 39 -86 -20 27 -39 7 53 -30 28 46 -17 22 56 -58 -9 114 -37 -91
3114 -91 30 15 -99 51 10 -21 34 3 -55 42 56 -63 31 13 -125 15 66 -59 32 22 -43 -6 83 -62 11 24
3140 24 -52 -17 107 -69 -13 57 2 -78 45 -35 -55 33 3 -40 36 -1 -44 25 3 -65 65 28 -62 2 44 -34 15 87
3168 87 4 63 63 -34 2 13 0 -52 -9 -69 31 51 -34 -60 32 -22 -5 60 -13 -31 48 12 -81 48 48 -2 68 46 -107 72
$$ packed form
2979D3k2n7Q3l2l7L0oo9J15n0j0Q2k6j08P9J7j25R7N0j28N0O6q7M2L3r3L7J15
3007H9j39J3J03n6p5J06q0J1Q1k0r6J34r5l7J38j10m7P0N0j19L2J12o6l8Q8q4
3033c5N6N0j12L5O1j23L4J16q8k6Q7n3k4P9r5L9J3J4j05J12m3o0R9K2j36J08L1
3060E6j34J18Kj43P3R1j27P3Mn5J1P5j23K3J38j27k9J39q8k5J19j02k2P8p7m1
3086i3P7N7q4J31n3p5L5Rn2N3L4j25O6M7o6M6M6q3N8J8o3L9L4j14M9J23j51n4
3114i1J21j5j14J50m1l1N5l1n8R7J4j19R4j8j38J40N1j25R1j0o5L7Q9j45P3J3
3140B4p6L5J24j76N6P0n5q0J23q0k0Q8l0m3P6l7m3O9k2o8J30l7r0O4M2p8M9P2
3168H7q3N9%r7L6J1j3n2M3o0J00K0q5k6R2n4J7O5p3j8P9l6r3J29%n0P0k2j53J79
$$ plain form
3198 72 30 -60 34 42 3 -1 78 -26 -6 114 -16 -47 57 12 -16 34 -20 2 60 -39 -42 61 -23 -105 56 0 -65 38
3226 38 46 -4 60 -1 -43 -42 12 -73 39 -10 -55 15 44 -60 13 48 -23 -19 44 -41 -63 53 -37 -12 50 -29 -34 14 41 -63
3256 -63 -18 -6 -17 0 -14 -51 42 37 -69 -10 -11 -53 -8 54 -54 -25 20 4 -19 18 -45 13 10 -13 -22 101 -3 -38 87 -9
3286 -9 -57 87 -35 -47 79 -58 -40 -3 38 -13 57 12 1 48 -24 -56 29 38 -14 59 44 -70 1 28 -15 -59 33 -84
3314 -84 -80 84 -60 -26 56 -10 -80 75 19 -35 110 18 -47 62 47 -22 30 16 -67 30 9 -70 30 45 -31 5 16 25
3342 25 19 34 -17 -19 20 -61 -60 10 -30 -45 54 -48 -22 93 -23 -4 26 -50 -69 -8 18 -70 1 -74 -31 17 13 -39 32 91 -27
3373 -27 22 61 -61 -1 59 -11 16 12 -14 16 86 -4 1 25 -51 9 83 -38 -79 41 -6 -89 10 -10 -52 67 16 -28 9
3402 9 27 -89 5 -32 -17 30 36 -18 -5 40 -44 -2 21 -15 38 35 -52 -1 4 -3 1 14 -46 -27 57 -46 -39 7 -22 -45 45 -13 -50
$$ packed form
3198G2m2r0R4Ql9mP9j04K0J20j30l1J04m5k8N0n4K2N8r9lJ03q4q2J61n6o5J03
3226C8Qn0O4o1m2JN4q5J12m9m5P0K9j04P3L5p1MO3q5k2J16r0K5O2p9nM8K7j04
3256f3M5J2j1J7j4l7R3nj06N9jm2M5O2j08K9M5j6k3L7o3N8lk3rJ23j04l5J25r6
3286im8J44j22j2J26j37J8L7M1n1P0m5j1M7p2l2Q5Rn2P3j5j14P1K7m3m4R2j17
3314h4MJ64j44L4Q2o6p0J55n6n4J45r2o5J09j5o9N2j4q3R7k1p9J00J5p6L6J1R
3342B5oJ5n1kL9q1JP0m0j5R9j02K6J15j16J9L0p6j9O1K6q8P1p5M3M8mn2P1N9j18
3373b7M9L9j22O0O0p0K7mk6L0P0r0NK4p6O0P4j21m1J20m7q3R9k0m2J19n1m4L7
3402IJ8j16R4l7J5M7On4J3M5q4M2K3l6N3lq7N1NpMJ3o0J9Q4j03PM6k9k3R0n8l7
$$ plain form
3435 -50 15 23 -46 15 -71 -54 -5 43 -53 7 72 -15 6 53 -2 71 51 -42 -51 28 -41 -11 13 -69 -66 90 10 -66 50 7 5
3466 5 -12 -12 -101 12 0 -80 -15 -2 -29 20 10 3 14 -9 -25 -3 27 -16 -43 67 -18 13 76 12 -19 30 7 -45 58 -20
3496 -20 -44 13 0 -50 35 -11 -61 -3 -14 -29 -29 -2 -41 21 32 -7 26 21 -13 -6 47 -68 -14 -8 -27 -12 59 -5 31 51 -67
3527 -67 2 37 -7 -33 85 -38 -21 12 -13 -52 47 -1 -52 60 34 -60 -25 -14 -42 4 27 -53 13 48 -36 6 23 24 -43
3556 -43 40 -16 -71 29 30 -40 56 -10 -26 9 -3 6 59 -9 -43 102 -35 -8 31 34 -34 -3 -9 -73 -19 23 -73 4 45 -120
3586 -120 28 18 -55 -43 -6 -25 -51 8 -9 1 22 -58 -5 40 -39 -61 86 31 -74 28 -12 -49 48 22 -91 -55 -1
3613 -1 -84 -15 23 -31 33 23 -53 -14 54 20 20 5 -42 -65 -32 -34 -10 -6 -14 -26 20 -40 -17 54 13 -65 31 -67 -54 33 -15 -62 20
3646 20 9 -61 -49 42 -68 18 36 8 23 5 -2 -19 55 -21 -50 42 -75 -3 9 -33 -22 8 -20 -72 26 -54 -49 -25 11 -38
$$ packed form
3435e0O5Qo9O1q6J7M9M8r6O0O5q7K1M7n5P3k0r3rP9o9L0K4q2LJ56q0p6J16m3k
3466Ej7%q9J13j2q0O5J3k7M9j0pJ1k3j6K2L0m3k7J10q5L1O3o4l1M9k3n2J03p8
3496b0k4N7j3n0Q5m6n0N8j1j5%K7l9O2J1l9L3nl4PN3j15N4Oj9J5P1o4L6K0j18
3527f7O9L5m4k6J18j23J7L3k5l9R9m8n1J12k6r4L5J1k8M6K3q0O6L5q4M2J7Jo7
3556d3Q3n6n5J00Jp0R6o6j6L5j2RN3o8l4J45j37K7L9Lo8L1oo4N4M2r6P7M1j65
3586a20J48j0p3J2L7j9k6N9j7J0K1q0N3M5p9k2J47n5j05J02m0l7R7k6j13L6N4
3613aq3O9L8n4O4j0p6L9O8l4%j5m7k3L3kK4Mqj2M6o0K3P1m1p8R6r8J3Q7m8m7Q2
3646B0j1p0J2R1j10Q6J8k8J5j8pj7P4p6k9R2j17P2J2m2J1L0k8n2R8q0NK4L6m9
$$ plain form
3676 -38 12 5 -26 9 22 -31 16 -19 -96 -4 18 -44 0 99 -69 28 56 -32 -45 35 40 -32 12 -81 -20 -11 29 -47 -2 -32 -43
3707 -43 41 -6 -51 43 24 6 1 20 -37 30 16 -11 22 119 6 18 16 -53 -42 35 -9 -37 73 -40 -62 39 26 3 73
3736 73 24 -27 29 14 -55 43 -72 1 7 -33 -27 3 13 36 6 -2 -69 53 39 -80 36 -26 -58 12 38 14 -19 22 -4 -25
3766 -25 6 20 -46 26 10 -7 54 27 -31 49 -24 -45 -29 -22 -41 -16 2 -72 -25 45 -42 1 -16 43 8 25 -25 -2 50 -35 -1
3797 -1 42 -32 -34 27 -22 20 21 36 -51 38 50 -44 63 3 -48 -2 -22 -50 40 54 -39 10 37 -82 8 72 -36 32 25 43 10
3828 10 25 -24 -54 32 -58 -64 15 -3 -49 14 -11 -31 23 22 -33 19 52 -13 68 22 -12 90 25 -6 9 23 -9 42 39 31 1 0
3860 0 -65 41 11 -13 5 13 -67 6 45 30 -8 39 -29 -72 60 -45 -75 26 14 -24 65 17 -5 54 15 -17 21 9 -13
3889 -13 15 47 -57 14 -8 -9 3 35 -13 14 7 -52 -52 17 -37 -24 38 -29 -7 62 4 -10 70 6 -4 60 40 -24 42 28 -57
$$ packed form
3676c8N0pl1L5J3n3M7l5p7R2K2o2M4R9j68R7K8q8j3Q0Np2M4r3O1RM0p6M5l0j1
3707d3Q4m7m5R4j9j8nJ9n7O7j4k7L3R7j13J2ko9J1P7m4k8J10j13k2J01j3k3P0
3736G3m9n1N6j5o9R8j15P3Om0OL0J0K3l0qo7J22j4j19J16o2l2P0K6k4l3M1k6k1
3766b5L1J4o6P2j6j7O1k7n8Q0p3k1J6Pj9K5J8p4M7P0q7M3j7N9l5J7n0K3N2q5L4
3797aM3p4kO1m9M2JJ5q7Q9J2r4J07o0n1M6k0k8R0J4r3M9K7j19R0O4j08O8pJ8l3
3828A0J5m9l0Q6r0oP9j8m6O3k5k0N4jn5N2L3o5Q1m6l4J02o5l1J5J4l2N1lql0j
3860@o5J06l0k4J8Qq0P3L9j5l8M7o8m3J32j05l0J01j2l8Q9m8k2N9l9l2L8j2k2
3889a3K8L2j04P1k2jJ2L2m8K7pn9%O9n4J3O2o7K2O9n8j4Q0o4j0O4k0o4O6j4q5
$$ plain form
3920 -57 23 -4 3 18 2 -32 30 46 -60 15 59 -46 10 47 17 -72 59 32 -20 -16 -17 29 -3 -27 -53 28 -21 -22 19 32 -19
3951 -19 75 -11 -37 18 38 -33 13 28 -34 52 46 20 22 13 -39 7 33 -16 -29 78 37 22 8 -37 18 -4 2 -19 41 -70 -33
3982 -33 47 -45 -67 25 33 7 50 -6 -10 18 33 -57 11 11 -24 13 58 -55 3 20 -26 54 43 -51 -36 11 35 5 5 13 -35 39
4014 39 15 -42 51 8 -55 4 46 -21 -1 11 -19 -34 14 -35 -32 43 -47 5 15 -29 -23 16 -23 -44 2 -74 26 47 -15 42 56
4045 56 -27 -21 53 -21 -82 65 43 2 -9 32 -38 18 16 -45 20 35 -25 4 2 -8 -23 32 -63 -5 1 -5 9 -9 -11 -33 9 -43 -29
4078 -29 -35 -1 13 62 -28 -14 9 -12 61 33 11 -17 16 36 30 18 64 -44 -2 23 -35 -1 9 -10 25 3 -45 -11 60 -34 -57
4109 -57 2 -28 6 22 -40 -30 45 -4 8 7 -41 61 28 61 -17 41 26 -14 51 64 6 48 22 23 20 13 -30 29 -11 -16 39 62
4141 62 -27 -29 56 6 -55 -14 -25 9 35 16 -22 -16 7 -17 -27 -21 21 21 -12 -62 4 13 33 33 2 -69 8 33 -21 49 40 -63 -48
$$ packed form
3920e7Q0k7PJ5j6l4O2J6j06P5M4j05N6L7l0q9J31k7n2MjM6l2k4k6Q1m9jM1J3n1
3951a9R4q6k6N5K0p1M6J5o2Q6ok6Krn2M6K6m9j3J07m1j5j4m5N5k2Ok1O0j11L7
3982c3Q0r2k2R2Qk6M3n6mK8J5r0O8%l5L7M5j13N8J7m6Q0j1r4J5M7K4l0%Qm8P4
4014C9k4n7R3m3o3N9M2o7K0J2l0j5M8m9LP5r0N2J0m4OL9l9k1M6p6J00K1o2N7J4
4045E6q3OP4p4o1J47k2m1j1M1p0N6ko1O5J5o0K9kj0j5N5r5N8OoJ4j8kk2M2n2J4
4078b9oL4J4M9r0J4K3k1P3k8k2k8L3K0oj2M6j08M2K5n8L4J0j9L5k2m8L4P1r4k3
4109e7N9l0L4J6o2J0P5m9J2jm8J02l3L3p8N8j5m0O5J3n8M2k6Jlpm3N9m0nN5K3
4141F2q9kQ5n0o1M1j1L4K6j9l8OK3k4j0OM2%l3n0O6RK0%l1p1P7K5n4P0rj03J5
$$ plain form
4174 -48 26 -6 18 33 14 5 26 -21 -25 21 -17 28 -51 -10 -41 49 -36 -23 54 56 -30 13 35 -39 37 -33 -50 -6 -2 -51 7 35
4206 35 12 -28 51 -72 -9 38 -9 1 50 -49 -52 34 40 10 21 -32 4 13 -6 19 -17 -18 -16 -9 11 8 12 -17 -40 23 43 -3 -46 69
4240 69 -52 -14 44 -60 35 26 -52 25 25 -60 -22 59 -69 -39 63 -28 -18 20 24 1 5 -9 3 -14 -6 -75 -1 -2 -48 48 28
4271 28 -19 -6 27 -36 36 12 -13 -24 45 6 20 21 -28 41 21 13 -22 28 11 11 53 2 -33 103 -8 -56 20 55 -25 -15 2
4302 2 -42 -19 6 -36 44 33 -19 11 34 -13 31 49 -3 20 45 -4 -36 5 -4 13 42 -34 -3 73 3 -9 6 -2 -18 74 44 -40
4334 -40 27 -3 -12 64 -20 -7 30 20 -18 12 27 -27 9 -4 -41 12 -48 -40 -5 11 -49 -25 25 -68 23 45 -21 -15 3 15 28 70
4366 70 12 28 65 14 19 -18 27 -3 44 17 -5 -36 24 -47 -3 17 -21 55 30 -26 9 36 -37 -25 22 -39 -34 -5 -11 34 26 26 -8
4399 -8 35 11 1 52 0 -23 13 -26 3 25 8 -24 31 6 6 38 -6 -43 -12 48 -96 -35 34 -55 -15 13 -58 -52 46 -19 -24 24
$$ packed form
4174d8P4l2K4J5j9rK1m7mM6l8M5p9M1l1R0q5J3P7Kq6M3K2p4P6p0j7M4Mm9N8K8
4206C5k3m0P9j23O3M7m7J0M9r9lQ6Ol0J1n3L6Rj9K5l6jKPK0lMk9k3O3K0m6m3J15
4240F9j21L8N8j04R5rp8P7%q5L8Q1j28L0J02r1J0L8Mk3Mj4J2j7Qo9P4jm6R6k0
4271B8m7J3L3o3P2k4k5j1O9l9J4Jm9O9k0ql5N0j7%M2n1l5J36j11m8P6L5q0J0J7
4302Bm4K3K5m2Q0j1n2L0K3m7M4J8n2K3K5m9l2M1rJ7K9p6L1P6p0j2J5qj6R2l0q4
4334d0O7l0rP6q4J3L7j0l8L0J5n4L6j3l7N3o0QL5J6o0K4N0r3R1K2o6OJ8J2J3M2
4366G0n8J6L7n1Nl7M5l0M7k7k2l1O0p1M4K0l8P6k5n6L5K7p3J2M7o1NK9oM5q%l4
4399hM3k4j0N1n2k3L6l9K9K2j7l2N5k5%L2m4l7L1O0j44O1O9q9M0K8p1OR8o5nM8
$$ plain form
4431 24 -103 -8 -6 -16 18 16 21 -31 13 70 -42 2 -11 -56 0 23 -41 -12 30 1 14 79 -25 48 11 46 4 4 -4 24 18 -62
4463 -62 -40 -6 -27 -61 2 -5 -34 57 3 -25 -25 25 -63 4 2 -4 1 32 25 23 -2 -94 -97 7 16 -58 30 5 17 -2 13 -63 14 -32
4497 -32 -25 67 -41 -39 53 -35 4 34 -28 -38 -20 2 -39 19 -58 -62 22 28 -47 -17 -49 -70 -8 -3 -17 6 10 -29 -46 -10 -55 -34 17
4530 17 -4 23 74 8 -23 26 -23 30 -17 32 -11 7 1 32 -47 33 -70 -12 54 -67 -23 -48 -52 26 48 -32 2 39 -16 33
4560 33 29 -13 8 18 -55 17 54 -78 -12 16 -21 -32 57 0 -31 57 -81 -7 31 15 -13 -16 -6 6 -1 61 -42 -14 6 -32
4590 -32 -17 51 -4 -19 40 -69 -47 11 -2 -39 25 -2 -44 19 1 -42 5 28 -5 22 50 -10 44 11 -74 -15 8 -27 38 -18
4620 -18 -15 31 17 -81 -1 24 -39 -16 25 3 -7 -49 -5 -43 12 -33 -51 17 -51 6 24 78 -37 19 9 -3 0 17 -42 3 -8
4651 -8 -9 4 32 -17 -3 7 1 -17 59 -13 -6 16 -14 -20 42 -55 27 1 -19 -27 46 8 -27 12 -69 -4 13 42 18 23 -13 -67 -11 16
$$ packed form
4431B4j27R5Kj0L4kNn2M4N7j12M4j3m5N6K3o4K9M2k9J3O5j04P3l7L5m2%qK8oq0
4463f2K2L4k1l4O3pk9R1n4k8%N0q8O7koNL1pkk5r2lJ04Rp4Q8k5J2j9J5p6P7m6
4497c2PR2j08KR2q8L9L0o2j0J8K2m1N8p7mQ4Op5L0l2k1O2Nj4K3Ml9j7L6m5K1N1
4530A7k1K7N1o6l1M9m9N3m7M9m3J8oL1p9Q0j03N8O6j21M4k5mP8K2q0L4L7n5M9
4560C3mm2K1J0p3P2L7j32O6K8l7j1Q9n7l1Q8j38P4L8j6k8lJ0J2pO2j03K8K0l8
4590c2J5O8n5j5N9j09K2N8j3l7O4k7m2O3j8m3M7K3l3K7K8o0N4l3q5N9K3l5O5n6
4620a8LM6j4r8Q0K5o3K3M1k2j0m2M4l8N5m5j8O8o8N7J8N4j15N6j0j2LJ7n9M5j1
4651hjJ3K8m9J4J0oj8P6p2PK2l0oO2r7Q2k6k0qP3l8l5L9q1O5J7K9k4Nl6n4N6K7
$$ plain form
4685 16 -96 38 42 10 14 13 -28 24 50 -50 55 -18 25 5 -33 -23 -42 42 -7 19 -3 -76 1 -33 -38 -18 -11 -1 -36 44 59
4716 59 -41 72 -21 -42 -39 47 32 18 34 -18 -8 47 52 20 74 32 -13 13 -2 -55 58 -6 32 53 -9 -7 -8 13 -38 3 -30
4747 -30 -30 -4 0 -59 -2 -22 -25 26 17 -6 57 34 -76 -7 5 68 28 51 -9 -67 15 -27 -44 30 3 25 40 -57 -25 7 -1 46
4779 46 58 -40 -20 25 13 -21 -2 -1 -2 -19 7 -20 -2 45 -48 30 31 -4 -12 7 -24 -14 -29 -59 20 34 25 20 20 -37 -4 14 2 -2
4813 -2 -8 -13 -16 -18 65 -24 21 33 -42 -7 1 14 4 -47 -17 8 -64 -22 -22 -11 -65 -18 -8 -7 34 52 -3 3 31 5 -24 32 38 -5 40
4848 40 9 -34 65 35 -8 25 -52 21 21 26 -3 -16 37 -10 35 3 8 -16 -11 -15 -22 11 -33 11 -17 2 -35 13 -17 -17 -7 -36 -36 0
4882 0 -13 -91 38 11 -4 20 38 -53 7 7 63 -5 8 -24 24 21 -14 -27 -6 6 -6 35 34 -26 12 3 -3 -13 -17 -30 14 12 -40 48
4916 48 10 37 -15 -11 -20 70 -20 -2 -8 38 -22 -25 -10 -44 15 -53 21 -13 5 -5 39 18 18 -27 40 -18 -2 13 -22 5 19 -28 2
$$ packed form
4685A6j12J34Ml2Mjm1N2K6j00J05p3M3k0l8J0j9Q4m9K6k2p3P7l4nK0PJ0l5Q0J5
4716E9j00J13r3k1LQ6j5j4J6n2J0N5Nl2N4m2m5K6j5n3J13o4L8K1o2KjK1n1M1l3
4747c0%K6Mn9N7k0lN1rk3O3k3j10O9J2O3m0K3o0n8Q2m2j7P4k7K2J5r7L2L2qM7
4779D6J2r8K0M5j2l4J9Jjj7K6k7J8M7r3P8Jl5qJ9l1J0j5l0P9J4rn%n7L3J8j2m
4813bonlkQ3q9M5J2p5L5QJ3j0n1L0K5p2M2%J1n4M7J0JM1J8n5OK8k6k9N6Om3M5
4848D0l1m3R9l0m3L3p7P3%Nk9j3N3m7M5l2Nk4NmpL3m4M4k8J9l7M8l0%J0k9%L6
4882@j3p8J29k7j5K4J8r1O0%N6o8J3l2M8ll5j3K1J2j2M1jo0L8roj0mj3M4kn2Q8
4916D8l8K7n2MrR0r0J8oM6o0lJ5l4N9o8P4l4J8j0M4k1%m5O7n8J6J5l5K7J4m7L0
$$ plain form
4949 2 -4 0 8 31 -6 -13 11 -41 -45 -13 34 -46 48 63 -14 35 -12 4 -5 3 31 4 80 -27 76 3 1 -17 -8 55 -14 39 -15 24
4983 24 31 -6 -71 62 45 -23 37 53 -10 30 72 12 -6 16 -43 47 -24 -5 26 24 17 90 -3 19 38 24 -8 14 61 12 -7
5014 -7 29 9 10 17 -18 4 -6 -44 -39 15 -12 -13 17 38 -21 -11 32 -40 9 15 -19 46 -16 -27 38 38 -49 -23 27 46 13 -21 34 0
5048 0 49 18 10 50 -27 3 -33 -38 -17 54 24 -29 23 9 17 35 59 -26 -40 -14 41 5 -6 19 12 5 22 -14 55 -48 1 32 3
5081 3 37 -5 18 11 -38 6 -11 59 12 28 43 0 -20 15 24 3 50 48 -40 -7 13 -35 2 30 -7 17 -31 -20 -19 -37 -29 -39 52
5114 52 5 38 -42 -62 -13 -12 32 -38 -13 -51 -19 31 47 -14 59 -44 10 25 0 55 51 43 -5 -8 -22 -16 22 11 -28 15 23 12 -16
5147 -16 -11 -16 -38 19 -23 -29 -38 -38 3 61 -51 -19 -20 -36 -1 26 16 -15 23 3 -60 1 4 0 -5 19 -35 -36 23 -27 -5 13 -10 -16 -2
5182 -2 24 30 17 -49 -15 -2 -7 11 -13 11 26 53 44 -39 -58 19 52 57 -6 -39 9 21 -6 80 6 31 36 34 16 -15 9 46 -42 51
$$ packed form
4949BoMQK3l7pK4n2mL2M7q0R4J5p7M9m7J6rQK8k7P6j07J03p3kj8RO3o9N3n4L9
4983B4Pl7o5J33j7o8O0J6o3M0M2o0j8K2n9R0p1J9L1kpP3r3K2J9j4l2K2M7m9j9
5014gL6k0JPl5K2j0l8NN4k7jL0K1n9J0M3p2M9Ol4O5o2j1O5%q7K6N0J9l3l4N5l4
5048@M9l1qM0p7L0l6nK1P1l0n3N2j4QJ8K4q5j4K6N5l6j1K5ppJ7l6O9j03M9L1k9
5081CL4m2K3pm9M4j7P0m7J6J5m3k0L5Rk1M7kq8L3K0m8L7K8l7K4m8J1Jj8Qj0R1
5114E2m7L3q0k0M9JM4p0K5l8L2N0J6o1P3j03N4J5k5N5mqm8lj4OL8j1l9M3Qj1k8
5147a6Nnk2N7m2or%M1N8j12L2jj6L5K7j0l1L8k0o3O1LmnK4n4jN9n0K2J8k3oJ4
5182bK6Oj3o6L4J3nJ8k4K4J5K7rq3j9P7L3No3l3M8J2k7Q6p4K5Nkj8l1K4L7q8R3
$$ plain form
5216 51 -5 -36 53 -25 9 11 35 18 26 14 -20 18 -11 19 -1 -11 1 31 -24 5 50 -11 35 -22 35 21 -15 68 17 40 75
5247 75 35 -50 11 -15 -4 26 10 -18 50 -10 -75 -10 12 -43 -32 -40 -17 46 12 25 6 31 10 13 -33 -14 20 -12 -6 38 64 20
5279 20 33 -6 -17 -5 9 -7 -9 44 36 -8 11 33 28 80 34 13 -8 31 3 31 10 -90 8 19 15 15 2 -1 15 -46 -35 -14 -41
5312 -41 -37 -4 56 -38 -4 20 -31 26 26 -19 23 -6 15 26 -14 -54 5 64 39 -18 -13 13 14 49 -57 9 8 -10 -33 45 -3 -22
5344 -22 41 50 -33 6 -3 -45 -8 -28 -18 -6 -2 4 14 41 8 0 -21 -15 -7 12 -28 -2 6 -28 -44 -19 20 54 -5 31 -39 48 -21 30
5378 30 58 13 6 -9 -21 -16 -18 -5 23 28 -19 -11 23 3 -36 -10 52 51 -9 -8 -14 10 2 -48 -19 -20 26 -16 9 2 -15 42 -1 -52 -28 -1
5414 -1 -7 17 23 -32 55 3 3 11 8 -22 30 0 -28 -39 32 -20 -19 28 -6 23 31 -11 -17 -15 2 36 5 -8 -61 1 7 7 -7 -6 -8 9 -7
5451 -7 -16 30 33 -54 45 11 -30 4 3 -50 -55 64 -6 -1 27 29 -21 4 -20 -32 -24 19 -20 13 28 -3 -10 16 8 -10 -4 -12 -16 -9 -6 17 19 8
$$ packed form
5216E1n6l1Q9p8L4KK4j7Qj2l4L8k9L0k0j0J2L0n5K9M5o1M6n7N7j4l6Q3n1K3L5
5247G5m0q5O1k6J1L0j6k8O8o0o5O5K2n5J1qK3O3l4J3j9K5k1Lm6J9L4l2OM4K6m4
5279B0J3l9j1J2J4j6kN3qm4J9K2nN2m6k1k1L9k8K8k1j00R8J1m%j3lJ6o1J1K1k7
5312d1ML3O0r4L4K4n1N7%m5M2k9K1J1m0m0N9N9k5n7NK6JL5j06O6jj8k3P8m8j9
5344b2O3Rq3L9rm2L7k0J0J2MOJ0K7l3qk1OQJ9m0K6Ql4j6K5L9L4n9L6p0Q7o9N1
5378C0K8m5pj5j2NkJ3K8Nm7QL4k0l9K6O2jo0JoK4qn0K9jM6m2K5pj7N7m3n1K4K7
5414aoK4On5Q7n2%Qll0N2l0k8j1P1n2JM7l4K9Qm2oKJ7L4l1j3n3O2O%j4JkJ7j6
5451grM6Lq7R9l4m1L4jn3nJ19p0NK8Kn0K5k4j2QM3l9L3J5l1pK6qj8OqmPLK3Kj1
$$ plain form
5489 8 -2 66 -12 59 3 -12 -7 29 -21 1 17 -19 37 36 -4 -15 -22 -47 23 -31 -30 -78 -10 -33 -42 -5 -5 -28 -10 29 -63 -17 15 -18
5523 -18 6 0 -35 -3 5 -9 8 1 -14 -56 42 55 10 36 19 -46 42 -43 -14 42 -29 20 61 6 -8 44 -12 -26 37 57 -76
5554 -76 -13 -23 21 39 -25 -35 -46 13 -45 13 60 -6 -11 22 -16 2 -3 29 -21 61 -34 -7 22 -42 -7 0 -26 6 -17 11 29 -6
5586 -6 -28 -4 -8 -36 19 42 16 -76 40 11 22 83 26 -13 -4 -15 19 -23 37 25 -8 50 -39 33 23 10 41 17 -66 45 -20
5617 -20 0 -18 -9 20 -34 -32 27 11 22 9 -16 -41 29 -28 54 -12 -49 -1 -4 -22 5 -1 57 10 -45 -1 -66 61 -1 45 19 17
5649 17 -9 16 -30 15 28 -14 21 44 40 -39 46 2 -19 40 13 -40 34 -9 -8 33 -11 -58 -55 32 40 1 -2 -8 -49 3 28 -32 -9
5682 -9 6 30 15 9 -6 -13 -5 -27 21 -33 -76 14 -46 -6 31 -18 -18 -20 22 -19 24 53 -43 -7 37 -24 -7 7 -42 -44 6 -24 39 -7
5716 -7 -10 -8 -20 23 -25 27 35 5 -30 -40 28 10 71 -24 48 -53 -1 53 -2 2 16 18 -26 38 25 -59 17 -32 7 -25 2 -55 -48
$$ packed form
5489Hj0O8p8P1n6j5NL6n0K2J6l6N6jm0j1pk5P0n4Jm8O8k3rL7%k3J8L9r2M6L2l3
5523a8K4ol5L2Qj4J7pj5m2R8J3m5K6j7o5Q8q5K9N6p1M9M1n5j4N2n6j4O3K0j33
5554g6O3j0M4J8o4j0j1N9n8N8M7o6nL3l8J8nL2n0Q2r5K7K9o4L5Pk6L2k3K8J8l5
5586fk2K4mk8N5K3k6r2J16k9J1O1n7l9Rj1L4m2O0j2l3N8q9P2j0j3L1k4q3J11o5
5617b0K0j8RK9n4KN9j6J1j3k5k5P0n7Q2o6l7M8lj8K7oN8m7n5M4o5J27o2M6k6k
5649A7k6K5m6M5J3m2L5K3mp9Q5m4k1N9k7n3P4m3JM1m4m7LQ7Ql9lom1N2K5o0K3
5682iJ5K4j5oj5pQk2M8n4m3R0o0M0L7m9%kM2m1M3K9r6L6M4o1J7J4m9kN0l0O3m6
5716glKj2M3m8N2Ql0l5j0O8j8O1r5P2j01N2N4n5MJ4Km4O4j3q4P6m9L9l2K7n7P
$$ plain form
5749 -48 54 -33 54 35 -28 13 10 40 -7 -12 -31 -22 -12 -8 -41 2 0 51 -7 10 -47 -25 5 -7 42 -13 -25 19 -18 4 -60 16
5781 16 -5 -24 -18 -33 -22 -55 43 -52 34 7 -9 12 2 -5 10 -12 -20 -16 3 21 18 4 -24 -3 2 59 14 1 -6 -42 -8 -3 -26 12
5815 12 90 -22 15 6 38 22 -35 -22 29 18 -17 -19 12 -54 64 7 42 0 15 -2 -19 30 -1 -16 -21 22 2 26 15 57 25
5846 25 10 15 16 17 -17 54 -40 -3 -15 6 33 6 -21 11 -41 -39 -17 20 -30 -85 -8 8 -6 9 -38 -9 28 -16 -29 4 24 -21
5878 -21 54 -82 56 -7 -34 -23 -14 -4 59 -18 33 -20 1 -17 -16 -6 8 42 -17 27 -1 -11 -12 -20 -2 -46 2 -4 36 27 -33 15
5910 15 57 -33 -19 0 -36 -49 3 -21 36 39 -54 -19 31 -13 -23 -54 15 8 -8 -10 -4 43 -8 25 -10 21 -5 14 23 0 3 0 -40 -62
5944 -62 16 -38 24 -33 -28 -12 -4 -21 -51 7 -8 -62 23 -26 20 15 -12 9 -37 39 51 29 -88 -1 -2 -57 -49 6 -38 -27 -10 -19 25
5977 25 -10 38 4 6 1 39 -30 -19 -55 -16 1 -54 -56 -17 -30 -9 -15 19 -28 26 19 -37 -31 -4 -74 34 40 14 -7 -23 4 21 17 -20
$$ packed form
5749d8J02q7Q7j9o3M1lL0m7nj9RJ0Ml3M3kN1n8J7n7K2L0j2M9n5j2M4l7K2o4P6
5781A6k1j9Oj5J1l3R8r5Q6k7j6K1j0pJ5k2qMJ9J8lj4k8K1NN7m5j3pl6L4Nk3L8
5815A2P8j12L7rL2j6n7J3N1j1l5kL1o6J18n7L5m2J5j7j7M9l1j5nM3k0K4j1M2l2
5846B5j5NJJl4P1r4L7j2K1K7k7k7L2n2KK2L7n0n5P7J6j4J5m7K9L7m4j3L3K0m5
5878b1P5j36J38o3k7J1RJ0O3p7N1n3K1j8JJ0J4L4n9M4k8j0jqJ8m4M8oM0ro0M8
5910A5M2r0J4J9l6j3N2k4N7Lr3L5N0m4j0l1O9pj6kOM7n1L3l5L1k6J9Rk3Llm0k2
5944f2P8n4O2n7NJ6Qj7l0N8j5n4Q5m9M6nk7K1m6P6J2k2j17Q7jn5QN5m4J1J7rM4
5977B5l5M8l4KnL8o9J1l6L9J7n5kL9j3K1oL4m7N4pn6OK7p0J08Ok6k1j6K7J7ml7
$$ plain form
6011 -20 -23 12 -49 -20 10 -30 -62 4 1 5 37 -7 66 -39 -32 -4 -14 -20 -1 -43 33 -32 -34 34 -5 -30 0 49 22 20 10 24 -7
6044 -7 -17 21 1 23 27 0 -42 51 7 38 8 -2 2 8 4 -42 55 3 -18 44 27 -24 -28 30 -11 2 12 -4 -34 -16 -87 -24 35
6077 35 38 -42 22 -26 47 -35 9 -19 -47 -53 7 -9 68 -27 -42 39 -30 -6 -31 -9 29 76 5 -32 14 -27 -33 -45 52 -14 -17 13
6109 13 -61 -40 -19 -13 14 -36 -2 8 23 21 -39 -9 6 40 16 58 43 22 18 38 16 38 37 11 -3 7 7 31 -16 5 18 6 -11
6142 -11 -16 14 -37 20 -3 -4 -18 6 -17 55 -9 19 -1 -76 7 -4 -27 -13 -7 53 -3 -22 -9 4 7 -42 25 -16 -4 0 -8 36 12
6175 12 -4 54 -23 -7 45 -19 14 21 -13 -23 -30 12 -22 25 29 -34 15 -50 19 12 33 30 -16 1 -28 -10 -2 -68 -9 -26 29 -30 1
6208 1 -21 -35 13 -19 -11 -18 -16 32 -27 -24 -22 -24 6 -46 -37 -40 5 -10 -5 -2 -42 -10 -8 -16 -21 28 -30 13 20 36 -23 -18 -37 -36 -27 60 34 15 -21
6247 -21 28 78 -20 18 64 24 -31 1 -28 13 28 20 39 31 -9 0 -45 -14 7 -3 -6 -38 14 6 -5 -30 1 4 12 -15 8 70 -7 -23
$$ packed form
6011b0lL5o1K9L0m0l2O6lML2m4P3j05PK8j0oJ9m2P6o5kO8l9k5L0M9k7kj0J4l1
6044gj0L8k0K2Mk7m2R3m4L1l0j0MOmm6R7n2k1O2j7n1mN8m1J3J0j6l0J8p1O3N9
6077C5Lq0O4m8P3q2M4k8k8oO0j6P7r5j5Q1o9K4k5K2L8M7p1l7M6m1oj2R7o6lL0
6109A3p4K1K1OK7n0L4J0J5ko0L0J5L4k4M2j5k1mK0k2K2jk6j4J0%K4m7K1J3j2j7
6142a1nL0n1N7k3jj4K4k3P2o4K8k0p5Q3j1k3J4OO0n6j9J3J3Lm9O7m1J2MqM4k4
6175A2j6N8p7J6N2o4L3Pl4j0pM2l4M7Mo3M9o5O9pK1lm6J7k9J8Qo6N9j7N5n9L1
6208Ak2j4M8l2QpKM8n9LKkL0n2RlM5j5NLm0L2KqnM9n8M3PJ6n9Nj9JRQ7k6j9l6
6247b1M9N0r8L8M6m0n5L2k9M1J5qJ9qm0Rm5L1K1j0ll2N2qj1k5L1LQk7K3O2p7j6
$$ plain form
6281 -23 52 1 49 21 -39 16 32 -22 25 -5 14 31 -51 11 8 0 -74 -15 -21 -20 -29 -13 65 62 -6 66 -31 -20 -22 -24 8 -27 -18 -50 -42
6316 -42 -41 -8 17 -2 42 -17 38 -42 24 -26 24 57 -16 24 -4 52 7 -7 -7 23 -1 59 0 5 17 16 -1 30 1 -32 22 7
6348 7 2 21 -47 -5 2 -8 -10 -19 26 -58 11 -11 -15 5 -19 -35 6 -5 14 11 11 11 79 4 -71 13 14 56 19 1 -2 -11 -21 -4 -19 -10 49
6385 49 11 4 -60 -7 1 -2 50 19 8 14 -8 1 7 35 22 -29 21 15 -22 18 -41 47 -38 -13 -5 -15 18 27 16 0 -32 29 -3 12 7
6420 7 -10 -30 -2 -4 -49 -51 -4 -38 -11 15 23 11 61 17 -29 -19 7 -4 -51 21 -11 -48 6 -1 5 53 -28 -21 3 8 -33 30 15 26
6454 26 10 -40 19 42 21 12 1 -11 -25 2 -64 27 -14 -35 15 40 55 -3 22 -6 57 33 -1 24 15 -12 1 52 19 -14 57
6485 57 40 -48 28 -30 8 5 11 35 25 54 3 -14 40 -33 0 -5 -54 -12 3 -68 -39 -35 -5 -1 16 16 2 3 -35 34 -12 29 14 -6
$$ packed form
6281b3P5n1M8k8o0N5J6n4M7l0J9J7q2O2lqp4N9oJrJ6P8lo8P2r7J1kkL2l5Rl2Q
6316d2JL3K5j9M4n9N5q0O6n0N0L3p3M0k8N6m5j4%L0k4O0n9NJ2jj7L1k9l3N4j5
6348GnJ9o8M2Pj0krM5q4O9k2mK0k4j6M1j1J9l%%O8p5p5Q4JM2l7j8lrj0J7j5RN9
6385D9l8po4N3QlN2l1j1Ok2ROK8j3n1N0ol7M0n9Q8q5K5Qj0L3Rj1j6l2O1l2J5n
6420Gj7k0K8km5kM7l4K7K6Qj2N0m4m6J0K6j1m7P2l2l7N4pOM8q1PK4Nm1O3j5J1
6454B6j6n0N9K3k1rj1j2j4K7o6R1m1k1N0K5J5n8K5k8O3k4l4K5rk7J3N1l3l3P1
6485E7j7q8P6n8L8lOK4j0K9n1j7N4p3L3nm9M2J5p1K9ML0MJ7%j4Jl8O9m6M1j5k0
$$ [...]
8191a6
##END NTUPLES=NMR FID
##END=
