##TITLE=1H_EC-3234x
 DMSO, 8 sc, 
 21.9.2020
##JCAMPDX= 6.0         $$ Bruker NMR JCAMP-DX V2.0
##DATA TYPE= NMR FID
##DATA CLASS= NTUPLES
##ORIGIN= UXNMR, Bruker Analytische Messtechnik GmbH
##OWNER= root
$$ XWIN-NMR		Version 3.5
$$ Mon Sep 21 10:30:18 2020 Russian Standard Time (UT+4h)  she@DPX200
##.OBSERVE FREQUENCY= 200.1315066352
##.OBSERVE NUCLEUS= ^1H
##.DELAY= (6, 6)
##.ACQUISITION MODE= SIMULTANEOUS
##.ACQUISITION SCHEME= undefined
##.AVERAGES= 8
##.DIGITISER RES= 18
##SPECTROMETER/DATA SYSTEM= spect
##.PULSE SEQUENCE= zg30
##.SOLVENT NAME= DMSO
##.SHIFT REFERENCE= (INTERNAL, DMSO, 0, 15.7039)
##AUDIT TRAIL= $$ (NUMBER, WHEN, WHO, WHERE, WHAT)
$$ ##TITLE= Audit trail, XWIN-NMR		Version 3.5
$$ ##JCAMPDX= 5.01
$$ ##ORIGIN= Bruker BioSpin GmbH
$$ ##OWNER= she
$$ F:/spectra/data/she/nmr/H-F/1/audita.txt
$$ ##AUDIT TRAIL=  $$ (NUMBER, WHEN, WHO, WHERE, WHAT)
(   1,<2020-09-21 10:29:07.56 +0400>,<she>,<DPX200>,
      <created by zg, POWCHK disabled, PULCHK disabled
       configuration hash MD5:
       00 E9 B6 7A A2 85 ED C7 34 08 36 98 17 FE 4E 26
       data hash MD5: 16K
       CC B1 55 FF A6 FA 10 00 12 DD 4B D8 79 63 D7 E3>)
$$ ##END=
$$ 
$$ hash MD5
$$ 61 F7 99 35 0F 83 0E 20 F9 A7 84 BA C7 3F 21 18
##$RELAX= 
##$RELAX= 
##$RELAX= 
##$RELAX= 
##$RELAX= 
##$RELAX= 
$$ Bruker specific parameters
$$ --------------------------
##$DU= <F:/spectra>
##$EXPNO= 1
##$NAME= <H-F>
##$PROCNO= 1
##$TYPE= <nmr>
##$USER= <she>
##$AMP= (0..31)
100 100 100 100 100 100 100 100 100 100 100 100 100 100 100 100 100 100 
100 100 100 100 100 100 100 100 100 100 100 100 100 100 
##$AQSEQ= 0
##$AQ_mod= 1
##$AUNM= <au_zg>
##$AUTOPOS= <>
##$BF1= 200.13
##$BF2= 200.13
##$BF3= 200.13
##$BF4= 200.13
##$BF5= 200.13
##$BF6= 200.13
##$BF7= 200.13
##$BF8= 200.13
##$BYTORDA= 1
##$CFDGTYP= 0
##$CFRGTYP= 5
##$CHEMSTR= <none>
##$CNST= (0..31)
1 1 145 1 1 1 1 1 1 1 1 1 1 1 1 1 1 1 1 1 1 1 1 1 1 1 1 1 1 1 1 1 
##$CPDPRG= <>
##$CPDPRG1= <>
##$CPDPRG2= <>
##$CPDPRG3= <>
##$CPDPRG4= <mlev>
##$CPDPRG5= <mlev>
##$CPDPRG6= <mlev>
##$CPDPRG7= <mlev>
##$CPDPRG8= <mlev>
##$CPDPRGB= <>
##$CPDPRGT= <>
##$D= (0..31)
0 1.2 0 0 0 0 0 0 0 0.06 0 0.03 0 0 0 0 0.0002 0 0 0 0 0 0 0 0 0 0 0 0 
0 0 0 
##$DATE= 1600669747
##$DBL= (0..7)
120 120 120 120 120 120 120 120 
##$DBP= (0..7)
150 150 150 150 150 150 150 150 
##$DBP07= 0
##$DBPNAM0= <>
##$DBPNAM1= <>
##$DBPNAM2= <>
##$DBPNAM3= <>
##$DBPNAM4= <>
##$DBPNAM5= <>
##$DBPNAM6= <>
##$DBPNAM7= <>
##$DBPOAL= (0..7)
0.5 0.5 0.5 0.5 0.5 0.5 0.5 0.5 
##$DBPOFFS= (0..7)
0 0 0 0 0 0 0 0 
##$DE= 6
##$DECBNUC= <off>
##$DECIM= 32
##$DECNUC= <off>
##$DECSTAT= 4
##$DIGMOD= 1
##$DIGTYP= 9
##$DL= (0..7)
0 120 120 120 120 120 120 120 
##$DP= (0..7)
150 150 150 150 150 150 150 150 
##$DP07= 0
##$DPNAME0= <>
##$DPNAME1= <>
##$DPNAME2= <>
##$DPNAME3= <>
##$DPNAME4= <>
##$DPNAME5= <>
##$DPNAME6= <>
##$DPNAME7= <>
##$DPOAL= (0..7)
0.5 0.5 0.5 0.5 0.5 0.5 0.5 0.5 
##$DPOFFS= (0..7)
0 0 0 0 0 0 0 0 
##$DQDMODE= 0
##$DR= 18
##$DS= 0
##$DSLIST= <SSSSSSSSSSSSSSS>
$$ [...]
##$SUBNAM2= <"">
##$SUBNAM3= <"">
##$SUBNAM4= <"">
##$SUBNAM5= <"">
##$SUBNAM6= <"">
##$SUBNAM7= <"">
##$SUBNAM8= <"">
##$SUBNAM9= <"">
##$SW= 16.880792210976
##$SWIBOX= (0..15)
0 0 2 0 0 0 0 0 0 0 0 0 0 0 0 0 
##$SW_h= 3378.37837837838
##$TD= 16384
##$TD0= 1
##$TE= 0
##$TE2= 300
##$TE3= 300
##$TEG= 300
##$TL= (0..7)
0 120 120 120 120 120 120 120 
##$TP= (0..7)
150 150 150 150 150 150 150 150 
##$TP07= 0
##$TPNAME0= <>
##$TPNAME1= <>
##$TPNAME2= <>
##$TPNAME3= <>
##$TPNAME4= <>
##$TPNAME5= <>
##$TPNAME6= <>
##$TPNAME7= <>
##$TPOAL= (0..7)
0.5 0.5 0.5 0.5 0.5 0.5 0.5 0.5 
##$TPOFFS= (0..7)
0 0 0 0 0 0 0 0 
##$TUNHIN= 0
##$TUNHOUT= 0
##$TUNXOUT= 0
##$USERA1= <user>
##$USERA2= <user>
##$USERA3= <user>
##$USERA4= <user>
##$USERA5= <user>
##$V9= 5
##$VALIST= <valist>
##$VCLIST= <CCCCCCCCCCCCCCC>
##$VD= 0
##$VDLIST= <DDDDDDDDDDDDDDD>
##$VPLIST= <PPPPPPPPPPPPPPP>
##$VTLIST= <TTTTTTTTTTTTTTT>
##$WBST= 1024
##$WBSW= 4
##$XGAIN= (0..3)
0 0 0 0 
##$XL= 0
##$YL= 0
##$YMAX_a= 182190
##$YMIN_a= -203599
##$ZGOPTNS= <>
##$ZL1= 120
##$ZL2= 120
##$ZL3= 120
##$ZL4= 120
##$ABSF1= 10
##$ABSF2= 0
##$ABSG= 5
##$ABSL= 3
##$ALPHA= 0
##$AQORDER= 0
##$ASSFAC= 0
##$ASSFACI= 0
##$ASSFACX= 0
##$ASSWID= 0
##$AUNMP= <proc_1d>
##$AZFE= 0.1
##$AZFW= 0.1
##$BCFW= 1
##$BC_mod= 2
##$BYTORDP= 1
##$COROFFS= 0
##$CY= 11.3945322036743
##$DATMOD= 1
##$DC= 2
##$DFILT= <>
##$DTYPP= 0
##$F1P= 16.9975609425685
##$F2P= -3.02152046262296
##$FCOR= 0.5
##$FTSIZE= 0
##$FT_mod= 4
##$GAMMA= 1
##$GB= 0.15
##$INTBC= 1
##$INTSCL= 1
##$ISEN= 128
##$LB= 0.24
##$LEV0= 0
##$LPBIN= 0
##$MAXI= 10000
##$MC2= 0
##$MEAN= 0
##$ME_mod= 0
##$MI= 1.114404
##$NCOEF= 0
##$NC_proc= 0
##$NLEV= 6
##$NOISF1= 3.799351
##$NOISF2= 2.8
##$NSP= 1
##$NTH_PI= 0
##$NZP= 0
##$OFFSET= 15.70392
##$PC= 1
##$PHC0= -9979.001
##$PHC1= 22.6009
##$PH_mod= 1
##$PKNL= yes
##$PPARMOD= 0
##$PSCAL= 0
##$PSIGN= 0
##$REVERSE= no
##$SF= 200.130013532006
##$SI= 16384
##$SIGF1= 3
##$SIGF2= 2
##$SINO= 400
##$SIOLD= 16384
##$SREGLST= <1H.CDCl3>
##$SSB= 0
##$STSI= 0
##$STSR= 0
##$SW_p= 3612.71676300578
##$SYMM= 0
##$S_DEV= 0
##$TDeff= 0
##$TDoff= 0
##$TI= <>
##$TILT= no
##$TM1= 0
##$TM2= 0
##$TOPLEV= 0
##$USERP1= <user>
##$USERP2= <user>
##$USERP3= <user>
##$USERP4= <user>
##$USERP5= <user>
##$WDW= 1
##$XDIM= 8192
##$YMAX_p= 0
##$YMIN_p= 0
$$ End of Bruker specific parameters
$$ ---------------------------------
##NTUPLES= NMR FID
##VAR_NAME=  TIME,          FID/REAL,        FID/IMAG
##SYMBOL=    X,             R,               I
##VAR_TYPE=  INDEPENDENT,   DEPENDENT,       DEPENDENT
##VAR_FORM=  AFFN,          ASDF,            ASDF
##VAR_DIM=   8192,          8192,            8192
##UNITS=     SECONDS,       ARBITRARY UNITS, ARBITRARY UNITS
##FACTOR=    0.000296,      1,               1
##FIRST=     0,             0,               0
##LAST=      2.424536,      0,               0
##MIN=       0,             -203599,         0
##MAX=       2.424536,      182190,          0
$$ Real data points
##PAGE= N=1
##DATA TABLE= (X++(R..R)), XYDATA
0@%%%%%%%%%%%%%%Qj6J6j6J8k6L2l9M7n5O3p2Q8j03J18j35J56j79K04k33K64k97
36a57L34l76M22m72N26n86O52p23Q02q88R79j081J194j315J448j594J756j936
54a015K134k357K608k891L214l588M030m555N188n977O990q342J0251j3158J8244
69A0776m4771K16185j13404k31115J46538L4078K9257p795j38983M9319J65885
80A15970r4803j00090N4116Q5521J6521j08371p0911J39267O7588j07594o5891
91f8677L9750Q9862J1170j36467k6293J41528L7823j23426o7624J11604R3640
102A02890j21851q4831J00955N8669k5525m9536o2484P8434J11143j11351j03789
113a07276J12584Q3763p5028q4746L5826R5407j5847r3354n515P2315N0413o4997
$$ plain form
0 0 0 0 0 0 0 0 0 0 0 0 0 0 0 0 8 -8 8 -8 10 -16 16 -23 24 -31 32 -40 48 -55 63 -72 84 -95 109 -124 140 -157
36 -157 177 -199 223 -249 277 -309 343 -380 422 -466 513 -568 626 -689 759 -835 921 -1015
54 -1015 1119 -1238 1370 -1521 1693 -1895 2135 -2420 2768 -3209 3781 -4561 5690 -7468 10776
69 10776 -33995 182190 68786 -162329 -15791 18287 47544 39749 -99234 -49915 115970
80 115970 21167 -78923 -24807 60714 77235 -31136 -102047 37220 104808 -2786 -68677
91 -68677 -28927 60935 72105 -64362 -90655 50873 88696 -34730 -102354 9250 102890
102 102890 -18961 -103792 -2837 55832 30307 -19229 -81713 -3279 107864 -3487 -107276
113 -107276 5308 89071 14043 -70703 -34877 60530 44683 -48671 -54186 18129 68542 3545
125C545j00369P1288J08495o5442q1782K3731O1281L5003p2460o6996R3026O1164
137G0484p7593m5351L0141O0702K0982j05577l5290J42068K0582j29023j0840
148e8715Q3733K6094m3517n2178K0687O4589J245o8186l4457P9147N6565r4319
160a9312n5944Q9735M2744n4388m2958K714O6640K8124r1670k7012Q9069J9242
172D6984n4076l9127J8762Q4794j9940j10891M3303Q8266m5067l7592J953J180
184b1451O6415l678j14956L1367J21080n3004r2602M6217N8108j2307l7404k5285
196c7500L1061N1844k6695o5169J8206P0948n173p2021q848O8354K0875n8337
208a2455k9586M3008L4671j7580m4835j0186O2252L0186q0245l3458Q6489K5465
$$ plain form
125 3545 -96824 -25536 82959 17517 -64265 -40534 20747 55750 -16710 -83706 9320 70484
137 70484 -7109 -52460 -22319 38383 59365 -46212 -81502 60566 81148 -47875 -58715
148 -58715 25018 51112 7595 -44583 -23896 40693 41938 -26248 -60705 18442 75007 -19312
160 -19312 -75256 14479 57223 2835 -40123 -37409 29231 57355 -34315 -61327 27742 46984
172 46984 -7092 -46219 -27457 57337 37397 -73494 -30191 58075 13008 -24584 -22631 -21451
184 -21451 44964 41286 -73670 -42303 78777 25773 -66829 -20612 37496 25189 -12215 -37500
196 -37500 -6439 45405 18710 -46459 -28253 42695 37522 -34499 -43347 25007 45882 -12455
208 -12455 -42041 967 35638 18058 -26777 -36963 25289 55475 -24770 -58228 28261 53726
220E3726p1718k0985M3610K8379j6491m1189k375M6068J8217m2975m0735M2420
232d048O0817m9935o4072N1802M7367l5542k8024j103K4871L7815m0477n4253
244e4782N5456M8467n0689l6695K4986L8874M75m9252j2194N1412J6616l7185
256d511k5876J8573M3687o789n9089K732O4179J397o0612p844N1234J7598l9953
269e274k4650K4972L0440n799l8222j2054M8236K1805n5473k0203M9248J8406
281C1432l0197k6430J1119M0190N3m9860n859M8058J1862l6954k5510K6874L9915
294C4693k1770n0329K2536M7495k1215l3200P663J7089J7304j0044m4642J6339
306a8081N8165k4523n4373K3135M1909r791l0886q327K6185K2458k2706l0158
$$ plain form
220 53726 -17992 -38977 4633 33012 16521 -24668 -27043 19025 37242 -5733 -46468 -4048
232 -4048 56769 6834 -57238 -5436 41931 6389 -21635 -22738 2133 39948 -529 -54782
244 -54782 674 49141 -1548 -38243 -13257 25617 26092 -23160 -35354 16058 32674 -4511
256 -4511 -30387 -11814 31873 25084 -34005 -31273 32906 34303 -26309 -34153 17081 34679 -5274
269 -5274 -29924 -4952 25488 19689 -18533 -30587 17649 39454 -16019 -36222 13026 31432
281 31432 1235 -25195 -14076 26114 26167 -23693 -29552 18506 30368 -6586 -32096 -5222 34693
294 34693 12923 -37406 -14870 32625 11410 -21790 -14127 2962 20266 10222 -34420 -18081
306 -18081 40084 15561 -38812 -15677 26232 16441 -14445 -22772 3413 25871 3165 -26993
318b6993J4713L6493m488m3654l543M9768M870m6731m077L2105R845j2684k2742
331a7118j603L7698P923m6223q710M4727J2860l9241j7407L1763K2425k3093k4128
344b0127J1625K3679L704k4472j9986K7284L2477l3578l5435L6529K7216k9087
356a71j7174R681J3132J3860k1247k9650L2095L1793l5322k5865K5872K1925q643
369A0286k5491m276L1406Q355k9531r820J9083J7864p434l0769M282L9413n464
382A7904l7261K892K9280N662k1712j5931J6765K2202j0798k5028J949K8274O033
395B0231l1798r845L1541J0212k4709j0801J1277J8871l87k9307k521L3583K368
408A8715k7792o067J7870J6573j2086k6562J1686K9726j1641k6030O784J8933
$$ plain form
318 -26993 -12280 24213 19725 -23929 -27472 22296 27166 -19565 -23642 8463 18308 5624 -17118
331 -17118 -18721 18977 26900 -19323 -28033 16694 29554 -9687 -27094 4669 27094 4001 -20127
344 -20127 -8502 15177 18881 -5591 -25577 1707 34184 606 -34829 1700 28916 -171
356 -171 -17345 -7664 5468 19328 -1919 -31569 526 32319 -3003 -28868 -2996 18929 10286
369 10286 -15205 -19481 11925 20280 -9251 -19071 12 17876 10442 -20327 -16045 23368 17904
382 17904 -19357 -16465 12815 18477 -3235 -19166 -2401 19801 9003 -16025 -14076 14198 20231
395 20231 -11567 -21412 10129 20341 -4368 -15169 -3892 14979 14592 -14715 -17236 16347 18715
408 18715 -9077 -15144 2726 19299 7213 -19349 -7663 22063 10422 -15608 -8824 10109
420A0109L612j4133j5677J1885K4519j1723k9236J0613K8031p182k4237O89J8897
433F167P648j5059j5444J1823K1180p637k5368M509K6412O6k4813m448K1551R072
447A5659j5890j3036R404J7535l219k0940j847K3373N412k1788j0486J9954J4989
460A9120j8366j6383J3697J4976n798j3119o233J4812J6344j9656k0305K3611
472B700J7036k1948r887J1127P554L061j1976j3576J9587J5506k1969j3258J6940
485H97J3292r102j5600J915J8453K301j9145n329J6310Q439j1791j3402O755J8227
499A2220l980k1216K202J9378J403j5988m938J1140R806o914j4124K696J8843
512A0528J44k1375q09K0708K052j6010m693R487J0403l566j6740J434J9900j197
$$ plain form
420 10109 13721 -412 -16089 -4204 20315 8592 -20644 -10031 18000 10818 -13419 -12730 6167
433 6167 13815 -1244 -16688 -4865 16315 8678 -16690 -12181 14231 14297 -10516 -14964 6587 15659
447 15659 -231 -13267 -3863 13672 10453 -10487 -12334 11039 16451 -5337 -15823 4131 19120
460 19120 754 -15629 -1932 13044 7246 -5873 -12106 2706 19050 -606 -20911 2700
472 2700 19736 -2212 -12099 -972 6582 9643 -2333 -15909 3678 19184 -2785 -16043 897
485 897 14189 5087 -10513 -8598 9855 12156 -6989 -12318 3992 12431 640 -12762 -6007 12220
499 12220 8240 -12976 -10774 8604 10007 -5981 -10919 221 10027 3113 -11011 -8315 10528
512 10528 10672 -10703 -11512 9196 11248 -4762 -9455 32 10435 6869 -9871 -8437 11463 10266
526A0266j8501m79J4392L760r198r580N158J5150l868j8604L412J7130j219j3591
540e772l744J0530R154q650j3211O497J5735m831j6140K670J3702J594j0483o998
554i947Q459J1761p534j3423N002J4174k004j3624j664J2057O008j0744r878J0376
568i81J1302q957j0465M404J0126J256j0941n898J1700R221j1806j0687J1002
581g24R660p237p754N48Q394O466j1045r630J3264J0071j2762r095R509P524l642
596C547p549k975R993O578j1874p881J1399P448p306r340M037J0205o57j1320
610e695k279J1179M124r189o782P043Q877m398j0492K184J0947K42j0673k351
624g263R742L814o810n613K851R647p51j2567k0J3412p7j1287r28P841L531l545
$$ plain form
526 10266 -8235 -8714 5678 9438 240 -9340 -4182 10968 7100 -11504 -8092 9038 7819 -5772
540 -5772 -9516 1014 10168 1518 -11693 -5196 10539 5708 -10432 -7762 5940 7534 -2949 -9947
554 -9947 -1488 10273 2739 -10684 -5682 8492 6488 -7136 -8800 3257 9265 -1479 -11357 -981
568 -981 10321 1364 -9101 -4697 5429 6685 -4256 -10154 1546 10767 -1039 -11726 -724
581 -724 8936 1699 -6055 -5507 2887 9353 -1692 -11322 1942 12013 -749 -9844 -335 7189 3547
596 3547 -4002 -6977 3016 9594 -2280 -10161 1238 8686 1380 -7960 -3923 6282 5625 -5695
610 -5695 -7974 3205 7329 -1860 -8642 -1599 7278 2880 -7612 -5428 5519 5761 -4912 -7263
624 -7263 2479 6293 -517 -6130 -3279 6368 5617 -6950 -6970 6442 6365 -4922 -5850 1991 5522 1977
640A977q211J390J2416j998j2621K138R759K33o750l719M758O669k861r327J553
655d594J0746n74j0459p92Q883K884o944n678N331P853l810q867K132R185r68
670D328p418k133O127N513n946p512N371P382l227o906J23O752L092p045n767
685g266P498O992p187o903N641N807k330n552j320O196M110o220o273O427O966
700F586n856o036L545M912M29m744m875O757O703q063o102P085N374m429n252
715c966J111N656K316p159l375O821L822n401m267K862N540o76o957p47O919K353
731D852o992l007N722L752l415n674J597P171l88q123q2P717N99n703j527L149
747c52L428j90p312K80Q593p78p557K47N634J582l858l541J789N873r01p682J270
$$ plain form
640 1977 -6234 -4844 7572 5574 -7047 -4909 4850 5083 -1667 -5386 -628 6041 3180 -6147 -4594
655 -4594 6152 5578 -4881 -5673 3210 6094 -850 -6528 -1197 6656 2846 -6021 -3889 5296 4328
670 4328 -3090 -5223 904 6417 471 -7041 -1670 5712 2485 -4421 -4298 2454 5546 -1499 -7266
685 -7266 232 7224 37 -6866 -1225 4582 2252 -3300 -4620 1576 5686 -534 -6807 -380 6586
700 6586 730 -5306 -1761 3151 3580 -1164 -6039 718 7421 -642 -6744 341 5715 1286 -3966
715 -3966 -2855 2801 5117 -2042 -5417 1404 5226 -175 -4442 -1580 3960 3284 -3673 -4420 2499 4852
731 4852 -2140 -5147 575 4327 912 -4762 -3165 4006 3618 -4505 -4587 3130 3729 -1974 -3501 -352
747 -352 3076 2886 -4426 -4146 4447 3669 -3888 -3641 1993 3575 -283 -3824 -2035 3838 2937 -4745 -3475
764c475P550j110n752o76M544K453l178l930J161O096p06o930P16O073L2l904
780a036k465K727N248l066o350L232N922k658l760j47L176K930l712m829M370
795d18M967m571l597K656K442J080l261l544M446M608n274m501M919L370k935
810C87l198R40L248J666l764l487M587L991m715l433L393K947j282k741j337L531
826G33L667m930l997N242L192m138k317J785K772O97m034k110N131J568m357j682
842b778L084K073q77l337p95M623J479n719q74N025J58k445j413L82M159J95o033
859c093M43N961j126m556J345J576R41k02l129p48N627k16n752Q51M331k77k788
876h12j289J665K767j002m016P27M616m87m613L75L925M06k600j428J198L043
$$ plain form
764 -3475 4075 2965 -2787 -3463 1081 3534 356 -3574 -2413 3683 2977 -3953 -3237 2836 2868 -1036
780 -1036 -3501 -774 4474 1408 -4942 -1710 4212 1554 -2206 -2353 823 3753 41 -4788 -418
795 -418 4549 -22 -3619 -963 1479 2559 -702 -4246 200 4808 -466 -4967 -48 3322 387
810 387 -2811 -1871 1377 3043 -721 -4208 379 4370 -345 -3778 -385 2562 1280 -1461 -2798 733
826 733 4400 -530 -4527 715 3907 -231 -2548 -763 2009 2706 -1328 -3438 1693 3261 -1096 -2778
842 -2778 306 2379 1502 -1835 -2630 1993 3472 -2247 -3121 1904 2062 -383 -1796 -1414 2745 2940 -3093
859 -3093 -2650 3311 2185 -2371 -1026 550 1491 1289 -1840 -2588 3039 2823 -2929 -2078 2253 1976 -812
876 -812 -2101 -436 2331 1329 -2687 -1960 2656 2169 -2444 -2069 1856 2262 -338 -1766 -568 2475
892B475o86m142R44L878p69k501o05J351K819j955m237K852L994k930k570J804
908b78J121J154j488l485K754M001l677l100L461J446j580m98j413J771K621k509
924C01l392L441K792l037j940J491J885l55j653j537K485K302l148k350L170J701
940B156j895j042l18J752J646k912j991L463J750l104j247J631J515K2k117j188
956a879K991J296l737o41L070N24j506j161N8K292P13l637k82L567l44k469J23
973a022J060P30Q83l057p36M379n87l805J203J989o02k18j604K09K818j69l593
990b122O99L408j030k209K86J474L43m17j730K51K588k22k810J28K723j87k150
1007i77j96J092J443p62k380R99K384j053j423K74P01J173p00k758J802K546k417
$$ plain form
892 2475 1789 -2353 -1409 2469 1700 -801 -1406 -55 2764 809 -3428 -576 3418 488 -2082 -278
908 -278 843 1997 509 -2976 -222 3779 102 -2998 463 1909 329 -169 -1582 189 2810 301
924 301 -3091 350 3142 105 -1835 -344 1541 1186 -467 -2004 481 2783 -365 -2715 455 2156
940 2156 261 -781 -1099 653 2299 -613 -2604 859 2609 -495 -1742 -111 1404 1426 -691 -1879
956 -1879 1112 2408 -1329 -1970 1100 1624 118 -1043 -985 1307 2020 -1617 -1899 1668 1324 -1145 -1022
973 -1022 38 768 1651 -1406 -2142 2237 1650 -2155 -952 1037 435 217 -1387 -1178 1640 1471 -2122
990 -2122 -1423 1985 955 -1254 -968 506 849 432 -1298 -1047 1541 1319 -1491 -1363 1360 1173 -977
1007 -977 -1173 -81 1362 600 -1780 -781 1603 550 -873 -599 102 1275 575 -2183 -381 2165 -252
1024b52j242J645N62l37m39j422J335K511k061k626K810J218j616r79N62M51J071
1041A191r84j776J393J970j981j854K050R86o54r21m48R85J748k308j238K219
1057C78J018j372r47L66J171M00j562r32J862J045k094m76J327M78j4j098q41
1074a291K010R48k623m42K660j48j662Q2L0R01O98k258m39K801k23k163O05J097
1092E83m70M12j030p40K410J49k855P01J989n65j160O5K98J083m13j501K19J935
1110A110k35k001J62J744l91n65l54M4J401O4k136L42K106r35q72K26K46Q81j44
1129F93k085R16K030j563q83J193J9R5L07j904M91K297j529j694K038M16j168
1146c31L67q09K89J884j213j979J818J634k042p21J316N6N5j20j032O26J427j327
$$ plain form
1024 -252 -1494 151 713 376 -63 -1485 -150 2361 300 -2326 484 1702 86 -893 -331 120 1191
1041 1191 207 -1569 -176 1794 -187 -2041 9 995 341 -580 -1028 -43 1705 -603 -1841 378
1057 378 1396 24 -923 -557 614 1014 -548 -1480 382 1427 -667 -1143 184 662 648 -450 -1291
1074 -1291 719 1667 -956 -1398 1262 1114 -548 -466 -436 465 1163 -1095 -1534 1267 1044 -1119 -514 583
1092 583 113 525 -505 -1245 1165 1314 -1541 -840 1149 584 -576 -511 -213 870 457 -1044 -825 1110
1110 1110 875 -1126 -964 780 389 -176 -530 -486 915 979 -1157 -815 1291 356 -516 -290 -44 837 693
1129 693 -1392 -476 1554 -9 -892 301 320 415 722 -1182 -691 1606 77 -1617 421 837 -331
1146 -331 36 -773 -484 1400 187 -1792 26 1660 -382 -1103 213 269 324 204 -828 -202 1225 -102
1164a02j152J511Q50j309k26J48L87P61j095r67J393P50j366j84M25P97mj064
1182d47n25J234R25j859l44J588j32o72K43o02O83J105j886m03J950k59j385M89
1200b97L98l58R15j060j007K230L09k263N67J289p66J5R4q28J167M38j801K22
1218g36J530l91j157N20K91K6p1n51k30J529q6j629L66J472n62p00J9j71J085
1237E54k03j143M08J470j062n64N66m14M93L23j133J80J823j581o81J449k5p96
1255c36Q62q86o6J509q88j576J430Q31j377K9Q77j011J214j61j460N20J389j113
1273b13r84J486J1n96N00o07Q2J388j109j097J653K23j099n3M08R8M77n47q41
1292h20J174N75j423N9P99m74p1L92q98P64N46r62n62J808m46j144O80L4k44P93
$$ plain form
1164 -102 -1254 257 1107 -202 -428 -280 107 868 -227 -1194 199 949 -417 -601 -176 621 617 -447
1182 -447 -972 262 1187 -672 -1016 572 440 -232 11 -591 92 1197 -689 -1092 858 599 -786 -297
1200 -297 101 -257 658 -402 -1409 821 1130 -1133 -566 723 -43 -28 66 -762 405 843 -958 -736
1218 -736 794 403 -754 -234 57 83 12 -539 -769 760 674 -955 -589 883 321 -379 -360 -531 554
1237 554 351 -792 -384 1086 24 -540 26 -388 105 428 -705 -525 1298 -283 -964 485 460 -336
1255 -336 526 -360 -426 1083 195 -1381 49 880 -497 -468 409 -602 612 451 -1009 -489 900 -213
1273 -213 -1197 289 300 -296 204 -403 -321 1067 -42 -1139 514 737 -362 -415 -7 91 568 21 -820
1292 -820 354 929 -494 -435 364 -110 -181 211 -687 77 623 -339 -901 907 461 -683 -3 31 -213 580
1312E80o14j074J768K05j623O25P00o90L80j31r44J253P40j931Q9J541p50o54
1330e30P18o8j28M63q81l9J412o13j040M49O04o68K37M0n95P18N57j347M4J472
1350H05q39m87P46k99mN26j051L98J100p36p06Q94j89k07K99l92j16R32k76j309
1370i11J085M23p78P1j3L37J51J57j253N16J130r37n78J183n17l29P69o92j26
1389c12J297p37j128J251J00j158Q89J31o11Q12l97p18M88Q82j013j30N82j51
1407G7Q0r5m51K48O91p20m55Q56J02o29K99O7q3L23k26p54J150m7j149O65N42
1428D91q27P93k52p41O97O32j499J16J347n97k83K46j65k52J040j162k06R87P0
1447D35j089M49L40k3J39m58Q4L76O4n32p5P47n58k18M99l75L82J66j040K13J241
$$ plain form
1312 580 -34 -1108 660 865 -758 -133 567 -123 257 126 -818 435 1175 -756 -667 874 124 -530
1330 -530 188 120 -8 455 -426 -465 947 334 -706 -257 347 -321 -84 -44 -639 79 636 -711 -667 805
1350 805 -34 -521 225 -74 -78 448 -603 -205 895 159 -547 347 158 -49 250 -142 -258 674 398 -911
1370 -911 174 597 -181 -110 -123 214 365 522 -731 -215 915 -22 -600 583 66 -263 506 -186 -312
1389 -312 985 248 -880 371 471 -687 202 333 -278 534 137 -581 -93 789 -224 -354 228 77
1407 77 157 62 -389 -141 550 -170 -625 231 333 -296 3 70 -13 310 84 -670 480 433 -716 -51 491
1428 491 -336 457 205 -536 161 793 -706 -590 757 160 -123 123 -42 -294 746 -416 -622 365 435
1447 435 -654 -205 135 112 251 -207 -123 253 317 -215 -290 457 -101 -319 180 -195 187 353 -687 -474 767
1468G67j041k46Q58m01n3N27n82l23R04j77p37O99R9m47J56K43l46K09J69p05
1488d27J63R37p05l76M77R0j66L25o91J96P11o46m17P76L8n80M93k23m73J037
1508E39l02j040J074J80r86K93N10l72N8M18r67N44O63p74m82O86J15m11L92o0
1528G8k52M19l26j68M50P8p38L00L80n46Q63m60o53R66nq84J03R02q99M77K40
1549C25o63M13N18j064n5J475q75n17O45m9l80M87pn53M40L10o67p7O49k47m23
1570c15O45k51l7M26p53o6P07n65M4K64l64R0N99p30M6R06p41m46J152o24m08
1591d21P92m68k99Q30q2p93L36O93j019J99L48l80K88M6j70o6M35j63n29N43j22
1612bk24M40m72PP23m06o54J062j94m95L15k44k45Q91k66q99P07P30j390K66Q65
$$ plain form
1468 767 -274 -520 338 -63 -116 411 -171 -494 410 233 -504 195 294 -153 3 246 -100 109 278 -427
1488 -427 -264 673 -32 -408 69 159 -7 318 -373 -177 534 -112 -529 247 285 -295 198 -25 -498 539
1508 539 237 -803 271 451 -535 -242 268 -104 -46 372 -595 -51 612 -162 -644 42 157 -254 138 78
1528 78 -174 245 -81 -249 201 279 -459 -159 221 -325 538 78 -575 391 386 -498 -395 507 -392 85 325
1549 325 -338 75 593 -471 -526 949 74 -443 202 153 -227 260 253 -300 140 450 -217 -294 355 108 -315
1570 -315 330 79 42 468 -285 -351 356 -209 -165 99 -265 -175 424 -306 -260 646 -95 -541 611 -13 -421
1591 -421 371 -97 -396 434 352 -441 -105 588 -431 -232 116 -264 24 70 -100 -166 269 106 -423 120 -2
1612 -2 -226 214 -258 -251 472 66 -588 474 280 -215 100 -144 -389 502 236 -663 44 774 -616 -350 515
1633E15n54j30L40l98j8J008m87j021R04M66r83k7P89o36K26R2k56J52L65l82
1653c5l0K56k07J44qp10J123M9j181N42O28r35K9N94l30j23P60m03r30J379k23
1674C89j156R95K36r30K72M13m84R4P12n88n27R81k53o10M85J20m09P8K66j92
1694a08M24k34n2Q4k13OM90o43k99J020m63l04N57rp94P15J73o93N30M07p28k02
1716c36J067p62o75J133j85n46K70K84o13L15O23o70K42K10m57j6j01K19j02n5
1736a55o5N59j58m61N34P8n27M10M3q74N81O43j198n5J299m33r10J049j82o80
1756e02R17O0q96K94O78j156K24P41j76m64M26Mk38L72j46j39J33P3l00m3j10
1777b48K77J48p59O91L05p18k6Q25m82l57O95n3r88R56j67r77P92Q71j258J1J095
$$ plain form
1633 515 -39 -169 171 -227 -245 763 276 -745 159 625 -358 -385 404 -232 -6 86 -170 -18 347 -35
1653 -35 -65 191 -16 128 120 -590 533 582 -599 -57 571 -364 -335 259 -71 -194 566 163 -767 612 389
1674 389 -767 228 464 -466 -194 219 -265 -171 541 -47 -574 407 154 -456 29 149 -260 -182 84 -108
1694 -108 316 82 30 114 -99 -93 397 -246 -545 475 12 -292 265 256 -538 177 350 -343 187 594 -134 -336
1716 -336 731 -31 -706 427 242 -304 -34 250 -363 -48 575 -95 147 357 -100 -116 -217 2 -100 -155
1736 -155 -220 339 181 -280 254 332 -195 215 258 -616 -35 608 -590 -645 654 221 -689 360 178 -502
1756 -502 415 475 -421 -127 551 -605 -381 360 184 -280 146 150 -88 284 138 -1 132 205 -95 -138 -248
1777 -248 29 177 -582 109 414 -304 -330 495 13 -344 351 298 -690 266 99 -878 -86 785 -473 -462 633
1798F33r30j04Q69l05p18N99M05r47M71N05m62j27L06k37J12M6k34J25R5L03j38
1819B67k61JM32n20l47M47M95q88K65M54n01p7Q41o70m55J223m27p73L71P65r76
1840c34K63N22p36J63P34q93K9L50P2n09M16J97k18l8Q8J09k26k05K52J44m06
1861b26J97L21o43L3O82m11m54R11k66o14N83J93p42M39N44q82K42R12r26o09
1881g16J163n42l56M91K04m98K93J86m68K40J04k42J49j39L00o5j74N5M40n87
1901a62o0N66n02k59N87R0n66N47K69q25J47P56p40l57Q82%p42N41j5n84M38K25
1923B36o04J94N92n98M8M71n53K35N4JJ90l18k9P6o7N2L51k63l89J88M22o70J53
1946b28O56o20K49N66m53o78P79l8o55K50L08p20L75M95n00K3N92l17n08O53j69
$$ plain form
1798 633 -297 -401 468 163 -555 44 449 -498 -27 478 16 -111 195 -42 70 116 -118 7 102 405 267
1819 267 6 7 439 -81 -428 19 514 -374 -109 345 -156 -233 608 -62 -517 706 279 -494 -123 642 -334
1840 -334 -71 451 -285 -122 612 -281 -252 98 170 -339 77 274 56 18 106 215 -11 -216 36 180 -226
1861 -226 -29 292 -351 -318 364 -47 -501 410 144 -470 113 306 -436 3 547 -335 -93 819 -107 -716
1881 -716 447 -95 -451 40 244 -254 39 225 -243 -3 101 -141 8 -131 169 104 -70 -15 425 -162
1901 -162 -222 344 -158 -417 170 260 -306 241 510 -315 -168 588 -152 -509 373 373 -369 172 157 -427 11 236
1923 236 -368 -174 418 -180 -132 339 -214 21 75 76 266 -52 -81 -5 -72 -20 331 68 -321 -133 289 -381 -228
1946 -228 428 -192 57 623 170 -508 271 233 -422 -172 136 -584 -209 286 -214 -191 401 84 -424 229 60
1967F0j18l2J48nl03L43j61j05M0K30J42k11k6K77n02J4O50k66l60L38J30o08
1989c25L35M84p74J75P11p57k78J212o13o05O27k09k89N13j4j43K60l59J22k13
2009a40J55Q9j52L91L5j98m21K97K92k05l21K39qj08J91P2m85L57M34o30k97O46
2031B33j30n60O95k72m47N06L3m01L42L19m67MP73p12j58M41j88L2J65j31J7%
2053I4j20j8K07k25J65M9m98K71K75j99j48L31p1n28Q33m92j12M22L52r42K17
2074a37N67o70J52L45l54k37O96n98j65M67j10j07N5M16l68k2J67R1j69r0q1L08
2096A56r1j93L09j07k48L39o3l29J40L11o26K97M01n68J13M96m59k35N99l71l44
2117d73P10j42o32M95L9k2p2L05k20l9L52l05q4L6J71k35K00j24j79M17l22j7
$$ plain form
1967 60 -58 -90 58 53 -250 93 -68 -173 -133 97 239 28 2 279 -223 -209 441 175 -185 153 283 -325
1989 -325 10 494 -280 -105 606 -151 -429 783 170 -435 192 -17 -306 207 193 50 310 -49 73 -140
2009 -140 15 104 -48 343 378 180 -241 56 348 143 -178 61 53 -55 136 208 -277 80 514 -116 -413 233
2031 233 103 -457 238 -34 -481 25 58 -343 -1 318 -149 -145 628 -84 -242 199 11 43 208 77 94 94
2053 94 -26 -44 163 -62 103 152 -346 -75 200 1 -147 184 113 -415 418 -74 -186 236 588 -354 -137
2074 -137 430 -240 -88 257 -97 -334 362 -236 -401 66 -44 -151 -96 320 -48 -70 97 188 19 -71 -152 156
2096 156 65 -128 181 74 -174 165 102 -227 -87 224 -402 -105 296 -272 -159 337 -122 -357 242 -129 -473
2117 -473 237 95 -537 -42 -3 -25 -97 208 -12 -51 301 -4 -88 -52 119 -116 84 -40 -219 198 -124 -141
2139a41M27m53J89J51j06k84N91k61l93N25j40m39O11j94k30J55J95l44P5L73
2159C07l99kM17m42p3K58K00m65M8J06qJ10m2q4j58K89l6N2M6l39J40Q9m6j08
2183a40N04p99L15N23m18J04R7m64J80N72l47m02M36Lj56L92k01m28K36J97m51
2204b47L05L35m52m0M12m45J34J11l29q5L91j13R3J59l12j82K60L4k19N50n66
2225b06N0M82l86j63K62R2m96N72J5n84M98J84n88M87j79k43K21R6p2l97M16k47
2247a86J24R0n5k22L63J4j21Q7J46l84J96K78o16L51j40l30M99o7k39M0M90m06
2269h8K08J65m73L48J44o27K6N28j78k94K34J27l54K60J03m8o1jJ51j19Q4k96
2291a61K39j21j02J1P7j49K20M13p17J98M68n12J39K39k83K17n4j5l35M87k94
$$ plain form
2139 -141 286 -167 22 173 67 -217 374 113 -280 245 105 -334 277 83 -147 8 203 -141 -66 307
2159 307 -92 -94 323 -119 -192 66 266 -199 -151 -45 -53 57 15 -69 -227 62 26 78 124 -215 -75 14 -32 -140
2183 -140 364 -435 -120 403 -15 89 186 -278 -98 474 127 -275 161 164 8 400 199 -229 7 204 -247
2204 -247 58 393 -59 -99 313 -132 2 113 -216 -301 90 -23 70 229 -83 -265 -5 29 -190 360 -206
2225 -206 -156 326 -60 -223 39 131 -365 207 222 -362 136 320 -268 219 40 -203 18 114 42 -355 61 -186
2247 -186 -62 28 -27 -249 114 128 7 94 240 -144 52 330 -286 65 -75 -405 94 27 -212 -172 318 -88
2269 -88 120 285 -188 160 304 -323 -297 231 53 -241 -7 120 -234 26 129 81 20 19 170 51 135 -161
2291 -161 78 -43 -145 -134 -57 -206 14 427 -290 -92 376 -136 3 242 -41 176 122 107 -228 259 -35
2312c5j70K53J35n50N70k44l75N41j19j82J8M53m33j08M48r5l6L12p12L62J57
2333A90m27J04K50j02jL55k66m45M26M1k78K62J97m61M47N2o53P03j04m13J45
2354B2L0q9p6K20k36j16L73k60O5N8J04l63M87j55k22J95k0j17N18j04l55L63
2376C22j29k76j53L93p9k7L22n57K90k33J08j43L29kj50L68n75K52K14l60j03
2397a89M23k38k97L27M5j84OQn5J38P1r5J08l5k93K15K53l30ML72n85J86P0L43
2421B68m73L51j20j43L83l22N3K91l13j14K5J25r7Q6N4j24O2j6O4l41N74j88k75
2444a90M06j88j86J44J44k89J59k88j09L86K30j21j71l7O4K05K7k32J14rj21K03
2466A41k16J73j75L69l92J17L38l09k21J25J67l48J67k5j96M99p0l36J22M41k17
$$ plain form
2312 -35 -205 48 183 -367 203 -41 -416 125 6 -176 -158 295 -138 -246 202 107 71 383 -329 33 190
2333 190 -237 -133 117 15 14 369 103 -342 84 125 -153 109 306 -155 292 344 -309 394 290 -123 22
2354 22 52 -37 -113 107 -129 -245 128 -132 -67 -9 95 -268 219 64 -158 37 17 -100 418 314 -41 322
2376 322 193 -83 -236 157 78 51 373 -184 106 -127 -19 -162 167 165 15 383 -192 60 274 -86 -189
2397 -189 234 -4 -301 26 71 -113 -107 -99 -154 -16 55 -40 68 33 -260 -45 208 -122 -118 254 -331 -145 -75 268
2421 268 -205 146 26 -117 266 -56 -3 288 -25 -139 -114 11 -86 0 54 -70 -8 -24 40 -301 273 85 -190
2444 -190 216 28 -158 -14 130 -159 0 -288 -397 -11 219 98 -73 -110 -46 159 186 -46 68 59 -62 141
2466 141 -75 98 -77 292 -100 17 355 46 -175 -50 117 -231 -64 -89 -285 214 144 -192 -70 371 154
2487A54l34N26m96J94J49m25L91q4k19k7M19l35J99O0j07q9R7P0k56L47j82p3
2509b1K43O4l74P4J83j77K05J45m60J73o7l1O2M03m42o7J07j47K31R7m00N9L73
2532B33j59l16L52j42l8J5j25j28J69L19l32J8L09l9k0N2j63j16K8P1j50K83j58
2555c7l4K31kk83M20n76m4M36l5k17L29p2m79N08Q3l80JM39l00Q7k03j96K73K24
2579A73j63l7J29l4l60O59m04lK49l23j54J03J31j93L53q4l42J04J92k00J10K01
2601A07l56J3K28j27J15L02l71K17pj03k41L30p8k38K60o4N6P6j70j13M23j14
2623A45k29k33R42k65k77K04m37L81k29nJ62J91k33q5J37k39j54M33l94K99O2
2644A76l79j7M73k04j5J06p5L2k04J08K0L11k18l81L90J75j66L9Rk84P2K28j03
$$ plain form
2487 154 -180 346 -150 44 193 -232 159 75 -144 -171 248 -87 112 172 65 -24 73 143 -113 234 52 -21
2509 -21 222 286 -88 -14 169 -8 197 342 -118 55 -12 -43 19 422 -20 -87 20 -127 104 201 -199 -140 233
2532 233 74 -242 110 -32 -70 -55 -180 -308 -139 180 -152 -134 175 136 116 168 5 -111 -83 -12 -162 121 -37
2555 -37 -71 160 158 -125 295 -281 -325 111 76 -141 188 116 -363 145 228 -152 -151 288 -12 75 -128 -324 -51 173
2579 173 10 -27 102 68 -292 367 -37 -40 209 -114 -268 -165 -34 -227 126 42 -300 -196 -4 -204 -94 107
2601 107 -249 -236 -8 -135 -20 282 -89 128 121 18 -223 107 29 -209 51 -13 43 119 -51 -164 259 145
2623 145 -84 -317 625 360 83 287 -150 231 2 -3 159 350 117 32 169 -70 -224 209 -185 114 176
2644 176 -203 -220 253 49 34 140 65 97 -107 1 21 332 114 -267 123 298 132 171 180 -104 -32 196 93
2667I3j48K59l48o8K32j00r4L17j35K5j75J17k04M9J3kK95K24m79k8M05l91J98
2690E5q3Q0lQ5k00j6K24m74j3L14j29nK03o4k15K76p0J93k9j21r4J58K16l47K55
2715A96k50K5P9K94n05L78j14k32K57l5j58kJ56K5k21lN06m46L28k47j22L4J42
2738H5l35L83J12m95K23L02m67L43j99j46K7M73l37K3k5o3k76O58q24M56K43J09
2760B70r62L78N94o37J13K44m95R45m62l04K72k68m6J89J220j248p8P7L6j94N56
2781B00k63L22j33P31q47J66l66K14m3j9J53N2j24k33J48R5j94J08O8j46P7K46
2803B12m38J49J21l9j92M65m44J06Q9l2j56K26l9l34L18J91l15J19N5j10L40j66
2825A26k86L79O0m78J42J56k98O3K54j18k29M98m14N0P5r8J53k0N0m36M52Mj90
$$ plain form
2667 93 -55 204 -144 -212 20 -80 -174 143 8 33 -142 -25 -229 -180 -167 -169 126 350 -129 -157 248 -143 55
2690 55 -28 52 49 134 -66 -82 142 -332 -345 -31 -160 -165 38 -26 -241 35 -35 158 129 8 -86 72 288 -59 196
2715 196 -54 -29 50 344 -161 217 103 -129 128 93 -65 -67 89 114 -107 -110 396 -50 278 31 -91 -57 85
2738 85 -250 133 245 -250 -27 275 -192 151 -48 -194 -167 306 -31 -8 -33 -96 -372 286 -538 -82 161 270
2760 270 -692 -314 280 -357 -244 0 -495 450 -12 -316 -44 -312 -358 -169 1051 -197 -275 -198 -162 -356 200
2781 200 -63 259 126 857 10 176 -190 24 -19 -38 115 167 43 -190 -42 53 -141 -33 35 -111 -34 212
2803 212 -226 -77 44 5 -187 278 -166 -60 29 -3 -159 67 28 -306 12 203 -112 7 62 -48 292 126
2825 126 -160 219 279 -199 -57 99 -199 -136 118 0 -229 269 -145 -95 -20 -118 35 15 65 -371 81 85 -105
2848a05M43l27K25j38jk78J20K89l31L99k19k30m8K82j16K21m4j52nJ16J0k70
2870a59J87J23k75M17l46k64M11N1k32L34k43l64M72p2J84r7o5L5p3J58k47o4
2892a29J67j0j56L53j46k47K89%k87J21P7k56K66O3j76L2J51l57M36k73l92L61
2914a13N69p23k6J69K73k33oj31J75P8Mj38K65m2n6Q8r6j84R8J28p2m4J53l46
2938b10L05J42m06J74Mj68j80O23k1k40j30K2J55J39r2l44K11Jm3J39p9q9P3k2
2962c6M0m7Q9j38J24N3j22L0P8P2k26K69n8j86Q9j56J06J11j77n4J20J85m36R5
2986a75J82p9J30O4m26M04r1k14J22J64j68M0j64J43J34l5k6k53K70j41p1J73
3008a7j14K05J40r6j64O6L22n71L68m55R8J51K24l03J49n1j13J13J19M1J5j03
$$ plain form
2848 -105 338 11 236 98 97 -181 -61 228 -103 296 77 -153 -201 81 -35 186 142 -10 -15 101 111 -159
2870 -159 28 151 -124 293 -53 -317 94 145 -87 247 4 -360 112 40 224 127 62 97 24 182 -65 -129
2892 -129 38 28 -128 225 79 -168 121 121 -166 -45 32 -224 42 105 -71 -39 112 -245 191 -82 -474 -113
2914 -113 456 -267 -293 -124 149 -84 -90 -221 -46 32 36 -102 163 121 65 153 57 -127 -29 99 27 -17 136 -210
2938 -210 95 237 -169 5 9 -159 -339 284 263 23 -107 -85 70 209 117 -227 -16 -15 -58 81 2 -87 -14 -36
2962 -36 4 -43 46 -92 32 85 -37 -7 71 143 -83 186 128 -58 31 -125 -19 92 -85 -139 -19 166 -270 -175
2986 -175 7 -72 58 122 -304 100 9 -205 -83 81 -87 -47 -211 -68 66 31 5 -248 22 -119 -190 -17
3008 -17 -131 74 214 118 -46 20 342 -229 139 -316 -218 -67 157 -146 3 -48 -161 -48 71 112 127 24
3030B4j84J68R2k90K68Q9m26J28L21k75o9J30K19k77K12k48mK00L5l12J49K33
3052A83k55R8J41l58K55J17m35J68K76j0j38r1M7j2M3K18k39K43j27j57K20O3
3074B50m33J65K7l85O14j49j86j11M26l65J57J11j4j88K05l07j07M37k30r0J36
3095c7Q3p8N6j8O7rk09O0K2rj2J48j07N0r6J00l2N3J92k22N8O1j14K86q3j59j46
3122i5J6J86k27J38J15k14J36j42j25M01j92j66L09j97R4k09K86j34N5O1k85L86
3144A97j58qj61J34J18j79M86m64l0K86O0k87%K70k99M2J23l70NM57k01j48L53
3167B26m24Q8K00n8j43K61nj48L2P2j74j07J04q3R4O5l05N58M3o36M52L3rj37
3191aL3j51K05j71Qk9J95o9K7J9q0l1K28k21k38K82J74m68K76R0l02K49J25n7
$$ plain form
3030 24 -160 8 100 -190 78 167 -259 -131 190 -85 -154 -24 195 -82 130 -118 -122 78 113 -199 -50 183
3052 183 -72 26 167 -191 64 181 -254 -86 190 180 42 -49 -2 -14 29 247 8 251 124 -33 187 250
3074 250 -183 -18 9 -376 238 89 -97 -208 218 -147 10 121 107 -81 124 -183 -290 147 -83 -173 -37
3095 -37 46 -32 24 6 73 64 -145 -85 -63 -72 -84 64 -43 7 -89 11 -21 32 224 2 60 121 7 293 210 51 -95
3122 -95 -79 107 -120 18 133 -81 55 -87 -212 189 -3 -169 140 -57 37 -172 114 -20 35 96 -189 197
3144 197 39 31 -130 4 122 -57 429 -35 -65 221 281 -6 -6 264 -35 7 130 -240 -235 222 21 -127 226
3167 226 -198 -110 90 32 -111 150 145 -3 29 101 -73 -180 -76 -159 -65 0 -305 253 296 -340 112 145 136 -1
3191 -1 32 -119 86 -85 -77 -106 89 20 47 66 -14 -45 183 -38 -276 6 180 -288 -12 78 -224 25 150 93
3215I3k19m8k4p8K87o5K00j36p1j5J53j27M8j6M5l03L80L1k62J83l16k6K26K7
3239c3K56k24Ljj82J38J74j53K04o3k36K06j16Q5k5N4k97J99J44l39K12Jk52K14
3263c1k8J27k97K63j%j09k7L2K33j45J4K18j87j6n1lk01K11P0m05O20l19n8J94
3288A04J7j08J28j47l28P31m16q6R0N3m5K31N4j69K5n9j80P1J09j46j91N24k35
3311B7j14K41j96rM7P5k81K73j16j73L85M5l96Q0J32j8k26J63K46j25M4K2K1n5
3335I2r0k01L94j38j22K1J21k53L77k78l5J69r6l05O02p7l94M19l99M7J10K50
3357B14k24K58j36n8q4K12q9l41N9J07%q7J28j8L57j58k65K71j39j66M8K38l29
3380b02L41J2m80P35p5l14j90J87j28J27j75K48n5j3j6p4O7j29m8K5J47J70j32
$$ plain form
3215 93 -126 -174 -198 -276 11 -54 146 10 -61 -76 77 -50 -2 -18 27 -276 104 135 -127 56 -260 -286 -60 -33
3239 -33 223 -1 2 1 -181 -43 131 -22 182 119 -117 89 -27 58 33 87 -210 -11 133 -206 6 7 -245 -31
3263 -31 -59 68 -229 34 33 33 -76 -103 -71 162 17 31 249 62 46 -5 -8 -209 2 72 -333 287 -32 -90 104
3288 104 121 13 141 -6 -334 397 -19 -105 -15 38 -7 224 278 109 134 75 -105 -34 75 -71 -262 262 27
3311 27 -87 154 -42 -51 -4 71 -210 63 -53 -226 159 204 -192 -112 20 2 -224 -61 185 60 104 126 147 92
3335 92 2 -199 195 57 -65 -44 77 -176 201 -77 -112 57 -39 -344 258 181 -213 206 -193 -146 -36 214
3357 214 -10 248 112 54 -30 182 93 -248 -189 -82 -82 -169 -41 -59 298 140 -125 146 7 -159 -111 127 -202
3380 -202 139 151 -329 406 331 17 -173 14 -114 13 -162 86 31 18 2 -72 -5 -134 -182 -157 -10 160 28
3403B8j27p7L88k78j18K66J64j84j92K64l37R4J64k00K65M4j49j19J35j78k57
3424d04N93j44k18J0L7L9K00r8N8p1K30j76K3Qk89j5K34p8K3J24j72lQ8j37L1
3449a07p2J53o0mJ60N3M3K5j75Rj46J95k8j7k14L07j14j27j2K64j33k67L91k16
3473i2J58J97k40K28l03J7P4n9K03l07J28J28k52l0J22p8k6K76m4j07J31j67J17
3496G4k98QK90J69l39K2J21j11q2L85l79Q1K18j96r8K98j83k12L20k0M5j08K65
3519B70k30J02j06l4j67K69r6M8O2k94J78J75k09j53P1J48J2rq9J7O2k73M28j94
3543a2J67q0m6j65J13J34n1r5J7j1k58J03K49J9J79j59j60r7L04J4l60J75J66
3566A46n9oJ98l14j05L0K3O6J39k65M20l8m13L38l37L08j63J49k80J74J02j02
$$ plain form
3403 28 -99 -176 212 -66 -184 82 246 62 -130 134 -203 -109 55 -145 120 164 15 -104 31 -147 -404
3424 -404 189 45 -173 -163 -126 -87 113 15 73 2 232 56 79 87 -202 -217 17 -61 -38 86 -86 -89 -1 -138 -107
3449 -107 -179 -26 -86 -90 70 123 166 191 16 25 -121 74 46 29 -185 122 8 -119 -131 133 0 -267 124 -92
3473 -92 66 263 23 251 -52 -35 39 -20 183 -124 4 132 -120 -150 -28 -106 -132 144 100 -7 124 -43 74
3496 74 -224 -216 74 243 -96 -74 47 -64 -146 239 -140 -59 159 -37 -135 163 -20 -232 88 68 113 5 270
3519 270 40 142 36 2 -165 104 8 56 118 -176 2 177 -32 -185 -114 34 46 37 -52 -35 27 -246 182 -12
3543 -12 155 75 29 -136 -23 111 60 -35 -18 -29 -287 -184 65 84 263 104 -56 -153 151 165 -195 -20 146
3566 146 87 81 279 -35 -140 -110 -87 -21 118 -147 273 235 -178 160 -177 131 -32 117 -163 11 113 11
3588A1Q3j56j02o4K86K8k54J82q9m4K22j56j27J41j81R9K9m0J28pJ99l88J69R7
3612F6K1j82J14K4l37L90J64k55J15o5j77K09j86p6L24M0m23J66K26n4p2j6j00
3635h4J05n4J32m9J78j4l31K18k5l54L81j39N1j89RP2P9J54p1k7k13l6L76Oj85
3660a0J35p2j08r5J54R7j10J16L9j73O2JM5J78J88n22K78j10k97J81Pk51N2N23
3684C08m11R7J83k66L14j26O1l68K86l52P6K08j15J51J94l56P2K20j27j41K39
3705A47j34l4k0p9K28q2J9j91J20o3P5J44Rj19j51J77j45J12L6N6l15K26j60J33
3729a1m4L19l76K69n7k47K10j41J2K08j51k48N01m85J92J16j39L42j019O15j05
3750b39J13L93j35q6r5j62R7L43M9n21J88p6k62M59O4m31L3K57k25N12k10N75
$$ plain form
3588 11 94 -62 -164 -228 58 86 -168 14 -75 -119 103 -53 -180 -39 -220 -121 -92 -132 -4 -11 188 -200 -31 66
3612 66 87 -95 19 43 -294 96 260 5 120 55 -122 87 -99 -175 149 189 -234 -68 158 104 32 16 -84
3635 -84 21 -33 99 50 228 214 -117 101 76 -278 103 -36 15 -174 -165 -93 -14 140 69 42 -171 -207 169 175 -10
3660 -10 125 53 -55 -150 4 101 -9 107 146 -27 35 36 81 259 447 -75 203 93 -204 -23 -16 -267 -215 308
3684 308 -103 -6 177 -89 225 99 160 -208 78 -274 -198 10 -105 46 240 -116 -44 176 49 -92 147
3705 147 13 -21 -41 -120 108 26 45 -146 -26 -89 -14 130 139 20 -131 46 -99 13 49 105 -210 16 -144 -11
3729 -11 -55 264 -112 157 100 -147 63 -78 -66 142 -9 -257 244 -241 -49 67 -72 270 -749 -134 -239
3750 -239 -126 267 132 46 -49 -211 -114 229 278 -243 -55 -131 -393 66 130 -301 -268 -11 -236 276 66 641
3772F41p23Q35r04M36j45l85J15K73k00q54L35P80J07k82P4j56J73p3m7J75k46
3793g1N0l76L57N1Qj14K51j17L69n32ML36m47k15M39j85R97k38L50j253j37P59
3815B86m27K22l19L18l86L13J16Lp2r4N3o5j00K07r5J6J72P6m26L08M2j66Lnj89
3840b09J68j09L11j53o2M72o82K31k42K72pJ60k97L39O9l77O0L51k61J9N6j29
3862b0J01J22k4m9q0j5j94K88k70K54N5k76J97L6k45J18P5n2N1k71K20n2j11L32
3886A90j79J77j43j00j32L10m7o6J8r4N7R6J88j81M4p8k37R6Q1O4n9R2R8j07O1
3911A49l51L50n2n54N68J07k55J43l3l73K09L03j93M5K41m22J04J2j03OK58k43
3933h4j76K09l2L6J72J14k60k13M86k62KQ0J27k52P2l5JJ25k45R5j04J71J69j11
$$ plain form
3772 641 -82 753 -151 285 140 -245 -130 143 -57 -911 -576 204 311 29 103 -53 120 47 0 175 -71
3793 -71 -21 -397 -40 11 19 -95 156 39 408 -124 -120 216 -231 -446 -7 -192 805 567 917 -336 -473 286
3815 286 -141 81 -238 80 -306 7 123 126 54 -40 13 -52 -152 55 -40 -24 148 224 -202 106 148 -18 -15 -20 -209
3840 -209 -41 -150 161 8 -54 418 -264 -33 -275 -3 -10 150 -147 192 261 -116 -56 295 34 53 109 -20
3862 -20 81 203 179 130 50 35 -159 129 -141 113 168 -108 89 125 -120 -2 73 21 72 -199 21 -31 -142 190
3886 190 11 188 45 -55 -187 123 76 10 28 -66 -9 87 275 94 138 60 -177 -81 0 64 5 97 195 88 149
3911 149 -202 148 96 -458 110 217 -38 105 72 -301 -92 211 18 63 304 -118 -14 -2 -105 -99 159 -84
3933 -84 -260 -51 -83 -47 125 239 -21 -234 252 -10 -8 72 199 -53 19 -16 -15 110 -135 -40 -144 27 196 85
3957H5m3k92K86J88k66N6Q8l85M40j08j87K02R6o7R7r8l1k98K53J08o5J37k5j52
3981A9q0K90k09J09j46j7J82L1k85m9P6q7J72j18J0K1J09J1k31K34j07j70K8K94
4005H7q18P36L20n45K21n3K58l20K50L4r5k38K2J12k1J53oj97K15pj38o0P5J36
4029A21l91L52k3J3k22K19q5j92L41J5m88L50o5j18K8K53k4R4k29L9j70L11k35
4052a06K03k7r3K02j44J11k11K56j44m4J05j45k68M42k88K31r2lj33J06k9M6J43
4075A18j7l78Q7L40k31j85L34j41J6J47k6k73J69L08l80K58k44J0J41m29M41j8
4097D7O7l97L36K4r8K2j54J78j80K69j63J93k4N6K9j00j23k64N61k93k39J85Q0
4120A2k30J07K53j97o7L18n8j79K3k10K55L2j7j79K37n3k12J82k6q6L0k13L56
$$ plain form
3957 85 42 -250 36 224 -42 14 102 -283 157 49 -138 64 160 93 190 92 61 -237 16 124 59 196 171 19
3981 19 -61 229 20 129 -17 -34 148 179 -106 -155 -79 -166 6 -112 -102 -81 28 39 -192 42 -65 -235 -207 87
4005 87 -731 5 325 -220 1 -52 206 -114 136 170 75 -163 -141 -29 -50 103 97 -100 115 108 -30 -90 -15 121
4029 121 -270 82 59 72 -150 69 -16 -208 133 148 -340 10 -55 -173 -145 108 84 178 -51 -12 -182 129 -106
4052 -106 97 70 -23 179 35 146 -65 191 47 3 108 -37 -305 137 -151 80 -12 -15 -148 -42 -71 -25 118
4075 118 101 -277 -190 150 -81 -266 68 -73 -57 90 64 -209 -40 268 -112 146 -98 -88 53 -376 65 47
4097 47 114 -283 53 77 -21 1 -153 25 -155 114 -49 144 120 176 205 105 -18 -282 279 -14 -253 -68 12
4120 12 -218 -111 142 -55 -122 196 138 -41 -18 -228 27 59 42 -137 100 47 -165 17 -9 -95 -65 -278 78
4143G8J02j88r4LM6J62j1K4l73J44r6Q6R8lK7N8k40K8K12j25p0R7Jj29K12J15
4169A64j46j12J31k07J47J03k82Q2J76r8j84K32P5j96%M90m41j30L75j12r2j01
4191a26J06K84j37nj50J93k79N8M43m28J60j20l4o7J19R3p4OJ97k7l50J05j11
4214a44K23J72l59k5O8LL7p9L70n33M32r5j34k3m4J96j25J01k2r0R8o0Q2j76R7
4239c0k08J02N1M10j87j22J32j12k31R9Q5L1j25J67l75K14Q08r49M76m42M01l50
4261a55N3K23k69J73K54o1M5k24l74M16J8k70K73j02p5J21j20j18K89J14k40m8
4283g7J14N7k41J34k21N4J20k3Q5J14l41K23P2j92J41M0q1J12k23L51o5n1m2l30
4307b70R2K31N3j63J19m4K06j60k6n6q2K79j25J0k61m1J63r4O1N9J96m63L76K4
$$ plain form
4143 78 180 -8 -102 -99 -53 109 98 122 -251 -107 -203 -117 -19 -22 5 63 -177 -149 63 -62 -132 -35 -34 -163 49 164
4169 164 18 -94 37 -170 -23 80 -202 -120 56 -42 -226 6 81 -115 -115 375 -66 -196 179 67 -25 -126
4191 -126 -20 264 127 122 -28 165 -114 -56 387 -41 119 -1 -35 -102 17 110 36 42 239 212 -138 -33 -144
4214 -144 79 251 -108 -133 -65 -62 -25 -104 266 -267 165 70 -64 -87 -131 65 -60 41 19 -71 27 -33 49 -127 -30
4239 -30 -238 -136 -85 325 138 16 148 36 -195 -96 -11 20 -105 62 -313 -99 709 -240 236 -206 195 -155
4261 -155 -102 121 -148 25 279 218 263 39 -335 81 99 -171 102 0 -75 46 -74 -192 97 211 -29 -77
4283 -77 37 94 -147 -13 -234 -180 -60 -83 2 116 -225 -2 70 -122 19 59 -22 90 -133 218 153 102 60 -270
4307 -270 -178 53 106 -57 62 18 224 64 38 -18 -100 179 54 64 -197 -238 -75 -169 -108 -49 147 -316 60 84
4331H4j04p4N5R7m7J72r9j53L45m63Q6J35m8n2nK18j01j61J75L1kk19O7R2O4j80
4357h7n1J10j04L30l11j69K41K1%K5J51K08n54M49k37j22oK20k23j13M92l60P6
4380a4k74L09j10o8J11j6L04l47j57J90k8q7J14J06o2nj00J2K24l8j51K0r1n2
4404b10L08q2j27Q1K2j42k9J36m9Lr4O7L44k44j16P2K21m13J84q6J63LJ78m12
4428b22M10J07k43Kj19J35KL32o85K19q7O2n6J19k6O6Qj02j38L55R2l8k32M8r3
4453h4P9QN7k55P7J79L4n1p5J23j66J16p8M1J42k32K34K72n86KL45j35m1j37m3
4478a74O5QK12k80K95j15k84K86L2Q9o9J29l84K96k05J0j9O0l8O6j76L20j60m8
4502h4r7J83k4j69K04Q2j26J39j02kr0J16j06J76Q5j77j31k0J31j46N2J5O5Q8
$$ plain form
4331 84 -20 -94 -39 58 11 183 84 -69 276 -187 -101 34 -14 -66 -71 147 46 -115 60 91 89 -130 -63 29 93 -87
4357 -87 -138 -28 -132 198 -113 -282 -41 -20 -20 5 156 364 -190 259 22 -100 -106 114 -109 -222 270 -90 -14
4380 -14 -288 21 -89 -157 -46 -62 242 -105 -262 -72 -100 -187 -73 33 -29 -34 -134 -122 102 64 -87 -67 -158 -210
4404 -210 98 16 -111 -30 -8 -150 -179 -43 -92 -89 -183 -116 228 -16 -132 -60 161 -252 -68 -154 9 12 190 -222
4428 -222 188 295 52 54 -65 70 72 404 -281 -62 -149 -87 -143 -24 -50 16 24 -78 -216 139 231 193 -39 9 -84
4453 -84 -5 3 60 -195 -118 61 95 44 -31 92 -74 42 -36 5 147 -85 149 421 -165 -163 182 47 6 -131 -174
4478 -174 -109 -101 111 -169 126 11 -273 13 45 134 65 194 -190 106 -99 -89 -108 -48 -86 -20 -196 124 -36 -84
4502 -84 -181 2 -22 -191 13 95 -31 108 6 4 -86 30 -76 100 185 8 -123 -143 -12 -158 -106 -91 -26 62
4526F2J33j78J53k76K45j85R7p5j66R4J05K8M4k18P1N9J83l19J38K4p4rl5J44
4550D5j4P3k85L60J12j37r1J08l25J64Q6j09r9M08r0j46K3k02l9J30J03l18M68
4573B25l19K40j11Qq9M2J5K6k15L2J74J2M2k58o9L81K6k76Q1J94k17J72k09J81
4597H8K09J0j63r5r5p2L29k55j26K02k15K54j3j23N6j24J95p7o4K96m27K17k3
4620a6K6oR5k0R4k08j8k8oK9mq0Q7k9n2J99J21J29l52j2l0N9j64L34j33L7j86
4647a34K32l0J8o4p5J28j68J23p6J01j93M0p3K36r6k04L15n2k6j28J54P2j41j50
4671a91K46j97O5j04J73j8R0m5k00L13L6j79Nn6j48J68m0P1%j40L40k02K4M8k12
4696a53J14R6l24J41K55l13K75L1j81J64j15J3j35K17Kk53J80k75RL06k63K60
$$ plain form
4526 62 195 17 170 -106 139 -46 51 -24 -190 -96 9 37 81 -137 -66 -7 176 -143 -5 19 -55 -64 -99 45
4550 45 31 104 -181 179 291 154 63 171 -154 10 96 -13 -112 296 206 60 83 -119 -158 -28 75 -243 225
4573 225 -94 146 35 43 -46 -4 11 37 -178 -146 28 40 82 -176 -245 136 162 -114 -33 161 -56 116 -93 88
4597 88 297 307 144 49 -46 -118 211 -44 -170 32 -183 71 58 -65 -9 -133 62 -15 -79 217 -210 7 -16
4620 -16 10 4 99 79 173 -35 -53 -81 -87 -58 -62 -142 -55 -84 -136 63 184 313 -39 -51 -81 -22 -186 148 15 52 -134
4647 -134 98 68 86 22 -53 75 -93 30 -46 55 -138 -98 -171 65 -31 -235 80 28 2 -126 28 100 -41 -191
4671 -191 55 -142 -77 -181 -8 -26 64 19 -181 132 168 -11 -6 -62 -210 -42 -82 -11 -11 -151 189 -13 11 59 -153
4696 -153 -39 57 -267 -126 129 -184 91 122 -59 105 -10 3 -132 85 87 -166 14 -261 -252 54 -209 51
4718E1R8k71O3K01K4j45j11J89o6r4j7k8j25R1m8o5M73j61j78N2P8J1R3p0k25
4743a80J02J92l8k48L79k11K57j02N2j96P8o7l14N81n36Q5K98j02j08q4Q2J4J85
4766A19j18N7N1K10l88J43j61J78P4j87j34P5L79o48K70J88J13l67J02o9J02m2
4788e3k29M28k58K96l03K34j54m4K92l71J23J52j47R7N3j89q9J97P5j83J42l17
4810b48N27k14J64k95J69M2j09M7m7L2j98J58k00J74p5K76j43K7j25j7K9N5rP5
4834I5n2Qj48M29k41ql07K13j10L6p4Q6J13k63J9K00o8P6M1j3Q7mj87K16l11L06
4860A39l14J29L01k07O3n8J6l25K87j65L66l50K76j83p6K05r1m2m8J95k30mnK45
4884A24Nk69J52K1k77M41m45J4K43J93n0j52l0o0k43K74j12P2L57l91J2K80q9
$$ plain form
4718 51 149 -122 -59 142 166 21 -90 99 33 -61 -78 -106 -231 -140 -188 -253 220 59 -119 -67 11 22 115 45 -180
4743 -180 -78 114 76 -172 207 -4 253 151 203 7 85 18 -296 285 -251 -166 132 30 -78 -162 -80 -66 119
4766 119 1 58 109 319 -69 74 -87 91 165 -22 -156 -81 298 -350 -80 108 221 -146 -44 -113 -11 -53
4788 -53 -282 146 -112 184 -119 115 -39 -83 209 -162 -39 113 -34 63 116 -73 -162 35 110 -73 69 -248
4810 -248 279 65 229 -66 103 145 36 83 36 68 -130 28 -172 2 -73 203 60 87 -38 -55 -26 29 20 95
4834 95 43 51 -97 332 91 83 -224 -11 -121 -85 -159 -73 40 -223 -204 -4 -72 4 45 32 119 115 -72 144 -167 139
4860 139 -175 -46 255 48 111 53 69 -256 31 -134 232 -118 158 -25 -101 104 13 -29 -77 118 -112 -116 -121 124
4884 124 129 -140 12 33 -244 197 -248 -234 9 202 152 0 -30 -90 -333 -59 -171 -99 258 -133 -121 159 70
4907G0k50K89l88J77j9J59j18l6O3o7J40m3J08j92L10j81n8k97J71rK68n7J15
4930A55l43O8K4J75R5oj20j45k87M01J6j06J28J30k24k43N97k74j94J2K03j41
4952g9J71j94K69m1p0P6j28r1J21K5j37J16k8K41m45K29J25l29m6K23J09j46R
4975b0J57q3J09Q4l51j49J36o7J36K06k84L25k73J51j23j14J27J11J74k80m9q5
4997a62p2J57J56j00O0l6j3l4K40k51K17r1j12K83j20k21K25K5j1j64P3k92J92
5020e1K56k01J40j61j05j66J29N7k1K29J27k3m73O0K19m8J43l00l7J74n6J59p0
5043a9P3j52K01K19l91J49k61J16L49k04l09P3J13j92K95j98O6K74jk99K5J98
5065A25j72O9j80J57M4k9K79k11p0j66l4j6L9J70J84j77k74L12j15k7K32j94K43
$$ plain form
4907 70 -180 109 -279 -102 -121 38 -80 -116 -53 -120 20 -23 85 -107 203 22 -36 -333 -162 -171 97 40 155
4930 155 -188 -120 -96 79 174 168 48 -97 -384 17 33 -73 55 185 -39 -282 315 41 -153 -141 62 -79
4952 -79 92 -102 167 126 56 132 4 -87 34 59 -78 38 10 251 -194 35 160 -169 -215 8 117 -29 -20
4975 -20 137 54 163 247 -104 -253 -117 -184 -48 158 -126 199 -74 77 -46 -160 -33 78 252 -28 -77 -162
4997 -162 -234 -77 79 -21 39 3 -10 -44 196 -55 162 71 -41 242 122 -99 126 151 140 -24 49 -243 -51
5020 -51 205 4 144 -17 -122 -288 -159 -102 -123 106 233 210 -263 -203 16 -32 111 -189 -226 -52 -108 51 -19
5043 -19 54 -98 103 322 -69 80 -181 -65 284 80 -229 -156 -43 -235 60 -138 -72 202 201 -98 -73 125
5065 125 -47 22 -158 -1 43 14 293 82 12 -154 -188 -204 -165 5 189 12 -262 50 -65 -92 140 -54 189
5088A89k72j5M4m6L43l57J21l0n7O3J86m7k48P5J66k84L12k01K90l22K6Q8k86
5111b62L43K8k11J4J77J85m34K31j46j7J88k4J7k64K71k37n5K01j92P1J53J4j37
5134h6J0J2J02j05J99j10kj77K63o7k03K28P5l04K87j02j43J79K3k6j40K56k02
5157c3k14L55O0k75K38N1j25j5L13k82k45J96J61j91j0O7k9j02P5Q4l32L32q9
5180a0j2k35L94P7l27L45k90P5j71J15o4J96n3j57pK79n2j32Q5Q7j29J9M0j12
5204c9K43l19K57k43j8k3J61mm5oj7J87j32J12jk17PL24m44K34m3K69j30j06q4
5229g7Q7o1J18J15k90N0j87L15K8j08j03R8K09k74J01rj59J00l1J29Q4m8p3k02
5253a88P2J64r7p6L11l33r9L60n4k51M35l32R7o0q7P1M9P1j14j29K70J71j00O3
$$ plain form
5088 189 -83 -98 -54 -100 243 -114 7 -23 -80 -17 169 122 -126 -51 115 -169 143 -58 232 -90 -64 24 -262
5111 -262 81 109 -102 -88 89 274 -160 71 -75 -92 96 72 89 -175 96 -141 -196 5 -187 -116 37 51 -86
5134 -86 -76 -64 38 -67 132 22 20 -157 106 39 -164 64 139 -165 122 20 -123 56 79 53 -87 169 -33
5157 -33 -247 108 168 -107 131 182 57 42 355 73 -172 24 185 -6 -16 51 22 -80 -5 79 -253 79 -10
5180 -10 -22 -257 137 214 -113 232 -58 17 -154 -39 -103 93 40 -117 -124 155 103 -29 56 143 14 33 73 -39
5204 -39 204 -115 142 -101 -119 -142 19 15 -30 -36 -53 134 2 114 113 -104 -97 227 -217 17 -26 243 113 7 -77
5229 -77 10 -51 67 182 -108 -58 -245 70 98 -10 -113 -15 194 -80 21 12 -147 -47 -78 51 135 87 14 -188
5253 -188 -116 48 -49 -125 186 -147 -246 114 60 -191 244 -88 9 -51 -138 -67 -18 53 -61 -190 80 251 151 214
5277B14l36K88p9n1ok6p1Q5k65M25k83N9l7K25Kk23J66o4j9o6p8M8J40k29K93
5302A12l6N9j06k57L23N6j63p3L33l90J11R3O5j31J16n7J0K8q9j13K45k6l26J12
5326a04J02K53j55j52O0j51J61j49M3K8J78k71J02L8j25J41J80j89K65m50J38
5347e7J87l55L4J46K90l05N8o2n7L16l28k0K93l34K22k09R2j40J37R3j8J29l5
5370G7k14N9j6L2M4k6k10L71J11l22J83M3j76P1m0J7L5J06k07j24L20q3k40J34
5394e5J4M0k23L82L6j48jJ16%k09J26J8J2j77L3J31j57O1q6P8m4j14R1r7K61k09
5420a21O0K4o6K43J1J7j03j14L17m08N1j0J94l45K59k01L16p0o8j99K74j29l5
5443a03l5J95k67K09rN6R5o8j56nJ59j92J01j43K06j43l3P0J80k20K29j12j3J13
$$ plain form
5277 214 -122 166 87 36 30 4 -67 18 -247 178 -105 -46 -83 142 144 -79 87 23 4 -62 -140 -92 48 -181 112
5302 112 76 135 29 -228 95 151 -12 -85 248 -142 -31 62 127 -4 112 55 65 93 4 -109 136 110 -216 -104
5326 -104 -2 251 96 -56 4 -147 14 -135 -92 -64 114 -157 -55 -17 -142 -1 179 -10 255 -195 -57
5347 -57 130 -225 -191 -45 245 -60 -2 -64 -121 195 -133 -153 140 -194 28 -181 -89 -229 -92 1 -17 112 77
5370 77 -137 -78 -94 -62 -18 -44 -254 117 228 -94 89 132 -44 27 -13 4 39 145 -62 -186 134 51 -189 -55
5394 -55 -41 -1 -224 158 194 46 45 161 161 -48 78 96 108 -69 -36 95 -62 -1 -87 -9 -53 -167 -76 -173 88 -121
5420 -121 -61 -37 -103 140 151 168 65 -49 268 -140 -89 -99 95 -250 9 -192 124 54 -14 -213 61 -68 -103
5443 -103 -138 57 -210 -1 -10 46 141 73 -83 -88 71 -121 -20 -163 43 -100 -133 -63 117 -103 126 14 1 114
5467A14n5Qj27K25L6k76m3J34J2k88L9M73l97j10Q5K04j88J58j83L66n6q1K61
5490C11l35J11p1j5R4Rk80K33j95j8L37k89j7J13K7j65o6J5L12j00k14J42K1p6
5514a16J49J06k32Q4J35k36kNQ2R1j11p6J97j02L35m41L4J10J9k16J67P0K36k89
5538ak9m8L7J20J41l46L76j32M5k07N5j14J78k0k11J47l11M23l6k40L36L2r8K09
5562C06l53nJ33k3PO4m4p1N4j19J89p6p8l4j91O67m58M4o6K12j71j37J44J75l42
5587a73J01O7p5M1l0%J36k88R1K59k24p8L51q0k02K77q0l24pM34j83j53M11l00
5611b9m7l37K18K76r2M5P4j41R8l50K14L9n7J3J76j15J59R2k31j36R8K9J34k29
5635i9K41j87L5J90j4r8k18J53q6q3K01Mq2J39l69K12l3K06l63K25J66N6l85K65
$$ plain form
5467 114 59 67 -60 165 201 -75 -118 16 28 -260 -221 252 -145 -255 -170 34 -154 4 -179 187 131 50 311
5490 311 -24 87 16 1 95 104 -176 57 -138 -156 181 -108 -125 -12 15 -150 -216 -201 111 11 -203 -61 -40 -116
5514 -116 33 139 -93 -9 126 -110 -112 -107 -25 66 -45 -121 76 -26 309 -132 -98 12 31 -185 -18 52 288 -1
5538 -1 -30 -78 -41 79 220 -126 250 118 163 -44 11 -103 75 55 -156 -9 -320 103 67 -173 163 195 97 306
5562 306 -47 -52 81 58 65 129 85 14 68 -51 138 62 -16 -50 -241 426 -32 12 -54 158 -13 -150 -6 169 -173
5587 -173 -72 -5 -80 -39 -69 -69 67 -221 -130 129 -95 -173 178 98 -104 173 93 -231 -238 196 13 -140 271 -29
5611 -29 -76 -413 -195 81 -11 34 108 -33 65 -285 -71 -32 -89 -76 100 -15 144 236 5 -131 -33 -4 130 -99
5635 -99 142 -45 -10 180 166 68 -150 3 -83 -166 35 39 -43 96 -273 -61 -94 112 -251 -26 140 196 -189 76
5659G6j84M8l1J1J70j55j69K56o9M8L8j12Q3j09J90M1L9o6O4m2r7m9J40l23J89
5684a3m9M6m1J55m6m5k43J89O5K0j94J17j47K89o2m5O1n4R0k73L35k48J36k03
5708a60O3K11j42J28J6J69k42l55M79j37j57m2J44P9J51l44J18m5p9L96r8Q6m10
5731a71K85k40Q7N8l3q0K78k7k5q5j37o4%R1p7L74j40m7r1N2J4j57J66M3l17K8
5757b15K55K5p2M8K1on3J13j30J35j03j66o3Q3L5m9N06k27j65J2j22K7J28j23
5781a06K09j80J08n7K8J45j48O6p9j52J12J6R9p6R4l9l1K1o2j71J76l0R4Jr9J56
5807I5J61k93J11m4J43j29R9k20j19J38J22R2l4l21J97rJ44k09mJ72J88m19M5
5830i4Q9j11J81k15J86J06J29j09j70Nj66K21l9n3o3J91j24L37k93J22N9j78j60
$$ plain form
5659 76 -108 -60 -91 -80 90 -65 -234 22 -47 1 39 -73 10 -99 91 132 171 105 169 127 30 -19 121 -202 -13
5684 -13 -62 -16 -57 98 52 7 -236 -47 18 38 -156 -39 -186 103 41 -4 57 3 93 -180 155 -93 43 -160
5708 -160 -97 114 -28 100 116 285 43 -312 167 30 -127 -169 -25 54 205 -139 -21 -66 -145 251 153 239 -171
5731 -171 114 -126 -39 19 -14 -94 184 157 132 47 -90 -154 -154 -63 -140 234 94 47 -44 8 22 -135 31 74 -243 -215
5757 -215 40 65 -7 41 62 56 3 116 -14 121 18 -148 -211 -128 -93 -142 364 137 -28 -16 -138 -111 17 -106
5781 -106 103 -77 31 -26 2 147 -1 65 -14 -166 -54 -38 61 -15 79 40 9 30 -32 -203 -27 -57 37 38 -61 95
5807 95 256 -37 74 30 173 44 143 -77 -196 -58 64 156 122 -199 -2 -11 133 -76 -80 92 280 -139 -94
5830 -94 -5 -116 65 -150 36 142 271 162 -8 -3 -169 52 13 -40 -103 88 -36 301 8 130 189 11 -149
5853a49J97k13K35l25J41K40j71l0L6J70K1J91n47L11R5j87j89K48k35J96J20
5874A55k28Q4l2J59j61j12Q9J49o5l45J81J18j22K33M26o11R6n6o3jK06o3N0k27
5898a40K69m1R1k85J5O2J52n0j03J32l96N54n52J05K51q2o0L2M0j05K02qJ9Q3
5922A85k52N9r8J79%l2j21K10m83K62J46k86J53k9R9p5J86q1P6j6m5JK57j95j70
5947g0J77q9j37n7K14n8R3k40j01K45J08l40J12K02n7Jpk13K59Q6j76rJ34q3l18
5972c24M46j45K22n4k16J8m0K95k33r4Q2m8l7J06Q7J1P1k7J6N5k33J66j29N3R0
5997A38j24j41j02N22m21q7J99l3K29l3q5m8Q9p7O1lJ14m81K51j32L34J23l26
6020c3K4J12R1k80J11p9J01k08J27j0%j28L58k80N8J1K8j6O4m01K98J8l7n5K27
$$ plain form
5853 -149 48 -165 70 -255 -114 126 -45 -75 -39 131 152 343 -204 107 202 15 -174 74 -161 35 155
5874 155 -73 11 -21 138 -23 -135 -46 103 38 -307 -126 -8 -130 103 529 -82 14 -42 -105 -106 100 37 87 -140
5898 -140 129 88 179 -106 -91 -29 123 73 -30 102 -294 260 -292 -187 64 -18 -78 -46 -6 -111 91 83 102 185
5922 185 -67 -8 -106 73 73 41 -80 130 -353 -91 55 -231 -78 -107 -8 -83 103 22 98 82 37 38 295 100 -70
5947 -70 107 18 -119 -176 38 -20 73 -167 -268 -23 85 -255 -143 59 2 3 -4 -217 42 128 -48 -57 77 -6 -324
5972 -324 122 -23 199 145 -71 -53 -93 202 -31 -125 -43 -91 -128 -22 65 76 147 120 136 191 -42 124 -5 48 138
5997 138 14 -127 -229 293 -128 -215 -16 -49 180 147 62 14 103 26 87 84 198 -283 -32 -164 170 293 -33
6020 -33 -9 103 194 -86 25 -54 47 -161 -34 -44 -44 -172 186 -94 -36 -25 3 -13 51 -350 -52 -34 -71 -126 101
6045A01k23K40L4j16l2l6j63J50J64r6k52L59o6n3J53o6k78J07L2N2J54j51j80
6068a66J52K1p1R1j47Q6q5R9L6m2K6M5M1N2O5k29j48K8j40K81P6k03K72m07K67
6093@j0Q2P5r2r7O8j6m1J58l91P5J20j98J09O9J49j57m4K38L02k58j74K22p9k23
6118a13k1J95l07R1L40k12n1l5n3K90j45p6L3J83j40J39J2k3O7k45%J05j19J55
6142G0m1l17K11P2o7j61K45r3K92m21N8J41%R3n7J31j49O3j89n5K44R4j71J07
6166A00k65J87j64K99m0k4j83p8M60m70J1j71J82M12k72N9r9q3J74j67k9Q5P9
6189Cj87K69p9j0q8K62n06M29l06L60j94j46M1Q4L13q0Q6l11K35j00l46J40K03
6212G2k17j09qL17o7k25L93k47K42q3m0k24J34l1J4j75K88l39K95k31J92J19j80
$$ plain form
6045 101 -122 118 152 36 4 -32 -195 -45 119 23 -229 130 64 11 164 98 -180 -73 -41 11 165 14 -166
6068 -166 -14 7 -64 27 -120 -34 -119 -20 16 -26 0 45 86 138 203 -26 -174 -146 -286 -5 71 -132 140 -267 0
6093 0 -10 72 147 55 -42 26 10 -31 127 -264 -189 -69 -267 -158 -89 60 -97 -141 97 399 141 -33 189 110 -113
6118 -113 -134 61 -246 -155 185 -27 -78 -113 -166 124 -21 -97 -64 119 -21 118 130 107 174 -71 -71 34 -85 70
6142 70 29 -288 -77 -5 -72 -233 12 -81 211 -210 -152 -11 -11 82 25 156 7 70 -119 -174 70 164 -7 100
6166 100 -165 22 -142 157 117 93 -90 -168 292 -178 -167 -338 -156 256 -16 43 -56 -139 35 -132 -161 -76 3
6189 3 -184 85 6 -4 -92 170 -336 93 -213 147 -47 -193 -152 -68 245 165 251 -60 175 75 -271 -131 72
6212 72 -145 -254 -262 55 -12 -237 156 -91 151 68 28 -196 -62 -93 -79 -254 34 -305 -10 -241 -49 70 -110
6235a10p5J78J21k01K86r0j5k75K84J01j97j4P5l25L09k21K23j93J41l4r9J04
6257b7rJ94j71J60N8k70j01K15j28k5J87p4L5l85K94J71J96k46k55L60j65j68
6279a54J07J34j38l6l1L39j46K35j09k36J37n8n4Rl74L87j19N5j42L96R8k12o9
6302A9j16q0K08k83L11j71K62o4l33L65p6r8Q5j01L14j88P6j28m8J64R9j53j8
6325D6k3J08n7k29L27k84K03j53O0P9k57N1Q5J00M7k94K79P3o8j16K36j58j80
6348a25r9K42r1R5o6q2J00P6q9N2j06M2J76k14P9P7L2r3J33Pl43J90k2J89j0k43
6374i3j10j01N38m09Q1J36J51j49k89K03R1P2k44J15l9l5J20L2m0j97L27r4j39
6397g3K18l2l32K66J27j00l35M22q2pj07L7M22m20R9j37p3p3P2k3P3K8N6j52J92
$$ plain form
6235 -110 -185 -7 114 -87 199 109 94 -181 103 204 7 -7 68 -257 52 -169 54 -139 2 -32 -131 -27
6257 -27 -36 158 -13 147 205 -65 -166 49 -79 -104 83 9 44 -341 -47 124 320 74 -181 179 14 -154
6279 -154 -47 87 -51 -87 -118 221 75 310 201 -35 102 44 -10 -1 -375 12 -107 -52 -194 202 300 88 19
6302 19 -97 -177 31 -252 59 -112 150 86 -247 118 42 -56 29 -72 242 54 130 2 -46 118 217 64 46
6325 46 23 131 74 -155 172 -112 91 -62 -2 77 -180 -129 -44 56 103 -191 88 161 93 -23 213 55 -125
6348 -125 -224 18 -73 22 -44 -126 -26 50 -39 13 -93 -51 125 -89 -10 67 99 6 139 146 -197 -7 -29 160 150 -93
6374 -93 -203 -304 234 -175 -94 42 193 44 -245 -42 49 121 -123 -8 -47 -82 38 70 30 -167 160 66 -73
6397 -73 145 113 -219 47 174 74 -261 161 79 72 -35 2 424 4 103 -34 -107 -180 -108 -131 -58 -30 26 -126 66
6422F6j08j2O8J7J58lj08K3k1q3J31L5k64Q4j89J81K1N1q5R2l07J89r9K50k06
6447a19L3R5J59O3k75J3l1J79k77j04L23k7j21J65j0m8J51k06L79m19M5J60J08
6470B36l04jo8K70No6J8pr6M3j19J88k30J34J3J51k26J58k90K75k15J24J6P8J46
6495B33l09K29O4o1j36j7j33K26RJ57k06k87L07J48J15m01O4n5J18k17K66j90
6517g6j73K25L5K66n22L49j76J11k0R9j36rJ09j6p0r1L8j40N2J42j73K13K03j64
6541G6R7k05r0K60m15J95K88l29M9m2nJ61k5J38k29Q0J63j49J29j79o8J71m3j0
6565A8j9Q2m5k95L75K2j23J49j89j7J68j59q3j02K65k35L36j14J7j97J80j35j22
6588b23P0J43k93K80J38j59L1o1K82o00L27K5O3K55k57M0JL8j27o3K69l14J87
$$ plain form
6422 66 -42 -54 14 31 189 186 78 101 80 -3 128 163 -101 -17 -206 -25 -4 47 -38 54 -253 -64 -163 87 -119
6447 -119 -86 9 168 231 -44 -31 -62 117 -160 -264 59 32 -89 76 66 18 169 -37 342 -77 -32 128 236
6470 236 -68 -69 -137 133 138 72 90 83 -13 30 -89 99 -131 3 16 167 -59 99 -191 84 -131 -7 9 87 233
6495 233 -76 153 217 156 20 3 -130 96 105 262 56 -231 76 224 339 -62 2 -53 65 -152 114 -76
6517 -76 -249 -24 11 277 -245 104 -72 39 19 118 -18 -27 82 66 -4 -95 -57 -197 -145 -3 -176 37 240 76
6541 76 173 -32 -122 138 -277 -82 206 -123 -74 -116 -121 40 15 153 -76 4 167 18 147 -32 -100 71 28 18
6565 18 -1 81 36 -259 116 138 15 164 -25 -42 126 -33 -116 -218 47 -188 148 34 51 -146 34 -101 -223
6588 -223 -153 -10 -303 -23 115 -44 -13 -74 208 -392 -65 -40 23 278 21 61 62 100 -27 -90 179 -135 52
6611E2j58M3L32j33j97L83k52j64O7k3J19P9p7j51l3j60L38r4o4J1k34M71l19
6634a64K52k65J73l31L24R8j74J72k03J12j69K6R2P2k54K48o2l4J61j16J19l2
6656D5l0P8k63J4O5k0J2K78k22J91k79J77Jo5O2J52Q9q1k91j01K81j65J02J48
6680A78j59k3l5PO6j04n5J41j19K10k39K02j19O6K6l68L99jN1j59K73k59k37L43
6704H5k6r1J89o0k77J01Q7j59j65K95O2k17J09P1K83l07j43M6K16l64L11j04J58
6727A00j58m4p6N8J33J31l33K01L9j32j22J12K48J5j45L9J8k1n9j06l5J94mJ27
6751A80k88j40O2J64L0K6o7k4j6J48K38k57j41Q5K6K44k97J37l6k45J80q1J31
6774E9o8P3j14QJ66j54ml5K4p5K86j64J27p6k55K26k01L24K7j62q2l00M47l19
$$ plain form
6611 52 -106 -63 269 136 -61 322 70 -94 -27 -50 69 148 71 -80 -113 -273 65 -29 -93 -82 -316 155 -164
6634 -164 88 -177 -4 -335 -11 87 -87 85 -118 -6 -175 -149 -57 15 -239 9 -53 -87 74 -42 77 45
6656 45 15 93 -170 -156 -91 -111 -99 179 -43 148 -131 46 47 -18 44 196 285 204 -87 -188 93 -72 30 178
6680 178 19 -4 -39 -32 34 -70 -125 16 -103 107 -132 70 -49 17 43 -325 74 73 124 -35 238 -21 -258 85
6704 85 59 -32 157 97 -180 -79 8 -151 -316 -21 41 -176 -67 4 287 -20 -163 -117 99 -265 46 -58 100
6727 100 -58 -102 -178 -120 13 144 -189 12 51 -81 -203 -91 157 172 27 66 84 63 4 -102 -137 57 53 180
6751 180 -108 -248 -186 -22 8 34 -33 -57 -73 75 313 56 -85 0 26 270 -27 110 74 -171 9 -72 59
6774 59 -9 64 -50 -42 124 -30 -34 -69 -45 -120 166 2 129 53 -202 24 -177 147 174 12 -70 -370 77 -242
6798b42J21J68o2n0K17K13l32l00M37p2j31J44J28j31J95l59j83L56q1k85M43
6819A94P0l78J60k00J04N5j5j9j07J27J84Or8L8q4J7K30l92KJ00J76j45j67J98
6843E6j1j03M5K36l31J40k3j71j0k8N00j63m7J31k55n2J09l3JJ25j90J70k29J51
6867A8n%j08J41n4j5P3m1rj06NK5r5J20o1J51J77j99K7j14n9Q1J52M7l18L33o7
6894I9m7N6l44J58K30j93Mj57K90K0j84K66k05K78q9lj86j35J72KQ3K6mj5J04
6919B26k26n2J52k69J37j34K53k14K08l2j6r3o1N8j64J63J60Q0j47m7l4m0j02
6942a94J22m1N6P5O3K27l81L8o0M9J19J24k64k33K57q1J69k2k51J10J92J0J0j93
6966i9MJ31j84J66j27QJ80jJ04j65K41l83P8Q4J52l71L67j45l5Q2k0j64Q7J00
$$ plain form
6798 -242 -121 47 -15 -65 152 365 33 -267 170 98 -33 111 239 108 303 -56 -239 117 36 -249 194
6819 194 264 -114 46 -154 -50 5 -10 -29 -136 -9 175 181 83 121 37 54 284 -108 -106 -6 170 25 -142 56
6843 56 45 -58 -13 223 -108 32 9 -162 -172 -200 300 137 90 221 -34 -86 23 -10 -9 116 -74 96 -133 18
6867 18 13 13 -95 46 -8 -23 50 9 0 -106 -101 -76 -171 -51 -112 39 216 17 44 -70 -129 -48 104 151 -167 166 99
6894 99 52 108 -236 -78 152 -41 -37 -194 96 116 -68 198 -7 271 182 179 -7 -142 30 32 115 141 137 122 226
6919 226 0 -52 100 -169 -32 -166 87 -127 81 49 33 -60 -121 -63 -227 -64 96 176 29 -18 -52 -92 -194
6942 -194 -72 -113 -57 18 81 308 -73 -35 -95 -46 73 197 -67 -300 -43 -124 45 23 -228 -118 74 84 94 -99
6966 -99 -95 36 -148 18 -109 -101 79 78 182 17 258 -125 -47 37 189 -182 185 40 5 87 67 -97 -10 90
6990I0k20J8K15j9J02k76J78n1j54k5K36l9k26K88j46Q7p8M8R5k8j89j69J72K49
7014A58j05J02J29k23j19J62m03L79k68K34l9L10k77k84L97l36K24k67K17J23
7034A14j36j31J17j61J25R1j6L8p2j66J34L21l58J70j17N7P2n9k11L35J83m23
7056i3J00k17L03j74J30L3k33Q2m1J34p2P0J20k02K40l25K63J02k49R1J37j69
7078C0J20j55J39o3o9Q6P3l94N53n6k64j47R9J65P3r4j30k0J44J05j05J40nm89
7102b64L22k02J26N3j65J25j05K78k07K65j27j78Q8p4J42M2k34J11j2P1j35j0
7124i0J55k60K03l9K16k54Kj05L61m03L12j70m0kO7R0j30J09k53K43n8K05o9K
7148I2k04O3l3J04N6k13J46o0J2M42m37p9L02j69j74J20K14l25J94L9k60K51l07
$$ plain form
6990 90 -130 -112 103 84 186 -90 88 37 -117 -142 94 55 -171 117 -29 58 -20 28 123 95 -94 -263 -91 158
7014 158 53 155 284 61 -58 104 -299 80 -188 46 7 317 40 -244 153 -183 41 -226 -9 114
7034 114 -22 -153 -36 -197 -72 19 3 41 -31 -197 -63 258 -100 70 -47 10 82 23 -188 147 330 -93
7056 -93 7 -210 93 -81 49 82 -151 -69 -110 24 -48 22 142 -60 180 -145 118 220 -29 62 199 30
7078 30 150 -5 134 71 2 88 161 -233 320 264 0 -147 -48 117 190 96 -34 -54 90 195 90 230 225 -264
7102 -264 58 -144 -18 35 -130 -5 -110 168 -39 226 99 -79 9 -65 77 119 -115 -4 -16 55 -80 -90
7124 -90 65 -195 8 -31 185 -69 -67 -172 189 -214 98 -72 -112 -114 -47 43 -87 22 -231 12 -46 159 90 92
7148 92 -112 -49 -82 22 78 -135 11 -49 -37 405 -32 -111 191 22 -152 -32 182 -143 51 90 -170 81 -226
7171b26J85L1j09J06J37J19k87j19m9K42M3j86N16m18j18J94R5j90L07j50J44
7192B67pj12pj04n5j62K40j25J93j05L16l95O8j48J04m6K18J20j53q2M4J42k23
7215a2K43j92L48k88l1J4j45J46j27m7J40m9n6m9J17o9J36j89K65j81J8j17K56
7238A31j44M9n2q2K1K41k13J84j90J52l8k7m0J61r6J0j24q0K44j30r2L2K37k67
7262a13J4J91k25O7j5J3K77m00J9o2K87m8j41L14r2l50L92j54J11j98L30l17L15
7285B15k19n7O6j51K16j53j05K14J09k31j67M49j13j41mm2L30m32K60k52K58p9
7307b9J9m1Lj4J41q2K8P6j34j6L12k71J98k85O9Oo4j29K10J7p6L08l76QJ56P2
7333A06J71l88K36j9j96K68m31M62j31j24k62K56n9J78j10j94K77q9j13K01j82
$$ plain form
7171 -226 -41 -10 -119 -13 124 243 -44 -163 -212 30 73 -113 403 -15 -133 61 156 -34 273 123 267
7192 267 260 148 141 37 -18 -180 60 -65 128 23 339 -56 12 -136 -32 -78 140 260 107 25 69 211 -12
7215 -12 231 39 387 99 68 82 -63 83 -44 -91 49 0 -56 -105 12 -57 79 -110 155 -26 -8 -125 131
7238 131 -13 36 -16 -98 -77 164 -49 135 -55 97 59 32 -8 153 57 67 -57 -137 107 -23 -115 -83 154 -113
7262 -113 -99 92 -133 -66 -81 -68 209 -191 -172 -234 53 5 -136 178 86 -264 128 -26 85 -113 217 -100 215
7285 215 -4 -61 5 -146 70 -83 -188 26 135 -96 -263 186 73 -68 -72 -114 216 -216 44 -208 50 -29
7307 -29 -10 -51 -48 -62 79 -3 25 101 -33 -49 263 -8 190 -95 -26 -20 -84 -213 -3 14 -62 246 -130 -122 34 106
7333 106 277 -111 125 106 -90 178 -253 209 78 -46 -308 -52 -111 67 -43 -237 40 -49 -162 39 -143
7354a43J26o0K09Q8m62M52j54n4m8K7R9k45L8J18O5p8J54N6r2j87N4J0j6N2L36
7379C45k95k23M54j17k19r7K31j85P5K00k35pJ56K79n85L25j75r3L90m03J04r8
7401a73K29m8k7j24J45l0l9N0k6kj08J99j3J7Rk32L35J57k14k06L06K2j88q7L5
7426a3K1oj36j7o4K81P6o9j39j52P0K56k33j8P0K0n3K7M3j75K20Q5j37o4R7k13
7452b23L62j29J25j41L0j3J47j95J47j31J81j76J0O1J77m70K28R5J10l0J22k61
7474B6l6K8k29J13J66k20J64J35m8K06l97O1K10j15R6k67%R9R1o1k52N10l16R4
7498E8n0K06r1J65j15j02L9j21m01M13j09K08k17L4L07k09p9J73p6L0l17L42j75
7521h7n4m6K92L2m16J67N3K5j4J38J28j49k9n1K37r9j99K7l5K99l62K13J57k45
$$ plain form
7354 -143 -17 -77 132 220 -242 210 56 2 -46 -19 80 -165 -127 -9 56 -22 132 188 96 -91 -37 -27 -43 9 345
7379 345 50 -173 281 164 -55 -152 79 -106 -31 169 -66 -73 83 362 -223 102 -73 -166 224 -179 -75 -173
7401 -173 56 8 -19 -143 2 -28 -67 -17 -43 -45 -153 46 33 50 59 -173 162 319 105 -101 205 227 39 -48 -13
7426 -13 8 2 -134 -151 -215 66 142 73 -66 -218 -148 108 -125 -143 -73 -53 -106 -79 -36 -211 9 94 -43 -107 -10 -223
7452 -223 139 10 135 -6 24 11 158 -37 110 -21 160 -16 -6 55 232 -238 -10 85 195 165 287 26
7474 26 -10 18 -211 -98 68 -152 12 147 99 305 -92 -31 179 64 160 -107 -107 -8 83 22 -230 280 -36 58
7498 58 8 214 123 288 173 71 110 -11 -412 1 -108 100 -117 -83 224 15 -64 109 33 63 -254 88 -87
7521 -87 -141 -187 105 137 -279 -112 -59 -34 -48 90 218 69 40 -11 226 127 -72 -45 -80 219 -143 70 227 -18
7545a8p2J72j74k00L28o1j5J24l03J32K4k2J47K8j23K33k10R6m90L24o7J93m7
7568aM5q6J5k14R0M8K14j60P5p0p7Q9P1J17Pn9M3k38K27j49Q4J82l24j45R2J97
7594G3J59p9k11l11M96p6k42K38r9K38p0l9K07j51o5r1P6j03J23j5l47J45J10
7617c4o7J11l3q0Q2p8L81l76j51J51n3K06M1O2O3o6N7ol07M4o2J69J74l79J24
7642b7RJ55m8m7j26R9J04Lq2o1p8J06jl9Q9p5N1r6L12k64q3J17j4R1J24J02m77
7669a56j4K15j51MK5L45l40J56j71k54M07k89JJ01O6kJ45k59K21L9J03l24n8L73
7693A83m36L09l10K46j1O0j78K33r4L9K36k48J31m55M29M4j73K98l59j07M06p8
7715A65l87K38n3l3j05J25K00l9l50K70j40J98j50P8k09L11%l7r4J74k89j3j86
$$ plain form
7545 -18 -90 82 -92 -292 36 -25 -40 84 -219 -87 -63 -85 62 90 -33 200 -10 86 -404 -80 -147 46 -1
7568 -1 44 -42 -27 -241 -151 -103 111 -49 26 -44 -121 -32 39 156 163 104 147 -91 136 -13 71 253 -71 -216 -124 73
7594 73 232 153 -58 -369 127 51 -191 47 -52 186 116 77 284 133 68 -23 53 -50 73 58 -289 -144 -34
7617 -34 -101 10 -23 -103 -21 -99 282 -94 -245 -94 -147 59 100 162 225 159 216 210 -97 -53 -115 54 228 -151 -27
7642 -27 -18 137 89 42 -84 15 119 122 40 -21 -99 7 6 -33 56 -19 32 -64 248 -16 -99 18 4 95 219 321 -156
7669 -156 -170 45 -106 -102 -77 268 -72 84 -87 -341 66 -223 -222 -121 -55 -57 88 -171 50 89 192 -132 -190 183
7693 183 -253 56 -254 -8 -19 41 -137 96 2 41 277 29 160 -295 134 178 5 303 -56 -163 243 165
7715 165 -222 16 -37 -70 -175 -50 150 111 -239 31 -109 89 -61 17 -192 119 119 82 -12 162 -127 -140 -326
7738c26L80Q4o4j58Q5K8j53K79j12r5P1o8k6O8j71K52J42k00j10O8J1RJ57l38
7762a87J92j96K95j82K16l25K39m23L19J04l7n3L36m06J25n5p2R3K26k65K2j8
7784e2J22l34M90k2l19q0K82P6m19K47J19m6l6N5p7j05rj64j6J87O9K00l97L50
7808A21k20J28j50J13rJ07j56J5o2Q2J66j16k74L98J22j53k74L43n1j60j34J2
7830a52L79j45n8nJ36n0j88OM7k3J51j7j54k06M73j76jJ19k23J73r3K79m10K37
7854I9k7j12K67j52j53L64k00p0n7l0n1P1J62KL2r4J48k23m2L5K20j67j19K7K03
7879A33l23M38m71J14q4K30j06O0j38J4J84l50L98J57m68L9M50l94K5m5K12J55
7901B30j72r9rM9L7R8n12M51j13j59K69J4r0L0o4K8J82j12LN4k45K8L69l40P0
$$ plain form
7738 -326 54 138 74 -84 1 29 -124 155 43 -52 19 -49 -75 -7 -178 74 216 16 -94 -26 -15 -6 151 -187
7762 -187 5 -191 104 -78 138 -187 52 -371 -52 52 15 -38 298 -108 17 -38 -110 -17 209 -56 -34 -52
7784 -52 70 -264 226 204 -115 -195 87 163 -256 -9 110 64 28 83 6 -99 -108 -272 -288 -101 -32 168 -229 121
7808 121 -99 29 -121 -8 -17 90 -66 -51 -113 -31 135 19 -255 143 265 112 -162 181 130 -30 -164 -152
7830 -152 227 82 24 19 155 105 -83 -77 -30 -53 98 81 -73 -279 194 18 17 136 -87 86 -7 272 -138 99
7854 99 72 -40 227 75 -78 286 86 16 -41 -71 -122 -51 111 113 145 51 199 -24 -66 -31 189 22 -97 -70 133
7879 133 -190 248 -223 -109 -193 37 -69 -9 -147 -133 51 -299 99 256 -212 -173 277 -117 -92 -137 75 230
7901 230 58 -41 -50 -1 36 134 -378 73 -40 -199 70 84 -6 24 -40 -12 170 58 61 115 -130 -102 267 -73 -3
7926cJ60q9J67j66p2J13q6q0j53J7j5K42K7k6N3q3K23l05P0j57J67J16j68k6J00
7951B6J30j0K8j02N5Qj56N1k7j03K59j56l1k97M59Q6Ol18J23J18k07j12L93k63
7975d0J74j80j32O7J91oq2P6k26J07J69l45LJ73J83n0oj16J47k14K76O8k62J47
7999A22J9mj09L4j18J12k07K04k4jj3J42l8j74J46J16p3m8J26n24M09L6l8j2p7
8024Fk5j85L05q4k2j05N2j18K85n2m05K58J27J00N6q1j39L5M9j80J02k58P9J49
8048e1P3o7o2J11j40K10qJ59j40j97j7K31jn7N4j21M8J62j75r2M0J25m4j90Q0
8073f9N8qj93k56N59r1r7J14m7l6J82r7q3l5L68j96q1NL90m73j9J42j51J59r4
8098d9J65l31K86J5k25j98K44o5L8K01K57m96K10j5p0Q8j3J89o0k26Q7j34L23
$$ plain form
7926 -3 157 68 235 69 -3 110 24 -56 -209 -192 -207 35 62 36 89 6 229 -76 -6 -163 4 120 -48 -74 26
7951 26 156 146 174 72 127 135 -21 30 3 -100 159 3 -28 -325 134 220 226 -92 31 149 -58 -170 223 -40
7975 -40 134 -46 -178 -111 80 74 -8 68 -158 -51 118 -227 -224 -51 132 82 76 -40 107 -107 169 237 -25 122
7999 122 141 137 28 62 -56 56 -151 53 29 28 15 157 119 -55 91 207 134 86 212 -312 97 133 95 83 6
8024 6 -19 -204 101 17 -5 -110 -58 -176 109 57 -348 -90 37 137 193 112 -27 8 57 -123 -21 -279 -200 -51
8048 -51 22 -45 -107 4 -136 74 66 225 85 -112 -129 102 101 44 98 -23 25 187 12 -80 -40 85 41 -149 -69
8073 -69 -11 -19 -212 -468 91 0 -97 17 -30 -66 116 19 -64 -99 269 73 -8 -3 387 -86 -105 37 -114 45 -49
8098 -49 116 -215 71 86 -139 -337 -93 -158 -120 81 338 -158 52 37 -33 55 42 231 171 -55 32 -102 221
8121B21l23J33N2j45K65j79n8J3J24j31J26L9l48O2K07r7j29N7L48k86J66K4j29
8144A2K3K9k27K48k49J94m8j49K59k54K52m6J0q9P2k02L24n7j33J63j8p0J23k97
8168a30J98p3N6J46k62M0O5p8p6M0J61N6r7O0L0j98j49K88j04J02k12Mj1
$$ plain form
8121 221 -102 31 83 -62 203 24 -34 -21 103 -28 98 137 -211 -149 58 -39 -168 -111 237 -49 117 141 12
8144 12 35 64 -163 85 -164 30 -18 -167 92 -162 90 44 54 -35 37 -165 159 102 -31 132 114 44 167 -130
8168 -130 68 -5 51 197 -65 -25 40 -38 -114 -74 87 143 46 106 136 -62 -211 77 -27 75 -137 -133 -144
8191a44
$$ Imaginary data points
##PAGE= N=2
##DATA TABLE= (X++(I..I)), XYDATA
0@%%%%%%%%%%%Qj6J6j6K1k9L2m0M8n6P2q8J04j20J36j60J87k11K44k84L22l63
33a93M13m68N28n93O64p42Q27r21J025j136J256j392J540j699J874k067K275k505
51a314K762l043L356l708M104m552N066n663O363p200Q224r505J1158j3387J6575
66I236k1527L0297n0292J76143M830l52286J88034J04119m8030j9600q3213J5808
78d6481J71375r7655j36285Q0632J00588j8440r1794n8043J30420P0740j30536
89b5479o7270Q1846P9437k867j21806k8362J40335L5021j31732m9788J13341Q6981
101A09657j17994r9028J10800P0649o3535m3756k1936N7959R2601r6831j14247
112a15661J15601R3578r0454p7366N2297Q6177k5830r6039R640Q3857K5574o3571
$$ plain form
0 0 0 0 0 0 0 0 0 0 0 0 0 8 -8 8 -8 13 -16 16 -24 24 -32 40 -48 56 -64 72 -88 99 -112 132 -152 170 -193
33 -193 220 -248 280 -313 351 -391 436 -485 540 -596 660 -732 808 -891 983 -1084 1191 -1314
51 -1314 1448 -1595 1761 -1947 2157 -2395 2671 -2992 3371 -3829 4395 -5110 6048 -7339 9236
66 9236 -12291 18006 -32286 143857 148687 -203599 -15565 88554 40524 20924 -62289 -46481
78 -46481 124894 27239 -109046 -28414 72174 53734 -38060 -96103 34317 105057 -25479
89 -25479 -92749 -10903 68534 65667 -56139 -84501 55834 90855 -40877 -90665 22676 109657
101 109657 -8337 -107365 3435 74084 10549 -33207 -55143 2816 95417 -1414 -115661
112 -115661 -60 93518 3064 -74302 -22005 64172 38342 -57697 -48057 35800 61374 -2197
124b197p6825O5376J05632p4358r4540N1679O9126M758o3963n6057Q3216O5640
136G7487r1426m8243O0284M8350m351q2841l2766J29099L0036j42204j1148J10033
148D2310J4969o4691m2034L1444O2362j0972o7155j8162P2150M7439q9841o0650
160h2831R6460N1244p4966m0781K6722N2720J7359q1163l0561R6179K3182p3540
172a9976k5390L2115O1020j2687j01835L1218J05518m8527o3472K7872J3343L2333
184C1532L236r4553J6309J21913m4956j09339N3414P4071l1683m4068o477L2943
196B342L8955k9428n9390K4090O8967j2139p1477j669P0808J4045o3799k5140
208d3835N2033L2069l1560l9172L394N1992K1805p1631l4380Q6358K9604q2449
$$ plain form
124 -2197 -79022 -13646 91986 17628 -76912 -25233 43893 48651 -15312 -71369 11847 77487
136 77487 -13939 -62182 -1898 46452 42101 -40740 -73506 55593 85629 -56575 -67723 42310
148 42310 57279 -7412 -49446 -18002 44360 33388 -33767 -51929 20221 67660 -22181 -82831
160 -82831 13629 64873 -10093 -50874 -24152 28568 45927 -35236 -65797 30382 53564 -19976
172 -19976 -45366 -13251 47769 35082 -66753 -35535 69983 21456 -42016 -14144 -801 31532
184 31532 34768 -59785 -43476 78437 33481 -75858 -22444 51627 19944 -24124 -30601 2342
196 2342 41297 11869 -47521 -23431 45536 33397 -38080 -39749 31059 45104 -18695 -43835
208 -43835 8198 40267 8707 -30465 -27071 24921 46726 -24905 -59285 27073 56677 -25772
220b5772k2043N8207K3348k9092l4931O003M5198R951m5318k8806M1378N2788
232E0911m5713o5048N2423N7659m6818l6488J8552K4043K1712l1373m9276M9158
244b58N3667n6267m1383L9306L5903j0679m4003q048N2305J4434m5773j9544K7349
257b991L4622j1401n2480M396O2556r42o2867m415N6428J2407m5870k1535L2946
270H54K7389j5725l3871l773M2786J8187n3196k2071N4538J8615m1069k1126J9864
283h598L3408m505m6583l310N0624Q182m3069j8033L1154L3527k3594m6195K1449
296a5543N0731k2828m1424J6459K4559L888j1853l1809J1957N3985k0983n8171
308d1032K5724M8287j7831l5622Q42K7969J6568k4838k6616J9258L3290j0036
$$ plain form
220 -25772 -47815 10392 33740 4648 -30283 -24280 20918 30869 -14449 -43255 -1877 50911
232 50911 5198 -59850 -7427 50232 3414 -33074 -14522 9521 31233 -140 -49416 -258
244 -258 53409 -2858 -44241 -4935 30968 20289 -23714 -31762 20543 34977 -10796 -30340 -2991
257 -2991 31631 20230 -32250 -27854 34702 33760 -29107 -33522 22906 35313 -10557 -32092 854
270 854 28243 12518 -21353 -25126 17660 35847 -17349 -39420 15118 33733 -7336 -28462 -8598
283 -8598 24810 20305 -26278 -29588 21036 29218 -13851 -31884 -730 32797 9203 -36992 -15543
296 -15543 35188 12360 -29064 -12605 11954 15842 3989 -27820 -15863 38122 17139 -41032
308 -41032 -15308 32979 15148 -20474 -19632 8337 24905 67 -26549 -7291 25999 15963
320A5963l9817K13M6915N349m9921m385M0843N861k2189j5641M722L0351N808
333B4072m3452q231M6206J0184m1973j5264L5607K0177k7960k3703J7837K3754
345A7254m306k3978j1895K4990K6490l0039l5236L6056L2578l4863k2182K0843
357d288J3988J977j5689k3402K7120L2258l5205k9102L2497K3142j7180k3090
369a6974J280K8976P339l1608q710K4888J2758j2724k3663M345L6536m806l9606
382b1969M814L3395Q82k5139j1001J8854J9732j4065k3829O417K6373K792l0355
395a3099q448L2434J0163k9000r827J8197J4304n131k4400j680L2383K529l2123
408a3698l190K2635J0592j3880k2277J1283K9312j1738k9224J0050K1925j717
$$ plain form
320 15963 -23854 -23641 23274 28623 -21298 -25683 15160 21021 -1168 -16809 -12087 18264 24072
333 24072 -19380 -27611 18595 28779 -13194 -28458 7149 27326 -634 -24337 -6500 17254
345 17254 12948 -11030 -22925 2065 28555 -1484 -36720 -664 31914 -2949 -25131 -4288
357 -4288 9700 11677 -4012 -27414 -294 31964 -3241 -32343 154 23296 6116 -16974
369 -16974 -15694 13282 20621 -10987 -19697 5191 17949 5225 -18438 -14093 22443 17637 -21969
382 -21969 -17155 16240 17122 -8017 -19018 -164 19568 5503 -18326 -11909 14464 17256 -13099
395 -13099 -21547 10887 21050 -7950 -17777 420 14724 9593 -14807 -16487 15896 18425 -13698
408 -13698 -16888 5747 16339 2459 -19818 -8535 20777 9039 -20185 -10135 11790 10073
420A0073j6320j0008J3274K0595j1782k7898J1887K9247r278k6145L949K1665
432I259L675j6650j1729J3899J8681r711k3520N944K6653k509k5709k089K3178
445I372O848j8926j0927J2707J5526o357j9225k29K2740L646k3112q198K0988
458D853J3084j9228j6218J6294J6096j0430j3455k21J3126J2146j7234j9206K2120
471A727J9511k3900j3335J7299Q295l914r188r093J5645J5523k1696j4532K0165
484B507J2936j3157j4102N205J6567R11j9489l488J8019O491j4088j0733R040
497c381J6091n114k0264L535K0358n61j7582k832J3743P582r170j2020M650J6728
511A1763j101k0275j64K1049J321j8577l516J3114O939o334j3813K393J8881j529
$$ plain form
420 10073 -6247 -16255 -2981 17614 5832 -22066 -10179 19068 9790 -16355 -12406 9259
432 9259 12934 -3716 -15445 -1546 17135 7424 -16096 -10152 16501 13992 -11717 -13806 9372
445 9372 16220 -2706 -13633 -926 14600 8243 -10982 -11211 11529 15175 -7937 -16135 4853
458 4853 17937 -1291 -17509 -1215 14881 4451 -9004 -9225 3901 16047 -1187 -20393 1727
471 1727 21238 -2662 -15997 1302 9597 5683 -3505 -12598 3047 18570 -3126 -17658 2507
484 2507 15443 2286 -11816 -6611 9956 10867 -8622 -12110 5909 12400 -1688 -12421 -3381
497 -3381 12710 7596 -12668 -9133 11225 10664 -6918 -9750 3993 11575 2405 -9615 -4965 11763
511 11763 10662 -9613 -9777 11272 12593 -5984 -9500 3614 10553 4219 -9594 -7201 11680 10151
525A0151j9542J66J6222K111j1517o928O893J2537m333j7287L627J8447k770j5261
539g484j220J1631P149r738j1173P473J4658n530j6271L926J5222q90j2070l919
553h236R099R784q409j2753O454J4053l522j4036J14J2859L777j1057q502J0584
567B09J1538j0288j1374P338R983j469j0498l695J1627P452j1463j0349J1431
580D42J0292r106q719L873P883L163r421q834J2331J0268j3273r849J1328Q223
594H601p039p012j04Q839M941j1239p341J1854P540r432q074N263J0119k277j0745
609f106r35J1247L367j0251n495P868Q088n663r874L490J1221j602j0817j083
623f545J0475K904q436m273M433P821j695j1172L28J3037O9j2760l11R765K046
$$ plain form
525 10151 -9391 -9225 6997 9108 -2409 -9337 -2444 10093 5760 -11527 -7900 10547 7777 -7484
539 -7484 -8704 2927 10076 338 -10835 -3362 11296 5766 -10505 -6579 8643 7753 -4317 -8236
553 -8236 863 10647 2238 -10515 -4061 9992 6470 -7566 -7452 5407 9184 -1873 -10375 209
567 209 11747 1459 -9915 -2577 7406 5937 -4561 -8256 3371 10823 -640 -10989 442
580 442 10734 1628 -7091 -3218 4665 7828 -1593 -10427 1904 12172 -1101 -10950 378 8601
594 8601 1562 -5450 -5554 3285 8226 -3013 -10354 1500 9040 -392 -8466 -3203 6916 4639 -6106
609 -6106 -7041 4206 7573 -2678 -8173 -305 7783 2120 -7754 -4264 6957 5355 -5462 -6545
623 -6545 3930 6834 -1602 -5875 -1442 6379 4684 -6488 -6160 6877 6946 -5814 -6125 3640 5686
638E686n511n957K409J0242j324j3118K356J1190j080q211j944N843N175l700
652B056q048K257R932j246j0976K72R844J706p899m482O301O501m349q095K494
667c732R282j446q683m26O619L820n526o837N606Q027m729p239J625P102J559
682E022o801m651P239O521p560o942O680O468m152n555K88N803L139o431n267
697f199O313O957o391o455M875N356j815m493k805N713O135p917o386P656N719
712F263n869m924K544N017J177o709k672P114L490o433m136M286M765j559o140
727c786m2O968J419p314k321O433K904m088m849K333O713r40q028M92P886O1o325
744b484r10L900K549j096n477j52Q330o33q295N13O678O38m647k749K826M878
$$ plain form
638 5686 175 -5782 -3373 6869 5545 -7573 -5217 5973 4893 -3318 -5262 581 5756 2056
652 2056 -5992 -3735 6197 4951 -6025 -5753 4091 5797 -2102 -6584 -283 6218 1869 -6226 -3732
667 -3732 5550 4104 -4579 -5005 1614 5434 -92 -6929 -1323 6704 1975 -5264 -3639 3463 5022
682 5022 -1779 -6430 809 7330 -230 -7172 -492 5976 1824 -3731 -3443 2360 5499 -932 -6199
697 -6199 114 7071 680 -5775 -900 4456 2641 -1852 -4657 1056 7191 -726 -7112 544 6263
712 6263 394 -4530 -1986 3031 4208 -2501 -5173 1941 5431 -1002 -5138 -852 3913 2354 -3786
727 -3786 -3828 3140 4559 -2755 -5076 1357 4261 173 -4676 -2343 4370 3430 -4598 -4106 3780 3841 -2484
744 -2484 -3394 506 3055 1959 -3518 -3670 4660 4027 -4268 -3755 2923 3561 -1086 -3835 -1009 3869
760C869j399o789R83P636q40p170M78M997J627l481l358K030N060p67o811L90
776c545P050l01n508o41K791L987k652o260L475O012k937n000J502L303J632l346
792d38m282M233N188m675m578L636L032o88k737k684M207M156n106m261M964L964
808C931l914l734K362L535O4l196k746L930M040m474m183M400L170k713k555N8
824b025K826K534m031l835M961L642m837k691L015K582n51l393j507M727K077
839C494n262j621L945J915j953k650m7M189P54n272j008N343P21l877p51J416
855f64K721J42m954o72O697p49n787J550L048m03p49k367J1M286M26n792O87N168
873B599p41l360m43K030J897o60l757O15M453l79m856M93M295P3l154r32J633
$$ plain form
760 3869 2470 -4319 -3336 4300 3460 -3710 -3232 1765 3392 -89 -3447 -1417 3643 2876 -3935 -3545
776 -3545 3505 3204 -2304 -2945 -154 3833 1181 -5079 -1604 4408 1471 -3529 -2027 1276 2908 -438
792 -438 -4720 -487 4701 26 -4552 -916 2116 1428 -1309 -3993 214 4370 -736 -4997 -33 3931
808 3931 17 -3717 -1355 2180 2244 -952 -3698 232 4272 -202 -4385 15 3185 472 -2083 -2025
824 -2025 801 3335 -696 -4531 430 4072 -765 -3456 -441 2141 1590 -1803 -3310 1417 3494
839 3494 -1768 -3389 556 2471 518 -2132 -2179 2010 2764 -2508 -3516 1827 2548 -1329 -2080 -664
855 -664 2057 2199 -2755 -3427 3270 2521 -3266 -1716 1332 929 180 -2187 -2176 2110 2536 -3256 -2569 2599
873 2599 1858 -1502 -1945 85 1982 1322 -2435 -1820 2633 2254 -2602 -2109 2186 2259 -895 -1827 -194
890a94K356p87l722Q79L899q68l204P0J913J786j671l683K182M791l212l417K590
907b92J879n75r55k740K230L815l509l603M139J998k633o57J63Q71J962j924l097
924b928K913L359l173k436K269J480l30k228n28K154K092l060k521L587J752k689
940b87j378J061J576Q07k440j756L134J816l277j395K366J203p55j605o64K954
956A360R21l326j204L491O41k296o98M81J828N44l134l84L508J71l229jJ770L00
974G43K09k147o72M024k73m389J078L179q67j199l31p9K375k12l356M16L518m56
992A561l181M29K254J49j289r56K80K449k15l076K18K988l34k346R9J187J141
1009A358r45k053Q13K954j477k157Q62J274N90n56k617J444K880k122k405K578
$$ plain form
890 -194 2162 1375 -2347 -1468 2431 1563 -1641 -1571 342 2128 457 -3226 -1044 3747 535 -2882 -292
907 -292 1587 1012 57 -2683 -453 3362 -147 -3750 389 2387 -246 -903 -740 131 2093 169 -2928
924 -2928 -15 3344 171 -2265 4 1484 1154 -1074 -1602 552 2644 -416 -2937 650 2402 -287
940 -287 -1665 -604 972 1779 -661 -2417 717 2533 -744 -2139 227 1430 675 -930 -1594 1360
956 1360 2281 -1045 -2249 1242 1883 -413 -1111 -630 1198 1742 -1392 -1776 1732 1903 -1326 -1327 443 743
974 743 952 -1195 -1867 2157 1884 -2505 -1427 1752 885 -314 -645 -724 1651 1439 -1917 -1501 2017 1561
992 1561 -1620 -1191 1063 1212 -77 -1033 -753 1696 1481 -1595 -1377 1611 1277 -1069 -970 217 1358
1009 1358 413 -1640 -827 2127 650 -1507 -645 629 1219 663 -1954 -510 2370 248 -2157 421
1025D21R30j306m80l32M27J887j294k638K660J730k245j016J487M72Mn66j659
1042a518J510J718j655k401K522J219j385q29J78P66J037j377j560K085J281j883
1058b92q01Q41J059j18j062q34J791R85k274o48J709L23o09o38j33J530N11k072
1076g32q08K364O14k624P14Q03j83O74j193j203K857m4k858P00J917p95O0o85
1094d22n53J758O68k960L97K600r89j220L52L95P20m61j351K08J875K2k192M45
1112g08J710k87j272K4K31Q55J71j633K01K360j018j543M70P69M79l70j606O42
1130e25K281j523j414J334L30m42J78j104J55K428j326j998K004Q98j669L59k51
1147b85J55J000o16j636J098J829j542j384J721O58r18j08m51O19J190j506j371
$$ plain form
1025 421 1351 45 -435 -767 -340 1547 253 -2385 275 2005 -240 -1256 231 703 707 141 -1518
1042 -1518 -8 1710 55 -2346 176 1395 10 -819 -641 125 1162 -215 -1775 310 1591 -292
1058 -292 -1093 -252 807 689 -373 -1207 584 1569 -705 -1353 356 679 70 -568 -701 829 1340 -732
1076 -732 -1540 824 1438 -1186 -472 331 148 822 -371 -1574 1283 1239 -1619 -919 998 203 263 -422
1094 -422 -975 783 1451 -1509 -1112 1488 499 -721 -369 26 746 285 -1066 -858 1017 1039 -1153 -708
1112 -708 1002 715 -557 -533 -302 553 724 -909 -708 1652 634 -909 -439 330 809 439 -1167 -525
1130 -525 1756 233 -1181 153 483 41 219 -885 -730 1698 372 -1626 378 1276 -393 -34 -285
1147 -285 -130 870 254 -1382 -284 1545 3 -1381 340 998 80 -28 -479 140 1330 -176 -1547
1164a547J659P62j336j06N26L32M82q30j167J660P83j644j63Q89L24l85m43p14
1182i18J282P37j648p50K180k92j242M11J74m8Q92j077j138K267N8j618J34J214
1200F18q40O32k76j147J810N66k250K6K031q16j026R48p45O52Q04j804j09K200
1218A274j021j045O04P71k74l39k20j05R65Kj146j76J938r91o23J89J3M16M36
1237F68j228O7J616j177r00Q63L55l24O01r99l78K050j208j155J518J21p80L17
1255B7k98j32J073k91k001J250J651j606o61J296m51K5K86r66L87J638j062j587
1273a422J877R9j197L22M25m47J370p79j352J407M72j484L43O32j68K35l46o21
1291f34O92Q39j524j29J142J30q33J61l46N88O78j222k11J465k48j376N31P22
$$ plain form
1164 -1547 112 874 -462 -568 -42 290 772 -58 -1225 435 1218 -426 -589 300 624 239 -204 -918
1182 -918 364 1101 -547 -1297 883 591 -651 -240 -66 -114 778 -299 -1437 830 888 -730 -596 618
1200 618 -222 410 134 -1013 797 1363 -887 -861 1170 354 -672 276 -469 183 987 -817 -926 1274
1218 1274 253 -792 -188 583 309 -30 -250 -355 610 612 -534 -710 1228 237 -386 -197 -184 232 668
1237 668 -560 -493 1123 -54 -954 -91 264 -60 541 -458 -836 1214 6 -1149 369 490 -290 27
1255 27 -271 -403 670 379 -1622 -372 1279 -327 -988 308 -143 -118 168 -798 -411 1227 165 -1422
1273 -1422 455 554 -643 -321 104 -343 1027 248 -1104 303 775 -709 -366 266 98 333 -13 -634
1291 -634 58 897 -627 -756 386 516 -317 -156 -502 86 764 -458 -669 796 548 -828 -297 425
1309D25o84M19k21p77J157N58j828M26J440r11l62N70p46O69Q52j611j37J390
1327F29l86j245J113K88l43K32n41l23R65K88j662P98M91l67l33O04m14K02N62
1346E58j061P3J373n99j071Q25K4m7K84q24RJ147o24q17Q40N11j128L91J20m72
1366d88R27l3j098P66P61j077k3L22m6O0M24q75K95R46q37p66J214k29p63O67
1386A47j95m44J048k60j132J099O35j207j26Q46p71M03L18q46L42R67r73l40Q97
1405D08j43m32K09l33kO14l52m09P41M5o63L48j53N6L35m46l04R81J49j127J21
1426c57J199r84p5N28q65M66P51j102k59J601p70m85M90j1l71Q08n98n78Q20M06
1446F14q47J8R34r81J07J66j29L58J63p72K92P90q29j36K29k12M88L56r08r7J188
$$ plain form
1309 425 -259 160 -61 -838 319 877 -951 -525 915 4 -358 212 -534 135 987 -624 -761 629
1327 629 243 -1002 111 399 56 288 -253 -576 389 677 -985 -187 304 -63 -396 208 -206 -4 558
1346 558 -503 -430 943 344 -727 98 122 75 359 -465 -456 691 67 -750 90 601 -527 -136 -16 -488
1366 -488 439 406 -692 74 835 -242 -265 57 11 71 495 -380 -85 861 24 -742 472 243 -520 147
1386 147 -48 -492 556 296 -836 263 898 -309 -435 411 -360 43 361 -485 -143 824 -149 -489 408
1405 408 265 -167 42 -291 -293 321 -31 -440 301 346 -317 31 -122 -66 269 -177 -481 500 649 -478 -357
1426 -357 842 -142 -217 311 -554 -88 663 -439 -698 903 133 -352 138 127 -244 564 -34 -612 208 614
1446 614 -233 -215 719 -262 -155 11 -118 240 403 -369 -77 713 -116 -252 -23 -235 253 609 -299 -396 792
1467G92n94q56O53O30r40N65o0m73R50l64q87N57M78n08l25O47m86K10N83q75
1487c03j15R06k66p44O18L53l51K18o16l44J400q44o51J127j55o56N82J17n58
1506b82O81j23r48Q17O58j083k66J105o42k32P49o91k3Q35p46l82Q26n1l54P0
1526h2J86q7O5j17j12M88k59l49O8M01l07L07j56m39N69M36j106O2J088p57k66
1547c67Q70n53j90R01r92n18J427j46j199R63J72n89J38N69q26J51O07o07j27
1566c16N76J54n53J77j74K2N89q42K93L29l77l42K89K71j93Q28q11k56P66l00
1586A30o88R32j01p55N13R5o19M41M21q50J05J012o82o08Q06k6k36L54k18l11
1606b85N07K50r06N39J78k92k91M27k49N28m80m86Q85m9o48M06K3k12L71L41j240
$$ plain form
1467 792 198 -658 -5 625 -315 250 190 -283 667 303 -584 -27 451 -57 -382 265 -221 -11 572 -303
1487 -303 -418 488 222 -522 96 449 98 316 -300 -644 756 -88 -739 388 233 -423 159 276 -282
1506 -282 399 276 -672 145 803 -280 -546 559 -83 -315 434 -257 -280 555 -191 -573 253 202 -152 -82
1526 -82 104 17 82 -35 -147 341 82 -267 -199 202 -105 202 46 -393 176 612 -494 -432 656 -101 -367
1547 -367 503 -50 -240 661 -331 -849 578 432 -767 196 368 -221 -83 486 -340 -189 418 -189 -316
1566 -316 260 414 -139 38 -136 -114 475 -367 -74 255 -122 -464 -175 96 -97 731 -80 -336 430 130
1586 130 -558 374 273 -482 31 126 -493 -52 369 -481 -376 636 -46 -654 152 126 -110 244 26 -285
1606 -285 222 472 -434 105 283 -9 -300 127 -122 406 -74 -560 325 276 -372 34 57 -155 216 557 -683
1627f83O09R05r01k31Q05n19l44Q64k52n36O76J22j249M55Q53q45m11J014k72
1646F0k41M66l12J22M60p59k28P91m85O6Q9k40M32L41j098L08O75m39m14P87j51
1667B30q33J094m75m87Q30R4r91K79P94r83r7J036m71l18N18m39k86R44k87r17
1687g65P49N14m37j57M9j24M49j93k34K62j94j4M14r3n58Q53l47o71P44j66o54
1708e73N22M98p55J84O10n62m72J116l02p11O26K78r18M13N61r98K55Q00q60N3
1728b35Q70m13m00K73k38J66P8l29O17k08l28P1K17o12L04M31r15M22P95q04j59
1749c97R40l02q13Q08R1q01P23J93p33M20M92q48k54Q68k21m04L28J77o33K36
1769a30L95m58K04J08r4k27j22L59M18p32%P00k75k93O49l13o37Q97k01o41L57
$$ plain form
1627 -683 -74 831 -70 -301 504 -15 -359 505 253 -283 393 515 -734 -279 574 -271 -682 332 60
1646 60 -181 285 -27 95 555 -204 -432 359 -126 -60 29 -211 221 562 -536 -228 447 8 -406 381 230
1667 230 -603 491 16 -471 359 453 -538 -259 535 -448 -545 491 20 -298 220 -219 -505 439 152 -765
1687 -765 -16 498 61 -96 -47 -171 278 85 -149 113 -81 -95 319 226 -332 521 174 -497 247 81 -573
1708 -573 -51 447 -308 -124 486 -76 -548 568 266 -445 181 459 -459 -46 515 -483 -228 572 -288 -235
1728 -235 635 222 -178 95 -143 23 101 -228 389 181 -147 -76 141 -471 -167 264 -651 -229 566 -238 -397
1749 -397 543 241 -572 236 327 -474 249 442 -291 129 621 -227 -481 387 166 -238 90 267 -366 -130
1769 -130 265 -193 11 119 25 -202 -324 35 453 -279 -279 421 146 -147 502 189 -448 449 248 -393 -36
1790c6J059j397j51J391r53k93Q03l47n04O60Mq51M85P86j016K06O52n11l83L03
1810i3P5j3L50l91L31j09j91R5j96j01M09J38n48M61L25r37r8R32n72l27J003
1831E43m70n62J075q4j378Q55Q74j227l5R25n22k64P58l36n14P61l16l36L87K05
1851C39j81n6l00k40L70j57K75o4J08mJ10k47k07O47l81l29P36K49j213M15P34
1872F04q88J6P23r60J70O97m46n53J044k18m85K56K49m10L18j75qK24k4j40J32
1893A26j62J9m9k11K24L35k11k99K09M06p83L59N38n69m5N15n38j98P87m59n82
1914e88P28J32q65P25K50o72K80N01q15J03P15m22k37K52J8j03K04l12P4LJ29
1935A00nj02m7K6J55n40K18O16n08j52N36k64o6J30P5m76M64K66q74K78O51o32
$$ plain form
1790 -36 1023 -374 -525 866 -87 -380 423 76 -428 232 236 -615 -130 656 -360 -154 498 -13 -396 -93
1810 -93 -18 -31 319 -72 259 150 -41 54 -142 -243 166 304 -244 217 542 -395 -493 439 -133 -460 543
1831 543 73 -489 586 502 -876 -21 853 -374 -409 516 -6 -270 488 152 -362 399 83 -253 134 339
1851 339 158 102 -198 -438 -68 -225 50 -14 94 90 200 -47 -254 393 12 -317 419 668 -545 -130 604
1872 604 -284 -268 455 -505 -335 362 -84 -637 407 189 -296 -40 209 -201 117 -58 -66 158 134 -6 126
1893 126 -36 -17 -66 -277 -53 282 71 -228 -19 387 -396 -37 501 -68 -113 402 -136 -334 453 -6 -588
1914 -588 140 272 -593 132 382 -290 -10 491 -324 -221 494 72 -165 87 105 2 206 -106 -32 -29 100
1935 100 95 -7 -54 -28 127 -413 -195 421 -87 -239 297 33 -33 97 172 -304 160 426 -448 -170 481 -151
1957a51l3O45o43k66P07l4q18N80O2k30J35K66l49p4K45N9m6k55K04J18k53J07
1979b4J02k5o3O1k43k12L79K27m74J87M81m05k99P90o24k66Q38k25r38R54J39
2000C60q44M44M80q19L52J59o7m48N86m28k55O03J17k22Ol36k41Q98o01M77R9
2021C20o28K23M08m58n0P22q33j18Q86k28p87N34J75l14L01M65q98n3P20m34m04
2042d51Q32l95m92M83J35K6J6l9j90J35n8J8p9p5K04j5j66m0K09j32J48jJ61l81
2066a47J82J31m31L90L62o10k5O53p55k77R94m73l37O94j48l94K41J42o10N38
2086A20l0l09j21L10J95j42n5j31Q7K8O6k93L36k58L05L0k08R8L54p65J25Q43
2108E85n00n09Q15j38n92P58l34l72M63J92n06K7K84l72N6K21n4j03M72k94l46
$$ plain form
1957 -151 -184 461 -182 -448 259 225 -593 -13 49 -181 -46 220 -129 -203 42 101 55 -200 4 122 -131 -24
1979 -24 78 53 -10 51 -192 -404 -25 202 -272 -85 396 -9 -308 482 -142 -408 430 205 -733 221 360
2000 360 -484 -40 440 -379 -27 132 65 -383 203 -225 -480 123 240 18 24 -312 -553 345 -256 221 320
2021 320 -308 -85 323 -135 -185 537 -296 -414 472 244 -543 -9 166 -148 153 618 -280 -333 387 -47 -451
2042 -451 381 -14 -506 -23 112 138 154 115 -75 60 2 20 -59 -134 70 55 -111 -151 58 -74 74 73 234 -147
2066 -147 35 166 -265 125 487 -123 -148 505 -250 -527 467 -6 -343 351 203 -191 50 192 -418 120
2086 120 90 -219 -340 -30 165 23 -32 -163 -76 -48 18 -275 61 -197 108 138 -70 28 382 -383 -258 585
2108 585 85 -424 391 253 -339 419 85 -287 176 368 -138 -111 173 -199 -143 78 24 -79 393 99 -247
2129b47K74L1j85K42l33K37n6K4j37Q1P8k82M50l28P2J90k86r4K50K26p06N24
2151B5L56o74K55O90q27J7K69p1j27J74L0k25K99j14J7k1M1j10K45m9n50k1M99
2174A28n00L62p8L2J6Lj27J3N74m67l5L04k39j07N39m53k01P94l05n97L85J78
2196B19m41L41k62j55N47K06l73j17L67n26J42K21j50q6K79l40lL47k92j7K41
2217A48k57p9J87j88K50K18j86m05N42j55k52K17Mk14J48L38p82L31N31m17j69
2238a90K60k02j45L70j7l96M24p9j15l5L71p29P33R7n41K81j99L9L64j4o45L49
2260a9J13l60L73J40k35j42L15k12N6K03l49k26N95m9l69N93m84L5K14j89k82
2281b79J71L15n06K27K11l13N5J22k6l62P71n56J10L58l87K61k6k49R9L01k92
$$ plain form
2129 -247 27 58 -127 115 -218 19 -37 -13 -150 -69 9 -273 177 -151 -79 111 -175 -269 -19 207 -499 25
2151 25 381 -293 -38 652 -175 -158 111 40 -87 87 117 -108 191 77 94 73 114 4 249 200 -350 -371 128
2174 128 -372 -10 -88 -56 -40 -37 -164 -151 423 -44 -79 225 -14 -121 418 -35 -236 558 253 -344 41 219
2196 219 -222 119 -143 -298 249 455 82 -35 332 -194 -52 169 19 -67 212 -128 -131 216 -76 -93 148
2217 148 -109 -188 -1 -189 61 279 93 -312 230 75 -177 40 44 -170 -22 316 -466 -135 396 -21 -190
2238 -190 70 -132 -277 93 76 -320 104 25 -90 -125 246 -483 250 347 -194 87 -112 -73 291 277 -368 -19
2260 -19 94 -266 107 247 12 -130 185 -27 29 232 -117 -343 252 203 -166 427 -57 -22 192 3 -279
2281 -279 -108 207 -299 -72 139 -174 -119 3 -23 -385 386 -170 -60 298 -89 172 146 -103 -4 297 5
2302EM9Nk29m9J04R2j48K57J83n93L70L80m03l8j9k9j3K25k20k34N37l95M0K64
2326A41j52l11K51M6j03L97l29j17J13k13N0K62m3k85P47j10k63KK47l31KJ77
2348A78k42K26l7r1l12N80m82j87O51l45j20J15L00l17J78l11J03M31o4m56K84
2369H2l8k23P1K32k95N4K12n28M18J62j28J6K11n29J15K92k20OJ13J15m96O27
2391B69k91k75N54M2m87P5K9m8J16M68m51j75M42m87J62K92k96p9J01Pk6K18k05
2414d5j28L50p6o41M69l4j5M50l71k77N08O6l38J96n6j96J40J10k02j19J66P8
2436C5J73n3k74m4K05j4k65M71j73m40N04j08p2O9K77m91K38K35m41K40j01j87
2458b16Q6L42m51O34k69J73m84J48r3QK79j21J28Rj77j3j25L04n31L42K27o09
$$ plain form
2302 5 54 59 -170 -219 -115 -23 -171 86 269 -324 46 426 23 -15 -34 -63 -76 149 -71 -305 232 -163 -123 141
2326 141 -11 -322 -71 -25 -128 269 -60 -177 -64 -277 -227 35 -8 -293 454 344 81 83 330 -1 1 178
2348 178 -64 162 125 34 -278 302 -180 -367 284 -61 -181 -66 234 -83 95 -216 -113 318 254 -202 82
2369 82 44 -179 -108 124 -171 -117 95 -433 -15 147 19 35 246 -283 -168 124 -96 -90 23 138 -358 269
2391 269 -22 -297 257 299 -188 -113 -84 -132 -16 452 1 -174 268 -219 -57 235 -61 -140 -39 -32 -58 160 -45
2414 -45 -173 177 101 -540 -71 -105 -120 330 -41 -318 190 256 -82 114 58 -138 2 112 -90 -209 -43 35
2436 35 208 155 -119 -163 42 28 -237 234 61 -379 125 17 -55 14 291 -200 38 273 -168 72 -29 -216
2458 -216 -130 212 -239 395 126 299 -185 -37 -130 -122 157 36 164 173 -4 -17 -142 162 -369 -27 200 -409
2480d09M37J14k85K2M47n59M65P5m66J22L23k62K3mk33K81O9k01n9L21k71j68
2502b18L77J43l13K88k33l19L96k6l64J02K57l4M6Q0j68J07J33k01j43K29l19
2523a80q8L21k21J4J42j07j26N64r2j65j04Q2j09K84q5l36K63J65k40j50J21k68
2545c15K71K18k35k68L86J21j85K20k2m28L04k5Q2j6J72q3j75K08k15k2L2k50
2567b25N63k24m68M49J04k94OL68p15M41m3O4k4L3R5j87L08l72q9L86K2k47K09
2590A60M9l63J72M05k98k78L55k39J79k9j70jJ43k32N8J86j13l8J75l76l4M48
2612A59k04J63J43m00j71L27ok16o1L73j42nK25l00R6j4j14M4K96j64o2M19l96
2635a0j45M34L5k87R9j30j57L33l1j29Rl4k40L18j33m1Q0J87m62M11Nj99j21L27
$$ plain form
2480 -409 28 142 -143 -121 326 -233 232 307 -159 -37 286 24 47 43 -190 91 160 -41 -100 221 -50 -218
2502 -218 159 302 -11 277 44 -275 121 95 -269 -167 90 56 102 182 14 121 254 53 -90 139 -180
2523 -180 -268 53 -168 -154 -12 -119 -245 319 227 62 -42 40 -69 215 130 -206 57 222 -18 -168 -47 -315
2545 -315 -44 174 -61 -329 57 178 -7 213 191 -237 67 42 124 108 280 197 22 230 15 -7 25 -225
2567 -225 338 114 -354 95 199 -95 -89 279 -436 5 -38 26 2 35 130 -57 251 -121 -210 176 198 -49 160
2590 160 209 -154 18 423 125 -153 202 -37 142 113 -57 -58 85 -147 -89 97 -16 -54 121 -255 -289 159
2612 159 -45 118 261 -139 -310 17 11 -205 -266 107 -35 -40 185 -115 -19 -33 -147 -103 193 29 -33 386 -10
2635 -10 -155 279 314 27 126 -4 -161 172 141 12 21 -13 -253 65 -68 -109 -29 158 -304 107 112 -87 -208 119
2659A19j70o4K6J27k05K8j0q8L51n8l14K70m1j4K76j51j23n8J67j92l2K23l06
2682b39J4L97l02R9Q4k2r8J61l3r7K69k06r3J57nk81L27J4j01K11j90l1J11p6
2706G0j57o8L42l50K7K59j54K4K46p4p3R5k42k5J81o2j05K68r8l06J7L07j56J69
2730A35j39j2Ol1oK50j5k77K91m6m70K53M61p33L10J31o46P96J57j88l45%K28
2753A10J8K03m69n9N45m09rJ52L62n04j97Q28j140O31L29o21j8M71p29O52J81
2774C27n98p3K31k64L92L33n46J91O28m63l99N56j80o13M78j8k46L08J04l59k3
2795b34K29K8j43J49Jj65K95j77q1K33q9j35K85j57j40Q5O8K0j87J21q4J19J25
2818A66p2P9k42N1N7J62m85Q0L91m53J15L72l50J14K61l78J87J53k20K44k31J00
$$ plain form
2659 119 -51 -115 -89 38 -167 -139 -149 -237 114 56 -258 12 -29 -43 233 82 -41 -99 68 -124 -156 67 -239
2682 -239 -225 172 -130 -31 53 31 -67 94 61 -36 233 27 -66 91 86 -195 132 146 45 256 66 35 146 70
2706 70 -87 -155 187 -163 -136 123 -31 -7 239 165 92 187 -55 -80 101 39 -66 202 104 -202 -185 122 -34 135
2730 135 -4 -16 -10 -41 -47 203 188 -89 202 156 -314 -61 400 -333 -23 108 -538 258 415 227 -118 -118 110
2753 110 128 331 -138 -197 348 -61 -70 82 444 -60 -257 571 -569 62 391 -230 -248 223 -506 146 327
2774 327 -271 -344 -113 -377 15 348 -198 -7 621 158 -241 315 135 -478 0 -18 -264 44 148 -211 -234
2795 -234 -5 23 -120 29 30 -135 160 -17 -98 135 46 -89 196 39 -101 -16 52 72 -115 6 -78 41 166
2818 166 94 173 -69 -18 39 201 -284 -204 187 -266 -151 221 -129 -15 246 -132 55 208 -12 232 1 101
2840A01m68N45J64o85K11K87j66KJ98l48J94K89l69j26L61m16O5L79j09j00l2
2861b3j44K53J03J40l58k4l8M9o4M50n43K58kj56K6Q8j71M9k6L3K69q6n5k07K98
2886A19k21K24J05k34r6J95k01q5K34N0l72M19r3k35J92K37l99L3J87j25K08j45
2908cj6j03O5k30J03K71k92p8N60J0l08L52k12l57N42m80K58rn5k21K21LJ54j65
2932A0J16l08K9M00j73k61L85k67j55M22k38J68k3lk45M18j05p2N3j12k96L32
2954G5K1n16K88Q8J2J81p4k30q2M64k05J86k81M2K39pk24J96O0k74J42Kj91J01
2978A3P4p2j99M9L85n07L14N8k26J18J09l23M3K67j66LJ97m03L42K44l76k54L03
3001gJ45k21L22l46j02K0L63m33N61p2m99J98n2J43j33L09j14r6J26k45K06r9
$$ plain form
2840 101 -367 178 342 -343 -132 155 -11 -9 189 -159 35 324 -45 -171 190 -226 -161 218 109 9 -23
2861 -23 -167 86 189 329 -29 -53 -91 -42 -106 344 -199 59 57 -99 -73 15 -156 -107 -133 -100 169 83 28 -179 119
2886 119 -102 122 227 -7 -103 92 -109 -194 40 90 -282 137 44 -191 1 238 -161 -128 59 -66 142 -3
2908 -3 -19 -122 -57 -287 -184 87 -205 -283 277 287 -21 331 119 -238 304 -176 82 73 18 -203 18 21 175 10
2932 10 126 -182 -153 247 74 -187 198 -69 -224 198 -40 128 105 102 -143 275 170 98 151 39 -257 75
2954 75 96 -420 -132 -44 -32 149 75 -155 -237 227 22 208 -73 -31 208 201 -23 173 233 -41 101 103 -88 13
2978 13 87 15 -184 -135 250 -257 57 115 -111 7 116 -207 -164 103 -63 -60 137 -266 76 320 -56 -310 -7
3001 -7 138 -83 239 -107 -209 -189 174 -259 302 230 -269 -71 -123 20 -113 196 82 -14 112 -133 73 -26
3023b6J21j09k1J74J55j00j01j41J16k27r8K94P0k37K27o3o1k9K94l55J1K13O5
3046A72l13K19J5j03L25k96l3J87k07l52K91j16M0K23J13l19K53K9k47L16m0l27
3068a70L00L9m9n5n6M7k48L22m8j55K54k79j12K20J90n48L13j00L1J13J77k77
3090i1J73j81k5L74N7l89J97J58l31N1n2j86J95L03k53k6L83m05j89N85n15N08
3112C41l35j5m7K29j1m13L41j85J63o9K66l71K21NN1p1L6o2M8K4k15j13K29j8
3136B9q5J58m7k15Qj5J04J79M8l73L99m7j91J55J47n50L38k3j01J61J2j10O7Q5
3160A33l52N0L99k87j51L85j21j79J41k55q7K54j98J05K04lj69K88j41J20p8L1
3182H9k51K11P5m5KQ1j31P7j58L94l92Q0R9k10L1J07j71K70o3j42J77o2l29K60
$$ plain form
3023 -26 95 -14 -35 139 294 194 93 -48 68 -159 -257 37 107 -130 97 34 -27 -56 238 -117 -106 107 172
3046 172 -141 78 93 -10 315 19 -14 173 -34 -386 -95 -211 -171 52 165 -154 99 128 -119 197 157 -170
3068 -170 130 169 120 65 9 56 -192 130 82 -73 181 -98 -210 10 200 -348 -35 -135 -104 9 186 -91
3090 -91 82 -99 -124 250 307 -82 115 273 -58 -7 -59 -245 -50 253 0 -26 357 -48 -237 348 -167 341
3112 341 6 -9 -56 173 162 -251 90 -95 68 -1 265 -106 115 120 171 100 136 74 122 146 -69 -182 47 29
3136 29 -56 102 55 -160 -152 -167 -63 116 164 -209 190 143 -48 107 254 -296 42 19 -82 79 91 -19 48 133
3160 133 -219 -169 230 -57 -208 177 56 -123 18 -237 -324 -70 -268 -163 41 38 -131 157 16 136 58 89
3182 89 -162 49 124 79 81 162 31 108 -50 344 -48 32 131 -79 -48 59 -112 158 95 -47 130 68 -261 -1
3206aK84m05K53j7k96K12J14j78R2q3p1J47j09J45kJ77k31J38k8j08rL5j07p3
3230a21J49J1j25R9J90j15n6l8l9N4Q5l34K77O7j54K75j41n0j34J17j10J93N3
3253A53j46k41K30J25j84K62k52j33K03K37l34J80mn15L57J81q2j48K01j31j78
3274b19K44l53M37l30R1m2J67k3m8J63L3l01J47K38j11j09K9l39L64J38l27L19
3296A68j09N0k79M24m83M32j75j7Ro9Km6Q7K10n87O11q3l03N2Q9j84J17K31j48
3320aK35o2j86q8M44m27J52j79J59j26Q9J23j83K99j29j18j19R1K88k19L7j23
3342d3m0K31j86J13j5m00M23Q4k71R6O8j35K14mj16j34O4J02P4j82J79j72L50
$$ plain form
3206 -1 283 -122 131 114 -182 30 144 -34 58 -25 -96 51 -58 87 85 262 31 169 141 33 24 59 -48 -121
3230 -121 28 39 -86 13 203 88 32 -6 -45 9 94 -240 37 104 -50 225 84 34 -100 17 -93 100 153
3253 153 7 -234 -4 121 -63 199 -53 -186 17 254 -80 100 96 -419 -62 119 37 -111 90 -41 -219
3274 -219 25 -328 109 -221 -130 -172 -5 -28 -76 87 120 -181 -34 204 93 -16 13 -326 38 176 -151 168
3296 168 59 109 -170 254 -229 203 28 11 20 -49 -47 -93 -6 204 -383 228 145 -158 -106 -17 -201 -84 147 -1
3320 -1 234 172 -14 -102 342 -85 67 -112 47 -79 10 133 -50 249 120 2 -117 -26 262 43 80 -43
3342 -43 -83 148 -38 75 60 -340 83 167 -104 -8 60 -75 139 135 19 -115 -51 51 125 -57 122 -50 300
$$ [...]
8191b43
##END NTUPLES=NMR FID
##END=
