##TITLE=1H_EC-3234x-Y
 DMSO, 8 sc, 
 22.9.2020
##JCAMPDX= 6.0         $$ Bruker NMR JCAMP-DX V2.0
##DATA TYPE= NMR FID
##DATA CLASS= NTUPLES
##ORIGIN= UXNMR, Bruker Analytische Messtechnik GmbH
##OWNER= root
$$ XWIN-NMR		Version 3.5
$$ Tue Sep 22 08:28:07 2020 Russian Standard Time (UT+4h)  she@DPX200
##.OBSERVE FREQUENCY= 200.1315066352
##.OBSERVE NUCLEUS= ^1H
##.DELAY= (6, 6)
##.ACQUISITION MODE= SIMULTANEOUS
##.ACQUISITION SCHEME= undefined
##.AVERAGES= 8
##.DIGITISER RES= 18
##SPECTROMETER/DATA SYSTEM= spect
##.PULSE SEQUENCE= zg30
##.SOLVENT NAME= DMSO
##.SHIFT REFERENCE= (INTERNAL, DMSO, 0, 15.7039)
##AUDIT TRAIL= $$ (NUMBER, WHEN, WHO, WHERE, WHAT)
$$ ##TITLE= Audit trail, XWIN-NMR		Version 3.5
$$ ##JCAMPDX= 5.01
$$ ##ORIGIN= Bruker BioSpin GmbH
$$ ##OWNER= she
$$ F:/spectra/data/she/nmr/H-F/1/audita.txt
$$ ##AUDIT TRAIL=  $$ (NUMBER, WHEN, WHO, WHERE, WHAT)
(   1,<2020-09-22 08:26:53.07 +0400>,<she>,<DPX200>,
      <created by zg, POWCHK disabled, PULCHK disabled
       configuration hash MD5:
       00 E9 B6 7A A2 85 ED C7 34 08 36 98 17 FE 4E 26
       data hash MD5: 16K
       51 3B 59 B4 14 A5 26 8F 4B 07 99 18 45 24 E2 B1>)
$$ ##END=
$$ 
$$ hash MD5
$$ 0C E9 99 B2 51 A6 0F 5A 04 FD 9D 4D 2B 7C C6 F5
##$RELAX= 
##$RELAX= 
##$RELAX= 
##$RELAX= 
##$RELAX= 
##$RELAX= 
$$ Bruker specific parameters
$$ --------------------------
##$DU= <F:/spectra>
##$EXPNO= 1
##$NAME= <H-F>
##$PROCNO= 1
##$TYPE= <nmr>
##$USER= <she>
##$AMP= (0..31)
100 100 100 100 100 100 100 100 100 100 100 100 100 100 100 100 100 100 
100 100 100 100 100 100 100 100 100 100 100 100 100 100 
##$AQSEQ= 0
##$AQ_mod= 1
##$AUNM= <au_zg>
##$AUTOPOS= <>
##$BF1= 200.13
##$BF2= 200.13
##$BF3= 200.13
##$BF4= 200.13
##$BF5= 200.13
##$BF6= 200.13
##$BF7= 200.13
##$BF8= 200.13
##$BYTORDA= 1
##$CFDGTYP= 0
##$CFRGTYP= 5
##$CHEMSTR= <none>
##$CNST= (0..31)
1 1 145 1 1 1 1 1 1 1 1 1 1 1 1 1 1 1 1 1 1 1 1 1 1 1 1 1 1 1 1 1 
##$CPDPRG= <>
##$CPDPRG1= <>
##$CPDPRG2= <>
##$CPDPRG3= <>
##$CPDPRG4= <mlev>
##$CPDPRG5= <mlev>
##$CPDPRG6= <mlev>
##$CPDPRG7= <mlev>
##$CPDPRG8= <mlev>
##$CPDPRGB= <>
##$CPDPRGT= <>
##$D= (0..31)
0 1.2 0 0 0 0 0 0 0 0.06 0 0.03 0 0 0 0 0.0002 0 0 0 0 0 0 0 0 0 0 0 0 
0 0 0 
##$DATE= 1600748812
##$DBL= (0..7)
120 120 120 120 120 120 120 120 
##$DBP= (0..7)
150 150 150 150 150 150 150 150 
##$DBP07= 0
##$DBPNAM0= <>
##$DBPNAM1= <>
##$DBPNAM2= <>
##$DBPNAM3= <>
##$DBPNAM4= <>
##$DBPNAM5= <>
##$DBPNAM6= <>
##$DBPNAM7= <>
##$DBPOAL= (0..7)
0.5 0.5 0.5 0.5 0.5 0.5 0.5 0.5 
##$DBPOFFS= (0..7)
0 0 0 0 0 0 0 0 
##$DE= 6
##$DECBNUC= <off>
##$DECIM= 32
##$DECNUC= <off>
##$DECSTAT= 4
##$DIGMOD= 1
##$DIGTYP= 9
##$DL= (0..7)
0 120 120 120 120 120 120 120 
##$DP= (0..7)
150 150 150 150 150 150 150 150 
##$DP07= 0
##$DPNAME0= <>
##$DPNAME1= <>
##$DPNAME2= <>
##$DPNAME3= <>
##$DPNAME4= <>
##$DPNAME5= <>
##$DPNAME6= <>
##$DPNAME7= <>
##$DPOAL= (0..7)
0.5 0.5 0.5 0.5 0.5 0.5 0.5 0.5 
##$DPOFFS= (0..7)
0 0 0 0 0 0 0 0 
##$DQDMODE= 0
##$DR= 18
##$DS= 0
##$DSLIST= <SSSSSSSSSSSSSSS>
$$ [...]
##$SUBNAM2= <"">
##$SUBNAM3= <"">
##$SUBNAM4= <"">
##$SUBNAM5= <"">
##$SUBNAM6= <"">
##$SUBNAM7= <"">
##$SUBNAM8= <"">
##$SUBNAM9= <"">
##$SW= 16.880792210976
##$SWIBOX= (0..15)
0 0 2 0 0 0 0 0 0 0 0 0 0 0 0 0 
##$SW_h= 3378.37837837838
##$TD= 16384
##$TD0= 1
##$TE= 0
##$TE2= 300
##$TE3= 300
##$TEG= 300
##$TL= (0..7)
0 120 120 120 120 120 120 120 
##$TP= (0..7)
150 150 150 150 150 150 150 150 
##$TP07= 0
##$TPNAME0= <>
##$TPNAME1= <>
##$TPNAME2= <>
##$TPNAME3= <>
##$TPNAME4= <>
##$TPNAME5= <>
##$TPNAME6= <>
##$TPNAME7= <>
##$TPOAL= (0..7)
0.5 0.5 0.5 0.5 0.5 0.5 0.5 0.5 
##$TPOFFS= (0..7)
0 0 0 0 0 0 0 0 
##$TUNHIN= 0
##$TUNHOUT= 0
##$TUNXOUT= 0
##$USERA1= <user>
##$USERA2= <user>
##$USERA3= <user>
##$USERA4= <user>
##$USERA5= <user>
##$V9= 5
##$VALIST= <valist>
##$VCLIST= <CCCCCCCCCCCCCCC>
##$VD= 0
##$VDLIST= <DDDDDDDDDDDDDDD>
##$VPLIST= <PPPPPPPPPPPPPPP>
##$VTLIST= <TTTTTTTTTTTTTTT>
##$WBST= 1024
##$WBSW= 4
##$XGAIN= (0..3)
0 0 0 0 
##$XL= 0
##$YL= 0
##$YMAX_a= 65176
##$YMIN_a= -55309
##$ZGOPTNS= <>
##$ZL1= 120
##$ZL2= 120
##$ZL3= 120
##$ZL4= 120
##$ABSF1= 10
##$ABSF2= 0
##$ABSG= 5
##$ABSL= 3
##$ALPHA= 0
##$AQORDER= 0
##$ASSFAC= 0
##$ASSFACI= 0
##$ASSFACX= 0
##$ASSWID= 0
##$AUNMP= <proc_1d>
##$AZFE= 0.1
##$AZFW= 0.1
##$BCFW= 1
##$BC_mod= 2
##$BYTORDP= 1
##$COROFFS= 0
##$CY= 11.3945322036743
##$DATMOD= 1
##$DC= 2
##$DFILT= <>
##$DTYPP= 0
##$F1P= 16.9975609425685
##$F2P= -3.02152046262296
##$FCOR= 0.5
##$FTSIZE= 0
##$FT_mod= 4
##$GAMMA= 1
##$GB= 0.15
##$INTBC= 1
##$INTSCL= 1
##$ISEN= 128
##$LB= 0.24
##$LEV0= 0
##$LPBIN= 0
##$MAXI= 10000
##$MC2= 0
##$MEAN= 0
##$ME_mod= 0
##$MI= 1.114404
##$NCOEF= 0
##$NC_proc= 0
##$NLEV= 6
##$NOISF1= 3.799351
##$NOISF2= 2.8
##$NSP= 1
##$NTH_PI= 0
##$NZP= 0
##$OFFSET= 15.70392
##$PC= 1
##$PHC0= -10124.36
##$PHC1= 6.8009
##$PH_mod= 1
##$PKNL= yes
##$PPARMOD= 0
##$PSCAL= 0
##$PSIGN= 0
##$REVERSE= no
##$SF= 200.130013532006
##$SI= 16384
##$SIGF1= 3
##$SIGF2= 2
##$SINO= 400
##$SIOLD= 16384
##$SREGLST= <1H.CDCl3>
##$SSB= 0
##$STSI= 0
##$STSR= 0
##$SW_p= 3612.71676300578
##$SYMM= 0
##$S_DEV= 0
##$TDeff= 0
##$TDoff= 0
##$TI= <>
##$TILT= no
##$TM1= 0
##$TM2= 0
##$TOPLEV= 0
##$USERP1= <user>
##$USERP2= <user>
##$USERP3= <user>
##$USERP4= <user>
##$USERP5= <user>
##$WDW= 1
##$XDIM= 8192
##$YMAX_p= 0
##$YMIN_p= 0
$$ End of Bruker specific parameters
$$ ---------------------------------
##NTUPLES= NMR FID
##VAR_NAME=  TIME,          FID/REAL,        FID/IMAG
##SYMBOL=    X,             R,               I
##VAR_TYPE=  INDEPENDENT,   DEPENDENT,       DEPENDENT
##VAR_FORM=  AFFN,          ASDF,            ASDF
##VAR_DIM=   8192,          8192,            8192
##UNITS=     SECONDS,       ARBITRARY UNITS, ARBITRARY UNITS
##FACTOR=    0.000296,      1,               1
##FIRST=     0,             0,               0
##LAST=      2.424536,      0,               0
##MIN=       0,             -55309,          0
##MAX=       2.424536,      65176,           0
$$ Real data points
##PAGE= N=1
##DATA TABLE= (X++(R..R)), XYDATA
$$ [...]
$$ plain form
319 2336 -308 -2107 1012 600 -1184 405 438 -1135 43 971 -285 -834 50 814 -227 -985 570
336 570 627 -832 61 397 -619 603 353 -1043 201 906 -196 -140 86 95 764 -78 -176 838 22 -87
356 -87 1080 -449 -391 1930 -333 -1595 1910 987 -1756 615 1124 -1081 322 747 -1037 -53 807
373 807 -500 -425 100 86 204 -686 -278 788 -604 -707 1069 -558 -722 1599 -484 -1415 1751 479
391 479 -1727 959 1009 -1204 400 1117 -816 -218 1272 -25 -956 685 1126 -864 -493 1317 -103
408 -103 -669 949 -31 -595 1198 168 -968 769 693 -393 98 366 335 156 -234 524 420 -397 531
427 531 442 -680 659 822 -1073 157 1199 -723 -327 815 -381 -389 554 -235 -514 315 -4 -401 -77
446 -77 237 -194 -173 149 28 -44 197 -47 -69 317 173 162 245 103 253 653 99 -68 741 229 -201 728
$$ packed form
319B336k644j799L119m12j784J589L3j573J178R28j256n49Q84P64j041p58J555
336E70N7j459Q93L36j016J222k50j396J244P05j102N6K26RO69q42r8J014q16j09
356h7J167j529N8K321k263j262L505r23k743K371N09k205J403M25j784R84Q60
373H07j307P5N25j4J18q90M08J066j392j03J776j627j64K321k083r31L166j272
391D79k206K686N0k213J604P17j933N98J490j297r31J641M41j990L71J810j420
408a03n66J618r80n64J793j030j136J737p6j086M91K68l1j79l90P58j04q17R28
427E31q9j122J339J63j895J230J042j922L96J142j196qR43p89k79Q29l19l97L24
446g7L14m31K1L22j21p2K41k44k2L86j44j1Q3j42J50M00n54j67Q09n12m30R29
$$ plain form
468 728 313 -336 619 503 -598 478 720 -657 -50 861 -362 -237 578 -284 -102 511 -292 -191 433
487 433 -212 145 210 -368 368 259 -561 535 540 -850 539 736 -974 315 951 -912 -138 1103 -488
506 -488 -448 756 -202 -399 539 -34 -552 358 308 -361 -103 513 25 -334 332 322 -211 267 411 -195 357
527 357 451 -67 101 381 231 107 161 236 371 -58 8 456 -8 -206 358 -113 -253 499 -62 -423 350 16
549 16 -520 278 85 -527 242 254 -500 92 389 -450 -48 544 -310 -91 375 -233 26 501 -218 -114 500
570 500 -115 -169 409 -100 -247 513 12 -255 336 191 -128 127 194 0 56 5 -35 94 122 -57 105 191 -1
593 -1 130 81 -27 95 101 -65 76 169 -133 127 283 -313 60 450 -352 -209 608 -244 -398 454 -135 -480
615 -480 401 16 -539 368 119 -537 138 215 -389 79 185 -322 79 255 -216 -108 335 -97 -164 226 43
$$ packed form
468G28m15o49R55j16j101J076K42j377O07R11j223J25Q15q62J82O13q03J01O24
487D33o45L57O5n78P36j09q20J096Nj390J389J97j710J289O36j863P74J241j591
506d88M0J204r58j97R38n73n18R10n0o69K58O16m88l59O66j0n33M78J44o06N52
527C57R4n18J68K80j50j24N4P5J35m29O6M48m64j98N64m71j40P52n61l61P73l34
549A6n36P98j93o12P69J2p54N92K97q39M02N92q54K19M66o08K59M75p19J04O14
570E00o15n4N78n09j47P60n01k67N91j45l19K55O7j94N6n1m0J29K8j79J62Q6j92
593aJ31m9j08J22Oj66J41R3l02K60J56n96L73L90q02J43Q17q52j54Q52n89l45
615d80Q81l85n55R07k49o56O75P7o04M68J06n07M01J76m71J08M43m32o7L90j83
$$ plain form
636 43 -41 50 -43 165 114 -134 96 211 -134 3 245 -84 -102 312 -142 -150 299 -162 -127 310 -190 -189 345 -140
660 -140 -272 269 115 -324 107 142 -411 19 211 -322 -86 211 -250 -166 192 -135 -166 174 -79 -275 249
681 249 25 -345 219 109 -272 104 109 -219 81 25 -122 94 106 -84 126 120 -130 173 101 -205 184 96 -192
704 -192 135 74 -244 105 117 -214 90 185 -356 69 311 -332 -25 382 -222 -192 277 -99 -248 267 -3 -328
726 -328 151 47 -295 148 92 -274 144 53 -243 6 160 -124 -162 174 -46 -52 176 4 -128 113 -37 26
748 26 36 -21 51 65 -66 -60 253 -60 -85 253 -63 -160 288 -41 -223 297 -93 -250 310 -58 -300 290 80
771 80 -339 173 211 -369 90 206 -252 50 169 -151 -55 114 -138 6 148 1 -121 86 -30 -150 115
792 115 33 -179 77 56 -111 -34 21 -32 10 76 -86 91 5 -66 60 89 -167 58 128 -148 79 90 -119 70
$$ packed form
636D3q4R1r3K08n1k48K30J15l45J37K42l29j8M14m54qM49m61L5M37n00JN34m85
660a40j32N41j54m39M31L5n53M30J92n33K36K97m61Q4L58l27l1L40k53j96N24
681B49k24l70N64j10l81L76Nl28L00n6j47K16J2j90K10ok50L03p2l06L89q8k88
704a92L27o1l18L49J2l31L04R5n41M25K42o43L07M07o04L0M69l76j49N15k70l25
726c28M79j04l42M43n6l66M18r1k96K49J54k84l8L36k20oK28j72j32K41j50O3
748B6J0n7P2J4j31OL13l13k5L38l16r7M48l29j82N20l90j57N60l68k42N90k10
771H0m19N12L8n80M59J16m58L02J19l20R6J69k52J44J42j47j22K07j16j20K65
792A15q2k12K56k1j67P7N5n3M2O6j62J77q6p1J26K9k56K25P0k76K27J1k09J89
$$ plain form
816 70 175 -124 72 234 -125 83 265 -142 -36 267 -133 -113 323 -39 -303 190 98 -291 176 42 -250
837 -250 99 47 -242 43 123 -225 13 108 -120 -11 101 -39 -134 142 17 -42 33 -13 20 60 2 85 84 -48 31
862 31 115 4 -16 163 6 -127 157 4 -111 147 18 -143 167 49 -197 132 99 -208 64 279 -206 -31
884 -31 180 -151 9 208 -78 -74 186 -42 -18 95 -91 16 124 -4 -22 92 -7 -42 59 54 -58 3 68 -27
908 -27 -41 20 -17 11 52 -2 -26 64 -48 -30 63 -48 8 111 -18 -79 141 -44 -15 184 -42 -27 209 -42 -48 216
934 216 -68 -63 180 -6 -108 193 82 -199 135 69 -127 26 136 -165 46 134 -151 44 99 -86 -72 124
956 124 -24 -48 30 21 -63 0 -33 -12 80 -10 42 -9 -86 65 125 -159 18 116 -26 -8 91 40 -69 100 68 -83 52
983 52 110 -103 64 174 -171 18 158 -50 -29 206 -97 -123 190 -61 -98 134 -44 -113 127 -97 -98 191 -26
$$ packed form
816G0J05k99J96J62l59K08J82m07J06L03m00K0M36l62k64M93r2l89M67j34k92
837b50L49n2k89K85Q0l48K38R5k28J09J12j40r5K76j25n9P5m6L3M0n8Q3jj32P9
862C1Q4j11k0J79j57j33K84j53j15K58j29j61L10j18k46L29l3l07K72K15m85J75
884c1K11l31J60J99k86MK60k28K4J13j86J07J08j28j8J14r9l5J01nj12O1O5r5
908b7j4O1l7K8M1n4k4R0j12J8R3j11N6J03j29o1K20j85K9J99k26J5K36k51oK64
934B16k84NK43j86j02L01j11k81L34o6j96J53J10l01K11Q8k85J95N5j85J4J96
956A24j48k4P8rq4O3l3K1R2r0N2n1p7J51O0k84J77R8j42J8R9n1j09J69l2j51J35
983E2N8k13J67J10l45J89J40k08K1K35l03k6L13k51l7K32j78o9K40k24jK89k17
$$ plain form
1006 -26 -65 131 -39 -92 124 23 -120 48 12 -33 71 -31 -76 96 -8 -49 -14 46 -39 8 71 -38 15 39 -59
1031 -59 -27 97 -6 -52 113 -118 -16 116 -91 -61 121 -30 -147 171 5 -94 193 52 -169 144 126 -164
1053 -164 45 200 -164 5 193 -170 3 165 -70 -51 145 -47 -76 90 -16 -66 70 -101 -26 146 -98
1074 -98 -35 34 -70 -5 129 -121 -29 145 -81 -109 106 -64 -111 63 36 -130 90 23 -76 15 35 -57 -7 93 -96
1099 -96 -24 63 18 -50 80 -3 -103 102 9 -129 184 12 -105 71 65 -111 51 7 -128 104 16 -104 42 76
1123 76 -137 27 35 -113 67 39 -125 13 17 -60 51 65 -123 71 43 -109 29 64 -128 -39 140 -39 -48 93
1147 93 -32 -127 110 -9 -86 96 4 -170 72 32 -157 58 23 -129 15 58 -118 3 66 -67 -37 77 -72
1170 -72 -74 94 -46 -47 103 -79 -39 97 3 -114 53 10 -70 95 -58 -88 41 33 0 86 19 -106 130 5 -119
$$ packed form
1006b6l9J96j70n3K16j01j43J68l6m5J04j02m5J72j04m1L5O0q5M7O3j09N3K4r8
1031e9L2J24j03m6J65k31J02J32k07L0J82j51j17L18j66r9K87j41k21L13j8k90
1053a64K09J55l64J69J88l63J73J62k35J9J96j92k9J66j06n0J36j71P5J72k44
1074i8O3O9j04O5J34k50R2J74k26k8K15j70m7J74k7j66K20o7r9R1K0r2N0J00j89
1099i6P2Q7m5o8J30q3j00K05r3j38L13j72j17J76oj76J62m4j35K32q8j20J46L4
1123G6k13J64Qj48J80k8j64J38Mp7J11J4j88J94k8j52J38L5j92Q9J79j79rJ41
1147I3j25r5K37j19p7J82r2j74K42m0j89K15l5j52J44M3j76J21O3j33L0J14j49
1170g2kJ68j40jJ50j82M0J36r4j17J67m3q0J65j53l0J29ql3Q6o7j25K36j25j24
$$ plain form
1195 -119 84 30 -160 23 30 -151 59 84 -139 2 114 -111 31 81 -75 -30 104 -26 -9 74 15 -60 32 30
1219 30 -86 101 29 -119 24 17 -78 38 50 -68 -12 72 -120 28 69 -106 -21 102 -108 10 77 -98 -41 38
1243 38 -82 -30 71 -73 -52 90 -38 -53 99 -114 -71 143 -15 -96 88 -34 -72 47 8 -56 33 48 -98 15
1267 15 47 -133 4 69 -76 19 64 -106 -39 89 -59 -48 25 -88 -72 69 0 -27 29 -52 -96 51 26 -59 93
1292 93 9 -66 26 -32 -87 62 76 -127 55 80 -114 57 60 -19 62 76 -116 35 91 -109 -4 82 -100 -12 68 -50
1318 -50 -26 20 -52 -9 103 -29 -98 29 -48 -102 28 38 -96 48 69 -81 38 95 -68 12 64 -10 -8 88 -57 4
1344 4 89 -90 18 18 -58 -34 45 -54 -47 92 -56 -37 93 50 -116 48 -21 -97 104 -2 -51 74 9 -124 13 -7
1370 -7 -91 45 55 -116 71 108 -79 -20 54 -96 -26 117 -88 -29 88 -86 -53 116 -18 -76 62 -19 -62 63
$$ packed form
1195a19K03n4j90J83Pj81K10K5k23J41J12k25J42N0j56M5J34j30J7Q3n9p5R2k
1219C0j16J87p2j48J43pr5J16J2j18N6Q4j92J48M1j75Q5J23k10J18O7j75N7P9
1243C8j20N2J01j44K1J42j28j5J52k13M3K14j58q1J84j22l8J19l9o4Q9J5j46J13
1267A5L2j80J37O5j45R5M5j70O7J28j48J1P3j13J6J41o9k7N6q1m4J47k5q5J52
1292I3q4p5R2n8n5J49J4k03J82K5j94J71Lp9Q1J4j92J51N6k00J05Q6j82Q8Q0j18
1318e0K4M6p2M3J12j32o9J27p7n4J30J0j34J44K1j50J19N7j63Q0N2p4KR6j45O1
1344DQ5j79J08%p6K4P9r9PJ39j48J9J30m3j66J64o9p6K01j06m9J25o5j33J37k0
1370gq4J36J0j71J87L7j87N9P4j50P0J43k05N9J17j74L3J69j34n8J38q1m3J25
$$ plain form
1394 63 -42 -51 51 -57 -55 57 -27 -71 39 -41 -63 -6 29 -102 -13 40 -28 48 36 -81 14 86 -34 65 118 -45 -24
1421 -24 138 -19 -47 69 3 -88 110 -17 -60 74 -11 -86 49 33 -110 -8 -18 -7 48 24 -3 4 -18 -74 8 46
1447 46 -95 2 60 -120 -10 80 -53 -9 102 -56 -75 45 -19 -46 28 -3 -75 28 -16 -91 90 12 -42 40 50 -138
1473 -138 22 30 -37 43 -25 -94 35 -12 -156 20 59 -33 -10 37 -125 -59 38 -67 -60 70 2 -48 71 1 -87 41
1499 41 76 -46 15 79 -65 41 28 -12 52 27 -66 46 -18 -101 74 -27 -89 33 22 -70 -16 18 -42 7 78 -51
1525 -51 -57 106 -48 -65 152 -58 -130 56 49 -119 80 51 -58 75 42 -25 -8 32 -25 52 30 -33 51 -3 -19 38 42
1552 42 -51 44 17 -113 -10 81 -79 -93 39 13 -59 98 -45 -67 122 27 -88 27 58 -88 31 63 -66 2
1576 2 58 -38 7 -16 -30 3 -28 -104 19 -21 -46 58 5 -90 100 90 -98 -22 48 -46 -49 81 -57 -84 56 16 -77 77
$$ packed form
1394F3j05rJ02j08KJ12q4m4J10q0k2N7L5j31Q9N3o8P6j2j17R5P2j20R9N3j63K1
1421b4J62j57k8J16o6r1J98j27m3J34q5p5J35j6j43J02j0J1N5k4k7Pk2n6Q2L8
1447D6j41R7N8j80J10R0j33M4J11j58j9J20o4k7P4l1p2J03m4p5J81p8n4Q2J0j88
1473a38J60Qo7Q0o8o9J29m7j44J76L9r2K3M7j62O6R7j05PJ30o8n0J19p0q8J28
1499D1L5j22O1O4j44J06j3m0O4k5r3J12o4q3J75j01o2J22j1r2N4L4o0M9P1j29
1525e1oJ63j54j7K17k10p2J86pj68J99k9j09J33l3o7J7M0n7P7k2o3Q4n4j6N7M
1552D2r3R5k7j30J03R1j60j4J32k6p2J57j43k2J89r5j15J15L1j46J19L2j29O8
1576BN6r6M5k3j4L3l1p6J23m0k5J04n3r5J90j0j88P6P0r4lJ30j38k7J40m0r3J54
$$ plain form
1604 77 17 -79 1 94 -61 -25 28 -8 -54 -25 20 -5 9 10 -11 9 32 15 -6 -74 46 20 -89 -24 43 -125 15 96
1632 96 -112 -15 94 -3 -115 108 -33 -103 52 38 -103 21 80 -82 -9 86 -9 -86 64 0 -9 12 -104 0 -33
1657 -33 -49 2 37 -48 81 59 -103 75 29 -11 -20 83 -83 -56 102 -14 -83 71 46 -117 14 61 -80 -16 59
1682 59 -11 -61 34 -1 -23 6 52 -59 -41 -12 2 5 -65 21 14 -68 2 59 -68 -1 138 -78 -14 129 -66 3 85 25
1710 25 -102 49 50 -105 -16 57 -59 -28 44 -46 -96 35 3 -69 23 41 -32 -20 11 -12 -2 -67 41 22 -41 -10 77 -5
1738 -5 39 92 -69 -26 100 -16 -127 98 47 -124 36 62 -96 -36 44 -50 -45 64 -13 -120 -41 18 -17 12 59 -23
1764 -23 -9 21 42 16 -42 22 28 -69 49 55 -53 -31 87 -53 -75 113 -27 -69 72 51 -73 118 107 -67 -8 55
1790 55 -39 -57 80 34 10 27 72 -63 8 -5 -19 -71 28 66 -43 -2 31 25 -44 -1 56 -73 -17 120 7 -94 114
$$ packed form
1604G7o0r6Q0R3j55L6N3l6m6K9M5k5J4Jk1K0K3j7k1o8J20k6j09O5O7j68J40Q1
1632I6k08R7J09r7j12K23j41p0J55j4j41J24N9j62P3R5r5p7J50o4rK1j16J04l3
1657c3j6N1L5q5J29k2j62J78m6m0rJ03j66K7J58j16o9J54k5j63J31M7j41O4P5
1682E9p0n0R5l5k2K9M6j11J8K9J4Lp0Q6pq2P0N7j27O7J39k16O4J43j95O9Q2o0
1710B5j27J51Jj55Q9P3j16L1P2r0n0J31l2p2R2J8p3J2L1k3J0o5J08j9o3L1Q7q2
1738eM4N3j61M3J26j16j11K25n1j71J60K6j58O0Q0r4NJ09p7j07P9N9l5K9M7q2
1764b3J4L0K1k6n8O4Or7J18Oj08K2J18j40k2J88j40m2J41k1j24J91j1j74N9O3
1790E5r4j8J37m6k4J7M5j35P1j3j4n2R9L8j09M1L3oo9M3N7j29N6J37j13j01K08
$$ plain form
1817 114 -33 -109 50 39 -74 18 27 -77 -49 42 -14 -86 84 -13 -57 -17 63 -20 -43 40 95 34 -50 -11 -15 -35 40 3
1845 3 -81 -49 50 -34 -73 39 -31 -59 55 -5 -153 -31 101 -39 -17 131 -44 -41 69 -9 -36 87 66 -44 47 35
1871 35 -41 37 11 39 19 -20 14 -6 -82 -19 64 -79 -10 68 -31 -45 97 -8 -51 90 74 -64 5 110 -113 -22 119
1898 119 -81 -47 61 -1 -16 10 105 32 11 -67 -1 -14 -31 29 28 -25 61 26 -11 18 63 -83 -43 68 -10 -58 57 66
1926 66 -124 11 79 -123 -25 45 -68 -36 82 6 -59 44 -4 -36 14 1 -14 -35 11 3 -3 -17 35 -27 -61 21 31 -16
1954 -16 18 92 -16 -56 51 31 -69 73 -4 -52 33 23 -142 -24 74 -25 -14 100 7 -99 28 5 -43 -13 36 -36
1980 -36 -39 43 17 3 -27 28 -6 -73 -12 21 -7 24 34 8 -69 22 37 -81 1 15 -37 10 46 -58 -25 39 -10 -52 59
2009 59 -28 -21 16 6 -64 16 50 -31 3 -14 -15 8 -30 11 60 -1 12 13 0 55 49 17 -62 46 -17 -97 -5 33 -55 -33 70
$$ packed form
1817A14j47p6J59j1j13R2Rj04K8R1n6p2J70r7m4M0Q0q3k3Q3N5o1q4L9mk0P5l7
1845Cq4L2R9q4l9J12p0k8J14o0j48J22J32j40K2J48j75LJ10p8k7J23k1j10R1j2
1871C5p6P8k6K8k0l9L4k0p6O3Q3j43O9P8r9j4J42j05m3J41j6j38O9J05k23R1J41
1898A19k00L4J08o2j5K6R5p3k1p8O6j3j7O0jn3Q6l5l7K9M5j46M0J11p8m8J15R
1926F6j90J35O8k02R8P0j13L2J18p6o5J03m8l2N0j3j5k1M6qoj4N2o2l4Q2J0m7
1954a6L4P4j08m0J07k0j00J42p7m8Q5j0j65J18R8r9J1J14r3j06J27k3m8L0M9p2
1980c6lQ2k6j4l0N5l4o7O1L3k8L1J0k6p7R1J5j18Q2J4n2M7L6j04L3O4m9m2J11
2009E9q7PL7j0p0Q0L4q1L4j7jK3l8M1M9o1J3Jj3N5ol2p9J08o3q0R2L8q8K2J03
$$ plain form
2040 70 -70 -24 81 -22 -27 8 -8 -53 -9 22 -5 5 -27 -23 -2 -17 24 45 24 31 -34 -14 -17 89 28 19 37 20 -22 66 79
2071 79 -58 26 45 -70 -22 89 -43 -17 14 26 -81 76 3 -93 4 11 -74 -8 25 -38 14 -3 17 36 2 19 15 25
2099 25 -77 48 39 -29 72 60 -30 2 112 -23 -8 80 -39 -40 56 4 -32 45 -14 -52 16 20 0 25 1 -108 -6 -4
2127 -4 -8 54 -65 7 3 22 5 27 13 -54 64 21 -51 8 52 -12 34 83 -9 -24 70 -49 -56 59 11 23 -7 6 -63 12
2157 12 84 -23 4 31 -6 -19 7 -80 22 17 -37 53 -45 -44 32 -40 -41 78 -20 -42 50 88 -33 -31 59 -86 39 23 12
2186 12 -32 23 22 9 50 -15 -26 6 -32 -52 -4 -50 -19 -59 -10 -44 5 -10 -41 -37 1 -46 -18 -3 -70 4 31 -56 5 49 -28
2217 -28 -19 55 -1 -31 11 -28 -7 48 -17 -63 17 -10 9 55 24 -49 22 35 -71 8 -5 -15 -46 16 -41 24 -1 -27 -18 -7 -35
2248 -35 0 6 -23 3 16 -16 -87 58 6 -5 48 2 48 42 13 -26 4 -7 -30 20 40 -13 -15 -3 -19 28 -4 -44 -20 28 -2
$$ packed form
2040G0j40M6J05j03nL5j6m5M4L1k7J0l2MK1j5M1K1k1Po5K0lJ06o1rJ8j7m2Q8J3
2071G9j37Q4J9j15M8J11j32K6L1J2j07J57p3r6R7Pq5O6L3o3N2j7K0J9l4J7mJ0
2099B5j02J25ro8J01j2r0L2J10j35J5Q8j19jR6n2l6P7n9l8O8Mk0K5k4j09J02K
2127dmO2j19P2mJ9j7K2j4o7J18m3p2N9M4o4M6M9r2j5R4j19pJ15m8J2l0J3o9P5
2157A2P2j07K7K7l7j3K6q7J02nn4R0r8JP6p2jJ19r8k2R2L8j21KR0j45J25j6j1
2186A2m4N5jj3M1o5j1L2l8k0M8m6L1m0M9l4M9j5l1ML8m7K8J5o7P4K7q7O1M4p7
2217b8RP4n6l0M2l9K1N5o5m6Q0k7J9M6l1p3P1J3j06P9j3j0l1O2n7O5k5k6RJ1k8
2248c5L5Ok9K6J3l2p1J45n2j1N3m6M6ok9l9L0j1k3N0K0n3kJ2j6M7l2m0K4M8l0
$$ plain form
2279 -2 -26 24 -33 -53 7 -16 39 -12 -17 -23 41 -8 -17 33 -17 -24 13 -23 4 6 29 -35 10 -37 7 24 37 -12 -1 38 -23 27 9
2312 9 -1 -45 36 -14 -19 25 -34 1 33 -22 -20 4 -40 -62 32 -19 8 -4 31 -78 9 -26 7 43 3 -14 50 31 -5 36 50
2343 50 33 -17 66 27 34 41 13 -10 9 11 -29 39 -43 4 54 18 21 68 -8 7 53 -65 -42 40 12 -69 -5 -52 -31 73 -4
2374 -4 -14 -4 59 -17 46 4 -58 -7 34 3 -7 117 -13 12 43 -24 -13 29 -10 35 -22 -39 10 -1 -42 -3 -16 20 -16 23
2404 23 -29 -19 -29 -30 -1 -10 -77 -33 31 2 13 3 16 -43 6 -26 -20 35 -13 -9 -19 6 17 -60 1 -34 20 34 -28 -48 -27 -19 35
2437 35 28 48 -52 19 17 -55 14 -1 5 51 -19 -23 23 17 7 15 54 -53 -7 32 -29 -21 16 -47 18 80 -10 -9 37 5 9 73 -23 -20
2471 -20 55 22 -12 1 -15 -59 20 11 -41 -29 23 -2 -20 -4 -34 -12 -9 -12 25 25 -53 5 -12 7 7 -7 -6 -4 23 -16 15 13 -31 -19
2505 -19 42 33 -82 38 -3 -40 36 -30 -8 16 25 -36 44 24 -11 -15 -13 -79 21 36 -26 -22 33 -48 -64 11 -21 -7 58 13 -6
$$ packed form
2279bk4N0n7k0O0k3N5n1noO4m9rN0n0pL7l6K7KK3o4M5m7M4J7J3m9J1L9o1N0j8
2312Ij0m4Q1n0nM4n9L5L2n5KK4m4k2R4n1K7j2L5j09Q7l5L3L6m0j7O4j9l6M1J4
2343E0j7n0Q3l9PPk8k3J9Km0O8q2M7N0l6LM7p6J5M6j18K3Q2k8q1O4m7K1J04p7
2374dj0J0O3p6O3m2o2N1M1l1j0J24j30K5L1o7J1M2l9M5n7j7M9j1m1L9j3L6l6L9
2404B3n2J0j0jK9ro7M4O4k9J1j0J3n9M9l2ON5m8Mj0K5J1p7O1l5N4J4o2k0K1QN4
2437C5pK0j00P1kp2O9j5OM6p0mM6oj0QL9j07M6L9o1QL7o3O5O2r0JM6l2MO4r6L
2471b0P5l3l4J3j6m4P9rn2J2N2k5j8J6l0K2LlL7%p8N8j7J9%j4JKK7l9L1km4J2
2505a9O1rj15J20m1l7P6o6K2K4Ro1Q0k0l5mKo6J00J5o2MN5q1j6P5l2J4O5m5j9
$$ plain form
2536 -6 42 42 -19 -35 1 -8 -6 5 -32 11 -11 -55 55 -17 -19 16 0 -17 2 25 -37 52 40 -54 14 8 -41 -21 17 27 -11 -15 -28
2569 -28 11 41 -35 -22 0 -44 -45 22 -2 49 12 -24 -4 28 19 -6 46 -1 -1 71 -23 -27 1 0 -54 74 -22 -48 -26 40 5 -26
2601 -26 2 26 -11 35 -59 -52 46 -32 -53 60 -62 -29 20 -1 5 4 -19 -2 0 -43 -5 -10 25 -11 47 -24 -39 15 29 -6 33 47
2633 47 -37 -11 11 -2 61 18 -33 -13 55 -3 -47 58 -38 -20 -32 -29 -48 5 -2 -64 7 -3 -9 83 49 -15 -14 46 -58 19 -1
2664 -1 -31 -13 69 -15 4 85 13 -23 -4 -40 -23 -9 7 23 33 -69 -13 16 -27 -23 -22 9 -1 -33 -33 -65 46 -27 -27 -22 -8 -23
2696 -23 1 40 -42 9 8 -12 -28 80 -27 -12 -16 -2 5 69 13 44 70 0 -15 -6 -42 -20 23 -17 -55 23 -19 2 -50 -12 -43
2727 -43 30 47 -29 24 54 -4 -31 29 8 -21 18 -4 -14 -10 5 12 21 35 31 23 -1 2 3 40 -3 21 0 -19 27 -58 12 32 -13 23
2761 23 48 9 -45 67 -12 -41 9 7 -51 -20 24 -20 17 -17 -30 1 -24 20 -49 -3 -33 -8 9 -26 -11 -11 -80 4 51 21 -29
$$ packed form
2536fM8%o1j6L6rKJ1l7M3k2m4J10p2kL5j6j7J9K3o2Q9j2r4O8om9K0L8J0l8mj3
2569b8L9L0p6J3K2m4jO7k4N1l7l6K0L2rk5N2m7%P2r4mK8jn4J28r6k6K2O6l5l1
2601b6K8K4l7M6r4PR8p8k1J13j22L3M9k1Ojk3J7Km3L8nL5l6N8p1j5N4J4l5L9J4
2633D7q4K6K2j3O3m3n1K0O8n8m4J05r6J8j2Lj9N3po2P1j0oR2l4o4JO0j04P7k0
2664al0J8Q2q4J9Q1p2l6J9l6J7J4J6J6J0j02N6K9m3MJL1j0l2%l2J11p3%NJ4j5
2696b3K4L9q2N1jk0j6J08j07J5mJ4PO4n6L1K6p0j5Rl6K2M3m0l8P8m2K1n2L8l1
2727d3P3J7p6N3L0n8k7O0k1k9L9k2j0MJ5PRJ4mqk4LJL7m3K4k1j9M6q5P0K0m5L6
2761B3K5l9n4J12p9k9N0kn8L1M4m4L7l4j3L1k5M4o9M6l0K5J7l5J5%o9Q4M7l0n0
$$ plain form
2792 -29 -3 22 12 -2 26 1 -22 -42 -17 11 7 -44 -47 23 -61 15 -48 -13 -30 55 2 33 22 -60 -20 39 -16 -1 43 -43 9
2823 9 -35 -9 -5 18 -1 -45 21 -19 34 19 9 33 -65 21 1 -12 53 36 -39 27 -25 -9 -24 -29 -15 3 31 16 29 16 5 59
2855 59 16 -3 3 -14 -29 7 20 -9 53 3 -30 74 76 -18 26 24 -8 23 47 -17 -11 -1 -6 -7 34 -8 -19 3 -48 -16 -17 -60 -36
2888 -36 62 -23 -2 11 4 -47 28 5 -27 53 10 -8 30 45 -9 67 24 -17 18 19 -39 7 -8 -18 -31 -25 3 -13 31 -46 18 48
2920 48 -3 7 31 -11 -17 64 -25 -46 -49 4 4 17 -4 27 18 -29 -64 -19 4 -6 31 26 4 36 15 7 11 54 -42 16 4 20 -11 0
2954 0 4 -5 -36 1 -43 -1 -29 -64 45 -5 -8 6 -20 -28 -33 -20 -54 3 -45 -67 0 13 -34 42 22 -13 -2 -50 1 -16 47 34 24
2987 24 -31 7 -29 13 -41 39 94 49 -65 27 -99 -41 7 -29 -4 -17 42 -50 58 31 -15 33 5 -5 -32 15 15 -27 17
3016 17 -52 -27 24 15 41 15 -26 4 22 -6 -6 30 -32 -8 28 4 -11 6 -15 -42 26 12 -2 -14 20 -23 6 -25 -3 45 5
$$ packed form
2792b9K6K5j0j4K8k5k3k0K5K8mn1lP0q4P6o3L5j7Q5n3L1j1q2M0N9n5J5M4q6N2
2823Im4K6MK3j9m4O6m0N3j5j0K4r8Q6k0j3O5j7p5O6n2J6j5nJ4J8K8j5J3j3j1N4
2855E9m3j9Oj7j5L6J3k9O2n0l3J04Kr4M4kl2L1K4o4OJ0njM1m2j1K2n1L2jm3K4
2888c6R8q5K1J3pn1P5k3l2Q0m3j8L8J5n4P6m3m1L5Jn8M6j5j0j3OK8j6M4p7O4L0
2920D8n1J0K4m2oQ1q9k1lN3%J3k1L1rm7l5M5K3j0L7nk2L2k1qMM3r6N8j2J6l1J1
2954@Mrl1L7m4M2k8l5J09n0lJ4k6qnJ3l4N7m8k2O7J3m7P6k0l5J1m8N1j7O3j3j0
2987B4n5L8l6M2n4Q0N5m5j14R2j26N8M8l6K5j3N9r2J08k7m6M8k8j0k7M7%m2M4
3016A7o9K5N1rK6k6m1L0J8k8%L6o2K4L6k4j5J7k1k7O8j4j4j2L4m3K9l1K2M8m0
$$ plain form
3047 5 4 -24 -1 -3 -92 2 -28 -30 9 -56 -31 17 -47 12 54 18 21 70 35 -1 4 -34 16 47 -45 -45 28 29 7 -5 27 -10 -18 38 -23
3082 -23 7 -2 -20 4 33 -15 1 24 0 3 29 10 31 3 -42 -36 23 -14 -12 -14 -17 -32 82 3 6 23 -6 -37 34 19 16 -3 -9 -31
3116 -31 8 55 -15 18 18 -16 -32 -8 -5 -32 16 22 -8 21 2 1 58 -31 -25 -23 7 -20 1 -12 -52 -16 3 -60 -21 -14 -55 61 23
3149 23 3 -11 18 5 24 7 -31 -38 53 10 -17 -29 -42 -17 19 0 -23 8 4 -48 32 -8 -33 27 8 -16 8 9 -56 1 54 -61
3181 -61 45 -72 -9 23 -5 26 46 0 -18 27 26 -3 15 21 -79 -15 9 -12 -23 -3 -6 -24 17 -68 -6 4 20 -28 41 -36
3211 -36 -59 51 -12 -41 40 18 -4 10 10 -32 7 -57 -31 24 85 9 -18 59 -33 2 86 12 -42 93 -9 -4 27 -8 61 61
3241 61 14 19 7 -4 -29 12 18 -25 -11 21 -44 56 30 -9 6 -22 -4 -32 42 2 -11 -27 2 28 16 -20 27 -5 30 -7 28
3272 28 29 -18 64 23 -46 35 -15 6 12 -62 -24 75 -4 13 -23 -15 -13 -21 34 -57 0 8 -35 -13 -9 1 10 29 -6 -21 19 -47 15 -38
$$ packed form
3047Ejk8K3kq9R4l0kL9o5K5M8o4N9M2l6LM9l5l6Nl8N0L1r2%P3Jk2j2L2l7qN6o1
3082b3L0rj8K4K9m8J6K3k4LK6j9K1k8m5ON9l7Kklj5J14p9LJ7k9l1P1j5lj9ok2
3116c1L9M7p0L3%l4j6K4Lk7M8Ol0K9j9jN7q9OKL0k7K1j3m0L6J9o3L9Pm1J16l8
3149B3k0j4K9j3J9j7l8pR1m3k7j2j3K5L6j9k3L1mn2Q0m0k5O0j9k4K4Jo5N7N3j15
3181f1J06j17O3L2k8L1K0m6j8M5jk9J8Oj00O4K4k1j1K0lj8M1q5O2J0J6m8O9p7
3211c6k3J10o3k9Q1k2k2J4%m2L9o4K6N5O1p6k7P7r2L5Q4p4n4J35j02NL1l5O9%
3241F1m7Nj2j1k5M1Om3J4L2o5J00k6l9J5k8J8k8P4m0j3j6K9K6j2l6M7l2L5l7L5
3272B8Jm7Q2m1o9Q1n0K1Op4L8R9p9J7l6QKqN5r1N7Qm3K2MJ0RJ9l5j5M0o6O2n3
$$ plain form
3306 -38 -45 16 3 30 25 12 14 27 47 -1 7 24 59 -47 43 -1 -24 -3 -23 -14 32 3 -40 -62 -24 -13 1 18 -26 -14 30 -33
3338 -33 0 22 -9 26 44 26 -15 30 -32 -23 34 -7 -25 -14 16 8 48 13 -29 27 49 -8 -27 5 -7 36 -12 -70 10 -28 -16
3369 -16 -15 79 -39 -8 24 1 -40 21 -16 -7 23 -24 -1 17 -8 -37 55 23 -42 80 -13 -11 1 -6 -20 -52 16 -4 21 31 -42
3400 -42 -30 18 -17 -30 16 4 64 -23 -26 -45 -15 -42 -40 13 -28 -48 19 1 10 17 4 10 -28 -2 -24 72 31 -23 0 -8 -74 69 68
3433 68 -31 42 50 21 0 18 -63 -17 -33 -80 51 29 -30 31 -13 -4 13 -3 6 2 1 15 11 34 -14 36 -13 -19 -16 -8 -2 -17 -45 87
3467 87 10 -13 -13 0 9 49 -29 -9 26 17 42 50 44 -8 -31 -6 -35 68 44 -18 -17 24 -31 -5 -2 -30 15 -6 -32 -44 45 -63 -64
3500 -64 -13 19 -9 -18 -1 -43 62 26 6 43 -4 26 44 -5 0 48 1 -41 -24 -5 -25 58 -17 -30 42 -11 -8 10 18 -109 -27
3531 -27 -12 -47 -23 27 -45 -42 44 -30 35 39 -35 0 58 0 -51 -1 -75 -7 92 -21 -34 27 13 -64 41 -60 37 20 23 -16
$$ packed form
3306c8pO1j3K7nj3KJ3K0m8QJ7L5j06R0m4k3K1k0RM6k9m3k2L8J1J4J7m4J2M4o3
3338c3L3K2l1L5J8j8m1M5o2RN7m1j8J1L0qM0l5m2N6K2n7j9L2j2M3m8n8Q0l8J2
3369a6JR4j18L1L2k3m1O1l7RL0m7K3J8k5k9R2l2o5J22r3KJ2pj4l2O8k0K5J0p3
3400d2J2M8l5j3M6j2O0q7lj9L0k7KN3m1k0O7j8RPj3Ol8K6k2R6m1n4K3qo6J43j
3433F8r9P3Qk9k1J8q1M6j6m7J31k2n9O1m4RJ7j6RmjJ4mK3m8N0m9oLQOj5k8J32
3467H7p7k3%J3RM0p8K0L5rK5Qon2k3K5k9J03k4o2JM1n5K6Lk8M5k1k6j2Q9j08j
3500f4N1L2k8rJ7m2J05l6k0L7m7L0J8m9NM8m7m2J7J9k0Q3p5j3P2n3LJ8Qj27Q2
3531b7J5l5K4N0p2LQ6p4O5Mp4L5N8n8n1N0p4O8R9j13j3O1j4p7J05j01R7j7Ll9
$$ plain form
3561 -16 -25 1 10 -20 -9 -9 41 35 -28 -20 -19 -14 -28 -8 -55 27 -2 3 -45 19 18 18 5 -14 -1 0 -10 -43 -7 -22 -42 27 8 -48 -20 23
3597 23 5 82 -5 -12 25 -33 -29 8 -36 13 36 29 -49 13 6 -78 -8 23 -36 -65 18 18 -38 19 -41 -16 9 -23 30 30 11 12 45 24
3631 24 -30 -56 -6 35 -6 18 -5 19 81 0 19 -56 -7 -18 -26 -3 -35 15 3 -27 45 9 -21 6 -38 -7 -20 -70 -74 -7 54
3662 54 6 10 32 -25 -14 -38 5 81 -16 -3 23 29 -7 20 14 60 12 -19 35 42 20 -13 -9 -4 -40 -8 43 -56 -13 2 5 -1 -30 -15
3696 -15 -22 21 -30 -16 20 -26 -3 29 -24 7 16 80 -13 -8 -19 -23 47 32 4 62 55 -18 -7 59 9 -17 38 25 -28 -38 -1 -7 -47
3729 -47 4 4 11 -39 52 -11 -46 -8 -13 30 -10 14 33 13 17 -18 -34 36 21 5 21 72 -13 4 42 5 -14 -8 45 -16 37 11 6
3762 6 37 -15 -31 51 -23 -72 -22 14 -32 -12 13 1 15 -52 -72 -22 1 7 -58 17 11 8 16 46 19 -40 -21 -24 -42 6 -34 -10 -14 -19
3796 -19 38 36 -35 -4 -3 29 -2 -15 -34 32 26 7 27 -12 -7 18 -27 -59 -57 -45 -57 12 13 -56 23 -8 -12 3 -2 9 25 68 13 43
$$ packed form
3561a6rK6Rl0J1%N0oo3QJNj4K0m7Q2k9Nm8O4j%j3j9J3Jj0l3L6j5k0O9j9n6K8M3
3597B3j8P7q7pL7n8ML7m4M9K3pp8O2pq4P0L1n9k9Q3%n6N7o0K5K5l2N3%j9JL3k1
3631B4n4k6N0M1m1K4k3K4O2q1J9p5M9j1qK3l2N0j2l0P2l6l0K7m4L1j3n0mO7O1
3662E4m8MK2n7J1k4M3P6r7J3K6Ol6K7oM6m8l1N4Pk2l3MNl6L2N1r9M3J5Lok9J5
3696a5pM3n1J4L6m6K3L2n3L1RO4r3Nj1mP0j5k8N8pp3J1O6n0k6N5j3n3j0L7om0
3729d7N1%Pn0R1o3l5L8nM3m0K4J9k0Ml5j6P0j5j6J6N1q5J7L8l7j9ON3o1N3k6n
3762FL1n2j6Q2p4m9N0L6m6K0K5j2J4o7k0N0K3Oo5P5olQL0k7n9J9lj8M8m0K4mn
3796a9N7kp1L1JL2l1j3j9O6oj9K0l9NK5m5l2KJ2j2O9Jo9P9l1mJ5nJ1J6M3n5L0
$$ plain form
3830 43 30 1 33 37 -11 31 27 -24 -10 -4 0 8 6 -22 30 20 -23 -5 -32 -44 -36 -49 -20 -12 -17 40 -48 18 -20 40 -12 81 -7 39 15
3865 15 -22 25 28 4 -6 0 46 5 21 34 -14 12 -34 -11 -12 -2 13 17 -27 -27 3 39 3 -17 -30 -89 6 25 -3 8 16 21 4 29
3899 29 23 -76 48 -55 -8 41 -32 40 48 13 -1 5 -36 -45 44 7 -4 15 20 -4 47 -25 -77 -21 -19 -5 -23 2 24 23 21 -29 -12
3932 -12 3 -62 -8 -37 12 22 -63 -34 9 42 -56 49 -16 8 10 5 -4 -49 24 -11 17 48 -13 -6 40 -20 -5 -1 2 -32 -14 -17 9
3965 9 -29 38 -40 12 -10 2 -17 -21 -17 -41 6 -18 -7 -28 -61 0 2 -24 12 50 22 48 18 24 -12 -49 35 46 -32 78 -13 5
3997 5 -2 -38 15 -10 -12 0 9 5 -62 13 -19 -2 97 -49 -53 13 -24 -19 -52 -26 -54 13 30 0 12 31 -36 -10 -26 -77 -32 16 -11
4030 -11 50 20 -5 25 49 -42 44 61 18 29 12 -1 20 47 -42 -27 -44 15 12 22 -27 -77 -21 -11 -36 32 -57 -16 36 -29 53
4061 53 -65 27 -97 -16 39 -2 46 22 -32 -16 5 -21 60 46 27 -6 23 20 29 16 -25 -5 52 -49 -29 7 11 -52 23 44
$$ packed form
3830D3j3k9L2Mm8M2mn1J4OMQkk8N2j0m3J8k7j2Qj3K9QnN7q8O6l8O0n2R3q8M6k4
3865A5l7M7Lk4j0OM6m1J6J3m8K6m6K3jJ0J5Mm4%L0L6l6k0j3n9R5J9k8J1QNj7K5
3899B9or9J24j03M7M9p3P2Ql5j4Om1rQ9l7j1J9Nk4N1p2n2N6KJ4j8K5K2jkn0J7
3932a2J5o5N4k9M9J0q5K9M3L3r8J05o5K4Knrm5P3l5K8L1o1PM6o0J5MLl4J8lK6
3965Il8O7p8N2k2J2j9mMk4M7k4J1k1l3O1Kk6L6L8k8K6l0Ol6l7Q4J1p8J10r1J8
3997Epl6N3k5kJ2Rmo7P5l2J7R9j46mO6l7Nl3K6k8O7J7l0J2J9o7K6j6n1M5M8k7
4030a1O1l0k5L0K4r1Q6J7m3J1j7j3K1K7q9J5j7N9lJ0m9n0N6J0k5O8q9M1N2o5Q2
4061E3j18R2j24Q1N5m1M8k4n4J6K1k6Q1j4j9l3K9lRj3m1K0N7j01K0L6Mo3P5K1
$$ plain form
4091 44 -44 -34 10 -12 44 29 -4 26 49 -23 -44 -35 2 8 27 -8 4 40 -20 25 42 2 -4 40 -22 -6 58 3 -40 10 40 -14
4123 -14 -4 -8 39 20 -45 -11 3 2 -9 48 26 20 6 -26 -30 -31 -26 -62 -26 6 -45 15 24 -37 -21 18 30 32 -11 23 7 -8 14 22 23
4158 23 -8 40 1 21 2 -2 -26 -13 40 24 -94 -5 -12 -4 -14 39 19 -10 13 -31 5 -85 -13 7 13 -62 15 -32 0 -30 -10 -9
4190 -9 10 73 53 17 33 27 39 48 45 0 -15 2 35 28 6 -17 -57 -18 -56 -32 2 -51 28 -6 5 -38 23 4 -25 -5 5 -36 -16
4223 -16 -22 -29 15 -69 -11 -48 8 55 66 -13 -8 23 76 3 32 2 1 -16 19 6 -28 27 -88 30 10 -46 -26 17 -33 19 -20
4254 -20 -5 -29 12 -6 -80 69 -7 25 4 -32 31 21 33 -26 33 3 -19 -13 23 -24 -6 20 -20 -16 44 2 32 76 -49 14
4284 14 46 -5 -29 -7 -22 -57 -7 -13 -25 -39 9 -10 -32 -17 -52 9 -51 -46 16 -23 -28 -28 -35 36 17 -49 -17 25 1 -60 13 20 -51
4317 -51 32 51 -19 -28 40 -16 -6 3 -5 -16 -47 -27 -15 2 -34 3 -36 8 7 -38 14 -27 -32 -13 7 -9 -14 -11 8 2 -37 21 35 -44
$$ packed form
4091D4q8J0M4k2N6j5l3L0K3p2k1RL7OJ9l5J2L6o0M5J7m0oM4o2J6O4n5m3N0L0n4
4123a4J0mM7j9o5L4J4jj1N7k2oj4l2mjNl6L6L2n1O0Ro1J6L9J2Km3L4j6j5K2QJ
4158B3l1M8l9K0j9mk4J3N3j6j18Q9pQj0N3k0k9K3m4L6r0P2K0Op5P7m7L2l0K0J
4190iJ9O3k0l6J6oJ2Rlm5j5J7L3pk2k3m0L9l8K4L4n3P9l4J1m3O1j9k9K0J0m1K0
4223a6opM4q4N8l7N6M7J1p9NL1N3p3K9l0jj7L5j3l4N5j15J18k0n6K0M3n0N2l9
4254b0J5k4M1j8p4J49p6L2k1l6O3j0J2n9N9l0k2OL6m7J8K6m0MO0m2L0M4j25O3
4284A4L2n1k4K2j5l5N0oj2j4M8j9k2J5l5O1o0NO2l9n%pP1j9o6L2M2k4o1P3Pp1
4317e1Q3J9p0rO8n6J0Rqj1l1K0J2J7l6L7l9M4jm5N2m1nJ9K0j6nLJ9ol9N8J4p9
$$ plain form
4351 -44 7 11 -23 -13 20 -17 24 22 12 44 51 30 -30 32 6 -9 27 12 13 -24 0 -41 -6 -10 -19 19 32 -13 15 7 -29 -12 -4 -3 30
4386 30 30 -24 -11 54 8 9 45 27 -4 11 -29 -17 37 -28 21 6 24 -22 -7 -19 4 -13 12 3 32 6 18 36 46 18 59 -36
4418 -36 -13 12 -25 30 5 22 -39 -6 26 1 -5 -11 26 16 38 -8 12 23 34 -27 -36 17 48 18 57 -1 4 -31 42 58 -2 16
4450 16 30 5 -1 13 -27 -36 -7 -15 -41 46 -21 -26 73 -25 6 -33 12 11 11 0 16 -28 25 31 -52 -23 42 -5 43 28 -76 46 18
4483 18 -47 -24 16 -27 -36 66 -62 -28 27 -26 -49 -24 -20 -2 18 39 -24 -11 27 -2 17 -13 3 -4 2 -9 -15 -49 -66 22 -26 -63
4515 -63 41 -35 -1 35 24 39 -27 -15 -26 5 -49 7 -7 2 -7 14 15 -20 21 -22 -9 -14 11 -52 2 32 -8 -14 50 -5 -13 -25 0
4548 0 -18 28 3 -54 -8 33 61 38 -30 -9 -1 28 -22 58 -4 -31 27 24 -16 -5 37 -3 20 -39 -47 -10 -21 -12 -42 9 10 29 22 0
4582 0 -27 -55 -36 -33 15 1 -6 26 -38 20 -2 21 6 30 1 -25 42 31 -14 -29 23 -34 13 23 -3 25 7 33 5 0 -37 -14
$$ packed form
4351d4N1Ml4J0L3l7M1kj0L2Pk1o0O2k6j5L6j5Jl7K4m1L5mrL8J3m5K8ql6J7QJL3
4386C0%n4J3O5m6JL6j8l1J5m0J2N4o5M9j5J8m6J5j2K3j7K5rK9k6J2J8J0k8M1r5
4418c6K3K5l7N5k5J7o1L3L2k5ooL7j0K2m6K0J1J1o1rN3L1l0L9n8Nl5P3J6o0J8
4450A6J4k5oJ4m0rK9qk6Q7o7nR9r8L1l9M5j%j1J6m4N3Oq3K9O5m7M8j5j04J22k8
4483A8o5K3M0m3rJ02j28L4N5n3k3K5MJ8K0K1o3J3L8k9J9l0J6pOj1ol4j7Q8m8l7
4515f3J04p6L4L6j1J5o6J2j1L1n4N6j4RrK1Jl5M1m3J3nK5o3N4L0m0oO4n5qj2K5
4548@j8M6k5n7M6M1K8k3o8K1QK9n0Q0o2k7N8lm0J1M2m0K3n9qL7j1Rl0N1JJ9pk2
4582@k7k8J9LM8j4pL2o4N8k2K3j5K4k9k6O7j1m5j5N2n7M7J0k6K8j8K6k8nl7K3
$$ plain form
4614 -14 27 -57 -31 43 29 -7 -5 23 -4 5 -27 -8 27 19 -15 46 12 30 43 3 -21 -1 26 -21 -20 27 20 -3 -8 -41 -45 -3 18 14
4648 14 0 33 0 4 12 14 -23 23 -44 23 27 -25 21 -64 -9 18 24 -24 21 -28 -23 24 40 2 34 0 22 -14 -1 5 33 32 -27 -28 54
4683 54 31 -87 23 -34 -40 -9 -31 -39 7 38 -3 -1 -5 51 -19 -17 -58 -16 27 -43 2 6 -42 -14 -17 15 -48 -10 -41 23 29 -9 18
4716 18 65 8 -5 -11 10 1 -20 -23 17 -18 34 -16 -18 -9 4 -27 19 -6 -15 4 -36 -11 -23 -10 48 22 21 0 -16 8 12 -45 -34 -15
4750 -15 62 -12 28 30 -8 24 29 -45 -27 51 -51 -10 -28 49 -55 41 9 -1 10 -7 -9 13 41 7 -4 -2 -41 44 -2 -73 34
4781 34 6 1 -17 7 -20 5 34 2 -19 30 -6 40 80 -12 -9 45 -16 16 55 10 21 22 -14 11 38 -51 -57 32 28 -7 -13 -30 -3
4814 -3 -31 -39 -38 -13 -46 -8 -37 -17 -18 33 -36 -8 -10 -11 -32 -27 24 -41 -3 -11 22 36 -17 -17 23 27 39 -56 11 -4 -50 -3 15 10 -9 -2
4850 -2 4 -40 10 -26 -23 -56 -25 7 34 24 -17 -19 -4 1 8 -16 -32 20 7 -19 39 -37 16 84 53 -7 7 14 51 4 18 10 42 74
$$ packed form
4614a4M1q4K6P4j4l6KK8k7Rl2J9L5ql4O1l4J8J3m0k4K0K7m7JM7pk3nl3mM2K1m
4648A4j4L3l3MQKl7M6o7O7Mn2M6q5N5K7Om8M5m9NM7J6l8L2l4K2l6J3OK8jn9jQ2
4683E4k3j18J10n7oL1k2qM6L1m1KmN6p0Km1M2M3p0M5Mm8K8lL2o3L8l1O4Ol8K7
4716A8M7n7j3oK1rk1lM0l5N2n0kRJ3l1M6k5rJ9m0K5j2J3N8k6jk1j6K4Mn7J1J9
4750a5P7p4M0Kl8L2Np4J8P8j02M1j8P7j04R6l2j0J1j7kK2K8l4j1Kl9Q5m6p1J07
4781C4k8nj8K4k7K5K9l2k1M9l6M6M0r2LN4o1L2L9m5J1Jl6K5K7q9oQ9ml5oj7K7
4814ck8qJK5l3L8k9K0jN1o9K8kjk1NN1o5L8qL3J4n3%M0MJ2r5O7j5m6M7J8nj9P
4850bOm4N0l6Ll3L1L2K7j0m1kJ5NPk4j6N2j3k6N8p6N3O8l1o0J4PL7m7J4qL2L2
$$ plain form
4884 74 -5 27 10 21 -13 -39 -17 -42 -35 -18 29 16 -12 69 -90 -23 -32 24 -43 27 -13 -11 1 -17 -21 -57 44 12 -42 20 67
4915 67 31 -19 -31 18 -16 26 -13 6 7 0 3 20 -19 16 62 -23 11 -18 -35 -2 26 -13 -24 -5 12 41 -6 -10 -7 -4 -4 -43 -32 55
4949 55 -18 -8 -32 -35 33 4 -14 45 10 28 38 45 24 -2 12 -27 -59 -23 14 -30 -12 32 10 -12 -67 -26 -17 -44 -17 -3 4 -14
4981 -14 -34 -28 -4 -31 -19 6 -21 -38 -8 -7 -24 3 -33 -18 -32 1 8 52 3 -14 13 12 5 9 31 27 -45 -30 -6 94 -38 -12 9
5014 9 -38 -13 -35 -34 -37 -32 -65 -4 37 5 18 -8 44 -24 -2 -22 -26 39 -13 -29 17 16 -48 -44 24 -13 55 -2 7 -6 -5 -7 -7 10 10 5 -31
5051 -31 -13 3 -19 -73 -20 -10 -13 11 32 -3 -62 -24 -27 -7 -1 25 -34 -15 -9 -24 21 16 -57 75 11 10 -26 0 36 20 25 -5 10
5084 10 -6 -13 -35 -21 -99 -18 -50 -10 -17 11 -66 -33 30 2 -25 -30 -34 -5 5 -34 -32 -38 42 -62 -8 26 -7 66 -2 -16 -21 66 -54
5117 -54 10 33 -9 -16 6 3 15 -3 -19 19 -27 18 30 31 -40 -47 18 -50 -14 37 1 -16 -22 -21 -61 18 -23 -55 13 -1 -50 -28 2
$$ packed form
4884G4p9L2j7J1l4k6K2k5PJ7M7j3k8Q1j59O7rN6o7P0m0KJ2j8ml6J01l2n4O2M7
4915F7l6n0j2M9l4M2l9J9JpLJ7l9L5M6q5L4k9j7L3K8l9j1J9J7K9m7mLL%l9J1Q7
4949E5p3J0k4lO8k9j8N9l5J8J0Pk1k6J4l9l2L6L7m4J8M4k2k2n5M1Rk7K7J4Pj8
4981a4k0OK4k7J2K5k7j7L0Jj7K7l6J5j4L3PM4m9j7K7jpMK2mp2J5K4J00j32K6K1
5014Im7K5k2JlNl3O1M1l2J3k6N2o8K2k0mO5n2j6M6jo4MO8l7O8n7Rj3Jk%J7%nl6
5051c1J8J6k2n4N3J0lK4K1l5n9L8lK0OK6n9J9Oj5M5np3J32o4jl6K6L6j6Nl0J5
5084A0j6pk2J4p8Q1l2M0pK8p7L3O3k8k7nmK9J0l9KoQ0j04N4L4l3P3o8j4nQ7j20
5117e4O4K3m2pK2lJ2j8j6L8m6M5J2Jp1pO5o8L6N1l6j7oJm0P9m1l2O8j4m9K2L0
$$ plain form
5150 2 42 14 -5 15 -2 80 -22 4 87 17 -31 37 -55 11 5 -45 51 30 -9 -20 -30 -38 34 -40 -2 11 -22 -25 -23 -3 25 16 -14
5183 -14 34 -14 4 6 -21 -29 -22 -4 32 23 -18 3 -16 12 11 49 20 68 -24 -52 -6 35 -51 -10 40 12 6 8 -26 8 -18 1 9 11 -1
5218 -1 -14 1 8 -11 -40 -23 -52 26 -32 -58 -62 -18 24 50 11 4 -6 25 -27 -8 -5 21 87 -17 -20 12 15 -8 -59 -26 -23 38 18 -34
5252 -34 18 15 -3 -40 32 -16 -41 1 -31 -48 3 0 -8 19 -40 -4 8 7 42 44 8 -17 -31 36 31 -9 -8 -26 44 32 22 -44 -3 -20
5286 -20 18 36 56 -5 4 40 -43 32 -18 54 24 -2 -28 29 -8 -36 -50 14 -45 29 -26 -8 10 12 -18 -4 21 12 27 24 -3 -4 -9
5319 -9 13 -26 -38 -28 2 -8 -17 -13 15 3 -24 -51 -23 5 4 23 -9 -14 -48 22 -27 -11 -29 -13 19 21 -39 29 -32 18 11 22 30 -12
5353 -12 -9 -10 11 32 -42 12 21 -24 39 13 9 -13 18 13 -11 -17 -5 3 6 -36 -9 12 7 5 27 -13 -20 14 -39 1 50 8 13 11 -26 -7 -3
5390 -3 12 35 20 6 3 25 -13 -66 17 15 -9 57 -63 20 -16 23 -26 25 27 -26 26 20 -1 -30 32 -53 22 -54 -19 12 -43 12
$$ packed form
5150BM0k8j9K0j7Q2j02K6Q3p0m8O8r2O6on0R6k1l9j1j0qP2p4L8J3l3lKK0K8rl0
5183a4M8m8J8Kk7qPJ8L6rm1K1j9K8jL8k9M8r2k8M6M1q6M1N0k8oKl4L4k6J9QKj2
5218aj3J5Pj9k9J7k9P8n8k6mM4M2K6l9pj0L1n2J9LK6O6j04lL2Lk3n1L3LO1k0n2
5252c4N2lj8l7P2m8k5M2l2j7N1lqK7n9L6J2jL5Kl6k5j4O7nm0Jj8P0j2j0o6M1j7
5286b0L8J8K0o1RL6q3P5n0P2l0k6k6N7l7k8j4O4n9P4n5J8J8Kl0J4K5rJ5lk7jn
5319iK2l9j2J0L0j0rMK8j2k7k7K8K8jJ9l2nl4P0m9J6j8J6L2Ko0O8o1N0pJ1Qm2
5353a2LjK1K1p4N4Rm5O3k6mk2L1nk4oJ2QLm2K7K1nkK2m0pL4n3M0M9m2Nkl7J9M
5390cJ5K3j5j4lK2l8n3Q3kk4O6j20Q3l6L9m9N1Kn3N2ok1k9O2q5P5p6L5L1n5N5
$$ plain form
5422 12 -27 -67 15 -48 17 4 34 -36 -13 -25 -25 40 58 28 -69 5 35 -75 12 13 28 23 33 3 8 16 27 55 -16 39 13 25
5454 25 -23 -43 -29 25 -16 9 -9 -5 -18 -57 25 -6 -17 8 17 45 12 -44 -5 32 10 71 11 11 -6 4 -35 -8 10 -35 58 32
5486 32 -23 36 -2 -34 -8 -16 44 22 -50 -33 1 17 10 -37 -32 6 21 41 -4 -33 3 22 -74 -24 -72 22 9 -6 -8 -19 19 18 29
5519 29 48 14 7 -9 -15 15 16 37 -22 -15 -40 -10 40 -39 -8 -26 -7 -29 35 -22 35 39 -37 -16 54 3 -19 -35 -22 -2 -4 13 2
5552 2 26 -8 2 -59 27 -17 13 -21 -8 25 39 -1 36 21 -17 14 0 14 -43 -28 -11 -23 13 44 7 -19 -2 -11 -32 44 -1
5583 -1 -25 -4 -13 12 -3 -5 47 -4 14 42 -46 35 39 22 -16 -2 -1 26 -19 6 -23 8 -15 7 95 -9 -9 -31 -19 17 -45 -10 -21
5616 -21 -27 -9 10 -7 4 -10 13 92 16 -45 34 -22 -59 42 28 3 14 19 18 15 17 -31 29 42 -30 69 8 33 16 8 23 -2 16
5649 16 45 -32 -33 -9 16 2 29 -57 10 -53 -27 -7 -30 23 14 -42 -92 -16 55 18 14 -46 -6 -12 -16 46 -7 4 8 6 11 -28 7 34
$$ packed form
5422A2l9m0Q2o3O5j3L0p0K3j2%O5J8l0r7P4L0j10Q7JJ5nJ0l0NQJ1K8p1N5k6J2
5454B5m8k0J4N4m1K5j8Mj3l9Q2l1j1K5RK8l3n6L9L7k2O1o0%j7J0l9K7J8m5R3k6
5486C2n5N9l8l2K6qO0k2p2J7L4J6pm7NL8J5K0m5k9L6J9r6N0m8R4j3j5kj1L8jJ1
5519B9J9l4pj6oL0JK1n9Pk5L0N0p9L1j8J9k2O4n7N7Mp6K1P0n1k2j6J3K0kJ7j1
5552BK4l4J0o1Q6m4L0l4J3L3J4m0L7j5l8L1j4J4n7J5J7j2L6L1l7k6J7rk1P6m5
5583ak4K1rK5j5kN2n1J8K8q8Q1Mj7l8J4JK7m5K5k9L1k3K2Q8j04%k2J2L6o2L5j1
5616b1oJ8J9j7J1j4K3P9p6o1P9n6l7J01j4k5J1NjlKm8O0J3p2R9o1K5j7qJ5k5J8
5649A6K9p7jK4K5j4K7q6O7o3K6K0k3N3rn6n0P6P1l7mo0M0omO2n3J1MkNl9L5K7
$$ plain form
5683 34 29 28 14 71 39 29 56 36 -36 5 -9 4 17 -36 -54 6 -35 -18 -7 19 -15 32 -34 -36 -4 -12 12 26 44 -10 -24 10
5715 10 -18 35 32 19 13 65 -2 -34 4 29 -16 1 23 12 -8 -11 22 -3 -39 -30 -42 -4 -10 7 -6 -21 21 12 61 31 -27 9 -5
5748 -5 23 -19 15 -29 33 8 -55 4 -21 6 17 -10 1 11 -17 29 42 36 60 5 -22 -9 1 32 -39 17 -11 -83 -24 -3 -74
5779 -74 -28 -40 -23 68 1 -18 -29 -42 21 -9 -27 -80 -11 -2 -29 -19 -39 13 -3 21 -26 -19 -4 13 26 38 48 -2 -59 11 -28
5810 -28 24 5 29 28 19 -13 -34 -22 -74 7 -26 -40 -54 -58 31 -15 -10 -31 10 -17 -8 -9 6 -28 -25 -16 -8 -20 -3 -4 -2 21 42 -55 4 -50
5846 -50 35 19 19 47 -4 16 -31 -63 -29 -28 14 52 -49 -12 -54 -13 -37 -19 3 -48 -1 2 7 -22 -7 26 -32 -23 16 -11 -19 80 30
5879 30 -2 42 4 -66 18 48 39 20 -18 20 -29 17 -37 30 -4 4 29 7 -46 -74 38 10 -15 -26 -5 0 -4 3 -65 -1 -42 -63
5911 -63 50 -19 49 -19 -33 -19 -10 -47 23 -13 -40 32 -31 22 11 -18 -17 -1 -1 -15 -29 26 -3 -50 -21 -8 -5 4 -35 20 -28 1
$$ packed form
5683C4njj4N7l2j0K7k0p2M1j4J3J3n3j8O0m1J7J1K6l4M7o6kL2qK4J4J8n4j4L4
5715A0k8N3lj3oN2o7l2L8K5m5J7K2j1k0lL3k5l6Rj2L8oJ7j3j5M2rM9l0n8L6j4
5748eK8m2L4m4O2k5o3N9k5K7J1k7J1J0k8M6J3oK4n5k7J3J0L1p1N6k8p2N9K1p1
5779g4M6j2J7R1o7j9j1j3O3l0j8n3O9Rk7J0k0N2j6K4m7PJ5J7J3J2J0n0n7P0l9
5810b8N2j9K4jrl2k1J2n2Q1l3j4j4mQ9m6Nk1M1k7RjJ5l4LRQj2J7jKK3K1r7N9n4
5846e0Q5j6%K8n1K0m7l2L4JM2L8j01L7m2M1k4J8K2n1M7LNk9J5L3n8RL9k7qR9n0
5879C0l2M4l8p0Q4L0rj9l8L8m9M6n4O7l4QK5k2n3k8J12k8k5j1K1NmPo8O4m1k1
5911f3J13o9O8o8j4J4Rl7P0l6k7P2o3N3j1k9JJ6%j4j4N5k9m7K9J3LRl9N5m8K9
$$ plain form
5943 1 -51 -63 22 -38 23 -25 3 1 1 -37 -12 -25 -21 23 -7 16 -22 -19 13 37 -14 20 18 15 27 35 -3 -71 -20 -11 8 14 35 -5 -32
5978 -32 -20 9 44 21 -6 -12 -51 14 -3 24 -28 -29 -8 -11 2 20 -21 -14 7 -20 -12 48 -12 22 1 40 -6 2 2 37 -16 18 9 -53
6012 -53 -8 15 -39 -10 -34 14 -47 13 -18 -8 -21 -32 -26 17 -25 -18 9 4 -23 37 12 -43 14 32 -17 7 16 -16 3 39 55 0
6044 0 24 29 -8 -3 33 -3 -33 5 -7 12 13 -12 -16 -28 -62 8 2 -1 -22 -22 -28 35 34 5 -15 3 -13 23 52 -25 11 -6 -18 38 -16
6079 -16 5 27 43 5 -7 25 -21 69 38 23 59 -1 -39 50 -18 -11 22 8 -4 -17 -47 -12 -22 16 -10 -5 8 14 10 9 23 -25 -66
6112 -66 -30 -29 -21 -4 14 12 50 18 32 53 -36 49 -16 -20 18 -16 40 -15 31 14 22 -6 6 13 -40 -9 0 -13 -67 4 -11 -9 -4 -68 -19
6147 -19 -18 2 17 -19 19 23 -21 16 -25 5 26 37 5 -3 27 39 -2 24 16 -7 22 -2 -8 -17 51 0 -2 -39 -8 -7 -53 -44 -17 19 -6
6182 -6 -43 28 -26 -24 -2 21 -1 -16 -24 16 -39 49 6 58 -18 2 8 -20 36 -14 -3 -15 15 -18 -6 -7 -23 -66 20 -23 -16 -3 -1 20
$$ packed form
5943An2j2Q5o0O1m8K8k%l8K5j3MM4l0K3l8LL2K4n1L4klJ2Ql8o8N1RJ9OK1m0k7
5978c2J2K9L5k3k7ol9O5j7K7n2jK1lJ3J8m1PK1k7QO0o0L4k1L9m6Q%L5n3L4ro2
6012e3M5K3n4K9k4M8o1O0l1J0j3j1OM3m2PK7nk7O0k5n5N7J8m9K4Rl2J9L6J6n5
6044@K4Nl7NL6l6l0L8j2J9Jk5mj2l4P0olk1%oO3jk9k0J8j6L6K9p7L6j7j2N6n4
6079a6K1K2J6l8j2L2m6R0l1j5L6o0l8Q9o8PL3j4j2j3l0L5j0L8k6NJ3OmjJ4m8m1
6112f6L6JQJ7J8kL8l2J4K1q9Q5o5mL8l4N6n5M6j7Qk8J2Pn3L1Rj3n4P1j5KNo4M9
6147a9JK0J5l6L8Mm4L7m1L0K1J1l2qL0J2m1K6qk3K9k4orO8n1kl7L1Jm6RK7L6k5
6182fl7P1n4KK2K3k2j5qM0n5Q8m3N2p6K0Ok8N6n0J1j2L0l3J2jj6m3Q6m3PJ3KK1
$$ plain form
6216 20 -50 34 6 28 -33 16 -87 25 -44 6 -2 4 -19 -13 -14 -59 10 14 -34 -26 -14 9 -7 9 12 42 14 57 40 -27 -4 -50 4
6249 4 -22 -21 19 0 -37 -21 18 -4 20 18 -13 5 13 -24 -59 -2 -47 -21 -41 -18 8 -2 23 -4 20 -47 42 38 16 -8 45 7 33
6282 33 26 -17 37 -16 4 39 19 2 -6 37 -64 13 5 -30 -18 25 -6 3 16 10 33 -14 -14 -26 -54 -26 -53 31 45 51 5 -25 -31 20
6316 20 -16 31 -44 24 -25 -18 36 72 59 -33 11 59 50 -9 37 22 0 -10 42 -5 -19 -38 -27 -56 12 -7 -69 18 -5 -24 -58
6347 -58 33 39 -3 -54 16 -6 -14 -3 -1 -13 27 29 -45 -6 27 -30 19 -27 21 -14 4 29 -46 -44 34 0 51 -4 11 4 12 42 -65
6380 -65 -3 8 10 -2 -8 20 -27 -21 27 -2 19 0 5 -9 -18 37 24 19 -39 15 -22 8 -10 -27 46 2 -1 61 17 -75 41 4 -18
6413 -18 2 -35 -57 -12 -14 -20 6 -4 14 -37 -65 -46 -93 -2 -31 -24 -61 26 -19 -1 0 14 18 17 -2 -12 -35 -5 44 27 -18 14 31
6446 31 3 13 17 21 -36 2 47 31 -1 15 23 36 23 7 -19 -28 -22 5 -27 -19 -4 -41 -18 34 21 -12 8 14 -31 47 29 -24 28 -8
$$ packed form
6216B0p0Q4k8K2o1M9j03J12o9N0qOk3Ojm5O9Mm8QJ2K3j6J6LL0k8M3j7o7K3m6N4
6249Dk6JM0j9l7J6L9k2K4kl1J8Ql7l5N7m5K6k0K3K6j0K5k7K4o7Q9mk2k4N3l8K6
6282C3pm3N4n3K0L5k0j7qM3j01P7ql5J2M3l1RJ3oK3m7%j2k8K8k7Q4J4Om6l0oN1
6316B0l6M7p5O8m9PN4L6j3r2M4M8rn9M6j5k2j0N2m7j4j9J1k9O8j9o2Q7k3j9l4
6347e8R1Om2n1P0k2qJ1Kj2M0Kp4L9L3n7M9m6M8l5J8K5p5KP8l4N1n5J5pQL0j07
6380f5O2J1Kj2oK8m7OM8k9K1j9Nj4rN5j3nn8N4l7L0j8j7P3m4lO2m4r2J16l7k2
6413a8K0l7k2M5koK6j0J8n1k8J9m7R1k9Pl7Q7m5J8JJ4Mjj9j0k3L0M9j7m5L2J7
6446C1k8J0MMn7L8M5j6l2J6QJ3j3j6k6rOK7l2QJ5l7K3N2j3l3K0Om5P8j8n3N2l6
$$ plain form
6480 -8 66 12 66 34 10 9 18 -23 16 -42 6 38 20 56 7 2 32 -6 26 -7 -45 45 -2 -19 -32 -21 -20 -40 -10 -13 -29 -7 -13 39
6514 39 -15 -1 -4 20 -5 -16 55 5 13 15 17 50 22 11 11 -45 10 19 -3 0 -26 71 10 -21 -23 -50 8 16 -23 -18 25 -19 -43 -19 1
6549 1 7 9 -15 17 10 -16 37 24 44 -5 28 -16 -13 -29 27 -15 37 2 22 -38 -20 19 10 -27 -9 -5 64 19 5 1 -31 -6 -43 -1
6583 -1 11 -30 -46 -27 2 6 21 -10 -7 -15 43 -26 -3 -13 -20 43 36 -1 28 -1 -4 74 -3 -17 -43 -24 11 28 6 -5 -27 11 8 37
6617 37 -29 49 -3 -28 -41 38 -11 -14 -12 -46 27 26 -2 12 -17 -19 -25 5 -15 34 27 -47 1 -7 -40 -27 46 16 -12 -25 7 -9 37 -12
6651 -12 1 -8 -45 -30 30 1 -47 32 -47 1 -31 -18 8 7 3 38 27 -59 28 16 -28 35 -19 -35 25 21 -3 -13 -61 44 -10 6
6683 6 28 39 76 -44 22 15 36 -14 23 2 19 21 -10 9 21 3 10 -29 10 -3 -26 -26 16 39 -2 -10 25 23 -44 15 -21 23 24 -3
6717 -3 20 31 20 -6 23 -11 33 -31 66 44 11 -40 20 11 -4 10 47 -1 -21 -47 2 4 -57 -7 -26 -8 37 34 6 -21 -18 39 -47
$$ packed form
6480hP4n4N4l2k4jRm1L9n8M8L2j8L6m9nL0l8L2l3l8R0m7j7j3J1Jk0L0lj6K2oN2
6514C9n4J4lK4k5j1P1n0QKKL3k8j1%n6N5Rk2Lk6R7o1l1kk7N8Ql9NM3m4k4K4K0
6549AOKk4L2pk6N3j3K0m9L3m4Lj6N6m2N2l5K0o0J8L9rl7J8MO9m5j4ml2K5l7M2
6583aJ2m1j6J9K9MJ5l1LqN8o9K3j0pO3pl7K9k9lP8p7j4k6J9L5J7k2j1k2L8lK9
6617C7o6P8n2k5j3P9m9lKl4P3jk8J4k9koL0k0M9pp4M8ql3J3P3l0k8j3L2j6M6m9
6651a2J3rl7J5O0k9m8P9p9M8l2J3K6jmL5j1q6Q7j2m4O3n4j6O0mk4j0m8J05n4J6
6683FK2J1L7j20O6pK1n0L7k1J7Kl1J9J2j8Pl9L9j3k3%M2K3m1qL5ko7N9l6M4Jk7
6717cK3J1j1k6K9l4M4o4R7k2l3n1O0rj5J4L7m8k0k6M9Ko1N0j9J8M5lk8k7LN7q6
$$ plain form
6750 -47 -40 -28 11 45 1 -36 -26 7 3 33 16 -38 15 -5 -1 -9 24 -11 -24 -27 11 14 65 49 13 51 -21 18 3 41 -2 -40 -1
6783 -1 -13 -3 -4 12 4 33 19 -35 -20 -29 11 -12 -16 -23 4 70 -11 -4 24 65 -3 42 57 1 15 30 16 67 -39 24 26 51 21 -1
6817 -1 -1 16 13 5 -36 -16 9 23 -51 -5 -34 -43 -7 -31 1 -58 -53 -1 5 -28 14 -26 25 -17 -56 28 42 57 23 50 -2 12 13 -7
6851 -7 16 35 2 9 47 46 28 48 -32 58 12 19 -5 29 4 -4 -40 -65 -10 -17 8 -11 -16 -9 13 52 -6 -10 -12 41 29 5 -20 28 31 -7
6887 -7 -18 -2 92 -32 5 31 2 0 -41 24 65 46 11 9 7 -11 41 -28 8 42 -3 -32 -4 10 26 15 24 -21 -26 -1 -12 47 7
6920 7 -44 21 -19 -45 37 9 23 -21 2 46 12 -6 11 7 42 -23 60 -8 9 25 26 19 -7 -6 -35 -51 -6 -12 -40 -20 -42 6 4 -47
6954 -47 -5 -1 33 -10 -44 12 -12 14 0 42 39 11 29 36 -12 5 -47 57 -7 -5 22 29 2 -54 32 46 -27 -39 -16 -63 36 2
6986 2 6 -2 25 10 -16 -84 -11 -31 -18 25 2 -26 62 -19 21 -12 29 8 6 22 26 -37 -23 -3 -6 18 -27 8 12 23 -48 -34 24 8
$$ packed form
6750d7PJ2L9L4m4l7J0L3mL0j7n4N3k0MqL3l5j3lL8LN1j6l6L8p2L9j5L8m3l8L9
6783aj2J0jJ6qK9j4n4J5rM0k3mpK7O6q1PK8M1o8M5J5n6J4J5j4N1j06O3KK5l0k2
6817a%J7lqm1K0K5J4p4M6k9rL6k4L2n9NN2Ol3M2m0N1m2l9Q4J4J5l4K7n2J4Jk0
6851gK3J9l3PL8jj8K0q0R0m6Pk4L4k5ql6k5N5pK5j9nPK2L9n8mkN3j2k4k5M8Ll8
6887gj1J6R4j24L7K6k9km1O5M1j9l5kkj8N2o9L6L4m5k9K8J4J6j1Rm5nK5j1N9m0
6920Gn1O5m0k6Q2k8J4m4K3M4l4j8J7mL5o5Q3o8J7J6Jpk6Jk9j6M5ok8K0k2M8kn1
6954d7M2ML4m3l4N6k4K6j4M2lk8J8Pm8J7n2J04o4KK7Pk7n6Q6J4p3j2K3m7R9l4
6986BMqK7j5k6o8P3k0J3M3k3k8Q8q1M0l3M1k1kJ6Mo3J4K0lK4m5L5MJ1p1J4N8j6
$$ plain form
7020 8 -44 -19 28 -31 -29 -42 7 -31 11 -10 -33 -25 -52 -22 7 7 -45 25 46 -10 3 -11 16 -41 -17 35 8 -1 26 18 23 51 37 -3
7054 -3 49 72 -18 24 -27 16 37 35 19 -28 24 -9 -38 -1 -64 -37 -43 50 -3 -4 -56 35 -34 -30 60 -8 -40 -10 14 -4 -38 -11 -5
7087 -5 20 -16 -21 -32 14 8 9 39 -25 -2 44 -24 2 2 19 25 54 14 -44 -37 3 -1 -1 1 -54 -1 2 -34 32 -5 57 24 -10 21 34 11
7123 11 43 13 12 21 -28 33 18 28 36 64 7 22 -33 30 41 -1 -26 -17 4 9 -55 -33 -12 10 15 -18 24 25 -86 0 -7 -62 11 -26
7157 -26 -2 -10 17 -8 72 -6 28 -12 -55 -7 26 -25 73 -13 30 35 10 -25 -67 35 -3 25 39 -13 -37 -25 -18 19 -29 -44 -5
7188 -5 8 -12 -5 -58 -24 12 -23 35 -14 9 33 -6 -28 16 54 -44 9 6 42 -15 -21 -9 35 7 -18 9 -22 1 -1 47 49 12 31
7221 31 13 -25 -23 23 11 23 4 13 -9 -26 -16 -22 59 -25 -7 -31 -61 -22 5 -18 13 35 -4 8 26 28 0 1 34 -23 38 -9 34
7254 34 29 30 38 46 59 15 42 -21 -7 -29 12 -39 -34 -10 37 -23 -54 10 25 -25 16 -37 -6 -39 -30 10 1 13 2 5 -5 -16 -44 33
$$ packed form
7020Hn2K5M7n9Kj3M9l8M2k1k3Qk7L0K9%n2P0K1n6J3j4K7n7K4N2k7rK7qNK8j4m0
7054cN2K3r0M2n1M3K1kj6m7N2l3k9L7o3K7oR3n3jn2R1o9MR0o8l2L0K4j8l4K7O
7087eK5l6nj1M6oJL0o4K3M6o8K6%J7OK9m0n8PM0m%Kn5N3Ll6O6l7O2l3l4L1J3k3
7123A1L2l0jRm9O1j5J0QK8n7J5n5O3J1m2k5RK1No4K2K1K2Nl3M2Jj11Q6pn5P3l7
7157b6K4qK7k5Q0p8L4m0m3M8L3n1R8q6M3Nk5l5m2J02l8K8J4n2k4J2PL7m8j5L9
7188eJ3k0Pn3L4L6l5N8m9K3K4l9k2M4L8r8N3lL6n7oJ2M4k8k5K7l1K3kM8Kl7J9
7221C1j8l8KM6j2J2j9Rk2j7J0oQ1q4J8k4l0L9K7k3L1K2l9J2J8Kk8JL3n7O1m7M3
7254C4nJQQJ3m4K7o3J4k2M1n1NK4M7o0l1O4J5n0M1n3L1l3RM0rJ2j1Lj0j1k8P7
$$ plain form
7288 33 6 22 -10 7 -18 45 32 5 -13 47 -4 -8 -6 10 -36 -12 4 -19 24 -16 -56 19 -13 4 -19 2 4 -3 10 -37 -10 -36
7320 -36 -14 -12 -40 32 33 -4 21 -7 31 32 27 39 19 4 14 36 -43 7 -29 -25 13 -14 -23 20 -27 -3 -22 12 -22 -32 31 -58 -54 -27
7354 -27 -24 -2 -3 25 13 17 -6 -39 23 -25 36 17 35 5 -5 34 13 1 64 -75 58 53 12 -8 21 40 -11 -13 14 -3 -77 -14
7386 -14 -14 -47 15 -2 -30 -11 -73 12 10 -1 3 -13 -22 16 -35 8 6 -19 -4 1 10 43 62 7 57 18 17 34 -2 8 46 -23 17 19 40
7421 40 15 -11 12 7 -7 -40 -15 8 5 7 -12 -16 -22 -2 21 34 26 -5 20 -45 -1 -37 -23 -34 38 29 30 -10 -15 -21 75 45 -3 42 -30
7456 -30 -14 20 -36 -16 -54 -10 37 -10 37 -11 -27 16 14 -64 -56 -34 -36 -19 -30 11 23 -40 7 -15 44 23 22 -1 -18 -4 24 -16
7488 -16 -16 16 -16 1 -38 2 -35 19 9 20 11 -13 4 -42 0 -14 17 10 5 -23 22 -29 -44 -7 -10 -21 -8 38 2 -25 -18 -3 22
7521 22 30 -1 56 -20 24 -13 26 32 22 3 67 -8 -14 -22 38 31 -31 42 29 -11 33 18 -79 -14 30 -12 -33 -44 35 3 8 13 -13 -26
$$ packed form
7288C3k7J6l2J7k5O3j3k7j8O0n1mKJ6m6K4J6k3M3m0m0P5l2J7k3K1KpJ3m7K7k6
7320c6K2Kk8P2Jl7K5k8L8JnJ2k0j5J0K2p9N0l6ML8k7rM3m7K4j9L4l4j0O3q9MK7
7354b7LK2jK8j2Mk3l3O2m8O1j9J8l0j0L9k1j2O3j39J33nm1k0K9J9n1kK7j7p4O3
7386a4%l3O2j7k8J9o2Q5kj1Mj6rL8n1M3kk5J5NRL3J9n5N0l9jJ7l6J0L8o9M0KK1
7421D0k5k6K3nj4l3K5K3lKj9moK0K3J3ql1K5o5M4l6J4j1P2rJm0noR6l0m8M5p2
7456c0J6L4n6K0l8M4M7m7M7m8j6M3kp8QK2kJ7j1M1J2o3M7k2N9k1jk3j7J4K8m0
7488a6%L2l2J7l9M0l7N4j0J1rk4J7m6M2j4L1pnk8M5n1j5L7lj1J3M6l6k7PJ5K5
7521B2Ql1N7p6M4l7L9Oj0j9O4p5oqO0po2P3j3m0M4j5r7O5M4m2k1j1P9l2NNk6j3
$$ plain form
7555 -26 15 2 1 13 -20 -27 5 -11 -9 55 4 4 53 12 46 -14 23 2 -27 28 37 26 -13 51 -19 -28 -36 15 -18 0 20 -11 28 17
7589 17 1 -79 30 3 -17 -33 10 5 -8 -2 24 -3 49 -12 37 11 -8 -31 40 -30 43 -28 -41 16 15 0 10 33 -6 12 11 -2
7621 -2 -25 -63 -33 -33 -49 10 -66 25 -31 -8 68 7 -54 -9 -22 4 19 -15 5 -12 -24 12 -7 13 -22 19 -19 31 6 6 -3 2 -30
7654 -30 10 4 58 -8 4 3 17 21 42 -15 4 -63 -26 -30 -21 -42 -46 -14 -29 -14 -5 -10 -40 -28 -18 27 1 51 37 35 -28 -5 38 31 13
7689 13 6 -38 75 18 46 -2 -15 37 14 -30 0 13 -20 21 28 0 -6 17 3 -41 4 -3 4 -18 -31 50 -9 -63 51 26 16 25
7721 25 24 -2 10 14 1 -9 25 93 10 76 2 8 88 -4 6 1 26 4 -16 6 30 -15 -19 9 -9 -42 1 -25 26 -14 -5 23 12
7754 12 24 -11 -13 -55 16 0 44 15 -20 -23 16 57 45 5 9 -52 -8 56 20 11 -8 23 -35 23 31 33 -34 -60 6 36 25 6 -33
7787 -33 12 1 60 -37 -41 -3 -23 -29 -32 49 -6 24 25 -19 4 1 -1 8 24 54 0 75 -13 -13 13 48 41 5 -31 8 12 44 -14 13 38
$$ packed form
7555b6M1j3jJ2l3pL2j6KO4n1%M9m1L4o0L7k1k9N5Rj1l9O4p0rqN1l3J8K0l1L9j1
7589A7j6q0J09k7k0j6M3nj3OK6k7N2o1M9k6j9k3P1p0P3p1j3N7jj5J0K3l9J8jj3
7621bk3l8L0%j6N9p6R1n6K3P6o1o1M5j3K6J5l4K0j7j2L6j9K0l5M1l8N0k5%rNl2
7654c0M0oN4o6J2jJ4MK1n7J9o7L7mRk1mL2j5J5Rnl0J2J0M5k6N0j4ko3K3M3pj8
7689A3pm4J13n7K8m8j3N2k3m4L0J3l3M1Pk8oK3j4m4M5pPk2j3Q1n9n4J14k5j0R
7721B5jk6J2Mj3j0L4O8q3O6p4OQ0r2J0nK5k2k0K2K4m5mK8j8l3M3k6N1m0RK8j1
7754A2J2l5km2P1j6M4k9l5lL9M1j2m0Mo1M4O4l6rj9L1n8N8QKo7k6O6L0j1j9l9
7787c3M5j1N9r7mL8k0olQ1n5L0Jm4K3lkRJ6L0n4P5q8%K6L5pl6l6L9ML2n8K7K5
$$ plain form
7822 38 -32 -21 0 -30 -10 -28 25 -4 -11 -26 -33 -43 -84 -20 -26 27 -38 -35 13 10 -3 24 25 -8 -10 -5 -41 13 73 28 65 21 -3 5 -5
7857 -5 -17 11 -2 23 9 -29 -13 -3 17 -51 -41 -29 -34 -14 -4 -9 -30 33 25 20 -24 17 2 34 23 -5 9 -6 57 12 -59 1 -10
7890 -10 50 -52 6 8 16 54 32 -89 -15 -30 -3 -38 -18 4 -9 -34 13 -25 -37 21 1 -30 10 -9 -33 16 -7 -29 -28 15 -11
7921 -11 32 12 12 2 55 -30 -2 -20 5 19 -11 -92 -1 -7 0 -53 -42 11 -42 -26 24 -31 -2 -7 -21 5 -14 -16 1 -23 -30 -18 -12 -50
7955 -50 -37 6 -12 -10 -26 26 -39 26 -74 -13 26 -7 31 43 -6 -23 56 -14 -4 72 -25 8 42 92 -27 -25 41 -3 -27 9
7985 9 -25 62 2 6 -14 5 36 -52 41 47 -13 17 -5 -3 -78 5 -40 -31 -5 -62 11 56 61 -30 26 19 15 -29 -20 -1 40 -38 10 27 -8
8020 -8 11 21 24 -13 17 12 -29 27 5 -39 5 -68 7 -63 18 -7 -7 -14 -16 5 -36 26 22 -2 -21 -30 -19 16 -32 10 28 -18 12 -14
8054 -14 12 38 17 -8 5 -32 -32 42 32 -18 -39 -11 -38 33 -6 -8 -37 18 -23 -33 -4 -63 -28 13 -30 1 38 -36 -24 37 23
$$ packed form
7822C8p0J1K1l0K0j8N3k9pj5pj0m1O4oN3o5LM8lj3K7Jl3kNl6N4O0m5L7m4k4Qj0
7857ej2K8j3K5j4l8J6J0K0o8J0J2nK0J0nk1O3qnm4M1j5L2j1k8J4j5O3m5p1O0j1
7890a0O0j02N8KQL8k2j21P4j5K7l5K0K2j3k5M7l8j2N8k0l1M0j9k4M9k3k2JM3k6
7921a1M3k0%j0N3q5K8j8K5J4l0q1R1oPn3J1N3n3J6N0n5K9nj4K6j9kJ7k4pJ2Ol8
7955e0J3M3j8Kj6N2o5O5j00O1L9l3L8J2m9j7P9p0J0P6r7L3L4N0j19KO6m4k4L6
7985Il4Q7o0Mk0J9L1q8R3Oo0L0k2Kp5Q3m5RK6n7P3M5Nr1N6pmm4RJ9M1p8M8J7l5
8020hJ9J0Ll7L0nm1N6k2m4M4p3P5p0Q1k5%pkK1m1O2mk4j9rJ1L5m8M2J8m6L0k6
8054a4K6K6k1k5J3l7%P4j0n0k1K8k7P1l9kk9N5m1j0K9n9L5M1m3L1L7p4J2O1j4
$$ plain form
8085 23 16 3 24 76 17 4 43 -40 30 66 -18 -10 -3 -6 10 25 58 -14 -38 16 27 6 36 -14 -28 11 -3 1 -26 14 33 -7 -8
8118 -8 -18 10 -4 -18 -51 21 18 -18 69 55 2 -38 74 -53 4 -22 26 3 29 9 -7 21 -20 50 -26 -12 -20 -29 -16 -25 -58 -29
8150 -29 2 -57 -9 4 -6 -8 26 21 25 -38 4 41 -24 15 -46 -10 20 36 7 37 -45 19 39 1 79 -50 -10 6 41 46 -23 31
8182 31 19 -26 -11 -35 -19 9 -28 22 -2
$$ packed form
8085B3pj3K1N2n9j3L9q3P0L6q4QPlJ6J5L3p2k4N4J1k1L0n0j4L9j4Mk7M0J9m0j
8118hj0K8j4j4l3P2ll6Q7j4n3m0J12j27N7k6M8k3K6k0j6K8m1P0p6J4qrJ3rl3K9
8150b9L1n9M8J3j0kL4nMo3M2L7o5L9o1L6L0J6k9L0q2O4K0l8P8j29M0J6L5No9N4
8182C1j2m5J5k4J6K8l7N0k4
8191b
$$ Imaginary data points
##PAGE= N=2
##DATA TABLE= (X++(I..I)), XYDATA
$$ plain form
0 0 0 0 0 0 0 0 0 0 0 0 0 0 0 0 0 0 0 0 8 -8 8 -8 8 -8 16 -16 16 -22 24 -24 32 -32 40 -46 48 -56 64 -72 80 -88
40 -88 96 -110 120 -136 150 -164 182 -200 220 -243 268 -294 324 -358 396 -438 486 -540 606 -682
60 -682 772 -884 1026 -1210 1461 -1824 2396 -3441 5912 -23831 9371 65176 -31329 -55309
74 -55309 24799 41833 -14541 -37136 -9330 39177 16709 -40189 -20286 34138 22138 -19265
86 -19265 -27548 9048 31345 -4066 -28763 3608 22069 3795 -13432 -9662 8515 12777 -5642
99 -5642 -13607 -1629 13987 7417 -15917 -9582 13747 4619 -9803 -4421 -727 4652 6488 -8292
113 -8292 -8361 8404 7686 -6789 -9811 3141 11339 -1228 -9938 -239 7717 5146 -5679 -8693 5657
128 5657 8444 -4876 -5387 1558 4119 2435 -6741 -4016 7541 -440 -6981 2399 -530 -2426 5327
$$ packed form
0@%%%%%%%%%%%%%%%%%%Qj6J6j6J6j6K4l2L2l8M6m8N6o4P2q6R4j04J20j36J52j68
40h8J84k06K30k56K86l14L46l82M20m63N11n62O18o82P54q34R24j026J146j288
60f82J454j656J910k236K671l285M220n837R353k9743L3202N5805r6505k3980
74e5309Q0108J7034n6374k2595K7806M8507k2468n6898J9903N4424j2000m1403
86a9265q283L6596K2297l5411k4697L2371J8461j8274j7227L770J8177M262j8419
99e642p965J1978J5616o570k3334O335K3329r128j4422N382L694N379J836j4780
113h292o9J6765p18j4475l022J2952Q198j2567q710R699P956k571j0825l014J4350
128E657K787j3320n11O945K561j684r176K725J1557p981o541R380k929j896P753
$$ plain form
143 5327 -4445 -8046 6585 3079 -7642 -1382 2916 68 -618 -805 -1016 -923 1922 1836 -3908 -1335
159 -1335 5306 644 -3200 687 1311 1625 413 -3324 323 3999 380 -1997 -2579 2300 6134 -5679
175 -5679 -6070 8535 595 -7462 4202 522 -5163 5228 -238 -7593 4094 3599 -6085 -799 2662
190 2662 -922 -376 -1274 -1128 1143 -408 -382 -497 -1988 1922 1515 -3896 -238 2713 -1815 -934 1483
207 1483 -1580 -232 2730 -1367 -2934 2197 2568 -2778 -1983 2873 1281 -2147 40 1664 -252 -305
223 -305 808 -233 -657 1443 914 -2090 320 2416 -1021 -1025 1180 -714 121 1142 -1795 -410 1742
240 1742 -853 -889 217 -565 942 -723 -2230 2127 25 -3189 2214 302 -3811 2527 1550 -4186
256 -4186 988 2389 -2408 -518 1443 -516 -511 -57 303 317 -649 687 509 -1653 1028 1781 -2152 -46
$$ packed form
143E327r772l601J4631l506j0721O260M298k848o86j87k11R3K845q6n744K573
159a335O641m662l844L887O24L14j212l737L647L676l619k377n82M879L834j1813
175e679l91J4605p940q057J1664l680n685J0391n466p355J1687m95r684N286L461
190B662l584N46q98J46K271j551K6j15j491L910m07n411L658K951m528Q81K417
207A483l063J348K962m097j567N131L71n346P95M856j592l428K187J624j916n3
223c05J113j041m24K100n29l004K410K096l437mK205j894Q35J021k937J385K152
240A742k595l6J106p82J507j665j507M357k102l214N403j912m113O338r77n736
256d186N174J401m797J890J961j959NM54L60J4r66J336j78k162K681P53l933K106
$$ plain form
274 -46 2029 -1170 -131 1905 -784 -1001 1748 781 -1469 166 2188 -989 -1623 2709 448 -2706
290 -2706 1944 1564 -3072 994 2661 -2555 -922 2342 -641 -1102 771 -213 -411 328 -210 -315 -206
307 -206 361 144 -1289 128 1734 -1222 -1320 1828 -222 -1304 1441 -38 -1711 1429 981 -1967 209
324 209 1708 -754 -908 933 517 -298 -229 334 267 -169 433 242 -762 565 1300 -694 -120 1086 -77
343 -77 21 556 -153 361 695 -320 153 606 238 412 -457 -376 1396 0 -1460 991 687 -1472 670
362 670 705 -1755 345 1325 -1770 -577 1514 -723 -1037 592 -1 -244 88 -371 221 216 -151 477 -194
381 -194 -469 1373 118 -1249 1409 772 -1396 1031 1004 -1374 791 1444 -1453 -64 1842 -465 -984
398 -984 994 598 -783 85 735 -407 -335 1010 -277 -955 1280 585 -1337 442 901 -812 89 490
$$ packed form
274d6K075l199J039K036k689k17K749r67k250J635K022l177o34M332k261l154
290b706M650l80m636M066J667n216J633L264k983m61J873r84j98P39n38j05J09
307b06N67k17j433J417J606k956r8L148k050j082K745j479j673L140m48k948K176
324B09J499k462j54J841m16q15O9N63o7m36O02j91j004J327P35j994N74J206j163
343g7R8N35p09N14L34j015M73M53l68J74q69Q1J772j396j460K451l04k159K142
362F70L5k460K100R80l095J193K091k237l14J629n93k43L32m59N92nl67O28o71
381a94k75J842j255j367K658o37k168K427k7k378K165O53k897J389J906k307n19
398i84J978l96j381Q68O50j142P2J345j287o78K235o95j922J779M59j713R01M01
$$ plain form
416 490 -397 264 318 -322 49 167 252 6 -701 310 639 -1000 -237 952 -750 -531 884 -574 -659
435 -659 885 -306 -803 616 129 -599 169 214 -145 123 288 -50 -90 449 264 -3 241 322 142 341
455 341 166 112 392 101 -10 348 156 -206 260 6 -401 402 218 -844 38 646 -750 -329 511 -532
475 -532 -441 540 -408 -637 659 -191 -553 518 -47 -406 261 -157 -120 359 -321 -66 483 -453 103 609
495 609 -839 36 1006 -869 -403 998 -524 -545 915 -328 -740 786 -28 -729 462 353 -562 98
513 98 421 -119 -86 365 77 -211 367 282 -352 149 560 -321 -136 473 -24 -136 58 -24 -8 -21 -185 -48
535 -48 -135 -174 102 -190 -406 117 -75 -550 184 44 -652 156 114 -544 105 225 -582 -45 509 -346 -109 442
557 442 -232 -186 600 -208 -411 520 24 -201 330 -55 -276 352 -68 -351 375 16 -491 269 205 -384 64
$$ packed form
416D90q87O61N4o40L71J18Q5k46p07J011L29j639P63J189j702K19J415j458q5
435f59J544j191m97J419m87p28P68M5l59K68J65l38m0N39j85k67K44Q1j80J99
455C41j75n4K80k91j11L58j92l62M66k54m07Q03j84j062Q82O08j396M21Q40j043
475e32R1R81r48k29J296q50l62J071n65l59O67m18L7M79o80K55N49r36N56N06
495F09j448Q75R70j875M66J401j522k1J460j243m12J526q14p01J191j09r15O60
513I8L23n40L3M51k88k88N78q5o34N01M11q81J85O09m97j12J94q2J6j3j64J37
535d8q7l9K76k92k16N23j92m75P34j40o96Q08m2o58O49J20q07N37N54q55K37N51
557D42o74M6P86q08k03R31m96k25N31l85k21O28m20k83P26l59n07P60o4n89M48
$$ plain form
578 64 81 -238 60 106 -226 -97 94 -50 -90 -10 -64 -19 77 -156 -112 83 -185 -100 -14 -106 -65 50 -248 -109 187
603 187 -316 -208 355 -266 -468 412 -129 -512 374 68 -568 260 307 -536 105 356 -369 77 349 -345 24
624 24 428 -189 -122 364 -44 -207 243 95 -128 176 -13 -70 78 22 -102 16 -82 -2 177 -198 -94 160
646 160 -121 -269 183 -63 -295 211 -74 -325 213 -75 -338 296 10 -320 135 118 -391 9 278 -363 -151
667 -151 370 -170 -200 292 -23 -171 140 -36 -245 216 115 -317 152 182 -305 124 204 -222 52 242 -163
688 -163 -6 205 -46 -1 68 -89 85 141 -165 159 161 -260 84 179 -168 53 152 -205 -38 163 -145 -74 204
711 204 -226 -109 346 -206 -265 378 -76 -280 291 70 -281 211 133 -335 76 213 -267 90 252 -221 71
732 71 143 -198 -31 191 -57 -139 183 66 -93 125 125 -75 109 23 24 113 -58 39 157 -1 -12 162 58 -122
$$ packed form
578F4J7l19K98M6l32J29J91j44m0Q0n4M5R6k33M4J95k68Q5Q6r2M1J15k98J39K96
603A87n03J08N63o21k02Q80n41l83Q86l06o36Q28M7q43O41K51p25M46K72o94L69
624B4M04o17O7M86m08j63M50j48k23L04j89n7J48n6j24J18r8Q0J79l75J04K54
646A60k81j48M52k46k32N06k85k51N38k88k63O34k86l30M55j7n09M00K69o41K12
667a51N21n40l0M92l15j48L11j76k09M61j01m32M69L0m87M29Q0m26K74J90m05
688a63J57K11k51M5O9j57J74N6l06L24Km21L44R5l47K21R9l57J67K01l08P1K78
711B04m30J17M55n52n9O43m54k04N71k21l51M92p8m68M11J37m80L57J62m73K92
732G1P2l41J67K22k48q2L22j17j59K18%k00J84q6JQ9j71R7J18j58j1J74j04j80
$$ plain form
756 -122 187 103 -232 216 49 -243 192 48 -321 215 67 -273 183 215 -379 53 309 -264 -38 303 -191
777 -191 -133 316 -86 -107 181 -22 -102 138 -67 -127 112 24 -51 84 151 -147 47 117 -25 33 137 -5 21 156
801 156 -56 25 90 -91 97 118 -31 43 211 -89 52 235 -24 -8 147 -53 -24 212 -135 -54 247 -114 -93
824 -93 291 -23 -220 173 67 -228 140 133 -241 121 176 -297 26 211 -162 -60 185 -104 -76 201 -54 -36
846 -36 180 30 -67 155 110 -6 91 5 23 33 -16 97 56 -22 39 114 -28 -75 133 100 -82 107 106 -144 103 122
872 122 -122 99 146 -180 93 210 -162 -1 208 -131 -114 243 -110 -71 203 -29 -82 163 42 -71 140 -14
894 -14 -53 102 -21 -78 142 25 -82 92 28 -37 -29 107 -1 -18 61 43 11 72 -4 -21 74 -1 -52 118 32 -73
920 -73 103 6 -58 153 -10 -98 115 -15 -10 196 -18 -208 191 -18 -194 200 106 -236 99 114 -198 85 157
$$ packed form
756a22L09q4l35M48j67k92M35j44l69N36j48l40M56L2n94M32K56n73K26L41m94
777a91N8M49m02k1K88k03q0K40k05o0K39q8p5J35O7k98J94P0j42N8J04j42K6J35
801A56k12Q1O5j81J88K1j49P4J68l00J41J83k59J6J55k00K9K36l47Q1L01l61K1
824i3L84l14j97L93j06k95L68pl74L62N5m73L23J85l73J02K45k89K8K77k55J8
846c6K16j50r7K22m5j16R7q6J8J0m9J13m1p8O1P5j42m7K08l3j82J89jk50K47J9
872A22k44K21M7l26K73J17l72J61K09l39J7L57l53L9K74k32n3K45j21j13K11j54
894a4l9J55j23n7K20j17j07J74o4o5QJ36j08j7P9j8l2O1p6j7R5p5n1J70q6j05
920g3J76r7o4K11j63q8K13j30NK06k14j90L99k09j76L94r4l42L35J5l12K83P2
$$ plain form
943 157 -188 -52 165 -106 -28 164 -89 -62 144 -79 -147 89 14 -51 83 -12 -62 36 14 -47 51 -26 1 75 -95
968 -95 9 56 -84 -30 117 -16 -18 72 38 -108 -9 83 -113 -50 152 -105 -52 135 -66 -53 134 -19 -124 133
992 133 -7 -186 123 6 -154 138 6 -147 107 18 -154 134 40 -149 76 2 -108 36 29 -120 76 -1
1014 -1 -63 40 69 -66 58 64 -55 5 68 -26 -16 40 -49 -38 109 -12 -28 29 10 -45 104 0 -98 108 -32 -79
1040 -79 48 15 -118 66 63 -155 67 128 -136 27 144 -127 -18 179 -78 -64 156 -92 -97 155 -11 -74 144
1063 144 15 -78 62 -2 -117 83 10 -56 65 -50 -118 135 -40 -93 108 -1 -101 150 -1 -122 157 43
1085 43 -73 115 43 -97 69 35 -178 22 89 -29 -22 120 21 -52 100 -19 -106 74 108 -180 61 68 -164 34
1109 34 96 -170 54 85 -66 -4 65 -101 68 44 -142 15 109 -117 9 113 -87 10 94 -143 3 128 -67
$$ packed form
943A57l45J36K17k71P8J92k53K7K06k23o8K36p5o5J34r5n0R8k2o1R8p7K7P4j70
968i5J04M7j40N4J47j33kR0l4j46R9R2j96O3K02k57N3J87k01J3J87j53j05K57
992A33j40j79L09j17j60K92j32j53K54q9j72K88r4j89K25p4j10J44pj49J96p7
1014ao2J03K9j35J24Oj19O0O3r4J0N6q9J1J47j21j6N7j9n5J49j04r8K06j40m7
1040g9J27l3j33J84lk18K22O1k64J63J17k71J09J97k57J4K20k48nK52j66o3K18
1063A44j29r3J40o4j15K00p3o6J21j15o8K53j75n3K01j09j00K51j51j21K79j14
1085D3j16J88p2j40J66l4k13K00O7j18PJ42r9p3J52j19q7J80L4k88K41Pk32J98
1109C4O2k66K24L1j51O2O9j66J69k4j86J57R4k26J26J04k00R7Q4k37J46J25j95
$$ plain form
1132 -67 -25 46 -40 3 114 -17 -68 60 -20 -94 108 41 -102 101 49 -124 85 89 -33 111 41 -115 21 80 -121
1157 -121 42 84 -159 -33 110 -55 -22 160 -114 -35 103 -42 -48 68 22 -71 32 -35 -45 76 58 -45 75
1180 75 43 -99 72 90 -106 65 80 -35 107 99 -75 61 101 -127 66 73 -143 6 101 -82 30 132 -69
1203 -69 15 139 -64 -23 94 -45 -71 116 2 -99 46 63 -71 55 69 -89 42 82 -50 56 50 -94 -18
1226 -18 42 -61 19 95 -8 -42 71 -48 -15 114 -86 -7 84 -50 -6 110 -54 -11 99 -30 -149 108 -23
1249 -23 -25 95 14 -66 109 1 -105 88 52 -59 31 115 -90 40 86 -96 -48 116 -84 -72 99 -34 31 53
1273 53 -15 -22 79 -26 -33 134 38 -62 35 -36 -47 56 37 -93 35 31 -43 13 75 -97 -1 81 -95 40 61 -69
1299 -69 58 51 -113 28 79 -60 -27 115 -96 -43 128 -112 -55 115 -38 -104 89 -19 -65 99 -37 -46 62 -3
$$ packed form
1132f7M2P1q6M3J11j31n1J28q0p4K02o7j43K03n2j73K09Mj22J44p0j56J36N9k01
1157a21J63M2k43J26J43j65L3J82k74P9J38j45oJ16m6r3J03o7j0J21j8j03J20
1180G5l2j42J71J8j96J71J5j15J42qj74J36M0k28J93Pk16J49R5j83J12J02k01
1203f9Q4J24k03M1J17j39k6J87j14j01J45J7j34J26J4j58J31M0j32J06oj44P6
1226a8O0j03Q0P6j03l4J13j19L3J29k00P9R1j34M4J16j64M3J10j29j19K57j31
1249b3kJ20q1q0J75j08j06J93l6j11R0Q4k05J30M6j82M8J64k00J2J71j33O5K2
1273E3o8pJ01j05pJ67r6j00R7p1j1J03j9j30J28mp4N6O2j72R6Q2j76J35K1j30
1299f9J27pj64J41N1j39L3J42k11N3J71k40N7J70j53o6J93j08m6J64j36rJ08o5
$$ plain form
1323 -3 -100 44 -6 -79 -54 48 -73 -38 24 -34 -17 92 -68 -64 2 -32 -16 61 -27 -55 58 -22 -58 108 -16 -112 102
1350 102 -33 -74 50 19 -74 77 7 -86 82 28 -84 71 66 -63 97 48 -34 42 66 -79 -22 69 -115 -54 88
1375 88 -104 -50 64 -36 -55 100 -90 -90 118 -52 -132 67 -38 -119 21 36 -31 48 7 -7 8 30 13 29 1 -54
1401 -54 -5 -9 -33 -1 37 -64 11 37 -50 8 69 1 -28 24 -9 -47 66 -23 -113 107 3 -80 88 -21 -130 40 30
1428 30 -71 25 -1 -72 18 21 -52 26 52 -61 -46 77 -69 16 -32 5 19 63 -47 -23 74 -80 -46 78 -31 -55 44
1455 44 -52 -66 129 30 -88 5 60 -82 1 2 -43 34 13 -80 18 2 -120 48 82 -77 25 93 -113 -35 54 -68
1481 -68 -38 67 -92 -75 74 -16 -83 92 47 -49 84 -33 -62 59 35 -121 35 52 -60 -25 89 -56 20 -1
1505 -1 -51 -27 18 -43 2 65 -110 -16 52 -90 32 76 -74 -8 42 -36 -53 113 -50 -61 112 -29 -97 58 7 -94
$$ packed form
1323cr7J44n0p3K5J02j21L5O2n8J7J09j60MO6l4J6P7q8k8J13q0l6J66j24r6K14
1350A02j35m1J24l1r3J51p0r3J68n4j12J55nj29J60m9q2P6K4j45N7R1j84O1J42
1375H8j92N4J14j00j9J55j90%K08j70q0J99j05q1J40J5o7P9m1j4J5K2j7J6k8n5
1401e4M9mk4L2L8j01P5K6q7N8O1o8k9N2l3l8J13q9r0K20j04q3J68j09j09J70j0
1428C0j01R6k6p1R0Lp3P8K6j13J5J23j46Q5m8L7J4M4j10K4R7j54L4J24j09k4R9
1455D4r6j4J95r9j18R3N5j42Q3Jm5P7k1r3R8j6j22J68L4j59J02O8k06P8Q9j22
1481f8L0J05j59J7J49r0o7J75m5r6J33j17k9J21k4j56J56J7j12L5J14j45P6k1
1505an0K4M5o1M5O3j75R4O8j42J22M4j50O6N0p8j7J66j63j1J73j41o8J55n1j01
$$ plain form
1531 -94 69 82 -112 30 74 -101 51 52 -30 -104 22 4 -38 60 -38 -9 54 -33 55 61 -82 23 36 -61 27 80 -59
1558 -59 -68 79 -25 -101 57 33 -49 81 55 -77 65 64 -27 -7 -6 -58 -4 79 2 -49 72 -23 5 2 5 13 48 -50 12 37
1588 37 -79 -3 59 -67 -37 115 -39 -83 94 -6 -136 75 27 -90 45 123 -92 5 48 -42 -8 52 2 -76 63
1613 63 -39 -23 51 5 27 7 20 22 38 -42 -15 -6 -54 -20 74 -79 -25 45 -52 -61 111 26 -146 92 20 -125 5 87
1641 87 -84 -36 50 -73 -26 82 -15 -32 45 52 -47 -66 6 -26 13 -24 39 39 -52 41 73 -89 11 138 -96 -42 85
1668 85 -50 -92 23 9 -108 33 35 -78 60 51 -16 25 64 -61 -75 46 5 -87 -22 34 5 12 -10 6 -26 -11 15 17
1696 17 -15 -51 62 -53 -10 77 -46 -71 89 -23 -100 82 89 -91 38 71 -81 -19 60 -24 -64 66 24 -64 29 21
1722 21 -57 42 37 -56 -13 11 -32 22 -54 -14 48 -43 -5 54 -30 -11 67 -33 -38 71 -6 -104 71 95 -132 28 77 -101
$$ packed form
1531i4J63J3j94J42M4j75J52Jq2p4J26j8m2R8r8K9O3q7Q8Oj43J05J3r7Q8N3j39
1558e9rJ47j04p6J58k4q2J30k6j32J42jr1K0Jn2N4Q3p7n1J21r5K8lLQL5r8O2K5
1588C7j16P6O2j26L0J52j54m4J77j00j30K11m8j17J35P8k15R7M3r0L4O0n0p8J39
1613F3j02J6P4m6K2k0J3KJ6q0K7Rm8L4R4j53N4P0r7rJ72q5j72K38p2j45J30Q2
1641H7j71M8Q6j23M7J08r7j7P7Pr9j9P2l2L9l7O3%r1R3L2j62J00J27k34N4J27
1668H5j35m2J15j4j17J41Kj13J38ro7M1L9j25j4J21m1r2O5N6k9Pk2J6l2J5K6K
1696A7l2l6J13j15M3Q7j23k5J60j12p7J82Pj80J29L3j52O2P9q4m0J30m2q8R3q
1722B1p8R9nr3M3K4m3N4p6M0O2r1L8N9q4J9P8j00nJ09p7r8J75K4k27J60M9j78
$$ plain form
1750 -101 -24 114 -51 -61 134 11 -63 36 46 -71 25 67 -71 5 -39 9 -26 -44 58 50 -12 14 65 -55 -68 122
1776 122 0 -122 48 2 -116 51 45 -110 -50 111 -66 -30 73 -10 -75 93 4 -63 68 25 -57 9 31 19 -14
1801 -14 -7 8 -5 16 10 1 -67 -84 88 -36 -72 76 50 -111 73 97 -22 -7 89 -105 -68 124 -10 -80 40 -3 -113
1828 -113 18 91 -42 -1 32 -57 -60 85 -2 -5 -19 45 -39 -80 40 28 -26 -41 52 -9 -57 -1 29 -123 -9 56 -64
1855 -64 -15 74 -68 -58 79 -26 -64 26 -1 -129 59 25 -28 -1 7 -23 -35 20 4 32 -15 19 16 -60 2 25 -28 -21 88
1884 88 -1 -59 34 32 -114 11 134 -63 -39 133 -68 2 99 -21 -101 57 62 -94 -17 28 -48 -55 37 -13 -56 45 9
1911 9 -38 -20 15 -7 13 -34 43 -1 -33 116 10 -85 17 54 -47 -30 99 -69 -39 85 -19 -123 71 33 -78
1936 -78 33 30 -15 3 37 -15 -29 18 42 -44 37 48 8 -38 37 19 -13 -56 7 -16 -51 74 66 -82 21 31 -93 32
$$ packed form
1750a01P7J38j65j0J95j23p4R9J0j17R6M2j38P6m4M8l5j8J02qo2K6N1j20j3J90
1776A22j22j22J70m6j18J67oj55O0J61j77L6J03q3o5J68q9o7J31m3q2O6K2j2l3
1801a4PJ5j3K1oro8j7J72j24l6J48k6j61J84K4j19J5R6j94L7J92j34p0J20m3j10
1828a13J31P3j33M1L3q9lJ45q7lj4O4q4m1J20j2n4j5R3o1m8N6L0j52J14O5j20
1855f4M9Q9j42J0J37j05l8R0k7j28J88l4n3K7Ql0j2N5j6K8m7L4lp6O2K3n3PJ09
1884H8q9n8R3kj46J25J23j97K4J72k01P0R7j20q0J58Nj56P7M5p6pR2n0m3J01l6
1911Im7J8L5k2K0m7P7m4l2J49j06r5J02L7j01J7J29j68L0J24j04j04J94l8j11
1936g8J11lm5J8L4n2j4M7K4q6Q1J1m0m6P5j8l2m3O3k3l5J25qj48J03J0j24J25
$$ plain form
1964 32 55 -25 -50 50 7 -79 71 18 -17 12 89 -48 4 42 -20 -43 56 23 7 -35 41 25 11 5 15 8 -37 40 -18 -53
1994 -53 45 46 -38 48 63 -39 -12 116 -49 -27 50 -23 -81 15 28 -65 26 2 -29 24 52 -3 -25 -24 -1 -12 32 0 48 1
2024 1 -7 9 -23 -103 26 25 -18 59 23 -74 -17 63 -43 -33 63 14 -113 0 -17 -67 55 100 -54 -7 26 -47 -79 51
2052 51 -11 -36 20 26 -8 -9 -33 45 -60 -59 15 20 -29 40 37 -84 27 89 -39 22 58 -24 -43 55 14 -98 74 31 -34 25
2082 25 -13 -32 26 41 -45 3 20 9 -28 64 25 30 -19 -32 49 33 -8 8 15 -38 28 76 -33 -7 11 -19 -22 13 -22 -72 74
2113 74 14 -91 24 23 -55 31 19 -44 10 6 -86 4 24 37 6 -1 -9 16 35 0 2 -30 -30 51 -21 -63 21 -12 -77 -22 53 -52
2145 -52 -63 40 11 -64 9 0 -67 18 66 -29 12 36 -46 14 22 -15 -12 11 -26 37 0 -23 12 18 -50 79 45 -54 43 34 6 -53
2177 -53 25 -49 -38 41 -8 9 48 -5 -28 61 36 -36 -21 -2 -29 -6 43 -48 6 71 -56 -32 -47 -28 21 13 -29 -42 25 13
$$ packed form
1964C2K3q0k5J00m3q6J50n3l5K9P7j37N2L8o2k3R9l3j6m2P6j6j4oJ0pm5P7n8l5
1994e3R8Jq4Q6J5j02K7J28j65K2P7p3n8R6J3r3R1k4l1N3K8n5k2JK3j1M4l2M8m7
2024AqJ6l2q0J29jm3P7l6r7N7Q0j06J0R6m9j27J13j7n0J22M5j54M7L3p3l2J30
2052E1o2k5N6Ol4jk4P8j05JP4Nm9O9lj21J11O2j28O1L6q2j9R8m1j12J72m3o5N9
2082B5l8j9N8J5q6M8J7j1l7R2l9Nm9j3Q1j6m1J6Pn3O6M8j09K6J8l0lL5l5n0J46
2113G4o0j05J15jp8Q6j2o3N4mr2R0K0J3l1pqK5J9l5Kl2%Q1p2m2Q4l3o5N5P5j05
2145e2j1J03k9p5P3ro7Q5M8r5M1K4q2O0Ql7LK3l7O3l7k3L5Oo8J29l4r9R7rk8n9
2177e3P8p4J1P9m9J7L9n3k3Q9k5p2J5J9k7K3M9r1N4O5j27K4j5J9M9qm2j3O7j2
$$ plain form
2207 13 2 16 -38 -49 60 -44 26 27 -36 -18 39 23 -30 52 -7 -50 84 45 -70 8 52 -22 9 34 -31 -38 30 -43 -54
2236 -54 26 -37 9 55 -24 5 28 -47 6 -24 -68 35 22 -65 -23 -1 -60 -27 86 -2 -17 -5 30 11 36 11 -69 24 -17
2265 -17 -31 -8 38 -8 -9 63 -22 3 2 17 -4 56 -20 4 -24 -26 -90 -6 4 -4 23 -9 -19 12 -46 -120 47 -15 17 53 -8 -44
2297 -44 13 77 -15 29 71 -37 20 51 -43 -11 55 13 16 -21 -47 20 26 8 7 47 -53 -52 63 -69 -7 66 -20 16 33 45
2327 45 -49 16 35 -32 2 56 -59 17 -7 -7 32 38 -6 29 58 5 7 -9 -57 -25 22 -25 -24 26 1 -10 59 -28 3 12 19 -37 15
2360 15 6 -62 7 29 -13 18 -10 -38 26 27 -24 0 66 -35 57 25 20 3 57 20 32 54 -28 -19 -19 13 -1 -4 -10 -24 44 -15 16
2393 16 12 -13 -103 1 -26 -62 -35 1 -67 -34 17 -31 -31 -1 -47 12 -31 -41 12 23 7 40 16 -57 -1 37 18 -31 70 -27
2423 -27 25 4 -22 -7 12 13 -17 44 27 -131 43 27 28 19 -52 15 -15 33 -21 3 14 -121 60 -10 5 30 -9 17 10 -5
$$ packed form
2207A3j1J4n4j1J09j04P0Jo3J8N7j6n3Q2n9m3J34l9j15P8M4p4L1K5o5pO8p3j1
2236e4Q0o3M6M6p9K9K3p5N3l0m4J03j3q7M2K2n9L3J13q8j5J2L5j9K5k5q0R3m1
2265a7j4K3M6m6jP2q5K5jJ5k1O0p6K4k8ko4Q4J0qK7l2j0L1n8p4J67o2L2L6o1l6
2297d4N7O4r2M4M2j08N7L1r4L2O6m2Ll7k6O7Oj8jM0j00JJ15j32O2P3q6L6J7J2
2327D5r4O5J9o7L4N4j15P6k4%L9Om4L5K9n3Kj6m8L2M7m7JN0k5j1O9q7L1RPn6N2
2360A5ro8O9K2m2L1k8k8O4Jn1K4O6j01R2l2nj7N4l7J2K2q2R%L2j4loj4O8n9L1
2393A6mk5r0J04k7l6K7L6o8L3N1m8%L0m6N9m3j0N3J1j6L3k4p3N6L8j9m9J01r7
2423b7N2k1k6J5J9Jl0O1j7j58J74j6Jrp1O7l0M8n4K4J1j35J81p0J5K5l9K6pj5
$$ plain form
2453 -5 -60 16 27 79 -10 59 -4 -20 -16 -3 4 47 3 -22 2 -19 -39 25 -17 11 -10 10 -47 -68 -7 -105 10 12 -97 -5 10
2484 10 -39 3 41 -8 -37 -5 -37 -51 20 -49 -3 6 -4 -30 23 -1 -49 35 -28 -71 -1 -22 -44 12 42 23 28 13 -41 3 44
2515 44 -24 0 28 -28 15 -14 -18 -36 60 -39 2 57 -54 -18 -15 -20 62 0 -57 -68 80 -25 -44 24 35 14 11 2 30 -17 -5
2546 -5 -42 24 -39 -44 9 50 16 -60 10 -17 -12 -7 -40 -45 11 -8 -86 9 6 -28 52 -9 -6 53 23 -2 13 -28 -14 63 33 -28 -2 19
2580 19 -20 -34 15 27 -10 63 -23 27 20 -1 20 104 -32 -21 47 -14 -18 28 3 57 17 -8 -10 22 9 11 26 -7 -4 111 18 -15
2612 -15 56 49 -32 -14 29 17 13 40 19 30 94 -61 -5 2 -24 6 43 -23 -27 55 -62 1 29 -17 5 2 65 -108 13 8 -41
2643 -41 21 -1 -13 56 28 15 -12 68 -45 49 26 -60 29 42 -44 4 -51 -74 -13 17 -75 -6 28 -47 -12 58 -1 -18 1 -11
2673 -11 -24 -8 64 -25 29 -22 -69 -1 -17 -60 19 48 -37 -8 -20 -4 7 13 -44 44 -5 -2 -20 62 18 9 -4 -11 -52 47 6 17
$$ packed form
2453en5P6J1N2q9O9o3j6MJ3PM3m4k5K4k1k0O4m2K8k1K0n7k1O1r8J15Kj09R2J5
2484A0m9M2L8m9k9L2l2j4P1o9M6Rj0k6N3k4m8Q4o3m3P0k1k2N6L0j9Nj5n4M4M1
2515D4o8K4K8n6M3k9mj8R6r9M1N5j11L6LnQ2o2n7j1J48j05j9O8J1k1lrK8m7J2
2546el7O6o3nN3M1l4p6P0k7NNl3nN6j9p8R5ll4Q0o1LN9l0k5J5m1J4P7l0o1K6K1
2580A9l9j4M9J2l7P3q6N0pk1K1Q4j36J1O8o1mM6k5N4m0k5kL2j3KJ5l3LJ15r3l3
2612a5P1pq1J8M3j2mK7k1J1O4j55N6Pk6L0L7o6mQ2j17O3K8m6K2lO3j73J21nm9
2643d1O2k2j2O9k8j3k7Q0j13R4k3q6Q9J3q6M8n5k3O1L0r2O9L4p5L5P0n9j7J9j2
2673a1j3J6P2q9N4n1m7O8j6m3P9K9q5K9j2J6J1On7Q8m9Lj8Q2m4rj3pm1R9m1J1
$$ plain form
2705 17 2 -19 7 -32 6 -54 59 13 -74 14 36 -55 -14 -16 -20 -19 71 -40 24 33 -10 -20 5 -34 -50 7 -34 5 0 -2 7 30 9
2738 9 -24 49 -51 8 40 13 -10 42 38 -44 48 -30 7 -5 -40 -41 33 -6 -43 68 27 27 14 8 -2 12 -10 -13 11 17 -17 32 26
2771 26 -32 -19 -2 7 -29 23 6 -7 27 73 5 41 -30 -45 1 -36 -63 6 3 -17 -1 3 -48 11 10 -43 -30 32 -34 -14 -8 -81 16
2804 16 0 -66 -45 13 -34 4 5 -7 -31 32 20 46 30 27 -36 19 60 -26 33 -18 22 5 -11 13 36 45 -9 42 -11 -40 8 45
2836 45 -43 -13 75 -2 -45 24 -32 4 11 -42 -3 1 -39 -72 30 22 -15 24 5 7 -19 11 0 44 14 28 11 -7 -23 -12 43 -64
2868 -64 -56 2 -9 -19 30 -28 -24 -28 -27 -9 31 -7 -25 32 -29 -29 22 5 57 39 -79 8 -5 19 -37 5 15 -59 17 17 2 -9 7
2901 7 47 -23 -30 -6 -19 62 -35 19 46 -34 6 -24 -1 -12 28 15 -19 17 -33 -23 27 36 8 16 12 -25 30 55 -26 -38 44 46 9
2934 9 38 -29 31 31 -25 1 59 -17 11 28 -42 7 -39 -27 9 13 -4 -18 19 -12 -6 46 10 -25 -2 -38 19 16 -6 -36 1 9 -63
$$ packed form
2705A7j5k1K6l9L8o0J13m6q7Q8K2r1M1kmJR0j11O4Rm3j0K5l9j6N7m1L9nkRK3k1
2738Il3P3j00N9L2k7k3N2mq2R2p8L7j2l5jP4l9l7J11m1%j3oj0J4k2lK4Ol4M9o
2771B6n8J3J7Rl6N2j7j3L4M6o8L6p1j5M6l7k7O9lk0J6Mn1N9jn3J3O2o6K0Op3R7
2804A6j6o6K1N8m7L8Jj2k4O3j2K6j6lo3N5M1q6N9n1M0j7j6K4K3Rn4N1n3k9M8L7
2836D5q8L0Q8p7m3O9n6L6Pn3L9Mm0l3J02ql7L9j9Kk6L0j1M4l0J4j7j8j6J1N5j07
2868f4QN8j1j0M9n8MmJJ8M0l8j8N7o1%N1j7N2j8j18Q7j3K4n6M2J0p4P6%j5j1J6
2901GM0p0pK4j3Q1r7N4K7q0M0l0K3j1M0j3l4L6n0J0N0Rk8Qml7N5K5q1j2Q2Kl7
2934IK9o7O0%n6K6N8p6K8J7p0M9m6J2L6Mj7j4L7l1ON2l6l5K3l6N7lk2l0L7Qp2
$$ plain form
2967 -63 -19 44 -40 28 17 -66 -34 8 -36 -13 14 -59 -21 -7 12 -41 -35 -22 -64 54 1 9 25 -35 -24 71 -21 -121 -35 -52
2997 -52 -69 -39 -8 -37 -14 -31 10 -48 55 -24 -13 27 -14 -25 17 11 57 28 -19 -2 28 26 -12 -51 -49 -16 -1 -44 -30 63 31
3028 31 -18 2 16 -12 -1 20 20 12 43 20 19 20 1 -5 -26 -27 -46 44 -14 6 24 -25 -12 -6 41 -28 12 -17 -50 26 20 -39 -15 -31
3062 -31 -20 41 22 -96 -24 29 -30 35 15 -48 23 29 1 34 -11 17 -21 -11 -61 -5 66 -11 25 29 1 1 31 -60 -13 5 -21
3093 -21 -48 2 -30 37 10 -23 -36 18 33 -44 -40 -12 -50 -2 36 -81 -2 -6 -28 11 -16 -32 46 21 -6 10 31 -40 -31 -10 -48
3124 -48 -21 -3 31 -3 13 -11 -19 33 6 -14 60 63 -20 -6 35 -5 31 4 -43 -25 -3 -25 19 58 -45 -7 -17 -33 -47 38 -73
3155 -73 -17 10 -12 -31 33 45 -8 4 -19 12 0 5 -50 53 57 -37 58 52 -36 13 -14 -57 -3 17 -8 -2 -23 -10 -6 -43 -19 -47
3187 -47 36 29 6 49 -7 -17 3 12 -59 11 28 -37 14 -12 -22 24 9 -28 18 -16 13 0 2 -52 61 -19 -19 46 23 -27 -22 40
$$ packed form
2967f3M4O3q4O8j1q3L2M2m4K3K7p3L8J4J9n3OJ3m2J18n3QJ6o0J1R5r2j00Q6j7
2997e2j7L0L1k9K3j7M1n8J03p9J1M0m1j1M2oM6k9m7J7L0kl8l9KL3J5m3J4R3l2
3028C1m9K0J4k8J1K1%qL1k3jJj9ok1jj9R0n8K0J8m9J3OM7o9M0k9l3P6on9K4j6
3062c1J1O1j9j18P2N3n9O5k0o3P1Ok8L3m5K8l8J0n0N6P1p7L6Mk8%L0r1M7J8k6
3093b1k7N0l2O7k7l3j3N4J5p7MK8l8M8L8j17P9mk2L9k7j6P8k5k7J6K1p1RK1l8
3124d8K7J8L4l4J6k4qN2k7k0P4Lq3J4M1m0L6k7m7J8K2k2M4L9j03L8j0j6j4Q5j11
3155g3N6K7k2j9O4J2n3J2k3L1j2Nn5J03Mr4R5oq8M9k7m3N4K0k5Ok1J3Ml7K4k8
3187d7Q3pk3M3n6j0K0Rp1P0J7o5N1k6j0M6j5l7M6l4K9j3Kn4J13q0%O5k3n0NO2
$$ plain form
3219 40 -48 27 65 -7 -23 1 -19 8 24 10 -20 42 20 -31 55 -65 -17 9 19 -2 30 6 -5 44 -19 -19 4 15 -70 -14
3249 -14 56 -33 -21 45 7 -3 -41 -50 8 29 -38 2 63 -35 25 28 -30 -7 40 14 -17 44 8 -46 -9 -20 -60 21 14 -43 -30 23
3281 23 -14 36 22 13 23 -27 17 -16 8 -32 31 28 -28 -26 39 4 -37 3 -32 -1 -46 -10 -30 -37 19 4 4 14 -56 28 14 17 13 -61
3315 -61 -59 1 15 -35 49 75 -15 66 28 -19 -9 16 7 -38 35 -64 -5 46 14 -19 -27 27 -4 36 14 -9 6 31 57 1 6 -18
3347 -18 80 37 16 54 46 -37 -10 46 -55 -17 56 -39 10 -5 -21 -4 -9 -39 -8 20 -7 50 30 -6 1 46 -4 -28 30 6 -26
3378 -26 -24 17 -3 22 -16 -49 35 -5 10 7 31 3 -58 -51 -95 -10 5 -37 -33 36 -15 -36 13 -9 -23 -26 -75 -27 52 -50 36 30 0
3411 0 5 53 -9 28 29 -17 -15 34 -19 -15 38 -10 -75 40 38 9 18 -15 -69 -5 32 -19 -31 54 46 -36 43 -4 -29 -20 -32 -22 -22 8 17
3446 17 64 -21 -28 17 -4 -46 23 16 -103 -2 7 6 -12 -13 28 9 43 11 22 62 16 25 39 -7 -15 14 3 5 4 -16 -30 7 -35 10
$$ packed form
3219D0q8P5L8p2j6K4k0K7J6j4l0O2k2n1Q6j20M8K6J0k1L2k4j1M9o3%K3J1q5N6
3249a4P0q9J2O6l8j0l8rN8K1o7M0O1r8O0Ln8K3M7k6l1O1l6n4L7j1m0Q1pn7J3N3
3281B3l7N0j4rJ0n0M4l3K4m0O3ln6KO5l5m1M0l5L1m5L6k0pN6j5%J0p0Q4j4Lmp4
3315f1KO0J4n0Q4K6r0Q1l8m7J0K5rm5P3r9N9N1l2l3qN4l1M0k2k3J5K5K6n6Nk4
3347a8R8m3k1L8qq3K7N6j01L8P3r5M9j5j6J7nl0L1K8k7N7k0l6PM5n0k4N8k4l2
3378b6KM1k0K5l8l3Q4m0J5lK4k8o1Pm4Q5J5m2MO9n1k1M9k2j4lm9M8P9j02Q6ol0
3411@NM8o2L7Jm6KM9n3MN3m8o5J15kk9Rl3n4O4L7n1j2Q5qq2P9m7k5Rj2J0%L0R
3446A7M7q5pM5k1m2O9pj19J01Rjj8jM1j9L4l2J1M0m6RJ4m6qK9j1Kjk0j4L7m2M5
$$ plain form
3480 10 22 -32 -6 8 0 2 -36 -25 -40 9 -4 -2 15 19 -8 42 96 19 -17 -5 -14 -3 83 33 62 51 10 -6 5 33 7 44 -19
3513 -19 -2 28 51 -33 23 26 -1 32 -9 11 16 38 -32 -12 42 -16 33 31 -21 -6 57 -65 22 42 -52 -1 7 -46 -19 12 -3 -3
3545 -3 8 -15 -8 16 -1 -10 -27 -16 -2 56 4 6 50 14 -59 -3 12 -96 27 14 -41 12 -35 -11 -24 8 -44 -31 5 -49 -16
3576 -16 18 20 -19 52 28 20 6 28 11 11 14 -7 -6 13 -34 0 17 -14 28 -30 5 34 -8 -13 62 43 -21 15 -24 -23 -1 59 -33 -4
3610 -4 -6 -30 -33 -24 8 -11 47 -8 -38 8 1 4 45 -9 -45 55 -50 -45 -22 -24 -18 -31 4 -27 4 32 -24 41 8 -5 -21 11 -12 15
3644 15 19 -30 -53 27 -40 11 3 25 43 12 -43 -27 33 -7 57 24 18 -13 4 -39 44 58 38 5 -12 -8 -28 33 47 -84 -18 -6
3676 -6 -65 -19 -1 14 -48 25 -15 -34 13 -7 40 -58 11 7 6 35 -44 3 30 -15 15 -38 -22 47 13 -1 23 -2 -10 -35 58 28
3708 28 17 -11 -72 -53 -5 -27 -22 62 -65 -51 18 -64 8 47 -40 -49 -7 0 -32 25 -23 10 -34 -25 -12 26 -22 -49 1 -12 -47 -20
$$ packed form
3480A0J2n4K6J4qKl8J1j5M9j3KJ7Mk7N0N4p7l6J2rJ1Q6n0K9j1m1j6J1K8k6L7o3
3513a9J7L0K3q4N6Lk7L3m1K0NK2p0K0N4n8M9kn2J5O3j22Q7K0r4N1Qn3K7L1j5%
3545cJ1k3PK4j7rj7J1J4N8n2KM4l6p3N6J5j08J23j3n5N3m7K4j3L2n2J3L6n4L3
3576a6L4Kl9P1k4qj4K2j7%Lk1JJ9m7L4J7l1M2n8L5K9m2nP5j9o4L6l9JK2O0r2K9
3610dkk4lRL2j9N8n5l0M6pLM1n4l6J00j05NK3kOj3L5l1L1K8n6O5l3j3j6L2k3K7
3644A5Mm9k3Q0o7N1qK2J8l1n5J6O0m0O4l3ol1J7m3Q3J4k0l3j7Mk0O1J4j31O6J2
3676fn9M6J8J5o2P3m0j9M7k0M7r8O9mjK9p9M7K7m5L0n3J6O9l4j4K4k5qk5R3l0
3708B8j1k8o1J9M8k2NQ4j27J4O9q2P2L9q7rM2Pl2N7m8L3m4RJ3L8m8k7N0j3l5K7
$$ plain form
3740 -20 11 -26 -2 34 -32 -14 19 -2 15 13 13 3 -12 -31 -20 22 -40 14 28 -16 -3 -10 -1 -60 1 -25 -14 -28 -32 -79 -45 49 -17
3773 -17 46 21 -19 39 44 12 4 -25 -7 39 7 19 -27 44 -17 -1 19 -23 -33 -36 -13 -41 39 -10 17 -15 -6 -25 75 -56 20
3804 20 37 -58 -17 -12 26 -45 9 15 1 -34 -26 -12 -48 5 6 30 12 -51 -6 -29 10 -7 51 27 33 -2 13 -53 -15 -54 -32 -1 -16
3837 -16 35 6 48 -21 36 -49 -10 19 -40 22 -29 62 -10 21 29 2 -32 63 22 -37 33 -63 20 23 2 -50 8 -34 -4 -3 53 -18
3869 -18 47 18 -14 39 -31 -38 -14 -21 -69 -19 19 7 -33 59 48 -24 37 -36 -35 -59 -31 7 31 3 -17 57 12 -44 8 -59 -54 0
3901 0 8 31 8 0 -65 -12 55 3 33 13 0 -41 -21 -47 10 -55 31 -20 -24 33 -26 -5 11 -9 12 -22 12 -15 -8 0 87 -65 1
3934 1 45 -24 -21 -8 10 -39 51 -5 -38 18 -21 -6 -7 -29 -8 -44 35 -5 11 27 -3 -28 21 -40 -35 68 -35 -47 -25 11 -15
3965 -15 21 -1 3 -31 -61 -11 -20 -41 27 29 -17 -51 -24 3 -54 79 -2 22 -61 33 -75 29 36 27 -42 -16 -13 -77 16 -31 41 -1
$$ packed form
3740b0L1l7K4L6o6J8L3k1J7k%j0j5j9J1M2o2N4J4m4J3pRn9O1k6J1j4mm7L4R4o6
3773a7O3k5m0N8Nl2qk9J8M6l2J2m6P1o1J6K0m2j0lK3k8Q0m9K7l2Rj9J00j31P6
3804B0J7r5M1NL8p1N4Oj4l5QJ4l6N3JK4j8o3M5k3L9j7N8k4Ol5J5o6L8l9K2L1j5
3837a6N1k9M2o9N7q5L9K9n9O2n1R1p2L1Qk7l4R5m1n9P0r6Q3Lk1n2N8m2L0JN6p1
3869a8O5k9l2N3p0pK4pm8N0L8j2m0R2j1p2O1p3Jk4K8L8K4k8k0P4m5n6N2o7NN4
3901@QK3k3qo5N3O7n2L0k0j3m1K0k6N7o5Q6n1mN7n9K1J6k0K1l4L4k7PQQ7j52O6
3934AM4o9LJ3J8m9R0n6l3N6l9J5jk2K1l6P9m0J6J6l0k5M9o1NJ03j03j2K2L6k6
3965a5L6k2Ml4l0N0rk1O8Km6l4K7K7n7J33q1K4q3R4j08J04Pro9K6Lo4R3m7P2m2
$$ plain form
3997 -1 -28 -31 15 7 -46 13 43 -30 67 -48 -27 22 -73 -38 52 -13 -20 4 45 -52 8 -7 -10 45 22 -31 -7 -5 4 -9 55 -13 -18 18
4031 18 -1 -16 6 -38 25 7 -28 -2 -25 -76 20 14 -9 -60 41 -25 -15 37 -30 -36 1 -5 -23 2 7 -5 7 -7 0 -3 32 -20 -31
4064 -31 19 -56 -35 19 -30 -32 32 -17 -12 24 8 -10 44 1 20 -16 -77 -33 7 6 -14 47 1 -22 -25 -52 -3 -5 -18 -12 26 -23 24
4097 24 -21 -18 -34 -35 51 9 -11 37 -47 2 1 -11 13 -14 52 -20 -37 -8 -52 40 -18 -21 -7 33 -3 11 -3 -49 6 11 -49 3 -34
4130 -34 -3 33 11 20 57 -15 -7 -9 -20 -18 -17 -1 -25 21 21 -25 -38 32 -21 28 -4 28 -74 2 13 -81 -39 -11 11 36 -12 3 30
4163 30 -52 5 -44 31 -5 -20 3 -9 37 43 -4 -36 -50 44 23 5 -18 3 18 -10 26 -36 -23 -29 -17 24 -88 32 -9 2
4193 2 -20 17 -64 3 28 -31 -19 -11 -27 -14 -3 6 -3 -20 -14 -5 -1 -7 -39 -11 21 -40 0 -67 -16 -9 32 19 40 29 -40 48 9 -11 -3
4228 -3 33 -18 -6 -23 -42 52 32 -76 -33 -14 15 30 16 3 -45 4 -20 -39 -30 -12 21 66 -11 15 8 -10 -27 19 40 -15 16
$$ packed form
3997ak7lM6qn3N9L0p3R7j15K1M9r5L5R0o5pK4M1r7O0j5lN5k3n3K4KRj3O4o8nL6
4031A8j9j5K2m4O3j8l5K6k3n1R6ok3n1J01o6J0N2o7oL7oj8K5Nj2J2j4PlL5n2j1
4064c1N0p5K1N4m9kO4m9NL6j6j8N4m3J9l6o1M4M0jk0O1m6k3lk7M9kj3OL8m9M7
4097B4m5Lj6jQ6m2k0M8q4M9jj2K4k7O6p2j7K9m4R2n8lJ4M0l6J4j4m6N5No0N2l7
4130c4L1L6k2RL7p2Qkj1KJJ6k4M6%m6j3P0n3M9l2L2j02P6J1r4M2K8K2K5m8J5K7
4163C0q2N7m9P5l6j5K3j2M6Om7l2j4R4k1j8k3K1J5k8L6o2J3oJ2M1j12J20m1J1
4193Bk2L7q1O7K5n9J2Qj6J3J1Rrj7ORMol2K8L2o1M0o7N1PM1j3K1j1o9Q8l9k0Q
4228cL6n1J2j7j9R4k0j08M3J9K9J5j4j3m8M9k4j9RJ8L3M5p7K6pj8j7M6K1n5L1
$$ plain form
4259 16 31 12 32 -9 -76 -9 21 -37 0 -34 4 9 38 -11 -21 24 -7 40 -3 -2 -10 8 -33 -40 -57 -29 -58 -9 -48 -13 29 34 -38
4292 -38 -47 -22 -55 40 -10 1 32 49 13 34 -76 -5 -22 87 3 -58 -15 -23 14 27 20 -8 11 29 30 -6 -6 -15 -10 -27 -15 39 3
4325 3 -3 -15 10 -23 10 -23 -54 1 83 22 -4 11 -56 47 2 -25 28 13 -32 -56 1 26 -31 18 -27 -39 36 -50 -36 3 -23
4356 -23 -5 22 23 44 42 13 -36 63 -14 -32 11 -42 -18 1 1 -49 18 -3 -42 30 0 6 17 -2 -3 -17 30 24 6 7 42 23 -26 -1
4390 -1 10 -2 -14 -11 29 -46 13 43 -26 13 -11 -13 0 -8 -2 11 28 39 -74 1 2 -48 -35 -6 15 -69 11 -10 34 -35 -20 -29 -39
4423 -39 -4 -13 15 -23 11 9 6 -16 4 -20 -23 0 54 -9 53 33 -38 54 4 -2 -37 -35 -22 -25 4 1 32 -1 -66 -6 31 38 23 9 5
4458 5 51 5 -10 -67 -23 14 -26 17 -61 -15 6 -25 5 28 -24 13 47 -15 -6 3 -2 -40 -32 23 -22 32 -5 -23 -46 -27 -35 48 5
4491 5 -2 -15 -6 12 4 38 -60 4 -32 12 47 -35 3 31 -30 -19 -4 -26 17 -30 29 -53 -3 -1 21 2 -20 -35 -4 48 16 -36 -19
$$ packed form
4259A6J5j9K0m1o7O7L0n8L7l4L8NK9m9j0M5l1M7m3JqJ8m1pj7K8k9M9l9L5M2Np2
4292c8rK5l3R5n0J1L1J7l6K1j10P1j7J09q4o1M3qL7J3pk8J9J8Jl6%rNj7J2N4l6
4325Coj2K5l3L3l3l1N5Q2o1k6J5o7J03m5k7N3j5m5k4N7K5n7M9m5j2P5q6J4L9k6
4356b3J8K7JK1kk9m9R9p7j8M3n3K4J9%n0O7k1l9P2l0OJ1j9jj4M7oj8JL5j9m9K5
4390aJ1j2j2LM0p5N9L0o9L9k4kJ3qOJ3J7J1j13P5Jn0J3K9K1q4Q0k1M4o9J5rj0
4423c9L5rK8l8L4klk2K0k4lK3N4o3O2k0p1R2n0ol5KJ3lK9lL1l3o5O0L7Pj5j4m
4458EM6m6j5n7M4L7m0M3p8M6K1l1L0K3n2L7L4o2RRnl8QN5m5N4l7j8k3J9qQ3m3
4491Epj3RJ8qL4r8O4l6M4L5q2L8K8o1J1J5k2M3m7N9q2N0KK2j9k2j5L1N2l2n2J7
$$ plain form
4524 -19 -57 31 5 -29 1 -8 29 -2 -33 24 -37 -4 23 2 -65 10 -19 -45 43 -28 35 -4 19 6 -22 26 22 -2 11 -32 -14
4555 -14 51 -15 -35 11 -29 -21 -8 6 -11 -36 -23 -8 37 4 -13 37 -1 -3 -11 5 -40 19 -14 -50 51 -2 -40 29 17 -18 11
4586 11 -8 3 -6 -45 -4 -20 40 -16 17 51 -30 -33 -4 -8 26 32 7 -70 12 -3 -33 1 -37 42 25 13 -40 54 34 -44 25 12
4618 12 3 -27 -40 -41 8 -25 9 -4 -6 -15 3 7 -54 -40 32 -10 -20 -25 -24 -57 39 -22 -44 10 -5 -43 24 -66 49 53 6 -7 -7 45
4652 45 2 38 -10 -70 -14 -17 -14 44 -12 -73 -28 1 -21 -16 -11 -6 -37 10 -47 -27 38 18 19 -10 -5 23 9 -13 -7 -3 21 15 8 -11 -29 -6
4688 -6 -34 -23 -6 -67 -52 17 27 11 -11 15 -67 -17 7 -29 -8 9 1 -5 19 28 11 7 -37 14 57 2 -29 0 -47 -25 67 5 4
4721 4 36 -4 -66 5 -59 -40 26 -3 -1 -12 36 -27 55 12 -39 -36 38 -10 -18 55 -46 12 37 -18 -34 82 43 -8 21 -8 -11 14
4753 14 -12 3 23 3 7 15 -24 -37 -18 -19 -28 11 -18 -25 -15 4 0 4 15 1 2 -11 -41 18 45 -20 -41 -17 11 -1 -29 -25 -5 -13 -7 -34
$$ packed form
4524a9l8Q8k6l4L0rL7l1l1N7o1L3K7k1o7P5k9k6Q8p1O3l9K3j3k8M8mk4J3m3J8
4555a4O5o6k0M6m0QJ3J4j7k5J3J5M5l3j7N0l8kqJ6m5N9l3l6J01n3l8O9j2l5K9
4586A1j9J1rl9M1j6O0n6L3L4q1lK9mL4Ok5p7Q2j5l0L4l8P9j7j2n3R4k0p8O9j3
4618A2rl0j3jM9l3L4j3krJ8Mo1J4P2m2j0nJl3R6o1k2N4j5l8O7r0J15Mm7j3%N2
4652D5m3L6m8o0N6lLN8n6o1M5K9k2NNNl1M7n7K0O5k0Jk9NK8j4k2OMK4opj9j8K3
4688fk8J1J7o1J5O9J0j6k2K6q2N0K4l6K1J7qoK4Rj7mm4N1M3n5l1K9m7K2R2o2j
4721DL2m0o2P1o4J9O6k9Kj1M8o3Q2m3n1LP4m8qP3j01N8K5n5j6J16l9n1K9k9lK5
4753A4k6J5K0k0MQl9j3J9jrL9k9pJ0J9mMJ1j4Jj3l0N9K7o5k1K4K8j2k8MK0qOk7
$$ plain form
4789 -34 51 16 5 33 15 17 48 -13 8 -10 -33 10 5 26 -24 -35 20 34 23 41 6 -61 -8 -24 -13 -19 12 -61 -15 -55 -46 12
4821 12 43 -6 25 -24 -39 -27 38 17 16 18 21 -34 -30 15 15 -9 37 -20 -4 -25 -17 -10 2 3 0 -11 -20 -6 -22 4 -8 19 -32 -18 14
4856 14 -5 -25 4 -2 35 -2 -24 8 13 64 -20 49 -50 35 -30 7 -25 42 -32 -26 17 -19 -12 -7 7 -21 39 18 -7 32 -8 36 16
4889 16 -5 14 -1 15 -38 33 -35 -22 7 -8 -43 -8 -12 -51 49 37 -34 -29 5 -1 48 23 -55 -53 -4 -22 2 19 32 -25 -22 40
4921 40 -9 -22 9 -13 -32 6 -23 25 -10 11 -16 19 -16 -30 15 39 48 16 14 -16 -23 6 -13 34 0 7 74 -17 0 54 -19 -31
4953 -31 17 -10 6 -28 -2 22 -23 -23 -58 18 28 -6 4 -20 1 10 -28 -10 -27 28 -24 18 24 -34 -2 -18 -8 26 -29 -29 39 21
4985 21 0 32 13 19 -14 32 -12 34 1 -5 -21 22 -1 -14 35 39 23 3 47 -11 25 22 1 -29 5 -72 -54 5 -7 -1 15 17 -6
5018 -6 12 -1 -1 23 4 -50 24 10 14 -25 23 8 -12 2 -56 30 47 -32 57 -47 -4 -8 33 5 -8 -16 11 -2 56 1 -5 36 -58
$$ packed form
4789c4Q5l5j1K8j8KL1o1K1j8k3M3nK1n0j1N5J4j1J8l5o7N3j6J1oL1p3M6m0RN8
4821A2L1m9L1m9j5J2O5k1jKLn5MM5%k4M6n7J6k1QPJ2Jlj1rJ4j6K6j2K7n1J4L2
4856A4j9k0K9oL7l7k2L2NN1q4O9r9Q5o5L7l2O7p4OM3l6PNJ4k8O0k1k5L9m0M4k0
4889A6k1J9j5J6n3P1o8J3K9j5l5L5ml9J00j2p1NL4oM9k5p8KM9j8K4J7J3n7LO2
4921D0m9j3L1k2j9L8k9M8l5K1k7L5l5j4M5K4Rl2kl0pK9j9M7l4PO7r1J7N4p3j2
4953c1M8k7J6l4K6K4m5%l5P6J0l4J0k4K1Rl8J8j7N5n2M2On8L2j6J0L4n5%O8j8
4985B1k1L2j9Ol3M6m4M6l3oj6M3k3j3M9Mj6k0M4n8L6lk1l0L4p7J8N9j2OJ6Kk3
5018fJ8j3%K4j9n4P4j4Ml9M8j5k0J4n8Q6J7p9Q9j04M3mM1k8j3qK7j3N8n5oM1r4
$$ plain form
5051 -58 72 -23 -31 9 16 -7 -16 -8 -74 23 23 -45 3 23 -28 34 12 -16 -49 -18 27 46 -23 20 3 28 29 14 36 26 -25 9 -23
5084 -23 -42 42 -44 -8 -39 26 13 4 36 -19 -50 24 -14 -5 73 20 22 41 45 3 28 22 -10 -15 -9 -6 27 14 -11 -7 25 -37 18 -19 -47
5119 -47 28 11 -8 60 -2 -2 -40 -31 -7 -3 -20 -14 44 -28 -35 -12 13 24 40 15 -38 31 -38 37 -41 26 -26 -75 43 -30 -1 42
5151 42 36 -32 11 -9 1 10 24 -20 35 23 5 -32 -45 -15 15 5 -2 18 -1 -26 -55 -22 -44 -9 5 -43 -6 29 15 -27 24 -7
5183 -7 -45 27 -5 29 5 42 -10 52 9 -23 -21 20 9 16 -1 21 -5 -10 -18 -14 17 -17 17 -28 9 -22 -21 26 -70 -31 -22 -33 -11 -25
5217 -25 -2 13 -56 40 37 59 3 -6 -4 -65 23 -26 -16 -40 -19 -7 -12 13 -28 -6 22 -26 4 26 45 -8 26 -38 -10 11 -14 -20 -34
5250 -34 -9 -16 -42 56 -34 -41 44 -8 -25 -18 4 -32 41 6 7 38 -26 9 6 -16 -14 27 -19 31 9 72 -32 24 39 -25 -3 -46 -9
5283 -9 -6 27 -8 -8 4 30 -2 -14 2 -38 8 -6 -34 -54 -15 -24 -30 32 13 -7 -78 71 37 27 3 24 5 -9 5 -60 12 -8
$$ packed form
5051e8J30r5qM0Pk3rQo6R7%o8M8K0n1O2k2k8l3L1M5J9o9M3j7K5Jj5K2j0n1L4l2
5084b3j9Q4q6L6l1O5j3rL2n5l1P4l8RP8n3KJ9Mm2K5ol2nOLL3j3k5ML2o2N5l7k8
5119d7P5j7j9O8o2%l8RK4Mj7ON8p2pK3K5J1J6k5n3O9o9P5p8O7n2m9J18p3K9M3
5151D2oo8M3k0J0RJ4m4N5j2j8l7j3L0L0j0pK0j9k5k9L3k2L5J4m8L7L5j4m2N1l1
5183gl8P2l2L4k4L7n2O2m3l2KM1j1Pj7K2k6nqML1l4L4m5L7l1JM7r6L9Rj1K2j4
5217b5K3J5o9R6lK2n6rKo1Q8m9J0k4K1J2nK5m1K2K8m8L0K2J9n3L4o4K8K1k5oj4
5250c4K5pk6R8r0pQ5n2j7PK2l6P3l5JL1o4L5lk2KM1m6N0k2O3j04N6J5o4K2m3L7
5283iLL3l5%J2K6l2j2J6m0M6j4k8k0L9roO2j9k0p1J49l4j0k4K1j9j4J4o5P2k0
$$ plain form
5315 -8 33 16 -26 -26 -34 -25 -21 -7 -17 -55 -50 -39 62 24 -25 -18 -35 0 5 13 45 7 -42 12 -15 9 -16 34 7 -22 7 52 -23 -9
5349 -9 -1 -50 30 -5 -1 40 -46 -16 -14 17 -38 -91 62 -19 -27 -11 -29 5 -8 -8 -18 -10 -2 62 34 -38 -21 -14 16 55 61 -32 -25 4 13 -31
5385 -31 7 -28 -26 -2 11 -43 17 13 56 29 -10 10 4 -14 30 -21 -2 8 19 -6 50 8 -57 -92 -64 -35 11 21 16 11 24 34 -21
5418 -21 10 -2 -18 24 35 24 -7 20 6 9 -46 -28 21 0 20 -58 48 -27 -25 -16 13 17 -24 2 -9 -37 -16 -13 -5 -27 28 5 62
5451 62 -36 7 -13 -30 -23 -10 -15 -12 36 -36 -57 6 26 -29 -14 32 -44 10 -10 -38 24 11 13 6 45 -41 -11 0 -31 -6 15 22 -10
5484 -10 -30 21 7 -17 -33 -20 -9 0 14 42 15 -3 -23 5 -6 -29 33 24 67 -17 -13 25 40 46 -11 28 19 6 88 22 82 7 -12
5517 -12 29 18 -6 57 -10 55 6 2 -5 1 -46 -4 -23 -8 -72 -16 -28 13 12 5 -2 5 34 -50 -1 11 35 47 11 -5 -29 -7 51 -25
5551 -25 -7 2 -4 38 4 21 7 23 -26 -22 -34 27 -4 31 -2 -1 18 2 -36 54 5 -31 -36 -19 -2 -35 7 -58 -17 -11 24 8 -29
$$ packed form
5315hM1j7m2%qRMJ4j0l8NJ1J01l8m9Pj7L5NQL2l8m9N4k7K4k5N0k7k9K9M5p5J4
5349iQm9Q0l5MM1q6L0KL1n5n3J53q1qJ6j8L4j3%j0QQO4k8p2J7PL0L9Or3PK9Rm4
5385c1L8l5KK4J3n4O0mM3k7l9K0oj8M4n1J9J0J1k5N6m2o5l5K8K9M6J0nnJ3J0n5
5418b1L1j2j6M2J1j1l1K7j4Ln5J8M9k1K0p8J06p5KRK9Mm1K6j1k8K1LQk2N5k3N7
5451F2r8M3k0j7PJ3nLM8p2k1O3K0n5J5M6p6N4k0k8O2j3KpL9q6L0J1l1K5K1Pl2
5484a0k0N1j4k4j6J3J1RJ4K8k7j8k0K8j1k3O2rM3q4ML8J5On7L9rj3Q2o6O0p5j9
5517a2M1j1k4O3o7O5m9mpOm7M2j9J5o4N6j2M1jppPK9q4M9J2K4J2l6j6k4K2N8p6
5551b5J8RoM2l4J7j4J6m9Mj2O1l1L5l3JJ9j6l8R0m9l6nJ7J7l3M2o5M1OL5j6l7
$$ plain form
5584 -29 23 44 -37 5 -12 -15 8 -36 7 -49 3 30 -26 -11 41 10 14 44 51 4 -15 10 24 -57 17 7 24 2 -21 25 -7 -15
5616 -15 35 10 -57 23 5 -20 28 63 27 12 75 -36 -2 -13 -6 14 17 18 18 -2 38 15 -21 13 -8 40 -10 -4 -19 -3 -29 26
5648 26 23 1 -13 -28 9 -21 83 19 5 4 1 -3 -37 -23 -14 2 -24 -18 40 -18 2 -27 37 -16 5 -70 -10 19 -26 6 31 25 -4
5681 -4 -1 17 -49 -4 13 16 -21 8 23 -32 32 46 58 2 1 -31 7 3 -18 52 30 -28 -10 -23 -10 -47 -20 -42 -1 -3 -32 -41 24 -23
5715 -23 -1 6 -21 -35 11 6 7 42 -29 -12 -62 64 -39 1 -7 0 -41 -4 77 1 28 10 56 49 -63 -19 -10 6 14 9 13 1 10 -55
5749 -55 18 29 -8 40 6 -26 9 62 48 8 41 43 52 69 -23 23 1 -23 -1 0 23 -21 1 -45 -19 5 -44 -11 -4 15 29 41
5781 41 -37 -7 1 -21 -1 70 32 -31 -2 -27 1 -6 24 65 -52 2 -5 -15 31 23 9 24 1 -48 9 -2 30 -6 -31 11 -8 -8
5813 -8 22 5 17 2 46 -21 -40 -7 3 -9 -23 10 32 -26 43 8 47 -5 18 -48 29 13 24 64 -33 5 -12 74 -2 25 25
$$ packed form
5584b9N2K1q1M2j7lK3m4M3n6N2K7n6J5N2l1ML0Pm7j9K5J4q1P4j0J7k2k3M6l2q
5616a5N0k5o7Q0j8k5M8L5l6j5O3j11L4j1PK0LJ%k0M0k3l6L4k1M8n0Oj5J6k6N5
5648B6lk2j4j5L7l0J04o4j4jlml4J4RJ6k6ON8n8K0k9O4n3K1p5O0K9m5L2K5ok9
5681dLJ8o6M5J7Ll7K9J5n5O4J4J2n6jl2L8mk1P0k2n8J8j3J3l7K7k2M1kk9rO5m7
5715b3K2Pk7j4M6nJL5p1J7n0J26j03M0qPm1L7Q1p6K7j8M6pj12M4RJ6QnMj2Ro5
5749e5P3J1l7M8l4l2L5N3j4m0L3KRJ7r2M6k2k4K2JK3m4K2m6K6K4m9L3PJ9J4J2
5781D1p8L0Qk2K0P1l8o3K9k5K8pL0M1j17N4pj0M6qj4J5k3m9N7j1L2l6k5M2j9%
5813hL0j7J2j5M4o7j9L3J0j2j4L3K2n8O9l5L9n2K3o6P7j6J1M0r7L8j7Q6p6K7%
$$ plain form
5844 25 8 -3 -22 3 24 -15 4 31 28 33 38 8 -22 43 11 3 -2 46 -45 -20 21 40 24 50 29 11 26 -10 -1 31 9 -10 -10 -23
5878 -23 -29 6 4 23 49 31 26 4 -27 -28 -14 -3 -51 27 36 18 19 -20 -25 24 62 -12 11 17 3 30 29 -9 11 17 -41 1 -26 -52 -16
5913 -16 9 8 1 -11 0 47 16 38 10 39 24 -32 19 17 -40 -12 43 -30 3 -19 -23 -11 2 -4 -42 39 52 16 40 -14 -52 18 43
5946 43 -16 34 2 -66 -13 -14 -41 43 -15 -40 9 6 4 46 23 -69 -27 4 -13 0 41 41 49 -34 -42 -20 -9 35 6 13 35 45 -29 -40
5980 -40 20 38 11 -2 36 -20 -2 35 33 10 61 5 1 43 -15 15 -13 33 -25 33 -21 -14 -3 -19 -43 21 -24 -6 -32 -18 -3 10
6012 10 -11 15 18 -14 -12 15 31 7 9 7 22 -29 -5 1 0 42 2 -12 -1 35 34 -5 70 -44 -3 24 4 24 21 39 0 -46 9 42
6046 42 14 4 28 15 18 34 -23 27 -19 13 -18 -24 -8 -13 27 7 5 33 -8 -19 7 -21 -28 -26 2 38 25 -4 25 -24 28 -58 -12
6079 -12 -56 22 -15 24 -18 37 -5 -9 21 -15 -16 28 19 -5 -53 26 33 -6 30 23 -8 -47 -15 72 46 50 9 19 -33 7 25 27 -6 6
$$ packed form
5844B5j7j1j9K5K1l9J9K7lNNl0l0O5l2qnM8r1K5M1J9j6K6k1j8J5l6RL2k2j9%j3
5878b3oL5kJ9K6j8nk2l1jJ4J1m8P8Rj8Jl9nM9L8p4K3Oj4K7jl8K0On8M2k7k6L6
5913a6K5jpj2J1M7l1K2k8K9j5n6N1kn7K8N5p3L3k2mJ2J3ol8Q1J3l6K4n4l8P0K5
5946D3n9N0l2o8N3jk7Q4n8k5M9lkM2k3r2M2L1j7J3M1%Qq3qK2J1M4k9PK2J0p4j1
5980d0O0J8k7j3L8n6J8L7kk3N1n6mM2n8L0k8M6n8N8n4PJ1j6k4O4m5J8k6J4J5J3
6012A0k1K6Ll2KK7J6k4KkJ5n1K4OjM2m0j4J1L6jl9P5j14M1K7k0K0lJ8l9m6N5L3
6046D2k8j0K4j3LJ6n7N0m6L2l1oJ6nM0k0kK8m1j1K6k8pKK8L6j3k9K9m9N2q6M6
6079a2m4P8l7L9m2N5m2mL0l6jM4rk4m8P9Pl9L6pl1l9L2Q7k6Mm1J0n2M0J8Kl3J2
$$ plain form
6113 6 30 19 16 7 13 -7 16 5 34 3 -20 -1 44 35 -28 -49 55 26 19 -15 17 -11 -18 -9 27 43 0 -19 -2 -28 -6 43 -36 2
6147 2 26 -6 52 6 -25 1 24 -5 24 -4 45 -15 -17 4 10 75 9 66 -33 35 88 50 -8 23 17 4 -19 42 -16 27 10 17 21
6180 21 -15 -9 26 34 17 -39 13 14 38 35 -1 22 6 4 37 14 43 49 -24 18 35 53 -23 66 22 29 -19 -1 -11 -50 -27 -30 10 -2
6214 -2 29 7 17 -4 -35 -1 38 -18 19 33 4 22 54 11 -34 -12 2 0 36 -25 42 52 5 -11 33 5 6 20 -16 -12 -32 11
6246 11 15 0 29 16 -12 8 17 -34 51 24 7 -9 1 30 15 17 16 -9 8 17 5 68 11 -14 -12 0 2 86 8 50 55 -2 -17 -45
6280 -45 48 -56 2 -11 -21 19 62 -13 28 50 42 -69 -6 10 10 29 -40 47 31 -28 -14 -19 -29 11 37 42 -9 -5 -32 -11 35 -24
6312 -24 -30 35 -22 40 19 -6 57 45 40 67 11 34 -6 -19 -7 24 16 47 5 -13 -11 8 -24 -33 24 41 -31 29 10 -31 39 14 -8
6345 -8 31 12 20 -7 40 7 -12 33 -32 -39 4 -55 19 63 11 -35 6 6 6 -8 -2 -25 14 -2 -7 14 1 -13 24 6 -5 14 -8 -12
$$ packed form
6113FK4j1lrOk0K3j1K9l1k3J9M5ro3k1J04k9pl4L2k8pRL6J6m3j9J7k6K2M9p9L8
6147BK4l2N8m6l1K6K3k9K9k8M9o0kK1OO5o6N7r9O8N3l8n8L1oj3k3O1n8M3j7PM
6180B1l6OL5Qj7n6N2JK4ll6K3j6kL3k3K9Op3M2J7J8p6Q9m4Pm8J8j0l9K3lM0j2
6214bL1k2J0k1l1L4L9n6L7J4k9J8L2m3m5K2J4kL6o1O7J0m7j6M4k8JJ4l6Mk0M3
6246A1Mj5K9j3k8K0Rn1Q5k7j7j6J0K9j5Kjk5J7Rj2O3n7k5KJ2KQ4p8M2Nn7j5k8
6280d5R3j04N8j3j0M0M3p5M1K2qj11O3J6%J9o9Q7j6n9J4nj0M0K6Nn1Mk7K1M6n9
6312b4oO5n7O2k1k5O3j2nK7n6K3m0j3J2L1qL1m2j8KJ9l2rN7J7p2O0j9m1P0k5k2
6345hL9j9Qk7M7l3j9M5o5pM3n9P4M4n2m6M1%%j4Ok3L9j6nK1j3j4L7j8j1J9k2m
$$ plain form
6379 -12 49 -7 18 57 -4 -28 -9 24 7 26 -5 27 -7 37 36 -3 15 -3 -3 -8 20 12 -16 -4 -30 -31 32 -19 44 -47 19 -1 41
6412 41 -5 8 25 52 7 25 -21 -20 -6 -6 7 6 -24 -9 -21 -2 -15 8 22 -19 42 41 14 0 24 39 -1 15 37 -9 38 12
6444 12 31 -32 61 -57 31 17 5 -30 -8 15 -5 -16 -7 64 42 54 40 -30 -24 -26 2 31 -10 2 -2 -2 39 -19 31 22 -18 -2 48
6477 48 17 -15 79 -39 -1 35 23 22 49 16 -4 -2 -30 -7 -32 6 -34 32 29 -25 -62 -41 -4 -1 -20 19 7 -34 -51 9 23 -2
6509 -2 -12 33 -25 2 -12 38 62 13 31 -14 25 15 -3 37 20 -11 -49 -12 -22 64 1 10 -26 -13 -11 -7 11 -9 16 11 -55 2 15
6542 15 35 34 53 -13 -36 -8 -15 34 29 24 35 58 12 -11 50 -14 47 6 30 20 -35 28 -32 45 18 -39 -9 -39 19 -27 -31 29 2
6575 2 16 45 9 1 -14 23 -9 -10 -2 13 26 2 15 2 40 -17 -7 22 10 26 2 25 13 -7 31 -36 11 -4 16 -21 5 3 19
6608 19 -52 4 -48 -27 3 -27 13 25 5 -31 36 9 21 -44 -21 -3 -21 4 -5 10 25 -44 -6 29 45 14 12 18 16 9 -46 -20 28
$$ packed form
6379a2O1n6K5L9o1k4J9L3j7J9l1L2l4M4jl9J8j8%nK8qk8J2k6jO3n1O3r1O6k0M2
6412D1m6J3J7K7m5J8m6JJ4%J3jl0J5j2J9j3K3J4m1O1jk7j4K4J5m0J6K2m6M7k6
6444A2J9o3R3j18Q8j4j2l5K2K3k0j1RP1k2J2j4p0OkK8K9m1J2m%M1n8N0rm0J6N0
6477D8l1l2R4j18L8L6j2jK7l3k0Kk8K3k5L8m0O6ln4l7K1L7Lj9L9j2m1j7O0J4k5
6509bj0M5n8K7j4N0K4m9J8m5L9j0j8M0j7l1l8L7j0Q6o3Rl6J3KMJ8k0K5no6N7J3
6542A5K0jJ9o6k3K8pM9nnJ1K3m6k3O1o4O1m1K4j0n5O3o0P7k7n7L0l0N8m6mO0k7
6575BJ4K9l6qj5L7l2jQJ5J3k4J3j3L8n7J0K9j2J6k4K3j2k0L8o7M7j5K0l7K6kJ6
6608A9p1N6n2K1L0l0M0J2k0l6O7k7J2o5K3J8j8K5rJ5J5o9L8L5J6l1kOkpn5K6M8
$$ plain form
6641 28 18 51 -39 -28 20 11 -36 -18 -9 6 21 -1 48 29 -40 0 -57 26 39 -14 -19 56 -11 33 12 6 -12 25 -4 -9 -9 19 -45
6674 -45 -15 27 1 -22 -73 6 -8 30 5 19 -8 -33 6 -13 7 -7 -67 -8 18 -33 -38 31 46 -50 -23 -54 9 -30 11 3 50
6705 50 -18 -19 -31 4 69 -21 11 17 57 -16 -60 36 -4 6 11 16 -18 34 -20 -21 6 26 4 25 27 46 -4 -3 -38 1 2 -12 -6 -54 -2
6740 -2 -8 -30 -24 2 1 -18 31 -10 0 -28 -20 -27 -83 0 16 -12 -2 31 -26 -31 -13 32 27 3 -63 -24 53 -18 20 -31 -22 7 18 -22 -5
6775 -5 13 3 -29 -22 -28 7 -4 -11 -25 24 -1 -25 -15 -11 12 -30 63 7 24 25 16 24 40 -41 -31 -11 26 3 -40 17 -19 -5 46 -35
6809 -35 0 -37 -33 -23 -5 50 0 -25 -50 18 4 -65 -63 6 24 49 -19 16 15 10 32 -41 -4 45 9 25 -40 19 -24 2 1 -5 54
6842 54 49 9 -70 -38 -63 -9 -11 -45 0 -14 16 26 -21 34 27 12 46 23 2 7 36 -10 -30 -25 -46 1 52 1 6 -28 -7 0 50 46
6876 46 -5 23 2 15 -12 1 9 29 38 55 -42 41 -46 8 9 2 -21 51 35 -27 -22 15 -27 2 -43 5 17 -55 7 22 -6 43 2
$$ packed form
6641B8j0L3r0J1M8rm7J8RJ5J5k2M9j9o9M0n7Q3J3n3nP5o7M4k1oj8L7k9n%K8o4
6674d5L0M2k6k3n1P9j4L8k5J4k7k5L9j9K0j4o0N9K6n1nO9J5r6K7l1O3l9M1qM7
6705E0o8jj2L5O5r0L2OM0p3m4R6m0J0NNl4N2n4jK7K0k2K1KJ9n0Jl5L9Jj4Om8N2
6740bok2OK6jj9M9m1J0k8Qpn6Q3J6k8J0L3n7nJ8M5nk4o6L9P7p1L8n1RK9J1m0J7
6775eJ8j0l2PoL5j1pj4M9k5k4J0MK3m2R3n6J7JrQJ6q1J0K0L7k3m3N7l6J4N1q1
6809c5L5l7MJ0J8N5n0k5k5O8j4o9KO9J8K5o8L5jnK2p3L7M9l6J6o5N9m3K6joN9
6842E4nm0p9L2k5N4kl4M5j4L0J0m7N5pj5L4k3k1NK9m6k0Nk1M7N1n1Nl4K1PN0m
6876D6n1K8k1J3k7J3QK0RJ7r7Q3q7N4Jpk3P2j6o2NL7m2K9m5M8J2p2O2J5k8M9m1
$$ plain form
6909 2 -29 2 28 -2 -5 20 -9 -9 40 0 -73 20 -18 22 -42 -42 -38 6 25 -26 4 -1 -47 -6 -90 -20 1 12 31 13 14 -52 6 -29
6943 -29 -23 -1 -63 -34 5 -22 59 -26 -35 8 -14 21 -4 30 -26 6 14 11 25 -3 -1 6 -3 6 13 13 -72 61 -27 8 38 -6 14 -43 -37
6978 -37 -14 -13 4 -59 0 -8 19 -8 19 29 -23 -16 -27 27 -3 27 20 20 66 50 16 5 -29 -5 15 19 -2 14 -48 -6 18 -42 10
7011 10 5 38 23 1 16 -30 -26 5 37 -49 42 28 19 19 22 14 5 27 -27 -19 25 -18 -21 -39 45 30 9 -5 18 14 44 9 -6 -11 0 -22
7047 -22 -20 -10 -44 -13 41 -49 26 -21 19 5 0 -12 7 31 -7 -9 -49 13 -26 8 15 26 39 27 41 -47 -37 31 -43 -37 52 -2 -7
7080 -7 2 -3 -6 -7 36 -39 59 -42 -45 18 4 -27 -25 -13 1 -19 -2 31 -65 5 21 -20 -19 -19 -72 -10 -9 21 -40 -51 6 14 -6 26 56
7115 56 18 -72 -3 17 -14 -4 36 -28 1 9 12 -29 20 -27 -39 35 -56 -10 16 -28 -59 72 -1 -20 4 -18 -23 -76 -5 -6 -34 3
7147 3 -7 1 -19 -8 -17 -28 29 -15 -1 -43 18 -8 -60 17 -36 -46 -16 -35 -21 8 -28 -10 -86 -25 39 5 -43 37 -56 -28 -8 5
$$ packed form
6909Bl1L1K6l0lK5k9%M9m0p3R3l8M0o4%MM4J9n1L0nm6M1q4P0K1J1J9j8Jo6N8l5
6943b9OK2o2K9L9k7Q1q5rM3k2L5k5L4n6L2QlJ4k8KPrRP%q5J33q8L5L0m4K0n7O
6978c7K3JJ7o3N9qK7k7K7J0n2Pj1N4l0L0p%M6j6l4j1l4K4K0Mk1J6o2M2K4o0N2
7011A0nL3j5k2J5m6ML1L2q6R1j4r%LqrK2n4QM4m3lj8Q4j5k1j4K3mL0l5j5nJ1k2
7047b2KJ0l4L1N4r0P5m7M0j4nj2J9K4l8km0O2l9L4PJ1J3j2J4q8J0O8p4OQ9n4n
7080gRnljM3p5R8j01lO3j4l1KJ2J4k0J7L3r6P0J6m1J%n3O2JL0o1j1N7Qk0L2L0
7115E6l8r0O9K0l1J0M0o4K9QLm1M9m7j2P4r1M6K6m4l1J31p3j9K4k2nn3P1jk8L7
7147Cj0Qk0J1rj1N7m4J4m2O1k6n2P7n3j0L0j9J4K9l6J8p6O1O4l4m8Q0r3K8K0J3
$$ plain form
7179 5 -2 -15 -30 -6 35 -25 -8 -9 -34 -24 28 2 -6 37 16 -48 -21 -15 -24 4 -25 11 46 -24 -23 12 54 -20 -17 44 12 49 -13 -15 37
7214 37 -30 -29 -29 -37 -32 -31 -30 -14 -44 29 -20 -83 29 -11 -4 -41 -21 24 20 45 87 -15 20 52 -22 -22 18 -24 14 65 -26 -9 -11 15
7248 15 -52 8 15 7 29 -17 27 -50 -19 -38 16 22 44 41 -46 45 22 -53 -10 75 36 -23 -45 4 24 0 30 7 -3 17 -6 10
7280 10 8 30 -3 -1 -23 18 -16 31 19 -50 -16 12 -43 7 22 9 11 -22 -12 -16 -17 7 -51 13 -10 -37 -13 -12 45 -15 -52 62 6
7313 6 2 28 34 19 31 17 12 45 5 55 35 -9 12 -19 -1 47 -36 45 -10 -6 -21 -10 29 -6 9 -10 -8 3 -18 -13 5 35 21 38
7347 38 22 -2 -20 -8 -34 -5 52 9 20 -5 27 11 -41 11 6 20 25 25 44 15 -4 80 11 12 20 -6 14 26 -8 -53 -39 17 10
7380 10 -8 24 3 -12 13 3 -30 32 -19 -32 -20 3 14 3 -6 -16 22 3 -1 -17 -2 23 26 -16 28 5 -58 -3 -24 -1 -30 18
7412 18 14 7 7 -21 -3 34 -27 36 -38 -15 -61 -18 19 -55 -16 -1 22 41 -9 -26 22 1 25 13 6 -23 -3 6 12 -1 0 12 42 0
$$ packed form
7179Epj3j5K4M1o0J7jk5J0N2k6qM3k1o4K7OrK8k9L6L5p0JL5M2p4LO1l2L7o2kN2
7214C7o7J%qNJJJ6l0P3m9o3J12m0Pl7K0M5mK5M2j02L5L2p4%M0m2L8N1r1J7kK6
7248A5o7O0PqK2m6M4p7L1j9N4OK2lq7R1k3p5M3Q5l9n9k2M9K0k4L0k3j0K0k3J6
7280A0kK2l3Kk2M1l4M7j2o9L4K8n5N0J5j3Kl3J0mjK4n8O4k3k7K4JN7o0l7J14n6
7313FmK6Oj5J2j4nL3m0N0k0m4K1l1J8M8q3Q1n5Mj5J1L9l5J5j9KJ1k1NJ8L0j4J7
7347C8j6k4j8J2k6K9N7m3J1k5L2j6n2N2nJ4N%J9k9j9Q4o9JQk6K0J2l4m5J4N6p
7380A0j8L2k1j5K5j0l3O2n1j3J2K3J1j1rj0L8j9mj6J5K5Lm2M4k3o3N5k1K3k9M8
7412A8mp%k8J8L7o1O3p4K3m6M3L7p4L9J5K3J9n0j7M8k1K4j2pk9K0ROj3JJ2L0m2
$$ plain form
7446 0 4 -23 -16 -17 3 49 -41 -19 12 -8 -16 -38 -45 -6 0 -8 45 56 42 28 4 -30 -7 -7 -27 -42 21 -9 18 33 17 21 -11 11 -23
7481 -23 -56 23 7 -24 31 57 -1 2 -21 -16 -23 8 12 2 -20 3 20 2 0 -17 2 10 6 42 -75 0 -11 -11 23 49 -3 -5 -2 -2 19
7516 19 -13 23 8 15 -15 -44 -8 -8 -41 -6 -18 29 -16 -27 29 30 -17 10 -21 16 -36 26 -20 7 -11 -11 2 -26 -45 18 27 6 0
7549 0 16 30 35 40 34 -21 -17 -28 -70 -9 3 -32 15 -21 33 -48 -30 6 16 -19 10 32 3 41 -6 -26 3 18 -20 -15 -22 -21 -32 5
7583 5 -6 32 -19 7 65 0 4 -2 1 59 7 -8 5 6 -2 -43 33 13 6 -11 4 17 16 -21 -21 4 32 -23 -68 -6 6 19 22 5 -46
7618 -46 1 -57 -26 -23 -3 -44 -35 4 17 44 28 -23 -30 19 -23 39 4 55 39 -16 29 -23 14 -40 5 -36 13 22 68 9 9 39 -3
7651 -3 34 -33 8 25 4 -18 12 -33 -2 -13 -12 15 -39 -23 21 1 -2 8 20 39 14 -9 17 -30 -29 -33 -8 0 64 47 -4 -25 42
7684 42 -2 46 1 9 -8 23 15 4 -1 3 12 -17 -12 4 18 7 -35 3 14 -10 10 -41 19 -17 -13 16 -39 14 54 -11 -48 7 63 1
$$ packed form
7446@Mk7PjK0M6r0K2L1k0qk2pL9OqN3J1j4j4k4l4K3%k0j5O3l0K7J5j6Ml2K2l4
7481b3l3P9j6l1N5K6n8Lk3NpL1Mj0k2K3J7j8kj7J9QmL6j17P5j1%L4K6n2kL%K1
7516A9l2L6j5Pl0k9L6%l3L5j2M7m5j1N6Jm7K7l1L7n2O2m6K7j8%J3k8j9O3Rk1o
7549@J6J4NNon5Mj1m2O1J2l5M7l6N4q1J8L6J0l5K9K2k9L8m7k0K9J5l8NpJj1L7
7583Ej1L8n1K6N8o5MoLN8n2j5J3Jqm1P6k0pj7J5J3jl7%K5K8n5m5O2J2J3Lj7n1
7618d6M7n8L1LK0m1RL9J3K7j6n1pM9m2O2l5N1j6n5M5n2L7n4M5m1M9RM6n9%L0m2
7651cL7o7M1J7k1k2L0m5L1j1JK7n4J6M4k0lJ0J2J9k5k3K6m7JmK5QO4j7n1k1O7
7684D2m4M8m5Qj7L1qj1nMRk9NJ6J4j1m2L8J1k4K0n1O0l6MK9n5N3M0o5l7N5N6o2
$$ plain form
7718 1 4 24 -22 -6 5 -30 -66 -26 -1 9 -26 -1 -40 -51 -9 22 -11 -19 -9 -3 -74 -9 -47 -25 -21 -8 -41 32 15 -27 2 6 -28
7751 -28 5 35 22 47 23 13 21 35 -15 5 -10 -26 16 -2 -9 -5 15 -19 -42 6 15 -34 16 41 -35 9 14 19 25 -39 25 50 -29 27
7785 27 36 22 31 -15 30 35 -9 -40 -21 -13 23 -28 -18 15 11 -1 -1 -1 20 47 -7 17 -33 17 10 -1 -1 25 31 -65 -15 -13 16 39 15 2
7821 2 73 -6 20 -14 24 -11 38 37 20 62 -7 24 41 40 17 21 -24 2 -22 29 10 -17 -22 -64 48 12 -17 10 -4 -19 11 34
7853 34 15 -5 25 -32 -17 11 30 38 4 -24 10 -47 28 -18 -33 27 -52 -19 -12 -66 23 8 24 20 -1 11 -17 13 -24 -8 12 26
7885 26 5 -16 -39 7 -13 -33 -25 -24 10 31 -22 -19 55 -45 55 -6 -70 -31 -8 39 -43 11 -25 17 1 36 -24 3 -24 -50 18
7916 18 41 52 0 -4 10 16 23 -16 -41 17 -4 7 -18 -9 -6 54 -45 -38 -39 26 -55 -20 23 -7 1 -46 2 -12 -2 -8 27 -73 1 16
$$ packed form
7718ALK0m6J6J1l5l6M0K5J0l5K5l9j1M2L1l3qJ0Op1O5l8K2MJ3l3P3j7m2K9Ml4
7751b8L3L0j3K5k4j0QJ4n0K0j5j6M2j8pMK0l4k3M8Rm9N0K5p6M4NNOo4O4K5p9N6
7785B7Rj4Rm6M5Nm4l1J9QL6n1J0L3mj2%%K1K7n4K4n0N0pj1%K6Or6N0KK9K3k4j3
7821BP1p9K6l4L8l5M9jj7M2o9L1J7jk3Mm5K6k4N1j9k7nm2J12l6k9K7j4j5L0K3
7853C4j9k0L0n7J5K8J9Ql4k8L4n7P5m6j5O0p9L3Pn4Q9j5J6mk1J2k8L0l7J6K0J4
7885B6k1k1k3M6k0k0QJL4K1n3LP4j00J00o1o4L9K3M7q2N4l6M2j6L5o0K7k7k6O8
7916A8K3J1n2mJ4OPl9k5N8k1J1k5RLO0r9PjO5q1L5M3l0Qm7M8j4J0oL5j00P4J5
$$ [...]
8191A7
##END NTUPLES=NMR FID
##END=
