##TITLE=1H_EC-3233
 DMSO, 8 sc, 
 5.7.2020
##JCAMPDX= 6.0         $$ Bruker NMR JCAMP-DX V2.0
##DATA TYPE= NMR FID
##DATA CLASS= NTUPLES
##ORIGIN= UXNMR, Bruker Analytische Messtechnik GmbH
##OWNER= root
$$ XWIN-NMR		Version 3.5
$$ Wed Aug  5 09:45:10 2020 Russian Standard Time (UT+4h)  she@DPX200
##.OBSERVE FREQUENCY= 200.1314999998
##.OBSERVE NUCLEUS= ^1H
##.DELAY= (6, 6)
##.ACQUISITION MODE= SIMULTANEOUS
##.ACQUISITION SCHEME= undefined
##.AVERAGES= 8
##.DIGITISER RES= 18
##SPECTROMETER/DATA SYSTEM= spect
##.PULSE SEQUENCE= zg30
##.SOLVENT NAME= DMSO
##.SHIFT REFERENCE= (INTERNAL, DMSO, 0, 15.7039)
##AUDIT TRAIL= $$ (NUMBER, WHEN, WHO, WHERE, WHAT)
$$ ##TITLE= Audit trail, XWIN-NMR		Version 3.5
$$ ##JCAMPDX= 5.01
$$ ##ORIGIN= Bruker BioSpin GmbH
$$ ##OWNER= she
$$ F:/spectra/data/she/nmr/H-F/1/audita.txt
$$ ##AUDIT TRAIL=  $$ (NUMBER, WHEN, WHO, WHERE, WHAT)
(   1,<2020-08-05 09:43:40.45 +0400>,<she>,<DPX200>,
      <created by zg, POWCHK disabled, PULCHK disabled
       configuration hash MD5:
       00 E9 B6 7A A2 85 ED C7 34 08 36 98 17 FE 4E 26
       data hash MD5: 16K
       03 8E 81 55 CA 96 E5 FF E2 99 82 C6 39 30 73 E5>)
$$ ##END=
$$ 
$$ hash MD5
$$ CB 37 D1 81 95 94 A8 7B 4A DA EA 51 D9 E2 8A 11
##$RELAX= 
##$RELAX= 
##$RELAX= 
##$RELAX= 
##$RELAX= 
##$RELAX= 
$$ Bruker specific parameters
$$ --------------------------
##$DU= <F:/spectra>
##$EXPNO= 1
##$NAME= <H-F>
##$PROCNO= 1
##$TYPE= <nmr>
##$USER= <she>
##$AMP= (0..31)
100 100 100 100 100 100 100 100 100 100 100 100 100 100 100 100 100 100 
100 100 100 100 100 100 100 100 100 100 100 100 100 100 
##$AQSEQ= 0
##$AQ_mod= 1
##$AUNM= <au_zg>
##$AUTOPOS= <>
##$BF1= 200.13
##$BF2= 200.13
##$BF3= 200.13
##$BF4= 200.13
##$BF5= 200.13
##$BF6= 200.13
##$BF7= 200.13
##$BF8= 200.13
##$BYTORDA= 1
##$CFDGTYP= 0
##$CFRGTYP= 5
##$CHEMSTR= <none>
##$CNST= (0..31)
1 1 145 1 1 1 1 1 1 1 1 1 1 1 1 1 1 1 1 1 1 1 1 1 1 1 1 1 1 1 1 1 
##$CPDPRG= <>
##$CPDPRG1= <>
##$CPDPRG2= <>
##$CPDPRG3= <>
##$CPDPRG4= <mlev>
##$CPDPRG5= <mlev>
##$CPDPRG6= <mlev>
##$CPDPRG7= <mlev>
##$CPDPRG8= <mlev>
##$CPDPRGB= <>
##$CPDPRGT= <>
##$D= (0..31)
0 1.2 0 0 0 0 0 0 0 0.06 0 0.03 0 0 0 0 0.0002 0 0 0 0 0 0 0 0 0 0 0 0 
0 0 0 
##$DATE= 1596606219
##$DBL= (0..7)
120 120 120 120 120 120 120 120 
##$DBP= (0..7)
150 150 150 150 150 150 150 150 
##$DBP07= 0
##$DBPNAM0= <>
##$DBPNAM1= <>
##$DBPNAM2= <>
##$DBPNAM3= <>
##$DBPNAM4= <>
##$DBPNAM5= <>
##$DBPNAM6= <>
##$DBPNAM7= <>
##$DBPOAL= (0..7)
0.5 0.5 0.5 0.5 0.5 0.5 0.5 0.5 
##$DBPOFFS= (0..7)
0 0 0 0 0 0 0 0 
##$DE= 6
##$DECBNUC= <off>
##$DECIM= 24
##$DECNUC= <off>
##$DECSTAT= 4
##$DIGMOD= 1
##$DIGTYP= 9
##$DL= (0..7)
0 120 120 120 120 120 120 120 
##$DP= (0..7)
150 150 150 150 150 150 150 150 
##$DP07= 0
##$DPNAME0= <>
##$DPNAME1= <>
##$DPNAME2= <>
##$DPNAME3= <>
##$DPNAME4= <>
##$DPNAME5= <>
##$DPNAME6= <>
##$DPNAME7= <>
##$DPOAL= (0..7)
0.5 0.5 0.5 0.5 0.5 0.5 0.5 0.5 
##$DPOFFS= (0..7)
0 0 0 0 0 0 0 0 
##$DQDMODE= 0
##$DR= 18
##$DS= 0
##$DSLIST= <SSSSSSSSSSSSSSS>
$$ [...]
##$SUBNAM2= <"">
##$SUBNAM3= <"">
##$SUBNAM4= <"">
##$SUBNAM5= <"">
##$SUBNAM6= <"">
##$SUBNAM7= <"">
##$SUBNAM8= <"">
##$SUBNAM9= <"">
##$SW= 24.9337058888022
##$SWIBOX= (0..15)
0 0 2 0 0 0 0 0 0 0 0 0 0 0 0 0 
##$SW_h= 4990.01996007984
##$TD= 16384
##$TD0= 1
##$TE= 0
##$TE2= 300
##$TE3= 300
##$TEG= 300
##$TL= (0..7)
0 120 120 120 120 120 120 120 
##$TP= (0..7)
150 150 150 150 150 150 150 150 
##$TP07= 0
##$TPNAME0= <>
##$TPNAME1= <>
##$TPNAME2= <>
##$TPNAME3= <>
##$TPNAME4= <>
##$TPNAME5= <>
##$TPNAME6= <>
##$TPNAME7= <>
##$TPOAL= (0..7)
0.5 0.5 0.5 0.5 0.5 0.5 0.5 0.5 
##$TPOFFS= (0..7)
0 0 0 0 0 0 0 0 
##$TUNHIN= 0
##$TUNHOUT= 0
##$TUNXOUT= 0
##$USERA1= <user>
##$USERA2= <user>
##$USERA3= <user>
##$USERA4= <user>
##$USERA5= <user>
##$V9= 5
##$VALIST= <valist>
##$VCLIST= <CCCCCCCCCCCCCCC>
##$VD= 0
##$VDLIST= <DDDDDDDDDDDDDDD>
##$VPLIST= <PPPPPPPPPPPPPPP>
##$VTLIST= <TTTTTTTTTTTTTTT>
##$WBST= 1024
##$WBSW= 4
##$XGAIN= (0..3)
0 0 0 0 
##$XL= 0
##$YL= 0
##$YMAX_a= 949067
##$YMIN_a= -765624
##$ZGOPTNS= <>
##$ZL1= 120
##$ZL2= 120
##$ZL3= 120
##$ZL4= 120
##$ABSF1= 10
##$ABSF2= 0
##$ABSG= 5
##$ABSL= 3
##$ALPHA= 0
##$AQORDER= 0
##$ASSFAC= 0
##$ASSFACI= 0
##$ASSFACX= 0
##$ASSWID= 0
##$AUNMP= <proc_1d>
##$AZFE= 0.1
##$AZFW= 0.1
##$BCFW= 1
##$BC_mod= 2
##$BYTORDP= 1
##$COROFFS= 0
##$CY= 11.3945322036743
##$DATMOD= 1
##$DC= 2
##$DFILT= <>
##$DTYPP= 0
##$F1P= 16.9975609425685
##$F2P= -3.02152046262296
##$FCOR= 0.5
##$FTSIZE= 0
##$FT_mod= 4
##$GAMMA= 1
##$GB= 0.15
##$INTBC= 1
##$INTSCL= 1
##$ISEN= 128
##$LB= 0.24
##$LEV0= 0
##$LPBIN= 0
##$MAXI= 10000
##$MC2= 0
##$MEAN= 0
##$ME_mod= 0
##$MI= 1.114404
##$NCOEF= 0
##$NC_proc= 0
##$NLEV= 6
##$NOISF1= 3.799351
##$NOISF2= 2.8
##$NSP= 1
##$NTH_PI= 0
##$NZP= 0
##$OFFSET= 15.70392
##$PC= 1
##$PHC0= -9796.18
##$PHC1= 14.00093
##$PH_mod= 1
##$PKNL= yes
##$PPARMOD= 0
##$PSCAL= 0
##$PSIGN= 0
##$REVERSE= no
##$SF= 200.130013532006
##$SI= 16384
##$SIGF1= 3
##$SIGF2= 2
##$SINO= 400
##$SIOLD= 16384
##$SREGLST= <1H.CDCl3>
##$SSB= 0
##$STSI= 0
##$STSR= 0
##$SW_p= 3612.71676300578
##$SYMM= 0
##$S_DEV= 0
##$TDeff= 0
##$TDoff= 0
##$TI= <>
##$TILT= no
##$TM1= 0
##$TM2= 0
##$TOPLEV= 0
##$USERP1= <user>
##$USERP2= <user>
##$USERP3= <user>
##$USERP4= <user>
##$USERP5= <user>
##$WDW= 1
##$XDIM= 8192
##$YMAX_p= 0
##$YMIN_p= 0
$$ End of Bruker specific parameters
$$ ---------------------------------
##NTUPLES= NMR FID
##VAR_NAME=  TIME,          FID/REAL,        FID/IMAG
##SYMBOL=    X,             R,               I
##VAR_TYPE=  INDEPENDENT,   DEPENDENT,       DEPENDENT
##VAR_FORM=  AFFN,          ASDF,            ASDF
##VAR_DIM=   8192,          8192,            8192
##UNITS=     SECONDS,       ARBITRARY UNITS, ARBITRARY UNITS
##FACTOR=    0.0002004,     1,               1
##FIRST=     0,             0,               0
##LAST=      1.6414764,     0,               0
##MIN=       0,             -765624,         0
##MAX=       1.6414764,     949067,          0
$$ Real data points
##PAGE= N=1
##DATA TABLE= (X++(R..R)), XYDATA
0@%%%%qJ6j4J4j7K6m1M8n7P4r4J11j31J67j97K29k71L17l77M34m94N74o58P47
28C98q46R61j091J226j375J541j728J929k142K388k658K945l264L615m006M437
44B330m908N438o035O707p467Q340r361J0561j1998J3759j5982J8887k2847K8632
58A6056l7964N5961j41017O07589L18870n71986q7025P2056m07800m49347L47912
69b76695L79613k81211j84168O66697N41677l79421n73319p0281j71221m17295
79g65624K31575R30633L51112n05138k65914K64641j13514n11386l6239L30331
89h9523j13185j76990N91826P24996k90191q31034k31075J57963j65680m6886
99d69779N88299M57881l17305l17716K93699J36909n38958m05109K27647J96241
$$ y = [0, 0, 0, 0, 0, -8, 8, -6, 8, -9, 17, -24, 24, -33, 41, -53, 58, -73, 94, -103, 126, -145, 172, -205, 229, -265, 309, -349, 398, -448, 513, -578, 648, -727, 814, -914, 1015, -1127, 1261, -1397, 1548, -1716, 1899, -2107, 2330, -2578, 2860, -3175, 3532, -3935, 4405, -4956, 5605, -6393, 7366, -8616, 10271, -12576, 16056, -21908, 34053, -106964, 500625, 819495, 247509, 160484, 232540, -175260, -624607, -276695, 102918, -178293, -362461, 304236, 845913, 466492, -106827, -177108, -348329, -765624, -534049, 396584, 747696, 242558, -23356, 241285, 127771, -383615, -419854, -89523, -202708, -379698, 212128, 937124, 646933, -184101, -415176, -257213, -422893, -469779, 118520, 576401, 259096, -58620, 235079, 371988, -166970, -572079, -344432, -148191]
109a48191o7366L49983O50243r1598q09927l72605K68200N2039k04085K46191
119a27116M70952o4738k76010K35747K57326m98603o60356J07461M70725R0235
129E623O4633M35814J31059n90759m73055K08265J98354k53231n5088M23457K24469
140C19541j62777O0863K27689l38654o92878o6332N38644K59922p2593J86840
150B60265K31133l07134m49356Q0781K19722k52267k48835L58743M65767l3342
160C25477j46609J10127j25304n59629k38830M33975L86757q0051k9177K34655
170C11391k0605l42819r6629J41243j67116l02863K26645N61368J35541k47112
180A99044o7510n290l33433k89188K48191L75677m1644j25432K22988J86610k34994
$$ y = [-148191, -215557, 134426, 784669, 693071, -116856, -489461, -221261, -169222, -373307, -127116, 343836, 279098, 3088, 238835, 496161, -2442, -662798, -555337, -84612, 5623, 70256, 506070, 637129, 46370, -426685, -218420, -20066, -273297, -328385, 95072, 319541, 156764, 217627, 445316, 106662, -586216, -652548, -113904, 146018, 73425, 260265, 491398, 184264, -265092, -184311, 35411, -216856, -465691, -106948, 358819, 325477, 178868, 288995, 163691, -395938, -634768, -200793, 185964, 105913, 76736, 311391, 290786, -52033, -148662, -7419, -174535, -477398, -250753, 310615, 446156, 199044, 131534, 126244, -207189, -496377, -248186, 127491, 85847, -39585, 183403, 370013, 135019]
191A35019k62789L0462m3430k50659P4875N14664K78979k34855k19151K9521j02834
202e0198k53938M1088K72547K6159j19567J87885K92640j24943l67959j01070
212a97356N6794j12343k6506L50056L17297j36470k53539K5132L9412k07502j31229
223b76254J58949J20196n8504J06426K90169m197l63495k20491Q0065L5909n2028
234a83255J52265K57953p030j79593J880P3439j63685k21048O0472J86609K7086
245E093K7121K00614P9103k60543k61511L6349J05381m1812J4210J83738R5055
256A82798r0467l3172N9917j03968k36931l3242J93937J15694o228P7891R5309
267B21538j16439k13953l2325Q0755k5876l7477J28203J45126k5534o3007L0689
$$ y = [135019, -127770, -97308, -140738, -391397, -316522, 198142, 477121, 242266, 23115, 52636, -50198, -304136, -263048, 9499, 35658, -83909, 103976, 396616, 271673, -96286, -197356, -140562, -252905, -279411, 70645, 387942, 251472, -2067, 23065, 62477, -145025, -276254, -117305, 2891, -55613, 50813, 340982, 336785, -26710, -247201, -167136, -131227, -183255, -30990, 226963, 219933, 40340, 42220, 115659, -48026, -269074, -208602, -21993, 5093, 32214, 232828, 311931, 51388, -210123, -173774, -68393, -110205, -95995, 87743, 182798, 92331, 59159, 119076, 15108, -221823, -255065, -61128, 54566, 48338, 126229, 221538, 105099, -108854, -141179, -60424, -86300, -123777, 4426, 149552, 124018, 61011, 91700]
278I1700m0218j95222r9545J41662J56787N163j203P6104j0927j40754p9098L2769
290f2782j1212n1194P5116J57136L4368p4277j7865J000j09294j16458N0875J31832
302G245L9549r228M8853K7093q1087q5638N56l034n0627K3175J32884Q1312m9024
315H2029n4097L133l6875q9779j8748P5446N4621Q133L3574L7599l7855p5569
327a8388k3181K261l3436j2155P7787R1172K701m7524j8055j3204m9543l5562
339g7127K4669L6329J3573L0866M8241m343o2001m1033J384j0476k3853K2726
351d1045O6309L8682j2102k1158j5379k7823l0092l550J3292R642K3152M5902
363D5830K3573l0343m4996j6652l610j4015k875K6835L6171K0051M790q789k6798
$$ y = [91700, 51482, -143740, -243285, -101623, 55164, 60327, 59124, 135228, 124301, -16453, -95551, -62782, -73994, -125188, -50072, 107064, 141432, 67155, 49290, 50290, -59004, -175462, -124587, 7245, 46794, 37566, 86419, 113512, 32425, -53213, -52657, -55691, -106318, -83143, 49741, 131053, 82029, 27932, 31065, -5810, -95589, -114337, -38891, 15730, 23863, 57437, 95036, 57181, -18388, -41569, -39308, -72744, -84899, -7112, 84060, 86761, 39237, 21182, 7978, -41565, -77127, -52458, -16129, -2556, 28310, 76551, 72208, 10207, -30826, -29442, -39918, -63771, -41045, 25264, 63946, 51844, 30686, 15307, -12516, -42608, -46158, -32866, -23224, -72, 45830, 69403, 39060, -5936, -22588, -26198, -40213, -43088, -16253, 19918, 39969, 44759, 35970, 9172]
376I172l1713j4169K105L729J0249L0372L6694Q443k6379l1303j6902r292p330
389c6324K038J7947L0163K8430R928j8584l3520k5339r688j327M177J7115L1179
402A6195K9830P192k0683l3511k6042j2558j864Q880K2081L2958K7980M994k4024
415C1428l6991k7931j1470K459J2545K3575L3773K9720K939l0254m3435k9690
427d3332q371Q075J8165K7864L4325K5875l358l5389m4634k9526q275J1541K7504
440a9536L5987L2362J6430r606l7560n0431l1919J752K3950K9034L2356L5179
452E7998J7017k3210n0683m5703k3884Q70K8969M7544L6921J5326K950j6441n0578
465b904o0398k0595K5245L6609L3655M1350L1387j4056n1547m8256l2167j9541
$$ y = [9172, -22541, -36710, -34605, -30876, -20627, 9745, 46439, 54882, 28503, -2800, -19702, -28994, -36324, -34286, -16339, 13824, 42254, 52182, 33598, 78, -25261, -34949, -36276, -32099, -14984, 16195, 46025, 53217, 32534, -977, -27019, -39577, -41441, -32561, -10480, 22478, 50458, 55452, 31428, -5563, -33494, -44964, -42505, -29960, -6385, 27388, 57108, 60047, 29793, -13642, -43332, -51703, -43628, -25463, 2401, 36726, 62601, 59243, 23854, -20780, -50306, -58581, -47040, -19536, 16451, 48813, 65243, 55637, 18077, -32354, -64273, -62521, -38571, -9537, 22819, 57998, 75015, 51805, 1122, -44581, -68465, -67595, -38626, 8918, 45839, 61165, 64115, 47674, -2904, -63302, -83897, -58652, -22043, 11612, 52962, 84349, 70293, 18746, -29510, -61677, -81218]
477h1218J2744N7635N8133J7865k888m4l1111p5438n4394J5244M6362L7393M3805
490D4088M5836k691n6143n0733k4582l0354k0028M6165Q5601L9916r153j996j1347
503E4579p2806q3216l388N5225L9503L4988N9922K3286n7987o6855j5571j9695
515e2015n0009Q503R9935Q1759k644j7614k224n8369j02225k6767O4911M5627
527a1132J0735N6028O6260l4312r2190l0333k33n7455l6084R2679J26829J8468
539A09260m0726n156l1670j05377n8075O4324O2003j3136K6636J03733K5330j03389
551C3757p6962J878l6518o3311O5342J57550M9454o5761k1708R648q1375r8548
563a26554L3277Q3073j2547j0965J15535R6799q6201j38930k3833L190n6166K2277
$$ y = [-81218, -68474, -10839, 47294, 65159, 62271, 62227, 31116, -44322, -98716, -83472, -37110, 283, 44088, 89924, 87233, 31090, -19643, -44225, -74579, -94607, -48442, 37159, 77075, 67922, 65926, 54579, -18227, -101443, -104831, -49606, -10103, 24885, 84807, 108093, 50106, -16749, -32320, -52015, -102024, -93521, 6414, 88173, 85529, 67915, 65691, 7322, -94903, -121670, -56759, -11132, -397, 55631, 121891, 87579, -4611, -34944, -35177, -92632, -128716, -36037, 90792, 109260, 68534, 63378, 31708, -73669, -131744, -67420, -5417, -18553, 8083, 111816, 137146, 33757, -43205, -41327, -77845, -141156, -75814, 81736, 131190, 65429, 43721, 53369, -28006, -126554, -93277, -10204, -22751, -33716, 81819, 178618, 92417, -46513, -70346, -67156, -123322, -101045]
575a01045J56466Q5403p6514n0735N0984k4504j34753l9923Q8772K8566k7427
586d4710R4462J44052m9043j86561o3943M8213k2453l0208J16055J22870n5334
597G3400q0935O9673M6213j48376j37249O6627J00369p696M4838J47563P73k00346
609b5146j08234Q4145L1226q2273L2667J48177J6571q9019M4459R1131j26726
620A6978k16681J7958J72801M4386j7854J01250N6142j64570j46016Q8456Q7593
631D0443j14216p4733J48701J27120n7791k5114Q2065p2857k38234m5028K09199
642b0445J12864o9940J3827J00129o7634j57952L4998J11653j03130j54918J16513
653h4035K28085O463j03198K2374j0116j95254r7535J93572J66226r7533q1026
$$ y = [-101045, 55421, 140824, 64310, 13575, 64559, 40055, -94698, -134621, -45849, -17283, -44710, 49752, 193804, 144761, -41800, -105743, -57530, -79983, -110191, 5864, 128734, 73400, -7535, 62138, 108351, -40025, -177274, -110647, -10278, -17974, 26864, 174427, 175200, -25146, -133380, -49235, -18009, -100282, -67615, 80562, 97133, 8114, 52573, 143704, 16978, -199703, -181745, -8944, 35442, 17588, 118838, 174980, 10410, -135606, -47150, 40443, -73773, -148506, 195, 127315, 69524, 44410, 126475, 53618, -184616, -229644, -20445, 92419, 22479, 36306, 136435, 68801, -89151, -54153, 57500, -45630, -200548, -84035, 144050, 150513, 47315, 69689, 59573, -135681, -233216, -39644, 126582, 29049, -51977]
664e1977J28483O4717j41773o6950Q9650m6070j81141N5933K85210Q8910j64900
675F0092p1055M8845r2769j31828J14805J84505p6572j46291J20945J85379q8009
686A08047j77189J5762K5514j35351l923K73853J53559j87774j59829R0382L8288
697D1339j41491j3431J60014p361j57650P9029K58442j2618k64112r0440R4445
708e3834k5122n2629J79187J83065j41994k09559Q8242J54466j14479j55867Q3037
719f5487R0484r0288J8058K40818N6127k82027j82308J30569R8945p8565L6371
730b7303J68056l8844j95371M3512K07192o1032k56931k1366J77233K8382l8116
741a4588J42976R7441k22195k28304J18921J91244p5507j06967J15719Q5213j19312
$$ y = [-51977, 76506, 141223, -550, -67500, 22150, -23920, -205061, -149128, 136082, 224992, 60092, -10963, 37882, -54887, -186715, -71910, 112595, 36023, -110268, 10677, 196056, 108047, -69142, -53380, -27866, -163217, -167140, 106713, 260272, 72498, -87331, 3051, 41339, -100152, -113583, 46431, 39070, -118580, -39551, 218891, 206273, -57839, -148279, -53834, -78956, -131585, 47602, 230667, 88673, -120886, -32644, 121822, 7343, -148524, -65487, 24997, -65291, -47233, 193585, 249712, -32315, -214623, -84054, 14891, -63674, -27303, 140753, 101909, -93462, -49950, 157242, 96210, -160721, -182087, -4854, 23528, -14588, 128388, 225829, 3634, -224670, -105749, 85495, 9988, -96979, 18740, 103953, -15359]
752a5359k1311J80200n873k87141j10949K23154J49945p5575N589J07215j05393
763D4502k19093O2841K26170m6638k14024M0454K00664k90r1936P8965L8676k29617
775a09326j62988K04613K33464p7875j26259Q1061L9339j49359k7204J76389j20
786H1735k34957l1916K58365J16477j37224n3552N8873j08273j62433J27474K45523
797A60092m7956k02211L8085J59586m9424j19596O6344M7127j69887p8619K36608
808D0149J92460j36704j66921N2072L0743j18161J3156J88897R133j99725j2258
819a07159K16762M9040j75634o3120P3458n3418q6884J52031K05145r3020k18467
830a01266K3272J35459n0467r2602Q7168O5546j30110m6914K02524J12585j83905
$$ y = [-15359, -36670, 143530, 137657, -149484, -260433, -37279, 112666, 37091, 42680, 149895, 44502, -174591, -111750, 114420, 67782, -146242, -105788, 94876, 94586, 2650, 81615, 120291, -109326, -272314, -67701, 165763, 87888, -38371, 42690, 82029, -67330, -94534, 81855, 81735, -153222, -185138, 73227, 189704, 52480, -1072, 57801, -50472, -212905, -85431, 160092, 112136, -90075, -51990, 107596, 58172, -61424, 4920, 52047, -117840, -196459, 40149, 232609, 95905, -71016, -18944, 11799, -106362, -93206, 95691, 104824, -94901, -107159, 109603, 158643, -16991, -80111, -6653, -60071, -146955, 5076, 210221, 117201, -101266, -77994, 57465, 6998, -85604, 1564, 67110, -63000, -109914, 92610, 205195, 21290]
841B1290j61301P6282O4853o9035M0147J65584k4187k02226j3355J81111J5647
852I4810j63757k3833J07170j9601o3738J24049J33158j37340k03288N0494J45542
863D3666l0713o4147Q9200N0824j25761m8440J54779O0716j73651j07012J13975
874c6564Q2945n4603K2309J09878n7307j82707N396J64872J3250j25931N939J03474
886E0951k3525o7279P8482P5891j29048j42307Q4151J42666k5053o0183N9091
897D3837K0518j14990l7427J27036M2811j33313n5575J18673O5027o5261n010
908F326O4115o1005j32290L7463J51227O930j04570P387P7289l3968o6434N5564
920H034N4211r6076q3776R7886J14741m3191o9081L5004P893q8747j3115J12066
$$ y = [21290, -140011, -63729, 1124, -67911, -27764, 137820, 113633, -88593, -101948, 79163, 94810, -68947, -92780, 14390, -5211, -68949, 55100, 188258, 50918, -152370, -101876, 43666, 12953, -51194, 38006, 88830, -36931, -85371, 69408, 130124, -43527, -150539, -36564, 46381, -8222, 14087, 123965, 66658, -116049, -110653, 54219, 67469, -58462, -52523, 50951, 27426, -39853, 38629, 114520, -14528, -156835, -72684, 69982, 44929, -15254, 43837, 64355, -50635, -88062, 38974, 81785, -51528, -107103, 11570, 76597, 11336, 6326, 70441, 9436, -122854, -85391, 65836, 72766, -31804, -24417, 52872, 18904, -47530, 8034, 62245, -33831, -117607, -19721, 95020, 51829, -17252, 17752, 25645, -63102, -76217, 35849]
932C5849L2345j00995k7453R7495L1177p4480j5564M7939l9781p9476N3642J19623
944H0321j1255r3136L721N4035l5807n2624M8901M7727o1306m4729Q0956O9990
956H6794n8004o3950K5840J1032n2934N332Q8210J9532p5273j8810O3257O753
968C7779o4807r620M3871j3889l9804M6648P5028k7509p7287J179L7158k3803
980a5056k8218M4632L9184l7973k7306M8648K9008n5779m5751K7297K1011k2947
992b3250J2993N8330K838o1018j8302L6589k443m1688P322M4073k34k3055K5135
1005A7290L2193l5903n5688O384L2965n992o992L6389K3783l1979k7631J8936
1017C755P377l7211j6193L4918K5543r995N228K4284j4580m7716j2170K5006O057
$$ y = [35849, 68194, -32801, -60254, 37241, 68418, -6062, -21626, 26313, -13468, -92944, -39302, 80321, 69066, -24070, -20349, 33686, -2121, -54745, -5844, 41883, -19423, -64152, 16804, 86794, 28790, -35160, -9320, 1712, -51222, -45890, 42320, 61852, -13421, -32231, 31026, 37779, -27028, -36648, 7223, -6666, -46470, 178, 75206, 47697, -29590, -28411, 8747, -15056, -43274, 1358, 40542, 2569, -24737, 23911, 52919, -2860, -48611, -21314, -303, -23250, -10257, 48073, 50911, -10107, -28409, 8180, 5737, -35951, -28629, 15444, 15210, -7845, 17290, 49483, 13580, -42108, -35724, -2759, -8751, -15743, 20646, 44429, 12450, -15181, 3755, 11132, -26079, -42272, -7354, 18189, 8194, 13422, 37706, 23126, -24590, -36760, -11754, -5697]
1030e697j1127J8331L1224m538k4926j137M666k5023k3640J8888L3148N931j873
1043A4227J2983l77l1882k4384Q337J0068n286Q306K8494J2997j4362j2678l885
1056B558j6525k1029N171K6885J7177K548O745L090j8186k5849p219N417R96O242
1070a1979K3196J9732l162j4083j0919j4068j7380l053J7441K0542J1016O542
1082B3825K888j0749k1503j6765l794L439R013J8482K0218N818r015j4423j6336
1095h902j5247o433Q837J8387J6544J1559L505p393j8132j8876j1744O7J0696
1108a7132J7157J8761J0899k048j3887j8378j6258q346L380J4101J8906J5961
1120B3116P079o036j5438j9001j4935m928P721J7117J8936J3096K810r247j8217
$$ y = [-5697, -16824, 1507, 32731, 28193, 3267, 2130, 6796, -18227, -41867, -22979, 10169, 16100, 14227, 27210, 26833, -5049, -29433, -21096, -11028, -16314, -8008, 20486, 33483, 19121, 6443, 2558, -13967, -34996, -29825, -2940, 14237, 16785, 23530, 26620, 8434, -17415, -24634, -19217, -18221, -11979, 11217, 30949, 27787, 13704, 2785, -11283, -28663, -31716, -14275, 6267, 17283, 23825, 26713, 15964, -5539, -22304, -26098, -22659, -13646, 4836, 25054, 30872, 21857, 7434, -8902, -24149, -30582, -21745, -3358, 13186, 24745, 28250, 20857, 2725, -16151, -27895, -27828, -17132, 25, 18786, 29685, 27637, 13750, -4628, -20886, -29232, -25852, -11751, 7155, 23116, 30195, 24159, 8721, -10280, -25215, -30143, -22422, -5305, 13631, 26727, 29537, 20290, 2073]
1133B073j8503j1647p11J1036J8623J8186J0147j237j3331j8811j7638q504L987
1146b6330J4608J9443J6025O465n224j5803j9797j5487n076Q935J8108J7522J2413
1159B5802M631q818k0044j9820r384L35Q308J8243K1668J0669n336j3458j5950
1172c154j7165j1579M647J8740J7650J1559P610p22j7660k4128j2421N4M245J2832
1186i492K5051J7635n268j4883j0358j4006j8796k932J9344K0178Q446Q242R248
1199C2409j1648l0440j9077L150N003M777K1747K6208q9j9404r240m799j9863
1212b1266j6450J4744K6362R060N059J5367j765l4368k8154N431J0805k379J1186
1225f368L1928J1213k2458j2567N636j4859l2264J967L6848J8611l785J1965J1374
$$ y = [2073, -16430, -28077, -28788, -17752, 871, 19057, 29204, 27967, 14636, -4175, -21813, -30317, -26330, -11722, 7721, 23746, 30211, 24987, 9184, -10613, -26100, -31176, -22241, -4133, 13389, 25802, 30433, 21615, 1571, -18249, -27633, -27298, -18990, -747, 20921, 31590, 26254, 12796, -3154, -20319, -31898, -27251, -8511, 9139, 20698, 28308, 27586, 9926, -14202, -26623, -26569, -22324, -9492, 15559, 33194, 27926, 13043, 2685, -11321, -30117, -33049, -13705, 6473, 14919, 23161, 32409, 20761, -9679, -28756, -25606, -20603, -15826, 5921, 32129, 32040, 12636, 3396, -1403, -21266, -37716, -22972, 3390, 12450, 17509, 32876, 31111, -3257, -31411, -25980, -15175, -17554, -6368, 25560, 36773, 14315, 1748, 7384, -7475, -39739, -37772, -924, 17687, 13902, 25867, 37241]
1238C7241k9562m0249K557K2970m841p001K8738K8494j4623k1407P471n597m0870
1251c6679j4768M2284L4862r936l006K1014j2818m6947q320L2730M0k9089J7364
1264a3269N0595L980l4216m466O946l5989l2637L8366N4113q580k7247J8948J6607
1277C3151l8288k9156K6747J1575l7028j426O4542L1208m3208k9286J5051j4509
1289a0627m1481J9852O4120J275m7942Q508M7960j5098n3848J605K6716k5862
1301b4822j9953O1728N7571m1091o0810J3861K1943l5498j3251N4355K0508n1205
1313a6664p745O7654J5919p3720l5768L6764N385k9175L8770P0944k6052q4248
1325c7936M074N9823j5631n3477K3300M5736k9594k5818O6163M3707p7805p6575
$$ y = [37241, 7679, -32570, -30013, -7043, -11884, -18885, 9853, 38347, 23724, 2317, 9788, 4191, -36679, -51447, -9163, 25699, 15763, 12757, 33771, 20953, -25994, -34314, -1584, -1544, -30633, -13269, 37326, 41306, 7090, 2624, 9570, -26419, -59056, -20690, 33423, 24843, -2404, 16544, 33151, -5137, -34293, -7546, 4029, -32999, -34425, 30117, 61325, 18117, -11169, 3882, -10627, -52108, -32256, 31864, 33139, -14803, -6295, 41665, 26567, -27281, -25676, 1040, -24822, -44775, 16953, 74524, 33433, -27377, -13516, 8427, -27071, -40322, 14033, 34541, -16664, -24409, 43245, 59164, -14556, -50324, -13560, -8175, -37350, 1420, 72364, 46312, -37936, -33862, 25961, 10330, -43147, -19847, 25889, -3705, -29523, 36640, 80347, 2542, -74033]
1337g4033L7391N0606k4866l633O1818L602q2020j4674P9995J2443q5047k3195
1349f1613O6421J6617l4945L4822N7352n9768j02164K5181R1044o722n3837K9033
1361A421M2962m7969l6365O7989L7331r2378o7619P1637P2304l0668j7678M8028
1373D8995j8873r7276q70J06268J8394r0486j5629P7185R171n2392K4957M8722
1385E8166p0069r3539N8183J16212j3579p3040J8023L2324n9723l2156Q5263M0791
1397F6856r8138n6980R4091P1721n5518l6880M0245k4699q8957L0387J30252Q270
1409H0650j12766j9195Q0887n89o2132K9890N3997p1387p9863Q6029J19809m4748
1421F0582j00539J4688L7420n1801j3436J01251L3948j13535n2862J03313O1166
$$ y = [-74033, -36642, 13964, -10902, -14535, 47283, 50885, -31135, -45809, 34186, 46629, -38418, -61613, 4808, 21425, -13520, 21302, 78654, 18886, -83278, -58097, 32947, 26225, -27612, 1421, 44383, -3586, -39951, 28038, 65369, -27009, -94628, -22991, 49313, 18645, 967, 48995, 30122, -67154, -68024, 38244, 56638, -33848, -49477, 27708, 36879, -15513, 9444, 58166, -11903, -105442, -47259, 68953, 55374, -17666, 357, 32681, -27042, -59198, 26065, 66856, -31282, -88262, 5829, 77550, 22032, -14848, 25397, 698, -88259, -57872, 72380, 80650, -32116, -51311, 29576, 28987, -33145, -3255, 50742, -20645, -100508, -14479, 105330, 60582, -39957, -25269, 12151, -39650, -53086, 48165, 82113, -31422, -84284, 19029, 80195]
1432H0195p5821m3459M7523j3808p0872N0327J28453j9409j35582j8041Q9849
1443A9355K007n7114L8582N4529p3090p1029R2594J03923p0558j09529K7241N4719
1455A1630l6512k798R6282J3519j26364m8431J09912N5603q2272l7190N8898n095
1467G182o2742N1867J10043m7760j41999O51J07318P878n4186L7290M3754q0230
1479b0934o4244R6601Q9090q5525j01485M9328O8311l3800p159P9599r849j31255
1491g1322k7097J25251N0302q7197l1062O2687q349o1382N0290R0030o3479j29436
1503a00764K9032J19157J991o2215K7330L0989q1340n0751J03078P7466r0205
1514C768q6506O3442O6718m1794j6439O2454j8960j14722k821J29646L9333r1866
$$ y = [80195, 4374, -39085, 8438, -5370, -76242, -25915, 102538, 83129, -52453, -70494, 19355, 21362, -35752, 2830, 57359, -15731, -86760, 5834, 109757, 39199, -70330, -43089, 11630, -24882, -27680, 68602, 82121, -44243, -92674, 17238, 72841, -9431, -46621, 12277, 7182, -55560, -3693, 106350, 58590, -83409, -82758, 24560, 32438, -21748, 15542, 59296, -20934, -85178, 11423, 100513, 14988, -86497, -37169, 31142, -2658, -9817, 69782, 59933, -71322, -98419, 26832, 77134, -10063, -41125, 21562, 13213, -48169, 2121, 92151, 28672, -100764, -71732, 47425, 49416, -12799, 14531, 45520, -35820, -86571, 16507, 93973, 3768, -82738, -19296, 47422, 5628, -10811, 51643, 32683, -82039, -84860, 44786, 84119, -7747]
1526g747l1145N7294r507n5589M5812P6483o3087j06161M5776J13555j1670p1277
1538a7263J6861K5095o7647k9830J01802O1743r1801p3650O6501N7439m7067k1654
1550a9471N2350j7427r0586J7733J20898J8367r9284k9024N6663o083m5632M5287
1562C791O3515o1996q5814N5708R6651l0134p4235J7575K8955n0618j2898R2527
1574D3027L9606r3693n9489O7440M7432n0064j8765M9912j2362p0515K5790R9645
1586F7964m116r7219j7934N8986j752l5856M0694M8299n7252o7163N2520P3879
1598F1050l8277o4500K4214L3177l5932p160P2391J9016q5931m3816O4456L8022
1610C6710m4007j3001M3556q332n4443K2654P2521j7199q1653l827N8467K394
$$ y = [-7747, -38892, 18402, 8895, -46694, -882, 75601, 12514, -93647, -47871, 65684, 54014, -17263, -402, 24693, -42954, -72784, 29018, 90761, -1040, -74690, -8189, 49250, 2183, -19471, 32879, 15452, -75134, -57401, 63497, 81864, -17420, -46444, 10219, 4136, -41496, 3791, 67306, 5310, -80504, -24796, 71855, 41721, -32514, -14939, 14016, -36602, -49500, 43027, 82633, -11060, -70549, -3109, 44323, -5741, -24506, 25406, 13044, -57471, -31681, 67964, 63848, -33371, -51305, 7681, 5929, -29927, 10767, 59066, 1814, -65349, -12829, 61050, 22773, -41727, -17513, 15664, -20268, -27428, 44963, 63979, -21952, -65768, -1312, 36710, -7297, -20298, 23258, 14926, -39517, -16863, 55658, 38459, -43194, -47021, 11446, 13840]
1622A3840k8997K9474L2547n1872n0923M7092N5890l7073m8937K9145L2349k9088
1634f553p986N0103L787p1963k4386O0986L0670l7494r263L4669r514m4184J7351
1647a3777N1877k0148n9764R987N3630p47k8551J8894J8161m3831l4001M3252
1659e018M1682l0967l2298K8358K2481k7667j0411L2964j135n0475o887N3426
1671A4053K0893l3670r048K3201j0905l3441J4869L8203j4172l7800J5467L9229
1683B6879q127k7682Q599J0893k8278j6228L7186K9468k4159k3204J9129J1578
1695A6054k4690r460K3876K390k7577L004L8209P464l1186j0288J5053p230j8679
1708b3060J5114K8835q944k2950J0150J9874j3199k2550P164J1873j1412l627
$$ y = [13840, -15157, 14317, 46864, -5008, -55931, -8839, 47051, 9978, -38959, -9814, 22535, -6553, -14539, 35564, 39351, -32612, -56998, 3988, 34658, -2836, -12099, 22570, 13056, -31128, -13777, 38100, 17952, -41812, -31825, 21805, 21058, -7493, 11401, 29562, -14269, -48270, -5018, 36664, 5697, -26601, 1757, 24238, -3429, -13840, 19124, 17989, -32486, -39373, 14053, 34946, 1276, -7772, 15429, 4524, -28917, -14048, 24155, 9983, -27817, -12350, 26879, 18752, -8930, -331, 10562, -17716, -33944, 3242, 32710, 8551, -14653, 4476, 16054, -8636, -18096, 5780, 8170, -19407, -16403, 21806, 29270, -1916, -12204, 2849, -4381, -23060, -7946, 20889, 11945, -11005, -855, 19019, 5820, -16730, -9566, 2307, -9105, -12732]
1720a2732K5840J4704k2472j8053J0504M968j6420j381K2058N351j5321K161J8010
1733A7217n004k4667n016J4269Q49n936J2287J6723q306j8686J493P384r577r169
1747a6139J1003J3740l451k525R650M37j8291j1154Q075N914k793N065J4130R91
1761A4652j2415n167L172n130j0223L705J4618N417k546K782K541j0479j3220
1774a2293q5O533J677K628R662N725m958p526l330l668p028O42R827Q564K036
1789H406J536N70o396j1336n325K911L785L159P300Q213p06p008o432m463n274
1804a1060j246N886Q958O629K353j640n085p865o996k228K887N665P721O495K228
1819A2702m197o459o969o318j839M405Q467P628M115L3m457o988q225m782J394
$$ y = [-12732, 13108, 27812, 5340, -12713, -2209, 2759, -13661, -15042, 7016, 12367, -2954, -793, 17217, 12213, -12454, -17470, -3201, -2352, -8288, 3999, 20722, 12416, -6270, -4777, 2607, -6970, -16139, -5136, 8604, 5153, 2628, 12278, 12715, -5576, -16730, -8655, -2741, -5534, -469, 13661, 14652, 2237, -2930, 242, -4888, -15111, -11406, 3212, 8629, 6083, 8865, 11406, 927, -12293, -12378, -5845, -4168, -1540, 8122, 13847, 8889, 1363, -1967, -5635, -12663, -12021, -2194, 6370, 8406, 9942, 10512, 4116, -7220, -12545, -9634, -5849, -2690, 4610, 12823, 12117, 5109, -1323, -5786, -11060, -12306, -6420, 2538, 9167, 11520, 9880, 4795, -3070, -10066, -12294, -9407, -3742, 3979, 10474, 12702, 8505, 2046, -4923, -11241, -13080, -8675, -208, 7420, 11535, 11568, 7111, 123, -8102, -12884, -11490]
1834a1490O005P297O443M577r28p053q955o383k189K685O401P785O764K343l812
1849I490p565q070n338j561M333P664Q654N013J21n832q018o881m394l19O085
1864f618R441P069L006j589n859r412p290k104L461O534Q050P396J716m682p431
1879A688p227o439k730N533J0554P574K488P58l128j0055j0572j861L766L803
1893e848N824J0610N767m778r290o109n619n625K210J1879R820J083Q85O50p676
1908C783j3400m999M806K615K685J1729J1580l659j3099n688k088p563l246J1857
1922d687J3583M22k379N304j358j6054j2026M592O584j3P747J6961J507j6827
1936C356r609L169m292j0411O584J7902L619n890O309O860j5743k1876K103J3409
$$ y = [-11490, -5485, 1812, 8255, 12832, 11904, 4851, -4104, -10487, -12676, -9991, -3590, 4195, 10959, 13302, 9490, 1925, -6145, -11483, -13044, -8711, -1047, 7607, 12620, 12741, 6909, -1109, -7990, -12384, -12703, -6618, 2823, 9892, 12898, 11309, 5450, -3962, -11252, -13356, -9895, -3361, 4689, 12085, 13801, 9119, 1688, -5539, -11978, -14708, -9175, 1379, 8953, 11441, 12199, 9071, -984, -11556, -13417, -9651, -5848, -24, 10586, 16353, 11575, 2285, -3824, -9443, -15068, -12858, -979, 8841, 9924, 10809, 11459, 3783, -9617, -14616, -9810, -7195, -4510, 7219, 18799, 15140, 2041, -3647, -5735, -13298, -16544, -4687, 8896, 9318, 6939, 12243, 10885, -5169, -17195, -12603, -6019, -6032, 1715, 18676, 20183, 3356, -6253, -3084, -7376, -17787, -11203, 6699, 10318, 4428, 10737, 17597, 1854, -20022, -17919, -4510]
1950d510O48Q42J7016R438j6603j6038O999L321j6014n215K0164J3550p347J593
1964G844J2511j1083k9934m504K1689O406q533J0180J8244j0119k1566N531J1516
1977H182j7319k0167J8316K7959l139r598J1619L03l1793j5417K5369J7252j6131
1990d564m695K4512O950k2661n781J4842j1668l0115R893M1095P664k2071J047
2003D448J1881k0949k5197J9323K6606j7176k1145K5537K9182j8257k3780J0390
2015H63J015l1103k844M5671K3072l0401j7517K1530J195l0027j80K9350p090
2028C534l0967J7798M7375n045m2620m900J6402j8068j6040L7666L5173l0472
2040I836l4353K5497K7645k8449k6534K1554J0230k8382N401N4480J1183n5378
$$ y = [-4510, -3862, -3020, 13996, 23434, 6831, -9207, -2208, 1113, -14901, -20116, 48, 13598, 6251, 7844, 20355, 9272, -20662, -25166, -3477, 2929, -5604, 4576, 22820, 12701, -8865, -3334, 8182, -9137, -29304, -10988, 16971, 13832, 4234, 15853, 16156, -15637, -31054, -5685, 11567, -4564, -9259, 15253, 22203, -458, -6239, 8603, -3065, -33180, -23287, 17808, 25472, 3401, 4448, 16329, -4620, -29817, -10494, 16112, -1064, -22209, 3328, 32510, 14253, -9527, 863, 1878, -29225, -32069, 13602, 36674, 6273, -11244, 10286, 11481, -18546, -18726, 10624, 3534, -27433, -9635, 37740, 32695, -9925, -14825, 1577, -16491, -32531, 5135, 40308, 9836, -24517, 980, 28625, 176, -26358, -4804, 5426, -22956, -17555, 36925, 48108, -7270]
2052g270k6795L0548P979k6376J2847L9295j5401m2261J9942M8152j8675n3609
2064c1624K926L2195j0031j0254M3615K5206n3360m5450L5372L7177k8876k2927
2076b6031L2477J2890l5115L558N3483l134p0242k0651N0505K0669k4012J2060
2088F457L2983l0382n2692K5703N5343k1229n4814J4759M3715j1092j6846L6467
2100B8372J2340o5777m0436N6156M9446l1163k5945L1895N510m4298L720N5665
2112C5485p809p1500o723O8132K1003l6492K660K3962l9556m8949M3148O6451
2124D9812k7079n8857K0704M4839k0868k4612L4020Q755o5911k3532P5293M8935
2136F1499m6910l6604K8585J580m3761J3735O3257j1836p3083L936P3587R278
$$ y = [-7270, -34065, -3517, 4462, -21914, -9067, 30228, 14827, -27434, -7492, 40660, 21985, -31624, -28698, 3497, -6534, -16788, 26827, 52033, -1327, -46777, -11405, 25772, -3104, -26031, 6446, 19336, -15779, -12221, 41262, 38128, -32114, -52765, -2260, 18409, -5603, 6457, 39440, 9058, -43634, -17931, 37412, 16183, -38631, -23872, 19843, 8751, -8095, 28372, 40712, -25065, -65501, -9345, 40101, 8938, -17007, 14888, 20398, -23900, -20180, 35485, 27676, -43824, -50547, 17585, 38588, 2096, 4756, 28718, -10838, -59787, -16639, 49812, 22733, -36124, -15420, 29419, 8551, -16061, 17959, 26714, -39197, -62729, 12564, 61499, 14589, -22015, 6570, 8150, -35611, -21876, 41381, 29545, -43538, -39602, 33985, 43263]
2148D3263n1002k258K4033l5746l5059N9028O5945m1566o7847K1868M4853k5204
2160C08k4059L8956J0329o1048j3725P9361L7520o3472m2589L1831Q176l4172
2172c2584K3122O2919k1084p7296P403P2241J152n5632M07L0740k6610k5196O0750
2185B0332N1921n7411p1015K9213M9740k1542j9588M0125O944o1284q693P6935
2197C5677K3609p3199l6583M3527J6712k7663K3820N0701l5417p8069J7631P5184
2209C5930l816n6230P163L4623k5131k1661N4821L5989o7678o1576M4784N4750
2221C1968k2049k0236L4986j435o0531k033P4099J3727p2172k5250N2438J8041
2233B1553k9284J6181L6542m1544o6589K9856P5184q910n4529Q881L2600k5016
$$ y = [43263, -7739, -9997, 14036, -21710, -56769, 2259, 68204, 26638, -41209, -19341, 25512, 308, -23751, 15205, 25534, -35514, -49239, 30122, 67642, 4170, -38419, -6588, 1588, -32584, -9462, 53457, 32373, -44923, -37520, 34721, 35873, -19759, -19352, 11388, -15222, -40418, 20332, 72253, 14842, -56173, -26960, 22780, 1238, -18350, 21775, 28719, -32565, -41258, 35677, 59286, -13913, -50496, -6969, 9743, -17920, 5900, 56601, 21184, -56885, -39254, 35930, 32114, -24116, -16953, 17670, -7461, -29122, 25699, 61688, -5990, -67566, -22782, 31968, 9919, -10317, 24669, 23234, -37297, -39330, 34769, 48496, -23676, -48926, 3512, 21553, -7731, 8450, 44992, 3448, -63141, -33285, 41899, 32989, -21540, -12659, 19941, -5075]
2245e075k1550M7173K5948o3900m5896N3474N2368k6528k5748K5733m565n1892
2257d0458O720O9267P317o7593j5736N3473J3807l3698P918K7668l6868m9188
2269e7371L9309O7794j7667n4515Q941K9541k3467j7773M2465J8822n6341l0217
2281e0479N5584M2120l6039k8685K2628k640l8884J5012O1519l331o2214o856
2293c2265M9920M797l5711P085K5454k8628l3699M0946N3173k7436n0658J1490
2305a5532K7000k0218j2205L8086J4425m8429k0128M9423K7344l9011k5172K3478
2317i39K771k6638J6832M7404j0555n4463k171M2212N22l0763Q440K4811k0730
2330c267k4526L3931L6342l1052m3167J4128K6766j3477p377L0976P149m0911
$$ y = [-5075, -26625, 20548, 46496, -17404, -63300, -9826, 42542, 16014, -9734, 15999, 11434, -40458, -33738, 35529, 42846, -24747, -40483, 12990, 26797, -6901, 1017, 28685, -8183, -57371, -18062, 49732, 32065, -22450, -13509, 16032, -7435, -25208, 17257, 36079, -20262, -50479, 5105, 47225, 11186, -17499, 5129, 2489, -36395, -21383, 40136, 36805, -25409, -32265, 17655, 22452, -13259, -6174, 19280, -9348, -43047, -2101, 51072, 23636, -27022, -15532, 11468, -8750, -20955, 17131, 31556, -16873, -37001, 12422, 39766, 755, -24417, -939, 1832, -24806, -7974, 39430, 28875, -25588, -27759, 14453, 14975, -15788, -7348, 17463, -3267, -27793, 6138, 42480, 11428, -31739, -17611, 9155, -4322, -11699, 19277, 26426, -14485]
2342a4485j3736L9582J6530l5787j7239K5798P309j9322J2060L1472j5854m4928
2354b8600L252L6516n0k3240J0172K0599j7928j9940K4771K2289k9167l0350J9131
2367a2545K6027r787o424K0203L9l4680p685L1855J0617k7750o672K4892N214
2380A3304j8259N068J8647j6144l0793R680L1408l00j6657P595J2030j7729j6100
2393a8250J8034J4782k0162j6412K0812K0475j0850j0927R616k896k2620j056
2405a9454K6012Q339j7943k393J6687q03j8291Q93J2036q283j4886J2159K3588
2418A7661k826j6246J177M669j2809q470J5127J2520j0742p453J4884R110j4813
2431A789j1669N774J815r396M526J8583M037j3604m315O466m836j2177L900J2430
$$ y = [-14485, -28221, 11361, 27891, -7896, -25135, 663, 7972, -11350, 710, 32182, 16328, -28600, -25348, 11168, 11118, -12122, -1950, 18649, 721, -19219, 5552, 27841, -1326, -31676, -12545, 13482, 3695, -2729, 17474, 17513, -17167, -24852, 7003, 17620, -10130, -16802, 8090, 13304, -4955, 113, 18760, 2616, -28177, -18497, 12911, 12611, -4046, 3549, 15579, -2150, -18250, -216, 14566, -5596, -22008, -1196, 19279, 8429, -2498, 7118, 4222, -18398, -19454, 6558, 14897, -3046, -5439, 11248, 10445, -7846, -6953, 5083, -3200, -18086, -5927, 17661, 14835, -1411, -234, 4435, -8374, -16844, -1717, 10803, 61, -7392, 7492, 16602, 1789, -9880, -4106, -2291, -11687, -7161, 11422, 15459, 1855, -2460, 4006, -830, -13007, -9107, 3323]
2445C323r18n829Q320J0773q473j4914q71M804l955K60J2843Q228q218o236M135
2460C272n48j1572m374R544O967k040K815P654k535j2134n556K598j88j146P787
2475E44R494j006o418p8j35p671p208M193Q373L194J423M475J93q475p358k87
2491f747M10o47L820R480M247l878l918j478m529o449m77O237N615L679L525M65
2507I355o001p010l259o6k84K742P010O554O37m092m176m293m928j870L249O034
2523c98N136L636J387m003p282m932j735O50K889M954N823L626j101n723n984
2538c057m458j767K309M484N294M571K285j999o406o304l629N59K834M126N710
2553D552M009J137l980o654n476k858J138M418N535M661K480p69m306o793n216
$$ y = [3323, 2405, -3424, 4896, 15669, 7196, -7718, -8589, -3785, -7740, -7480, 5363, 13591, 5373, -863, 3272, 2724, -8848, -13222, -3678, 3289, 1249, 4064, 11718, 9183, -2951, -8507, -5909, -6097, -7243, 544, 10038, 9032, 2614, 2536, 2401, -5270, -12478, -8285, 88, 3282, 4705, 9180, 9373, 898, -6460, -6747, -6337, -6984, -3164, 6316, 10563, 6685, 2767, 1289, -3240, -9689, -10166, -3929, 1686, 5365, 8890, 9355, 3354, -3656, -6915, -6981, -7265, -4523, 2487, 9041, 9678, 5586, 1410, -2883, -7811, -9681, -6432, -398, 4738, 8374, 9761, 5758, -1524, -6456, -8191, -7541, -4652, 302, 6125, 9751, 8650, 2927, -3057, -7515, -9282, -6973, -2489, 2805, 7376, 9661, 7662, 1256, -5048, -8677, -8118, -5284, -1158, 4552, 8561, 9698, 5718, -936, -6412, -9270, -8132, -3714, 1821, 6482, 8962, 8193, 3887, -2906, -8122]
2568h122j351K555N241N256L668J143j700m542o064n471l30M773N926M488K241
2583G711Q00k456o623o137k614J381L833O094N326J578j850l864m287o420l472
2598a1000L768O631M709L058J664j632o543o111j968m00R32N367Q900L152l824
2613F703m013j844n045o878J099P945N868J309K340J117n111p929k284M39j763
2628h047K425J0255P635l868o240j269k435p531j750P593O178o75K803O075l347
2643G802j1948m418L827r36k634Q611J2158j125j0003k234K402o562o505N350
2657f215Q463j186O42R412J981j3887j1152M868M820m694K993J3570L148j1524
2671A239l437O619l373j3106N81J2663K188m095P954R755j2247j8776K913J2013
$$ y = [-8122, -9473, -6918, -1677, 3579, 7247, 8390, 6690, 2148, -3916, -9387, -9717, -4944, 982, 5470, 7711, 8511, 6055, -568, -6705, -9319, -7938, -4105, 1989, 7315, 8893, 7043, 3179, -1108, -7528, -11000, -7232, -601, 4108, 7166, 8830, 7198, 655, -5456, -7424, -7824, -6892, -1525, 7375, 10527, 6703, 2690, 846, -4199, -11077, -9978, -2033, 3835, 5144, 7484, 8601, 3490, -4439, -6723, -6284, -8047, -5622, 4633, 12268, 8400, 2160, 891, -1544, -9075, -10825, -3232, 2946, 2271, 5074, 11149, 7802, -4146, -8564, -4737, -5673, -8307, 304, 12462, 11337, 1334, -900, 1502, -5060, -11565, -6215, 2248, 1062, 1704, 11116, 13097, -790, -11942, -7074, -2254, -6948, -3955, 9615, 12763, 1239, -2198, 4421, 1048, -12058, -11477, 1186, 3374, -721, 7233, 16988, 4741, -14035, -11122, 891]
2685H91k734n382J0468R289q671p212R264J400j7995p802J5421J0990o315J228
2699B840J1901n466k1373k241J7319J116j3916M106J6575j807j1248O564P674
2712A2044j8648j8187J5316K2643m691j1334R345N458j6953r169J6574O420j8996
2725a0178o350K3020J1425j4633m623J0763r700k3188P739K9949J434k1913J250
2738e005J6723o423j6100R132J1824j8638j5883K4240K6092j3516k0626Q075N081
2751D976j9368l709K7998R321k6654q923K6419R081k2623o073J4265q468k0620
2764b4378J7602L5992p552l4211n78K1137p072j6289J5678J6063k2112j6326K9070
2777G024K4403k4649k6516J2394J0292j7323L032L4710K895l9137j0475L2111
$$ y = [891, -1843, -7225, 3243, 12532, 3861, -3351, 5913, 7313, -10682, -18484, -3063, 7927, 1612, 2840, 14741, 9275, -12098, -14339, 2980, 4096, -9820, -5714, 10861, 9054, -2194, 4370, 12044, -6604, -24791, -9475, 13168, 8477, -2857, 6488, 11946, -5007, -14176, 2398, 8818, -10178, -16528, 6492, 17917, 3284, -1339, 9424, -276, -23464, -15725, 14224, 15658, -6255, -5005, 11718, 5295, -10805, -1673, 10151, -8487, -24370, -130, 25962, 12446, -8180, -105, 4976, -14392, -18101, 9897, 19218, -7436, -16359, 10060, 19141, -3482, -9555, 4710, -3758, -24378, -6776, 29216, 21664, -12547, -13125, 8012, 940, -15349, 329, 16392, -5720, -22046, 7024, 31427, 6778, -19738, -7344, 2948, -14375, -11343, 23367, 26262, -12875, -23350, 8761]
2789H761R050k6370m662J9694o915j9507K1902L4518j9506m3441M165L0263m620
2802C332j4834J9146J5051k9427j9081L2858K3755l1122k7118J9491J5920j5620
2814g649M557L2628p028m7543p269M1972J1794k9364l857K3106q088k1771K2500
2827C988L0964k7496m4841J4423L9090m801j7514J7760R372l5780j7360L9985
2839G790K4218l5771k6000K6985J8577j8505K154K7530j5012m8877L880N2148
2851A9117R557l5358l763K3249j1417k2727K4442K8780l1614m1143K4844M2689
2863B6656r643k2970J3808N014l6871r942M8228K3222m1614k5381L0851J8009
2875A9367k2803j256K4631j6526m3000J4540N5692L494m1909o149K2597j2282
$$ y = [8761, 17811, -8559, -13221, 6473, -442, -19949, 1953, 36471, 16965, -26476, -22311, 7952, 3332, -11502, 7644, 22695, -6732, -25813, 7045, 30800, -322, -27440, -7949, 7971, -7649, -3092, 29536, 22508, -25035, -32304, 9668, 21462, -7902, -11759, 11347, 3259, -18512, 3988, 34952, 7456, -37385, -22962, 16128, 11327, -6187, 11573, 20945, -14835, -32195, 7790, 32008, -3763, -29763, -2778, 15799, -2706, -552, 26978, 11966, -36911, -33031, 19117, 28674, -6684, -10447, 12802, 1385, -21342, 3100, 31880, 266, -40877, -16033, 26656, 17013, -5957, 7851, 12865, -24006, -33948, 14280, 37502, -4112, -29493, 1358, 19367, -3436, -4692, 19939, 3413, -39587, -25047, 30645, 34139, -7770, -13919, 8678, -3604]
2887c604k0222K7727K8776l3205l7484K9389M1712j6365k8724J2377M697l1243
2899b6169p83N1576J6932m7857k4918L2942J6338k4712k076K4644j4122l6026
2911c4231K0387N2411o948m8153n383K5680q502j4639K9945K4225l7000l3970
2923c6178L2785L6773k3608k9839J4604R388k3560N867M7037M327n3503k0326
2935c6233L6947J5843k4183R41K4826j4116l2333K2336M3902j6588m8492K063
2947b5087L0323m334j0640K7506J5289m1466k9629L4741L2857k5316k6176J9216
2959b716J2735k0312M477L6500n011n1791j1975M1628J6509k2734J000K0791j5920
2972C181k9467J9711L6609j9043m1202R763L3943l158j3122J8215O019l8820k1057
$$ y = [-3604, -23826, 3901, 32677, -528, -38012, -8623, 33089, 16724, -12000, 377, 5074, -26169, -26952, 24624, 41556, -6301, -31219, 1723, 18061, -6651, -8727, 15917, 1795, -34231, -13844, 38567, 31619, -16534, -21917, 3763, -4739, -19378, 10567, 34792, -2208, -36178, -3393, 33380, 9772, -20067, -5463, 3925, -19635, -13768, 33269, 37596, -15907, -36233, 714, 16557, -7626, -6685, 18141, 4025, -28308, -5972, 37930, 21342, -27150, -25087, 5236, 902, -9738, 17768, 33057, -8409, -38038, -3297, 29560, 4244, -21932, -2716, 10019, -10293, -5816, 30684, 25673, -26118, -38093, 3535, 20044, -2690, -1690, 19101, 3181, -26286, -6575, 30034, 10991, -30211, -20448, 13495, 10337, -2785, 15430, 21449, -17371, -38428]
2985c8428L7864K9905k5119k1731K0356J0772k1126N09K7533q200m2287K20M3459
2998A3727J2230k5139k774J4687j6768k4096K1799L2456j7953l2421J4422K9849
3010B0019q892j7163J1564L067l0196q216L9010K2798k6606j9337J7077N654k1340
3023a2561R67K5547n462l0627O441L6773L372k8159n488J2165j1777j4771K4200
3036F20K7102j7831k7291J2127K1768j3063j6410J1343O909j9196j612L2406J2488
3049B9360k8875j8308J4381N761j4317M721K3156m028k4540M531K6076l780k6567
3062a2429k204J4997l800o778J9553J6666k0503k3982J0179J6640j0285j0323
3074a2269J3686Q782j3584k260K0251K441k6806j1322J7031Q493q498N559J6252
$$ y = [-38428, -564, 29341, 4222, -17509, 2847, 13619, -7507, -6998, 20535, 12335, -29952, -29732, 13727, 25957, 818, -1956, 12731, -4037, -28133, -6334, 26122, 8169, -24252, -9830, 20019, 11127, -6036, 5528, 8595, -21601, -29817, 9193, 31991, 5385, -13952, 3125, 8779, -12561, -11594, 13953, 8491, -22136, -15695, 21078, 24450, -3709, -9197, 2968, -8809, -23580, 620, 27722, 9891, -17400, -5273, 16495, 3432, -12978, -1635, 5274, -13922, -15534, 16872, 29360, 485, -17823, -3442, 2319, -11998, -7277, 15879, 11851, -12689, -8158, 17918, 14138, -12429, -14633, 364, -3436, -10214, 9339, 26005, 5502, -18480, -8301, 8339, -1946, -12269, 1417, 10199, -3385, -5645, 14606, 17047, -9759, -21081, -4050, 4443, -4055, 1504, 17756]
3087A7756p742k2261K428J8444m828j7470M680J6080j231o890R808N558j8984
3100d652j5977J2180J5622n718n211J1549L874j4262m834J1923j42j6449j980
3113a4077J7385Q037q241N21O272r569j5848M283J5862l52r566N409J1420n165
3127F371r939K692K777j0568n820J4253J2430n546n697M190j084j2278k839J0858
3141b00L125p062K043J1536J458j0467m318K579m499n594P652J2987r38p561J269
3156B010L213o603q165L789N642j898O88Q247M303q056p190P36l20m313K455R671
3172D209L589m846r66L158m012q136j222N389K036k88N876M991m355p624j572
3187c773N30k398o93N947O208m41j767L86k161o337l371K915L498J612L425L821
$$ y = [17756, 10014, -12247, -9819, 8625, 3797, -13673, -8993, 7087, 5856, -1034, 8774, 14332, -4652, -20629, -8449, 7173, 1455, -3756, 7793, 11667, -2595, -7429, 4494, 4352, -12097, -14077, 3308, 11345, 3104, 3625, 9897, 328, -15520, -11237, 4625, 4273, -5293, 116, 11536, 6371, -3568, -876, 1901, -8667, -14487, -234, 12196, 6650, 953, 5143, 4059, -8219, -11058, -200, 2925, -4137, -2094, 9442, 10900, 433, -3885, -1306, -5805, -11399, -3747, 9240, 8302, 741, 2010, 5223, -1380, -9545, -5756, -114, -2012, -1324, 6923, 11226, 3170, -4020, -3284, -3604, -7917, -5462, 4209, 7798, 2952, 1986, 5144, 1132, -7004, -8226, -2837, -801, -1089, 4787, 9778, 5423, -2201, -3773, -3243, -5641, -6334, -387, 5821, 5380, 3613, 3999, 1838, -4499, -7870, -4955, -1457, 155, 3580, 7401]
3203G401r25n895l698j70j420j510L705O141K425j518n77j814m473m300P02L015
3219b911K634K702L246R62l457m649k511q04p50K104M256L840R08j049k174l671
3235a324l803r57K129K727L009K990J358j411m389l736j267o36J690K956L937
3250C273K412n84j926l649l291j627M36K707L329K924J074o35k343l772k259j578
3266e509J478K261L894K215P53j375k482l259l049p2J965L235K661J672P84k231
3282B941l053l077j398L02J877L372L048Q82q02k045k977l170j137J688K674K597
3298A722K277J110j660l026k568j403j117P91L620L694R78n20j243j875m000j923
3314e143J123K974J338K273K253k11l912k298n96j657j098K850N130J441j295
$$ y = [7401, 6476, 581, -3117, -3287, -4707, -6217, -2512, 3629, 6054, 4536, 3959, 2145, -2328, -6628, -5926, -2911, -277, 2425, 5671, 6633, 3176, -1473, -3984, -4788, -5538, -3434, 822, 4662, 5570, 4521, 2347, -1324, -5127, -6084, -3955, -1228, 1781, 4771, 6129, 4718, 329, -3407, -4674, -5310, -3620, -664, 3273, 5685, 5101, 3175, -474, -3765, -5392, -4956, -2249, 1080, 4004, 5078, 4443, 2100, -1672, -3931, -5509, -4031, -1770, 2124, 4339, 5092, 3717, 1235, -2024, -5073, -5145, -3180, 55, 2716, 4388, 5172, 2941, -112, -3189, -4587, -4285, -2408, 964, 4012, 4894, 4092, 2047, -930, -4100, -5237, -3549, -875, 1722, 3999, 5109, 3449, 423, -2145, -3548, -4665, -3874, -254, 3440, 4418, 3898, 2655, 780, -3220, -5143, -4020, -1046, 292, 2565, 4818, 4607, 695, -1603, -2199, -3856, -4954, -2104, 3026, 4467, 3172]
3329C172k99q14m050l628J800K860N04N89L762K125l605l729l80o90k718Q40O643
3346B382K874k678j293J508k255n399K43L907M26k032L988N902k902o340n70J353
3362h86l020k126O324N798l457l267L413J255o282l649M307K032l528J942Q306
3377G162M64q469l621L853l24n015L418P942j706o202L260O132n554q805K541
3392d924N914k842j472Q696M589r559p075N542L872o362k008Q001K247p061J362
3407a080R339k125j3151k223R821J221n174N369P739p266j0436N331R323o576
3421A12r598O384Q859m858l237R704K151j5416p371J1901Q105p939k726R446K83
3436E800j1234J308J2236l364j6249J098J5789J592q397M192O617j1653j2259
$$ y = [3172, 2873, 2059, -1991, -5619, -3819, -959, -455, 134, 3896, 6021, 2416, -1313, -1693, -2383, -5101, -4261, 2382, 5256, 2578, 1285, 2793, 538, -4861, -4618, -711, -285, -2317, 1671, 7573, 4671, -1669, -2239, -886, -3906, -6032, 292, 6090, 2633, -634, 2779, 4034, -2248, -5897, -1590, 442, -3086, -1144, 7162, 7626, -843, -4464, -611, -935, -5950, -2532, 5410, 3704, -2498, 762, 6894, 1340, -7465, -4924, 990, -1852, -3324, 5372, 9961, 402, -6673, -1131, 2741, -3621, -5629, 2372, 4619, -2442, -1080, 8259, 6134, -7017, -9240, 581, 1802, -3372, 1997, 9736, 2470, -7966, -2635, 6688, 112, -9486, -3102, 5757, 899, -2338, 7366, 9517, -5899, -13270, -1369, 6736, -1203, -3929, 5517, 5800, -5434, -4126, 8110, 4746, -11503, -10405, 5384, 6976, -1421, 2771, 9388, -2265, -14524]
3449a4524J1264J4086q253j1799Q350R437p862n617J1267J317j8628n249J9871
3462C660J0463j2717n564R379k183j3626M744J6982m989j9324L708J9828m65j2664
3476b768K606O529j3359j0683J8253J7309j3005j6269R639J0535j0420n615J3858
3489F610N69k0512j659K5389Q599j9375q676J1058j699j3021R401K0194r237k3189
3503a5548O658K2257l750j6851M066Q156j3513p336K3336J6329k0461k0004J2307
3516d354J2563j1245m320J5894k21k2366P81K8065N315k5790q903J4326R53j1252
3530a0554J2298J9766j4630k6983R183K5477n412j9428N825J0650j2727n832K4667
3543A2300J2753k7343k1550J7425J6640j0757m108J6308k919k4673K952L0088
$$ y = [-14524, -3260, 10826, 2573, -9226, -876, 8561, 699, -4918, 6349, 7666, -10962, -16211, 3660, 14123, 1406, -4158, 5221, 3038, -10588, -5844, 11138, 6149, -13175, -9467, 10361, 9896, -2768, -162, 6367, -6992, -17675, 578, 17887, 4882, -11387, -1748, 8787, -1633, -7248, 6610, 7179, -13333, -14992, 10397, 18996, -379, -9055, 2003, 304, -12717, -3316, 16878, 7641, -15548, -8890, 13367, 9617, -7234, -3168, 4988, -8525, -15861, 7475, 23804, 3343, -16661, -4354, 8209, -3036, -7356, 8538, 8317, -14049, -13268, 14797, 20112, -5678, -14581, -255, 698, -10554, 1744, 21510, 6880, -20103, -10920, 14557, 9145, -10283, -4458, 6192, -6535, -12367, 12300, 25053, -2290, -23840, -6415, 10225, -532, -4640, 11668, 8749, -15924, -12972, 17116]
3555A7116J279k9682o692K0169K734j1280J2318J5925k0829k7086J4603K8764
3567A7339p668k0309P731J1160j3599n051K4041P718l1491j7208K4459J8780j3296
3580B606n123J3855o435k4666O833L1480j936l0942k645K3430K242j2876R432
3593E255J2128k3020k3657K1571L0236j0764k2258P821J0885j4600m831K3771
3605A2537N382l1318j2733K9384J8016j7432q499J1264o558k1771J1492L1804
3617B1568m392l1436r40K4528k55j5110P729J0745k1432j7160K5795K7974j6034
3630A1580k4878Q129J0488j2875k815K3446L094k9699p799L0047J3090k1795r957
3643i944J2429m964j6437J5279K9029r963l2112J688K4564k644j5454R061J0348
$$ y = [17116, 18395, -11287, -17979, 2190, 4924, -6356, 5962, 21887, 1058, -26028, -11425, 17339, 9671, -10638, -2907, 8253, -5346, -10397, 13644, 21362, -10129, -27337, -2878, 15902, 2606, -2517, 11338, 4903, -19763, -12930, 18550, 16614, -14328, -16973, 6457, 8699, -4177, 5255, 17383, -5637, -29294, -7723, 22513, 11749, -10509, -2688, 8197, -6403, -11234, 12537, 17919, -13399, -26132, 3252, 21268, 3836, -4663, 6601, 43, -21728, -10236, 21568, 17176, -14260, -15200, 9328, 9073, -6037, 1692, 12437, -8995, -26155, -360, 27614, 11580, -13298, -5169, 5319, -7556, -10371, 13075, 16169, -13530, -21329, 8718, 21808, 13, -9944, 2485, -2479, -18916, -3637, 25392, 15429, -16683, -14995, 9569, 6925, -8529, 532, 10880]
3656A0880j8787j1965K6135K1540k1426k4977J0291J2669j0259Q4K1812n25k9172
3669a3700m919K8339Q674k3070p704J4458k137j2240J4911K2555j4982l1418N439
3682a5794K4619k094j3776R002R290j7114j0238K3278J5537k3419k0768J4273
3694g204J5170q544j078J6561m377k6427j589K6904N508k1225m737J5653m13j1755
3708g553J0841J5305j6683k4960J0172K4964k943j3469O988O786j6056q036K0596
3721E952J0897k1575j3445J6771J3287r639l515J0923o042k1172L113K5618L020
3734A4193j9203k338J3737k596j1699Q590J1445j4485j6718J3509K1175n872j4165
3747d427M729M434j3155m241J8555Q042j7741q956J5436R131j1779m478Q482l864
$$ y = [10880, -7907, -19872, 6263, 27803, 6377, -18600, -8309, 4360, -5899, -5815, 15997, 15472, -13700, -18619, 9720, 18394, -4676, -12380, 2078, -59, -12299, 2612, 25167, 10185, -21233, -15794, 8825, 6731, -7045, 1957, 11247, -5867, -16105, 7173, 22710, -709, -21477, -7204, 7966, -578, -1656, 14905, 10528, -15899, -17488, 9416, 14924, -6301, -11038, 4615, 4202, -7553, 3288, 18593, 1910, -23050, -12878, 12086, 9143, -4326, 2662, 9448, -6608, -14644, 5952, 16849, -4726, -18171, -1400, 11887, 2248, -1267, 9656, 3614, -17558, -14445, 11173, 14193, -5010, -7348, 6389, 3793, -7906, 684, 12129, -2356, -19074, -5565, 15610, 9738, -4427, 302, 4736, -8419, -12660, 5895, 13937, -3804, -12760, 2676, 11807, 28, -4450, 4032, 168]
3761A68j4214O251K1108P9j7914k062J1001l429r432P493J0219j0108j1692J2856
3775C24J4347q963j3408M256N129q378j435J5642N621j5113p516J2105M716j0885
3789c558k704Q442q21r073O156J4475m172j5733r65R418j869n600P637P848q698
3804G83q436Q830Q166r317r443O155N847n025J52J0739P86j3139n278R549L351
3819C720p308j74P787k81p108L412P744n296j1010J743R133m75l484N138L941
3834G482p799p021O244N571o143m838O446N102l935j520N275j629r322j971Q378
3849C20L873m791J16N071j626n865O72M677l192n628L761P316r31l280J424P84
3865B701n877l507N524M198k887k012M511K001m610k622K435n80m008J422O183
$$ y = [168, -14046, -7795, 13313, 13392, -4522, -6584, 4417, 988, -8444, -951, 9268, -840, -12532, 324, 14671, 5708, -7700, -3444, 1685, -6693, -8128, 7514, 13135, -1978, -9494, 2611, 7327, -3558, -6262, 2180, 1359, -7714, -1558, 12917, 8745, -6988, -7953, 1465, -404, -6004, 1633, 9481, 783, -7653, 1177, 9343, 26, -9417, -3262, 2585, -2440, -2288, 8451, 9237, -3902, -9180, 369, 3720, -3588, -3762, 4025, 3744, -3364, 48, 7792, 2496, -8514, -6771, 2362, 1887, -1597, 3541, 7482, -317, -7338, -1094, 4477, -1666, -6504, -58, 5044, 1109, -411, 4864, 3235, -6087, -8058, 320, 4193, -598, -482, 4589, 2963, -2902, -2230, 2447, -745, -6373, -2612, 4704, 3773, 493, 1917, 2701, -3176, -6683, -1159, 3039, 152, -1860, 2651, 4652, 42, -2580, -145, -725, -4733, -3311, 2872]
3880B872K089l986q83J429k320l102J071L857q80j402K908K838k145l981J56M65
3896a014k135j62M142L347k086j923J012ll633j351K408J784n81J138K759n03
3912C199l696j451N62m72n90J672L021K90j070o9M1k648k100N14K252O62J109
3929A226J354N84k134k427l28P6q95Q96K435J806o3j255n19j100j940p96J413
3946a667J656Q32J091N91q47j809j177q39r8N04J968J715L68l76q88r04k072n06
3964b458L59J557J026J269M62P6j449k112o87k34M63J069J561J383R4j017j190
3981A72j307r25m44P95J608J484O84L97j103j911q52m58m13J098J253J874M23
3998B375q34n24j384j379j077J437J296Q82O57R20o75j506j132m60q88N44J542
$$ y = [2872, 4961, 975, 92, 1521, -799, -3901, -2830, 1027, 147, -1255, 1653, 4491, 2346, -1635, -1479, -1014, -3149, -3311, 831, 4178, 2092, 169, 1181, 1178, -2455, -3806, -1398, 386, -195, 943, 3702, 3199, -497, -1948, -1386, -1858, -2448, -776, 2245, 2535, 1465, 1396, 1437, -1211, -3311, -2797, -545, 117, 1226, 2580, 3164, 1030, -1397, -1725, -1649, -2544, -1648, 787, 2593, 2530, 1275, 756, -344, -2284, -3080, -1667, -11, 821, 1912, 2503, 1656, -153, -1330, -2169, -2267, -1763, 205, 1920, 2288, 1912, 1024, 120, -1952, -2458, -2099, -542, 484, 1753, 2215, 2291, 842, -1270, -1957, -2191, -1728, -659, 902, 2285, 2379, 1362, 172, -1135, -2060, -2504, -1709, -101, 1383, 2067, 2464, 1361, -550, -1402, -1860, -2273, -1175, 78, 1952, 2375, 1541, 1017, -367, -1746, -2823, -1386, -90, 792, 1449, 2369, 1694, 188, -944, -1404, -2292, -1748, -206]
4015b06J891M29k40l04j086k345o96J087R05L27P75J901k04k162j027j12p16n52
4033b335J160K530O89p33Q2k38k086j807O44J660K12K33K260N66k057j567K23
4050e64j27j972M60L064J372r53k13J237k263k947J72K898q0r27J629K548j444
4067A890l155P84Q18k844j677M213L115j191j803J502j98l546j335L347J321k909
4083a668M92M334M12l401j325J770j985l368L025N881j145m023R55K895l102l295
4099c548K569K878l597j913N860L420m620l709K356M73m124O54O769O35n713m52
4115b062N247j76o100O8M471k296l471M916O643l934p257J549M371l406k695N303
4131A171L382n423l105P045L280p628m633N192J618m090J839Q162j705r581n66
$$ y = [-206, 1685, 2114, 1874, 1570, 484, -1861, -2557, -1470, -565, -238, 537, 2438, 2234, 72, -955, -1067, -1783, -2335, -1175, 1355, 2044, 1311, 1393, 1155, -931, -2738, -2094, -434, -222, 11, 2271, 2837, 780, -787, -564, -691, -2663, -2203, 861, 2233, 1280, 1067, 2304, 41, -2906, -2734, 164, 84, -843, 786, 3334, 1890, -1265, -481, 337, -2507, -4184, 29, 3144, 1953, 150, 1652, 1454, -2092, -3427, -80, 1241, -1668, -1176, 3158, 3570, 169, -1156, 614, -1371, -4739, -1714, 4167, 3022, -1001, -46, 2849, -253, -3548, -979, 1899, -1698, -3611, 2249, 5669, 1049, -2660, -304, 169, -3955, -3301, 3468, 4103, -1610, -2062, 3185, 3009, -3091, -3023, 1448, -848, -4319, 597, 7240, 3306, -3951, -2402, 1969, -1437, -4132, 1171, 4553, -870, -3975, 3070, 6350, -1278, -5911, -719, 899, -3191, -1352, 6810, 5105, -4476, -5042]
4146e042Q068j22o947J408N910k707m923O320O672p472r350M141P424l258k845
4161b723O156K798r329l258R557L583r606m737P996L068n523J749Q219m399j2238
4176h687R93J2378K62q450J914O507m244o432P400P379r776j0407P525J0241l894
4191B709m869O388R20j1728k245J3122M579j2224m283J0315K643p961K094Q067
4205G527o334j3406N006J5843j209j0846J412O901o351o243R811P723j2073j0088
4219a2327J1147J1155o658o686N814Oj1986O88J6663L497j5253m545J1345K549
4233E409q909J946Q807p531j2980Q882J7343l790j4542J159P083n834m955J2366
4247D454P114j4383j0180J3512J1393r428q543O774Q13j1326L531J8457N23j9045
$$ y = [-5042, 3026, 2904, -4043, -2635, 3275, 568, -4355, 1965, 8637, 1165, -8185, -4044, 3380, 122, -2723, 3433, 6231, -3098, -6356, 3201, 6784, -2822, -7559, 437, 3505, -2018, -269, 7950, 3551, -8687, -7694, 4684, 4946, -3504, -1590, 4917, 673, -5759, 1641, 9020, -756, -11163, -3638, 6603, 2709, -2160, 4228, 5148, -6580, -8825, 4297, 8876, -3348, -7631, 2684, 5327, -2634, -540, 7527, 1193, -12213, -7207, 8636, 7427, -3419, -2007, 4894, -1457, -7700, 2111, 9834, -2239, -12327, -1180, 9975, 3317, -3369, 2445, 2451, -9535, -8847, 7816, 11313, -3940, -8485, 2860, 5409, -3500, -1554, 7253, -278, -13258, -4376, 12967, 9177, -5365, -4206, 2877, -2957, -7912, 4454, 11568, -2815, -12995, 517, 11910, 2482, -6061, 713, 1526, -9800, -6269, 12188, 12711, -6334]
4261f334m841J3500L050r735K696R177p894j2131J1046J6872p482j7331K271R884
4275B748m971l350J3049M877j7243r200J5224J0647j1217q676Q557J608r679M876
4289b750J7115l803k0975k797J6219L234r611L032Q628r469j1016J2463J5271
4302A5541j0799j7477N639J1574m181l246J1694J964j9221p039J7975J0434j2914
4315e6p842R062K083r431N012J4463o344k0907L45J9546L071j0834J968P075j0324
4330c113j0142J3450J4772j2687j5802Q134J3188n051m972R186k18j8013l791
4343a5059J9694R732j4646p393R618J307r189M114J3177p468j8458M245J9893
4356I567J049j2938R12N703r358o998J4480J2224j3159j3977R841J1520o633o128
$$ y = [-6334, -11175, 2325, 5375, -4360, -1664, 7513, -381, -12512, -1466, 15406, 7924, -9407, -7136, 2748, -2223, -5573, 7476, 12353, -4890, -14090, 1134, 11781, 564, -8112, 445, 2053, -7626, -2750, 14365, 10562, -10413, -13210, 3009, 6243, -3368, -336, 8292, -1177, -12193, 270, 15541, 4742, -12735, -7096, 4478, 297, -2949, 8745, 10709, -8512, -15551, 2424, 12858, -56, -7898, 1164, 3247, -6184, -1172, 13291, 6947, -13960, -13615, 5931, 9002, -1832, 136, 7211, -3113, -13255, 195, 14967, 2280, -13522, -5388, 7800, 2749, -2223, 6963, 6745, -11268, -15059, 4635, 14367, -279, -7672, 1946, 3253, -5936, -1822, 11355, 3887, -14571, -10326, 9567, 10616, -2322, -1410, 4293, -5065, -12063, 2417, 14641, 1482, -12495, -2654, 8866, 2233, -3895]
4370c895Q129q07j5072K94K0250O245j6506p315R765R49q616N170J1862p914j5133
4385a2594O684J7441k264j4257P92N925o622m252J4805R134j4253j2659R722J0409
4399H011p585n264P936L2j2043K201J7691J755j7367n875J0457J905o546N531
4413H39R402p792j3645P071J4646m593j3433K563P788n003k501J2084N110j5464
4427b928j0005J0591R571p166m354P586L91r789K066J3594j393j5724k587J1742
4441A595K493n697L665O292q098j0913P281J2016n441j0138M019P457m329l062
4455b860Q324J951j3080o062J1376Q172o679l473N896r97q212J583J0854k028
4469D765j2217L94J1304J162o553J995M032p251p535P692J0371m718q570M013
$$ y = [-3895, 4234, 3427, -11645, -11351, 8899, 15144, -1362, -8677, 1088, 2037, -6579, -1409, 10453, 2539, -12594, -5910, 11531, 9267, -4990, -4198, 1727, -4895, -9147, 5658, 14792, 539, -12120, -2398, 8011, 426, -4838, 3098, 3130, -8913, -6712, 10979, 12734, -4633, -10508, -51, 1854, -4692, 839, 10241, 2449, -11196, -4125, 10521, 5928, -7505, -4942, 2846, -2157, -4658, 7426, 12536, -2928, -12933, -2342, 7229, 63, -4291, 3295, 3686, -6103, -4037, 9557, 8164, -7560, -10147, 1595, 4088, -1609, 2056, 8348, 250, -10663, -3382, 8634, 3193, -6945, -2926, 4531, 202, -2860, 5464, 7415, -5665, -11727, -351, 7821, 1142, -2331, 3565, 2568, -5644, -4061, 6793, 4765, -7452, -7058, 4246, 5408, -1145, 850, 4882, -2369, -9904, -2212, 8159, 3441, -5129, -1116]
4483a116N714m800l418O065J411r222k445J0430N748o980m248M435p19o979K835
4498c289Q666j403q983J484Q641p31p009J221L422m475m065P244O996m922p008
4513d211L224L655m108k558N450J740o219m57P579J758o807l048L739K70l914
4528c907K983O236j678o714R92N331j653n160J381L789k132j896N112L211n200
4543F95m778K227L087k456j171M627J079m662n57M374L89n457j264L799J226k126
4559i68J624L814k525n499J233L729q71k979J855L311k005j908K295J587l980
4574a287k697K500L101j153n95K279Q6l579j018K797L25k890K11L659M98k234
4590CJ46J369k318k515J475L114l64j512J198J423j421j971Q94P40j525o77K462
$$ y = [-1116, 4598, -202, -3620, 2445, 3856, -5366, -7811, 2619, 8367, 1387, -2861, 1574, 855, -6124, -3289, 5377, 3974, -5009, -3525, 5116, 4385, -2624, -1403, 2019, -2456, -6521, 723, 7719, 2797, -4211, -987, 2668, -1440, -3998, 1452, 3192, -3027, -3484, 4095, 5853, -954, -4002, -263, 7, -3907, -924, 5312, 3634, -3080, -2088, 3243, 1590, -3570, -2189, 1600, -532, -2428, 2684, 5895, 695, -4083, -1856, 1231, -1225, -2396, 2231, 3310, -1352, -1909, 2465, 2854, -2603, -3867, -68, 1158, -968, 656, 4470, 1945, -3554, -2321, 1408, 537, -2442, -587, 2724, 719, -1189, 1106, 2693, -1287, -3984, -1484, 1617, 464, -131, 2148, 2234, -1345, -2363, 434, 759, -2131, -1920, 1739, 2237, 3, 149, 1518, -800, -3315, -1840, 1274, 910, -602, 596, 2019, 598, -1373, -479, 261, -1264, -1941, 521]
4607E21J514r94q08P18q56k026N32J459P84r65J31J850n55k103j1M65m79q76J531
4626a68J686j68j239K57K27r67j190Q87R33o8k23J093K90j071j123p0N60m27L41
4645d40J259M63p67j30N6n50j057j12J002L75R6O59J81o52q11M1m45q3J16R18
4665A19J136l2n85m77j06n64k14J49K23O36J27P20q0r03o02m2o4k01M79Q93L94
4686A006l67J48n16p00p70J67Q65K29M83J27K69l05q06o06j11K8P8Q84Q07o9K17
4707A058p67l02n47l65L40J68N31L20Q75m80n18p74k53j5j4R03L76K29k15q2K
4728D70p90p77N58J07J06O10P92J31q31p98J74m72m86Q25P90L13j70O9L62r28
4748E5j219J3R90j07K32J263O0q68q07M72l60r37J47J331M01m77L22J217j445
$$ y = [521, 2035, 1041, 233, 951, 95, -1931, -1399, 60, 844, -121, 10, 1860, 1305, -798, -809, -344, -823, -1699, -168, 1518, 1350, 111, 368, 595, -372, -1562, -675, 258, 190, -33, 1060, 1350, 279, -844, -914, -354, -781, -440, 819, 1282, 515, 385, 441, -109, -1166, -1278, -276, 99, 195, 854, 1035, 383, -428, -387, -832, -915, -799, 119, 1255, 1223, 638, 161, 55, -509, -723, -574, -351, 285, 412, 1132, 1052, 149, -453, -495, -559, -760, -281, 612, 1006, 639, 787, 271, -429, -1199, -1032, -167, 62, 545, 672, 941, 636, -170, -776, -887, -859, -781, 103, 910, 841, 1058, 291, -11, -558, -923, -583, -415, 116, 436, 1311, 831, 313, -461, -714, -729, -743, 160, 536, 765, 550, 468, 470, -320, -1097, -539, -432, -326, 284, 1076, 1207, 376, -422, -248, -720, -1206, -381, 409, 722, 552, 621, 983, 55, -1164, -1151, -161, -268, -36, 1227, 1287, 419, -388, 84, -276, -1213, -1066, 265, 666, 189, 511, 1728, 283]
4767B83j354m25J201k13l11J246J124p43j071J30R79j873r48J647J181m99j84
4784A70J442m70k396p07J619N68q69J17K091j52j732J90J439j686k080R14K843
4801A301Rj267R87J207k872k018J946J740k077n61K322J544j625j243J702m72
4817F23l523j49L985J329k422J26J860j099l047J138K724j501k878K420L419j041
4833A964k517Q14R05l455j419M422K481k868k114L281Q02l197j271K983j89m208
4849c586J668N673J79m444j138K490j452l102L248L785k391l721K786M241l205
4864A031l805J621J896l292k35O005K163n626l308L955J263l849j85M750r67m375
4880b958J871O053j271o807m36L939p32k336M202M087n005n202L454M758l236
$$ y = [283, -1071, -1496, -295, -508, -819, 427, 1551, 808, -263, -133, 846, -1027, -1975, -328, 853, 354, 170, 1612, 1142, -1254, -1961, -342, 226, -643, -526, 1565, 1413, -319, -129, 1310, -376, -2456, -1542, 1301, 1310, 43, 1030, 2237, -635, -2653, -707, 1033, -1044, -1605, 717, 2261, 636, -607, 1095, 623, -2900, -3049, 936, 2265, -157, -31, 1829, 730, -2317, -1179, 1545, 44, -2834, -414, 3005, 1964, -553, 261, 1166, -2289, -3708, 714, 3195, 327, -1787, 1494, 2296, -901, -2172, 811, 622, -3586, -1918, 3755, 3934, -510, -1648, 842, -610, -3712, -464, 3321, 930, -2791, -5, 4236, 1031, -2774, -1153, 743, -2549, -2784, 3221, 5384, -242, -3550, 405, 1668, -2181, -2366, 2384, 1417, -2958, -1087, 4966, 3695, -3112, -3548, 391, -341, -2677, 1525, 5612, 607, -4595, -1141, 3617, 381]
4895C81m389L332K851l663m48O603R51q095l936N823L030l908O37M888j988o148
4911d079J814P069k227p960J135O308m88k789M072K893p247o187N946O427l575
4926A112m204M049K353m792o95O549n37r182j743Q406L485m427m12M135l816o746
4942f465L851Q358k978q092K531P077j712m353L478J927p817m600R092P616n504
4957B409n700L836J801n660j17P728o65r208m91J0333K977p292j744L609l416
4972a600n903O257R636m407r012J988P210k571m498L535K418p367k934J0773O380
4987I905p856p507M241K149m506Q62Q938j635r989K0J0489Q48q510j358M740k113
5003a282m091P471P826p060j0209L469P557k721m436M851K589p170k296J0546
$$ y = [381, -4008, -676, 2175, -1488, -1936, 4667, 5618, -2477, -6413, -590, 2440, -1468, -831, 4057, 2069, -4079, -2265, 4804, 2577, -5383, -4248, 2060, 1572, -1217, 2855, 5748, -1499, -7686, -1740, 4687, 1112, -3092, 957, 3310, -1482, -2177, 4372, 3835, -5347, -7090, 1316, 4801, 374, -38, 4097, 281, -6465, -2614, 5744, 2766, -5326, -2795, 4282, 2570, -1783, 1695, 3622, -4195, -8795, 297, 7913, 2409, -3291, 545, 2346, -3314, -3431, 4297, 3632, -5576, -6067, 4266, 7243, -49, -1793, 1816, -1600, -7503, -1246, 8390, 3983, -5029, -3041, 4169, 1598, -2900, 635, 3053, -4314, -7248, 3525, 9905, 2049, -5458, -1217, 932, -3574, -2712, 6226, 4591, -5398, -5378, 5111, 5959, -2551, -3909, 831, -1282, -5373, 2098, 9924, 2864, -7345, -3876, 3681, 960, -3476, 1375, 3964, -3206, -5502, 5044]
5017E044L638r963o656N804M027l872K193P267l689j0579J106J0449n1q246n1
5032c579N661j774l885O599N809q763j0195N483R122k125l990M199J633q270j711
5047e786R877K950j0359m502P924M118m015N45N270m879r887K906J1523l26q309
5062b950L62O099k636m239N284M336q915p380Q023R067l483n150K959M54p104
5077e273l83R944K414r733l065Q097L149n631j75M148m401p574N100J1106j954
5092E769q788L99M536k367l527N401L787p403m911P924P163n200o184K809Q13
5107B21m980J050R381R12r798k174P158K021n852j3M483l116n568N971Q099l348
5123D447q846M74M968j725k379N632L099p247m232P029N186o280n049L881K033
$$ y = [5044, 8682, -1281, -7937, -2133, 1894, -1978, 215, 7482, 3793, -6786, -5680, 4769, 4718, -3528, -3579, 2082, 308, -3577, 3022, 8831, 68, -10127, -4644, 4478, 2353, -1637, 2562, 4195, -4075, -5786, 4091, 7041, -3318, -7820, 104, 4222, 207, 752, 6022, 1143, -8744, -5838, 5685, 5359, -2950, -2588, 3511, 875, -3364, 1920, 6256, -2659, -10039, -2016, 7051, 3568, -1582, 1377, 1831, -5273, -5656, 4288, 6702, -3031, -6096, 2001, 5150, -481, -656, 3492, -909, -8483, -3383, 7723, 5769, -3019, -2620, 1916, -451, -3978, 1423, 5210, -2193, -7104, 820, 7983, 2783, -3401, -592, 221, -4759, -3709, 5672, 6584, -3214, -5388, 1770, 3791, -2061, -2074, 2409, -707, -6275, -304, 7795, 4447, -4399, -3925, 1043, -682, -3061, 2571, 5670, -1577, -5809, 1220, 6406, 126, -4923, -1042, 991]
5138I91l878J567P551j110r182j600O940J960n201N25M482k717m398M663N678
5153F271m454p957K437N460p19k085M076J309o651l075O170L897n601k885M147
5168C40J946l460Q57N199k698p165j82P193J113l760R8L405l005l534L486M291
5184D124l855n465L225N334j624k442K486O50n616j801O247L016m670k234L796
5199A171J044l636K28L597j777m825J417N744N73m291NK180k247k350K801L876
5215C510l244l608L049L607k383k929K160J071m006l10N116J723l993j920K904
5230G47N08l070Q07K636r19l084J617M318j278l729K6K138j641j189K558K802
5246C247k992k309K264J679k153j759K146O37k012K10L424K69l700r43J982L84
$$ y = [991, -2887, -1320, 6231, 5121, -4061, -5661, 1279, 3239, -1962, -1437, 3045, 328, -4070, 593, 6271, 1817, -6140, -3703, 1757, 1038, -1047, 3029, 4338, -2313, -5388, 782, 4679, -922, -3807, 340, 2286, -1174, -317, 4882, 2184, -4981, -5163, 2030, 3143, -617, -519, 2886, -119, -3653, -167, 4124, 269, -5196, -1971, 3363, 1739, -703, 1783, 2433, -3183, -4984, 1263, 4279, -391, -2625, 1171, 2215, -1421, -1193, 2404, 627, -4198, -2781, 2963, 3536, -755, -750, 1430, -817, -3167, -366, 3510, 266, -3342, -293, 3314, 931, -1998, 162, 1233, -2773, -3083, 2033, 3756, -237, -2157, 747, 1255, -1815, -1008, 1628, 709, -2375, -758, 3560, 2282, -1447, -1421, 717, -924, -2113, 445, 3247, 255, -2054, 210, 1889, -264, -2023, 123, 760, -1252, -1042, 2382, 2651, -1049, -1992, -10, 374]
5262C74j731R66K017p46k022N36K510r67k833L92J982k51r32J335J475k073j929
5279a897J662J248j518j010J919R20j755PJ853k74k590n94K267N16j144J52J537
5296A299o60j702N63J150o09j486R65J549k70r16O56N34j700j071J277J141r01
5313a81k15J206K05j393k05O51k52q35j15J756K46p63M9M13n22r14L04O69j90
5332h6k83L20Q32l09n16q5K4m28n09R18R03l14l84J32km55o74N71K95o8K76L65
5354E23M74o59n22q1j24j60J96O12M40j0m55M00n66q68P4J58L29L99L66L11m38
5375C99k93k30l23m32O4O98N03Q0K87l8n45m92k70K9K88J98L69K15J83m28o94
5396d32K40m02j49L67P64K06k74J38Qn73l30J08m66M91K29N78L47l23m07m41k2
$$ y = [374, -1357, -391, 1626, 880, -1142, -606, 1904, 937, -1896, -1504, 478, 227, -705, 630, 2105, 32, -1897, -235, 1013, -505, -1515, 404, 1324, -431, -424, 1429, 1155, -1435, -2029, 238, 754, -390, -238, 1299, 639, -1063, -500, 650, 41, -1445, -480, 1069, 799, -117, 539, 1073, -627, -1698, -421, 720, -181, -396, 810, 1015, -378, -583, 68, -184, -1019, -1134, 622, 868, 105, 154, 567, 45, -869, -565, 104, -86, -369, -49, 783, 474, -42, -127, -103, -531, -1040, -122, 781, 467, 83, 215, 213, -242, -916, -345, -50, -118, 158, 523, 997, 338, -184, -265, -389, -549, -353, 259, 699, 689, 234, 634, 68, -800, -726, -568, -239, 160, 526, 837, 399, 106, -124, -447, -879, -815, -117, 386, 466, 753, 715, 170, -322, -592, -563, -275, -77, 292, 507, 690, 262, -432, -192, -594, -743, -376, 388, 594, 320, 458, 466, -107, -437, -329, -795, -304, -75, 503, 850, 527, 120, -321, -343]
5417c43n53K09P41M45J45J77l69m64m87k22J14L45L71N85Q5k13l81m10l65m97
5437a087L21N14M32M00q9K48m82q68l39L68K21J94N95N04o8q13l17Q8n12j23N40
5458b73N92L65j12K03j79r74p25M72J25l0Q10J071l61p85k94J91q69m78N83Q17
5478A49M10n57O84M09j240p62k39N07J86J61J241N70j036p14L56pj544Q2J252
5497i2M23K31M38M35r17j852J75J116n4o14J179J552j565o00M51J3j415n32R38
5516f90J597m97R9R40n30k024m77J514K48r41J88K099j30j325j3P94j684j149
5534a981Q50K572l22j325R36O66j669j547J444N94j150n48K561J299j521j193
5550c34L53q4k250P04K777O21j903J73J802j033k291N32J146q71j490K387L240
$$ y = [-343, -896, -687, 54, 499, 644, 821, 452, -12, -499, -721, -607, -262, 109, 694, 779, 566, 185, -225, -590, -1087, -766, -252, 180, 580, 491, 739, 257, -611, -950, -582, -361, -167, 428, 932, 864, 51, -266, -178, -690, -813, -273, 319, 684, 572, 775, 596, -378, -1103, -631, -506, -536, 274, 1345, 984, 199, -95, 96, -773, -1251, -668, 149, 559, 2, 686, 1095, -145, -907, -1146, -639, -453, -292, 949, 1519, 483, -231, 125, 118, -1426, -1344, -92, 331, 562, 1000, 1435, 518, -1334, -1159, -43, -97, -711, 468, 2020, 455, -145, 306, 319, -1096, -1628, -690, 907, 410, 509, 1449, 919, -1105, -1582, -68, 180, -761, -573, 1526, 1396, 71, 58, 852, -832, -1981, -1131, 1441, 1119, -206, 730, 1396, -273, -1820, -376, 218, -932, -1480, 1081, 2380, 859, -334, 19, -65, -2315, -1611, 1166, 1787, -116, 57, 1859, 826, -1465, -933, 213, -658, -2148, 239, 3479]
5567C479j687k468N18N18k021m75K970J302k140p41K100N30k436j458J949n23
5583e83j504J765L500n97l582l14J851p20j886J522K391j792j574K303K552k875
5599D57l020J099J751j669O39L229O74l909j600K952R42l334n64L186K81k076
5615i62J394L272k051m795J4L455J19j318J794K184k816k760K559K587l461k581
5631c366K456K789j681m06L136o86n078j069M511J397k724n60L474r85k733J390
5647a35K869k561m540K005M472Q5k049J078R04l872k126M145K876l506k589L362
5663D18K124k089j151K570j361m652L90O084J471l827j159K462j019k794J852
5678f81L791k538m531K731N074j176l816R59O25l354r81N596K839m422k990L447
$$ y = [3479, 1792, -676, -158, 360, -1661, -2136, 834, 2136, -4, -745, 1355, 1885, -551, -2009, -60, -583, -2087, -322, 3178, 2581, -1001, -1315, 536, -184, -2070, -548, 1843, 51, -1523, 780, 3332, 457, -2563, -1464, 287, -1382, -743, 2486, 3160, -749, -2349, 603, 1545, -1789, -2353, 833, 1114, -962, 432, 3704, 1653, -3142, -3128, 327, 446, -872, 922, 3106, 290, -2470, 89, 2676, -785, -3366, -910, 1879, 198, -208, 2928, 2242, -2836, -3905, 606, 2003, -721, -1281, 2193, 1208, -1525, -135, 2734, 173, -4367, -2362, 2110, 2195, 146, 1224, 2128, -1744, -3870, 275, 3151, -355, -2944, 418, 2542, 453, -698, 1872, 511, -4141, -3751, 2333, 3804, -23, -1182, 1280, 261, -2533, -681, 3110, 572, -3959, -1228, 3846, 2670, -1146, -187, 438, -2916, -3897, 1699, 4538, 116, -2874, 573]
5694E73K169l581r24K921q91m287K257N886M08n279j775K859j214j853K897L835
5710D001l405m156K924M798k774m114J566J544k867N19N298J949n954l438L361
5725g48K414k912k9L341j312l856J888N783j015o637o66L616L91j632L053K867
5741D546m531m272L388M097k241m189K281K240k232K34M354L59o683k364M542
5756d71L291l163k55L318j560m163J736M969j615n676M04M506L57j920J964J573
5772C295m880l412M086M595k733l415K548J577k479p08L930k62n689j532O316
5787A237K530l358n39K130k173l479K363M612j697m880J346M061m6k947J502R86
5803A648m367j984N016L978l301k863K069J213k702m97L679l71m802K98N628R52
$$ y = [573, 2742, -839, -1763, 1158, 267, -4020, -1763, 4123, 4531, -748, -2523, 336, -878, -2731, 166, 4001, 596, -3560, -636, 4162, 1388, -2726, -1160, 384, -2483, -1964, 3334, 5283, -671, -4109, -748, 1666, -1246, -1275, 2066, 754, -3102, -1214, 4569, 3554, -3083, -3749, -133, 258, -1374, 1679, 4546, 15, -4257, -869, 3228, 987, -3202, -921, 1319, -913, -679, 3675, 4034, -2649, -5013, -471, 2820, -343, -598, 2720, 1160, -3003, -1267, 3702, 2087, -3589, -3185, 1321, 1678, -242, 1722, 3295, -1585, -4997, -911, 3684, 951, -2464, 84, 1661, -818, -1526, 2404, 2142, -3547, -5079, 1237, 3767, 409, -130, 2000, -173, -3652, -1289, 3323, 1626, -3254, -1908, 2153, 2107, -840, 662, 1648, -2719, -4703, 313, 4291, 990, -1873, 196, 1409, -1293, -1790, 1889, 1518, -3284, -2986, 2642, 3594]
5819C594l713j179J716j674k121L148M253k307m836J848L491j122k772J479J015
5834H20k627j180M804K769m117l117J859J394k065J63L519l03m151K64M408K46
5850B686l802j079J987l39j620L130L278l074m163J543K982j039k047J398J423
5865A264k233l97L940J278m675k726K601J969j486K4L068j240l501Q63L081k05
5881A625l289k13K528j91j066J673K016l203k963J686K941j048j719J541J139
5896A457j969o01K696O44l900j548L203J451j183K15J200r33l099O04L005m89
5912G53k283K99K652m37j563J265R96k449j977K162K554j020j471J078O96k066
5928h11p49K226Rj950l21K302J414j855k60Q44j018j987Q19K869p41j440M27J607
$$ y = [3594, -119, -1298, 418, -1256, -3377, -229, 4024, 1717, -3119, -1271, 2220, 1098, -1674, -195, 820, -1807, -2987, 1817, 4586, 469, -2648, -789, 605, -1460, -1297, 2222, 1919, -2232, -1968, 2440, 2686, -1116, -2195, -208, -547, -2167, 963, 4241, 1167, -2996, -1453, 1529, 490, -1557, -159, 1264, -969, -1366, 2574, 3852, -823, -3549, -948, 1021, -465, -441, 2627, 1387, -2114, -1251, 1830, 1625, -1664, -1877, 651, 460, -606, 1067, 3083, -120, -3083, -1397, 1544, 496, -1223, 318, 1457, -512, -1113, 1583, 2227, -1673, -3221, -18, 1433, 250, 465, 1665, 732, -2367, -1763, 1242, 753, -1530, -1231, 1421, 984, -579, 686, 1682, -767, -2744, -582, 1972, 952, -519, 559, 1255, -811, -1560, 666, 675, -1275, -1596, 706, 2120, 265, 5, 849, -169, -2156, -1337, 1532, 791, -649, -222, 1385]
5946A385q09j441N09P76j670p36K605J428j088j290K83M09j551j83J987M50j642
5963e78j20J882K17j685l26N17o12n41J219J850o07j629J23P61q56p59P42R59
5981E57o46m78J732N47j750r32K35O05n57mJ727L07j148m52Q15j75j507N2Q40
6000b32M56l15O99J067j115j539N5K32O8N2R94M54q4n81K69j14j160m76N90R28
6020B48l2M01O02m21r92n70N50m89r9L84J095J80l42M3n06n60l86J00Q74J97K6
6041C03M40L71o15r12k29J2n5P2P57J110k83n58n2p12n80Q4M28L36L34O46K56
6062A153m13r10l22k05l06J82R57P20J66k66o73p5p36k03L59M16K91N59O4j75
6082E83l80n75l88j17L53L72O29O51k47j52p93l97j98k41L81O28O47J21O7p21
$$ y = [1385, 576, -865, -356, 420, -1250, -1986, 619, 2047, 959, -331, -48, 361, -1190, -1373, 614, 1064, -578, -698, 1184, 1401, -284, -610, -93, -705, -1246, -27, 1823, 1216, -413, -290, 471, -385, -1144, -402, 557, -89, -567, 1165, 1712, -38, -970, -735, -130, -687, -691, 1036, 1343, 195, -257, 558, 383, -1124, -1072, -232, 224, -91, 608, 1675, 560, -979, -924, -692, -624, -572, 422, 876, 792, 211, 480, 366, -794, -1270, -680, 248, 216, 617, 1219, 798, -194, -764, -214, -703, -802, -418, 677, 857, 515, 558, 52, -508, -894, -794, 80, 277, 303, 743, 1114, 499, -413, -642, -630, -685, -613, 144, 1254, 971, 413, 361, -351, -931, -847, -419, -83, 251, 897, 1153, 740, -170, -492, -697, -1003, -821, 136, 856, 1022, 756, 83, 8, -728, -931, -572, -156, 135, 694, 758, 583, 203, -372, -760, -877, -524, -152, 477, 1128, 881, 729, -64, -461, -659, -900, -519, 109, 756, 877, 944, 223]
6102B23p27l16p4J80L54N00Q52Pk16m02q45m33n2L56N57J67N59J73N7o20q82k89
6124h71m7M95K15J011K2k35j84l32n02m52l9O85P17N9M45l37m59o68n78K61P9
6145g15O91O27L24o8l60l45p58k80M1Q2R99O63N2J07n25p74l46m88K84L96J031
6166F38L94k86j9l75p93o81j9N54P48J56J91N30n31o54n31j12k86M22Q53P14j76
6187G37k0n63j09n54q60O52L56L06P52O28n57r62o59K33j88n3Q32M29N60o15L40
6208F85k64j025n09j04J059J33N83P39M4r93j066J62N4k82j65J381N23j53l78
6227D24M22p87j501l3J126M53K13L08N70p89p87j19nm11j40P72J187J36n85M99
6247I53q46j229m25Q07J134k33K58O61j17j091o07L38k70p82P23J517L40n61J13
$$ y = [223, -504, -820, -894, -714, -360, 140, 992, 999, 783, 381, -464, -897, -949, -593, -36, 131, 690, 863, 920, 300, -582, -871, -918, -423, -208, 803, 825, 590, 406, 74, -428, -880, -919, -234, 483, 542, 987, 650, 191, -477, -1055, -794, -715, -24, 603, 927, 859, 499, 154, -604, -884, -843, -761, 238, 901, 953, 1060, 535, -239, -585, -1073, -789, -393, 638, 1032, 746, 727, 352, -441, -1122, -1141, -587, 161, 317, 508, 1038, 507, -147, -678, -790, -1076, -654, 199, 913, 737, 717, 154, 45, -509, -1369, -717, -361, -55, 697, 1325, 768, -194, -853, -620, -808, -861, -29, 400, 960, 345, 685, 421, -604, -1113, -1217, -158, -25, 558, 1297, 1341, 348, -718, -556, -502, -784, -949, 432, 955, 802, 424, 846, 59, -1442, -1475, -349, 104, 317, 625, 1195, 406, -381, -500, -505, -916, -1056, -284, 903, 1039, 454, 953, 107, -1122, -1547, -740, 394, 161, 419, 1080, 963, -128, -735, -397, -667, -1449, -726, 791, 1131, 570, 683]
6266F83j69j112j154R02J184j13l90O83P71p81j169K17Q7j073K08J866J081j302
6284D19n83M53k57j108n4J301O9o83K78J800m86j325k47Mn64q48K203J180r81
6303E71q53L84M17j018q26R36P58q43J53J999K92k233q15P27L1j212J275J795
6321A538m95j692L78J449q23j826M31R55m17r5J738J334k029k275J008R78p90
6338f33k16J570L61j343m81K232j39k367r51J780O31r42J662R76j661k177R63
6355g35J272l19j584J119J303r62m48J530N46k713j676J981J575n41l39J109k12
6372I06k050j51K053j0k373K4K312O61j163K10R96k146k034J676K565n96j515
6389f35J015P71j171j066J641L52k307r61K390J909j363r92R35m80j947M58K586
$$ y = [683, 514, -598, -1752, -850, 334, 221, -169, 514, 1285, 504, -665, -448, -361, -1434, -1226, 640, 1721, 419, -164, 289, 32, -1076, -1130, 171, 240, -443, -165, 1635, 1149, -176, -423, -419, -983, -1831, 372, 1552, 571, -282, 102, 519, -499, -1325, -389, 369, -474, -321, 1678, 1970, -263, -1078, -351, -320, -1532, -257, 1538, 1043, -649, -271, 1178, 355, -1471, -1040, -85, -502, -597, 1141, 2475, 446, -1829, -821, 157, -633, -849, 721, 1082, -261, -742, 1490, 1351, -1016, -1967, -187, 444, -498, 1164, 2140, 479, -1698, -735, 537, 218, -1366, -247, 1056, 94, -354, 1176, 1722, -991, -2667, -686, 889, 348, 9, 1118, 906, -1144, -1295, 758, 748, -1625, -1601, 711, 1372, 209, 419, 1415, -731, -2765, -1089, 1476, 880, -635, 380, 1151, -20, -1086, 555, 907, -1400, -2361, 29, 1938, 575, -417, 518, 38, -1909, -1451, 1135]
6406A135R7k281P8K165J41j636K86P41j590j622K324K574r32k409R09N00j215
6423g35o89J993P34k517k28K400J155j658j359P62r6j629J252K839o12l002J78
6440a212K106l01j691P21J223j783p12K235K331k058k745J057R68j113L18J827
6456A171L67k411o97K520Q94k537n56R01K25q73J353J978j035k915P1K116l7j140
6474f05O21J053j294j054K311J449k375k457J535J400p72K58J444l19k435m05
6490a645K455O93k420n48J925J39q64J009R76j146k912N91K724j26j460Q32J016
6507A239j520j076K017R04k222j580J907J446q05k36J288q74k494K37K760M04
6523A395j719l96J476L6j316R26L86j177j986J441K413l80j138K53K54j269o40
$$ y = [1135, 1232, -1049, -971, 1194, 1335, -301, -15, 726, -864, -2486, -162, 2412, 1480, -929, -20, 480, -735, -1424, 569, 1303, -1214, -1442, 958, 2113, 455, -904, -142, -238, -1867, -615, 2224, 1612, -1390, -1212, 894, 593, -1098, -377, 846, -937, -1649, 586, 2917, 859, -1886, -829, 139, -974, -656, 1171, 1538, -873, -1570, 950, 1844, -693, -1249, -348, -123, -996, 357, 2335, 1300, -1615, -1544, 572, 535, -605, 16, 1069, -225, -1279, 1032, 2481, 106, -2351, -816, 584, -188, 70, 1514, 1195, -1240, -1645, 810, 1503, -917, -1465, 460, 599, -265, 744, 1720, 574, -2338, -1747, 977, 851, -609, 223, 1239, -281, -1357, 660, 1564, -658, -2238, -331, 1115, 310, 74, 1362, 488, -2006, -1769, 991, 1395, -324, -720, 756, 792, -524, 402, 788, -389, -2375, -934, 1479, 1099, -39, 214, 468, -801, -1441]
6540a441J792P99j660j083J941J117r98q34R45q15j475P41K180K70j898l04J399
6557F76m25j027P14O98r60j381J476K118q04j503Q3M22r35l02J669Q42j887o47
6575a173J830O16j366o54P47o1j286N84K447m36j719o79J485m1q89N09R28j244
6593d02l95J543R35j445j559O55N83n98J30J619J47j823k11J244J37q80l45N64
6611a01K01o20M69J513r65j487K06R30l40m29P33P07p38l98N25N81r70r53O38
6630d98Q71k90j05P00N0q75j054J200N15r06j10P83N09j033R1R41p54j253M31
6649g87J209Nk13K71l2l61p04K99N29n04k12O31P99l73n66M63l69j027p0J115
6669A03L68m01J27M59L3r17n7L06n69l16O67R97O9o14r8K81j085l04Q63L78m99
$$ y = [-1441, 351, 1150, -510, -1593, 348, 1465, 467, -367, 578, -237, -1712, -971, 1209, 1479, -419, -723, 676, 251, -776, -62, 636, -324, -1705, -229, 1889, 1085, -418, -335, 87, -848, -1150, 519, 1361, -526, -1173, 657, 1273, -93, -747, 0, -61, -1347, -763, 1684, 1248, -471, -1150, 335, 294, -595, -86, 842, -402, -797, 746, 1681, 236, -1323, -668, -85, -683, -553, 1066, 1213, -610, -821, 423, 560, -320, -665, -101, 100, -520, -51, 1462, 497, -990, -784, 146, -194, -623, 110, 817, 79, -319, 206, 787, -183, -1136, -498, 373, 83, -22, 678, 728, -147, -1201, -1, 514, -392, -502, 281, 790, -243, -152, 789, 35, -1218, -787, 422, 427, 214, 485, 453, 92, -612, -313, 216, -288, -500, 131, 930, 557, -9, 454, 85, -942, -1012, 103, 471, 70, 197, 656, 689, -228, -285, 21, -548, -864, -197, 800, 869, 255, 157, 438, -647, -951, -88, 290, -209]
6690b09K74L91R3l53p13M10r9l53r7J276R5k78l77L79p56m80K42M50J13j33L42
6711B17Q24o86m50l52j34J62k4P44L71k34k30K28p48J7k95J25M74J27K51K49q1
6732E55n26n76M5OJ33K18Q13K40m61j60jp54k69L13K50L78j59K05M06n15k59j76
6754b94j71P5M6M58M87k20q5J77n84o25Q0L27J72M76K4J98k70l91j42l90K61J51
6776b40N78J54J43O2j34o28n45j18M63L47J91J24q0K73j30p85l66N1K38M87M51
6797E36o6P4j77n29l2n28pN39J06M42K35p6l60l90l37L5J31K88R3N23J47j17k07
6820C23n61k94O8K16K28M23L12k07m60K90q37J4J95n2N1Q89j02J53k91m33n09
6841e84K7K7L39O33R5J17l51k51n23J76l09%L20N34K91Mn22nl23l41K70J25K84
$$ y = [-209, 65, 456, 549, 196, -517, -107, -206, -559, -656, 620, 715, 437, 60, 439, -317, -797, -555, -105, 8, -125, 217, 1041, 355, -95, -447, -581, -419, -443, 301, 672, 438, 208, 436, -312, -295, -590, -465, 9, 136, 387, 636, 555, 29, -547, -502, -496, -363, -145, 668, 908, 447, 287, 286, -468, -737, -424, -174, 204, 45, 250, 656, 141, -118, -294, -465, -390, -344, 114, 601, 381, 296, 473, -111, -736, -656, -329, -157, 319, 343, 541, 271, -120, -262, -652, -391, -240, 338, 492, 635, 697, 563, -65, -610, -728, -265, 82, 273, 397, 317, 590, 460, -325, -691, -640, -402, 85, 536, 470, 544, 367, -162, -194, -722, -729, -190, -84, 358, 593, 517, 157, -233, -570, -535, -404, -116, -23, 500, 647, 530, 323, -238, -532, -464, -248, -20, 403, 715, 508, 48, 338, -499, -485, -290, -342, -291, 598, 496, 649, 358, -75, -584, -557, -530, -191, 442, 537, 654, 303, 52, -471, -295, -604, -604, -284, 250, 541, 545, 23, 18, -305, -646, -376, -251, 33]
6864C3M72Q3j38j21m59j29j32j35O13J08N74j83O8n73k19p10K09N60k67O96M46
6885G96j67k81n10j39k02oK59L65L30J11k0m19r6o08j21Q4N99M29k38N49j54m85
6907G6m42j00K10j53L52N51J38m61Q6o66J06m05K65K62K82M94K35O0r20l31j63
6928e24J91k58K83N43J24J50m03j62j59m64J56J41J95M88K19K39l38m84l94K23
6948b34RnJ19M48J98l28m0L5o13l05N43J17J74J62M51j87m87n43K00J09k04N9
6970c22N35R6J55m47K18l54n81Q3P05J17J2K72%k76o77J55J47P4l62O56K11M6
6992D63k62K18o69n83K44O59J67q0P2K70j92n71j95Q9J02l71O03R33l24l74k2
7013A77k57m62l17Q08O00m86j20L08K08o08k59J66j87j74N31O61J32p18k79N63
$$ y = [33, 505, 588, 450, 329, -130, -259, -391, -526, 87, 195, 769, 586, 654, 81, -138, -848, -639, -79, -346, 350, 796, 629, 348, -162, -301, -503, -509, -250, 115, 445, 556, 536, 117, 21, -587, -708, -624, -25, 404, 166, 715, 561, 76, -366, -466, -256, -409, -57, 494, 632, 171, 257, -409, -303, -708, -443, -181, 101, 595, 830, 890, -30, -361, -524, -333, -591, -308, 235, 359, 509, 106, -56, -215, -679, -523, -382, -187, 301, 520, 759, 421, -63, -457, -234, -225, -230, -111, 337, 535, 207, 167, 202, -411, -716, -173, -56, 118, 280, 731, 544, 57, -486, -286, -177, -381, -322, 213, 309, 464, 17, 235, -119, -700, -617, 88, 205, 217, 489, 489, 213, -464, -309, -162, -88, -450, 206, 417, 463, 201, 419, -250, -833, -589, 70, 237, 157, 229, 499, 307, -264, -459, -370, -268, -639, -36, 897, 573, 199, 177, -80, -542, -859, -51, 549, 63, -57, 251, 459, -149, -408, -242, -429, -603, -72, 589, 721, 3, -276, 287]
7033B87l79m76L02O38l15m25N72N30o06o35J53K65o27L87R74L91p79l17j21N79
7053C98n99m05M63K87l97P8J303o83r65j27Q02m06K28N2N83n64m15L06O11p71
7073b21k32J70N34k81N9O50j49j083k6P60p4l60M7N99j52l09R1O61m99j113M80
7094d48N26J42n9n5N85p79q14J121P1l35l96N27M43n62O7J41M4r18OP80N10o87
7116i0J9N54l59n21L65M32o06n75J42J325l24n67L51k4m25m82Q03P25q50j91L88
7137I0M38n97O4N01m08o57J01J127j0n96m12L16j6n31L35O54l13q53P29Q30l42
7158D50p66J74N69j155p6J062L36p82l18N61j5j31N5j6M42p53K31R57p6r64l47
7179e62M70k0k72qQ18j12q98K34Q43k14p02L30P2k97J74P20K68q74m98N88K22
$$ y = [287, -92, -568, -266, 372, 57, -368, 204, 734, 128, -507, -354, -89, -716, -329, 645, 1036, 257, -60, -181, 398, -201, -606, -143, 144, -253, -175, 1128, 445, -520, -647, 155, -251, -23, 29, 612, 48, -367, -61, 550, -221, -453, -283, 251, -30, 29, 679, 530, -553, -579, 181, 107, -253, -206, 393, 241, -68, 23, 684, 185, -928, -448, 78, 220, 161, 106, 691, -88, -902, 219, 290, -45, -441, 86, 529, -33, 34, 175, 219, -699, -693, 87, 597, -90, -71, 483, 124, -397, -32, 400, -206, -781, -639, 686, 362, -205, 146, 122, -303, -785, 18, 743, -107, -298, 90, 528, -69, -5, 496, 88, -569, -468, 659, 649, 53, -359, -43, -59, -590, -255, 399, 86, -767, -38, 792, 450, -316, -142, 427, -728, -804, 258, 594, -188, -506, 55, 40, -91, -36, -52, 390, -363, -132, 825, 749, -215, -562, -92, -112, -384, -392, 426, 314, -584, -350, 493, 279, -423, -93, -21, -318, -144, 576, 844, -30, -528, 60, 282]
7200B82j05n15R63n53l26Q6Q90m37n47j28O72j14n25M60O30n20q09O40L33m86
7220a09l05N75J6l46J76M60l30p39O2K34M97j71O1K74k35k47N22J08m65n12rR90
7242E07m0m50M32q2l61q06N57M55k3o81M41K02k68K16M91k97j076J24N91M14q
7263C38o8l8r2n73M11N43m13l88Q2L93j2M7j83K17k29n48L75P77l99o52R14Rq96
7286c85j59O08J2n48K8R46J48o19l51L59j76o45L57N67L69m83O9P8M2m34j86M32
7308B9j90l19N05M07q4n28k5K90l83J41J87J51j19P9L18p1l76m16J98N0k91O53
7330B06K29j38m48Q5J18k38m96L51N31j32J77kJ87k37o67R3j15K61J35L29Q0j52
7352A57n2L32o96J42k52J70K72J42L4J26L4p23r8J95k53K36J28M80K7j77J06l71
$$ y = [282, 177, -338, 625, 72, -254, -168, 722, 285, -262, -390, 282, 168, -357, 103, 733, 213, -596, 44, 377, -109, -414, 161, 177, -169, 7, 467, 137, -602, -540, -306, 191, 20, 81, 355, 120, -127, 395, 503, 38, -474, -483, 507, 467, 17, 449, 367, 6, -800, -243, 212, 189, -492, -51, 151, -117, 99, 590, 293, -783, -659, -68, 346, 338, 270, 232, 140, -433, -22, 521, 108, -280, -198, 195, 183, 230, 47, 264, 35, -513, -138, 639, 240, -412, 502, 511, -385, -544, 64, 76, -472, -444, 502, 650, 31, -320, 39, -137, -782, -425, 142, 511, 28, 97, 175, 217, -217, -403, 29, -161, -480, 25, 432, 348, -180, -205, 85, -298, -157, 30, 181, 62, 141, 459, 388, 12, -404, -206, -156, -447, 206, 435, 297, -151, -66, 52, -186, -682, -331, 200, 68, 245, 243, 430, 193, -474, -381, -496, -235, -100, 229, 309, 157, 105, 437, -259, -117, -369, -199, 73, 215, 249, 375, 409, -314, -412, -217, -470, -234, -106, 374, 401, 224, 330, -41]
7374d1k22L2J00L01m8m1J48P9m20m76K81J40k23L96M23m4p8m28L47n21j65K33
7396b27L97K40j71J37r1n25j08oK76o8j36N88K58q1m60l38L27k06o7M1O38k44
7418A74K58l41j65k92M6j41L6K48L98L04k30j79K24l80m46K10J79J09L27p4L1
7439B96n0m61k82mN55q5L32J85K27n18k78K6k69l20K71M83J90J65j91j37q0k52
7461a97k62L02J25J13L84m63K01Q7l54l88n1L9M69K09L36j02Pl17j67l19k12N26
7483c4M48k65J53K62p71J40j94k1J06K6M79MO5k4j90l05m29r7M08J7K95K03k0
7506B56m54J63l10L9m6J46L44M54l28p9j78L07m59k25J20j8L79Q9L49l06j07m65
7528c29l8J9J82J96K82J88j81k42k30k17l7K63K37p8L97p6n6l98j15M7r9L9j4
$$ y = [-41, -263, -231, -131, 170, 122, 81, 229, 308, -112, -588, -307, -167, -390, 6, 429, 385, 307, -121, 226, -295, -460, -227, 170, 410, 239, 376, 285, -240, -348, -354, -78, -146, -282, 306, 564, 483, 23, -315, 12, -194, -261, -220, 418, 174, 432, 91, -74, -366, -320, -461, -425, -177, 221, 525, 295, 116, 340, -40, -486, -276, -97, 12, 339, 265, 296, 246, -215, -497, -501, 54, -31, 301, 486, 713, 195, -83, -57, -326, -646, -375, 108, 298, 463, 272, 135, 55, -197, -459, -157, -32, 81, 465, 2, 203, 290, -64, -452, -503, -464, 5, 214, 550, 448, 455, 138, -29, -348, -560, -34, 414, 149, 302, 564, -207, -67, -261, -282, -176, -150, 329, 333, 398, 374, 184, -121, -550, -647, -239, -222, 73, 276, 256, -198, -35, -345, -306, -352, -206, 138, 592, 264, 185, 7, 314, -145, -370, -250, -268, 111, 200, 549, 243, 136, -329, -367, -348, -166, 30, 312, 500, 319, 77, -153, -370, -407, -144, 93, 15, 412, 336, 280, -118, -233, -186, -285, -246, -260]
7551b60O45J17M0n20k5l43q6K4L05K06l5K72k00K12l21K3m60J36K68j38K19L31
7573D10j61l19k0l35O3O0L16l9K42K00l28k12k40n7p4K12R6L59K2L12l83k64j70
7596c10j25P2M05K31j28j1L38n01k58J49k62J45M61J64J33l08k21J91l37k87L23
7617a36k64M48M76k81j60j56k12N3k3J39K6M17J96m06J42k92J12k58j06L3K61
7638IK24K20k27j32m28N9J69O5p4K52J90O8m92L56l04PLk80L27R4J76k38j9j65
7662a40Q5k69K19l3MM20k7j57k47J31l61J97J4K91p3J26J88K5k77j92P5n6R8j73
7686a32N60j89k55ML81m09l23K33j6J90p1P7J53J30m01q0J23j61N7J79m6J21m1
7709H4j86Jj0k49J69O9O4L73l60K06j92rK72k56L0k77M04J6j57K81m63K68o8j22
$$ y = [-260, 385, 502, 542, 22, -3, -346, -432, -408, -103, 103, 68, 340, 140, 352, 31, 54, -406, -270, -2, -140, 79, 410, 249, -70, -90, -425, -362, -302, 14, -25, 217, 417, 89, -123, -363, -420, -494, -282, -186, 173, 195, 507, 124, -140, -310, -435, -363, 42, 273, 145, 134, 472, -29, -287, -138, -400, -255, 206, 370, 503, 195, -26, 165, -172, -459, -136, -400, 48, 524, 243, 83, -73, -285, -232, -255, -116, -90, 327, 523, 117, 259, -33, 79, -179, -285, -252, 9, 233, 453, 226, 94, -334, -275, -106, -41, -115, 137, 327, 395, -97, 259, -45, -38, -35, -315, 12, 106, 282, 44, 25, -140, -55, -324, -105, -138, -134, 286, 259, 102, -145, -14, -375, -178, -164, 127, 54, 180, 368, 393, 116, -76, -1, -57, 41, -132, 428, 239, -16, -12, 369, -40, -363, -130, -146, 44, -27, 50, 203, 333, -68, -148, -25, -186, -129, 50, 4, 125, 84, -102, -101, -111, -360, -191, -122, -58, 315, -45, 161, -31, -40, 232, -24, 6, -271, 133, 149, -8, 273, -190, 78, 10, -112]
7733a12K51j32l4K28J69k80k18m31K44K18j2K93J76k43J78q3j10j34k50L62P0
7754A50q2J63l1l89k9K2J40r4N4MK07J50k29R9J42o79J45L28j73M52l49K49L6
7777B86k43n1L32l30K54j94J34J7k8p4j55j82j29N15l6q9k8J33Q7k26j98j3M66
7800B48k32k25K43L74k39n41L69K0J2p9N7J00l93O6M01j47j11J87j81k56J04J02
7822a21L29m69l5J75J02K7k07J54K85k81r0K90K69l79k41K93k03j87O5K93n7n7
7844d5P5J69r8k91j22J36J08l26N28K30j59o29K92Q6j02k37K83M07k32k87M46
7865B32j00n33J17r3M09l48K77J48J83m35l13N26j03q2L02o4O3j02K8K60p8m01
7887a07q6J65M8j42K88m2k07n7N3K64k45j21K40L8M41n68L30k73j16j96J09N04
$$ y = [-112, 139, 7, -27, 201, 370, 90, -128, -559, -315, -97, -109, 184, 360, 117, 295, 212, 102, -32, -282, 80, 150, 68, 231, 200, -189, -218, -196, -56, -150, -96, -92, 115, 265, 36, 135, 277, -402, -257, 71, -102, 350, 1, 250, 286, 43, -8, 324, -6, 248, 54, 188, 205, 177, 103, -52, -234, -363, 152, 116, 27, -1, 132, 219, -7, -205, -218, 248, 16, -209, 34, 408, 169, -372, -3, 17, 29, -50, 7, 107, -286, -220, 181, 34, -77, 110, -71, -327, -223, -121, 208, -261, -296, -121, -19, 8, -199, -45, 240, -41, -131, 159, 428, 49, -192, 101, -102, -289, -224, 69, 12, -45, 30, 199, 101, -190, -312, -176, -68, -394, 134, 364, 205, -424, -132, -46, -148, -385, -102, 305, 73, -214, 232, 132, -401, -284, -377, 32, -316, -39, 109, 292, -143, -456, 70, -33, -115, 187, 123, 186, 84, 112, 372, 294, -107, -193, -28, 20, -122, 166, 124, -83, -140, -87, 177, -68, -189, 51, 89, 530, -38, 292, 19, -97, -293, -184, 320]
7909C20m85L91O4j0k90K15k97J33n10K80N51q0j12j68Q3m47k09N46L66m93m7O02
7931D03k79N2J29m22J31l60O7M80K07n07M6K97p6j69k38L18K19p06M41M07l59
7952H1j92L15m80q3k8N02M19l03J16n10K98j24j41R2o1j41K72M54j48l47p0j05
7974a84J37l43M06L35k68j41L66l53J6m22L25N7j53O3M11K52l86k85J47K49o07
7995c78K68o4Q7J84j3K06l22k98k24M47K7K00K21O2N0n02J75j47l43N1K26M53
8017C66j11J20p3j94k87l72L35M23j59J02p7J54Q2m27K09J9m57L5M01L97J0k98
8039A98n5j33n93J45M58n1l1J01M15n09k29o4K01l85O5P23K44l32J24L7q0j55
8061I4l29R9l5J48R9L34K6l54P5k61l07n8M37L34J32L5k67P7n91r9J96p0PJ64
$$ y = [320, -165, 226, 290, 280, -10, 205, -92, 41, -469, -189, 362, 282, 170, 2, 85, -362, -571, -25, 341, -152, -199, 403, 124, 176, 305, -117, 14, -346, -279, 201, 408, -99, -53, 244, 168, -1, -239, 79, 298, -408, 33, 440, 81, -111, 204, -276, -359, -387, 115, 534, 231, 347, -163, 135, 11, -130, -38, -99, -240, 32, 486, 338, -9, -79, -184, -47, -390, 16, 351, 83, -58, 308, -45, -29, -451, -126, -69, -222, -159, 252, 504, 118, -167, -20, 229, -378, -110, -174, -87, 97, 84, 290, -32, -330, -554, -107, -80, 120, 341, 403, 453, -49, 126, -21, -364, -313, -87, 366, 255, 375, 302, 108, -179, -551, -216, 207, 48, 150, 73, 227, 309, -118, 91, 110, -347, -312, 89, 486, 496, 198, 143, 10, -583, -438, 20, -31, -62, 39, 454, -55, -284, -348, -147, -532, -467, 256, 500, 168, 292, 329, 249, 94, -235, -136, -171, -23, 76, 410, 436, 82, 157, -104, -411, -469, -32, 302, 434, 469, 202, 279, -312, -411, -215, -285, -278, -114]
8085a14N86o8k39k92J67m67J28M1O76j09Jj79L4k23l80n0N87q8L1L18q4o6n51
8108c41p4J23q5M53k6M66j46N2k56l03m64j53O57j70J85M47J18l44j39k13O2k68
8130d19J28L71M83k92q5j55K0m21K08m3J59K77j22J07j06K7j36M8l20K71k55L33
8152G8K11J5j18k09l5m50L6K82J63L99k64K89k48m32j17J8R8N3L23L52Q8m76n
8175E1J5k05k32N68l35K75j83L09J0l17l12J17j3m2J68L74
$$ y = [-114, 472, 404, 165, -127, 40, -427, -299, -258, 418, 309, 310, 131, 165, -58, -438, -488, 99, 11, 42, 360, 276, 210, -341, -415, -292, -377, 76, 50, 516, 370, 422, 166, -137, -601, -754, -97, -267, -82, 365, 483, 139, 0, -213, -151, -419, -291, 80, 563, 271, 186, 31, 51, -370, -162, -205, -46, 231, 109, 216, 110, 137, 1, 49, -271, 0, -255, 78, 289, 304, 186, -23, -58, -508, -472, -190, -27, 372, 108, 397, 149, -283, -400, -382, -284, -231, 92, 444, 532, 56, 51, 66, -139, -371, 197, -138, 137, -46, 263, 273, -44, -356, -239, -252, -294, -126, 248]
8191B48
$$ Imaginary data points
##PAGE= N=2
##DATA TABLE= (X++(I..I)), XYDATA
0@%%%qJ6j6K4m0N3o9Q0r6J28j60J91k26K77l32L88m59N38o33P36q40R73j120J273
27F78j447J642j861K095k353K642k959L308l682M098m561N057n604O210o878P616
43D001q428R336j0357J1504j2802J4288j6018J8048k0469K3425k7123L1914l8382
56b1063M7661o2208Q8391j50103N49827M96562j013447k41410J36071j53629k72849
67e96197M85748M73468k11221k46498N05848K97314o18379o97678Q6415K06960
77c14220n2881L42640P90185O8091p86027m27862K92957K0195l86521P3165M95097
88A14819M9832j64667L87512M08833n63137r11533n1011N15277J34305K5844M66335
99D12409K73467m96567m64991K22689J61532m51938k60834M48310M05534m6350
$$ y = [0, 0, 0, 0, -8, 8, -8, 16, -24, 29, -40, 40, -56, 72, -88, 103, -123, 154, -178, 210, -249, 289, -344, 392, -448, 525, -595, 678, -769, 873, -988, 1107, -1246, 1396, -1563, 1745, -1937, 2161, -2400, 2657, -2947, 3263, -3615, 4001, -4427, 4909, -5448, 6056, -6746, 7542, -8476, 9572, -10897, 12528, -14595, 17319, -21063, 26598, -35610, 52781, -97322, 452505, 949067, -64380, -305790, -169719, -323348, -596197, -110449, 363019, 151798, -94700, 411148, 708462, 90083, -607595, -521180, -314220, -367101, -24461, 765724, 833815, 47788, -380074, -87117, -66922, -453443, -380278, 114819, 164651, -16, 387496, 796329, 233192, -678341, -729352, -214075, -79770, -53926, 412409, 685876, 189309, -275682, -52993, 108539, -343399, -604233, -155923, 249611, 203261]
109B03261J22374L16275l35941q57572k13309N53055K93745j35565J74159L69961
119D90443j67117m20061P7745J85202m29328m67041L66417O76453R6554j59288
129B49979J34854o5808o21835l67792L99469L88129j56205n5802L87145J55894
139D48028l19057j49537J04176k75383m77911J93740P22012K61990k62679o4898
149A80481P4270l33320m00104J76560L56431j14494j66473L70414L94840k08719
159C29886l71484k1238o7012l56998r781N88619L99784k14092k21513J04111o1809
170I8473l45675p1863K39073k042j57188K72668M83225m9079m64966j90057M8240
181a39191j56041j07280L61236M03517j02232k45692J04549J06733k85958k72865
$$ y = [203261, 325635, 641910, 305969, -551603, -764912, -211857, 81888, -53677, 120482, 490443, 323326, -96735, -18990, 166212, -263116, -730157, -363740, 312713, 409267, 249979, 384833, 319025, -302810, -670602, -271133, 116996, -39209, -95011, 292134, 448028, 128971, -20566, 83610, -191773, -669684, -475944, 246068, 508058, 245379, 180481, 254751, -78569, -478673, -302113, 54318, -60176, -226649, 143765, 538605, 329886, -41598, -62836, -129848, -486846, -496627, 91992, 491776, 277684, 56171, 160282, 98473, -247202, -319065, -79992, -82034, -239222, 33446, 516671, 467592, 2626, -187431, -139191, -295232, -402512, -41276, 362241, 260009, 14317, 118866, 225599, -60359, -333224]
191c33224J12331J31280p9045J36421M38164J04982m26617l26770O8567L4644
201a39267j21830J19925L17643L5927j73414P5371J69764k14726l88298j7717
211c36622K27916N0622K8667K82958J79103k80449l45239K7599J18586j13638
221a60497n7181K25905J71253p4140K314J47100j10790l86645j41256K31991J74878
232B2932o723J01703J67205r9760k59032l9411R2880r5656j35161J47876K50697
243A47550K3599o5031O6086k1543k83665k02955J51284K17243O085p609J30476
254A61520L4419j61068j00226L9060n8615j47073O4123K59819J14187q3134l2716
265I0296J4261j39077j84640L6477J65574L5484k5321J00406R6487r0835j33739
$$ y = [-333224, -220893, -89613, -168658, -32237, 405927, 510909, 84292, -242478, -173911, -139267, -261097, -141172, 176471, 212398, 38984, 114355, 284119, 69393, -318905, -336622, -108706, -58084, -29417, 253541, 432644, 152195, -193044, -165445, -46859, -160497, -217678, 8227, 179480, 105340, 107654, 254754, 143964, -242681, -383937, -151946, 22932, 16209, 117912, 285117, 185357, -73675, -113086, -20206, -115862, -251023, -103147, 147550, 171149, 106118, 172204, 150661, -133004, -335959, -184675, 32568, 38653, 31044, 161520, 195939, 34871, -65355, -26295, -84910, -231983, -167860, 91959, 206146, 123012, 90296, 104557, -34520, -219160, -182683, -17109, 18375, -6946, 93460, 189947, 99112, -34627]
276c4627o434j5133j18581r622K05478J64551n0045q4929J0665l7460j34578m6079
288a56794R2039N4655j3191O9630J16954k7194j38562n6280J2532n5148m7917
299a49276J06294J54002J3936o8091r128n294q9104p1751L8580N3184m442L7314
311F224J08920L0035j06937r1816L798k693m3533K5210J04423N5448k4407j5369
323D9303m03n5821p2975m5M3130R135J2198P3088N8174m4818q5545k9247M052
336c9774j8593l639N1750N1082O336Q36J0373l2186p1155k8799L0045K2624R65
349b0135L1440N5318Q884m7905m3772j4598j1001o927J9592L3320J8405J3092
361C5713J8934p439n0902m6567J73K2140Q587J1640L1275K5991l821k3112k5941
$$ y = [-34627, -41061, -56194, -174775, -184397, 21081, 185632, 135587, 50658, 61323, 23863, -110715, -156794, -64755, -10100, -23291, 46339, 163293, 136099, -2463, -58743, -46211, -101359, -149276, -42982, 111020, 124956, 56865, 47737, 42443, -46661, -118412, -79832, -26648, -31090, 6224, 115144, 145179, 38242, -53574, -49776, -52469, -96002, -70792, 33631, 89079, 64672, 49303, 48900, -6921, -79896, -79941, -36811, -27676, -15478, 57610, 115784, 70966, -14579, -43826, -39774, -58367, -62006, -10256, 40826, 47162, 47998, 58371, 26185, -44970, -73769, -43724, -21100, -20135, 11305, 66623, 75507, 27602, -16170, -30768, -41769, -48696, -29104, 4216, 22621, 35713, 54647, 47208, -3694, -50261, -50088, -27948, -19361, -7721, 23554, 49545, 45724, 22612, -3329]
374c329k6564j6986P483K3939J9524J4137J9376J3164j8789m2891l0112p56J2843
387b8961J1924J6050K2674J9573M691j7329l5370l2580q007J3718J9719J8111
399D213J9469J8628N215k0611l7233l1048p516J3391K0947K2341K2522J6692N08
412D7518k3439l9294l1952o053J6790K5882K4595K1256J4898j124k6789m4782
424b2494l3637k917K3963L1431K7407J9633J0264p420l2347m5084l1368J407K7192
437c3970L5332L2379K1862K067j9165l6621m2456k9173N008L7148M4239K8586
449D5236J1848K74j9866m6560m9414j8186J8605L7954M4723L7606Q221k2238l2595
462A5608l3845m1213k5809K3588O0246M7584J6938M101j1783m5909o0353k9017
$$ y = [-3329, -29893, -46879, -39396, -15457, 4067, 18204, 37580, 50744, 31955, -10936, -41048, -41804, -28961, -17037, -987, 21687, 41260, 45951, 28622, -6748, -39328, -47335, -33617, -13898, 4213, 23682, 42310, 47525, 26914, -10319, -41367, -48883, -35492, -14545, 7796, 30318, 47010, 47518, 24079, -15215, -47167, -53220, -36430, -10548, 14047, 35303, 50201, 49077, 22288, -22494, -56131, -59048, -35085, -3654, 23753, 43386, 53650, 46230, 13883, -31201, -62569, -61162, -33970, 1362, 33741, 55603, 57670, 38505, 1884, -40572, -69745, -64737, -27589, 16650, 45236, 57084, 57358, 37492, -9068, -58482, -76668, -58063, -20109, 24614, 62220, 70441, 48203, 15608, -18237, -59450, -85259, -61671, -1425, 46159, 63097, 67198, 55415, 9506, -50847, -79864]
474g9864J0006K7123M2379N6850L2821k2771m4622k8530l2506m7078p404O1683
486c1913P2246K9608M435l490m1632p2341l9428J1433J9024K1607N9981O7840
498I7370m71n8687m1741k3131m9383l6740M9220R2322M3636R91O503k2652q1891
511b4654o4348J2317K8221l59L7394R5550M4637n8696p0042k5343l9117n4249
523a18689K7588J06304N9614j1448O614J4301o7405j01708j2565M5936L63O140
535d4955R9594R5587m0655j03322l8831j7538n8586m783J05951Q3741k0483j1028
$$ y = [-79864, -69858, -42735, -356, 56494, 89315, 66544, 21922, -6608, -39114, -86192, -93596, -31913, 40333, 69941, 74376, 70886, 29254, -43087, -82515, -71082, -52058, -30451, 29530, 97370, 96899, 38212, -3529, -26660, -76043, -112783, -63563, 28759, 72395, 73386, 79889, 57237, -24654, -89002, -76685, -48464, -48823, -11429, 84121, 128758, 70062, 20, -25323, -64440, -118689, -91101, 15203, 74817, 63369, 69983, 84284, 16879, -84829, -97394, -51458, -51095, -44955, 54639, 150226, 109571, 6249, -32582, -50120, -108706, -113489, -7538, 76203, 55720, 44692]
$$ [...]
8191B63
##END NTUPLES=NMR FID
##END=
