##TITLE=1H_EC-3230
 DMSO, 8 sc, 
 23.3.2020
##JCAMPDX= 6.0         $$ Bruker NMR JCAMP-DX V2.0
##DATA TYPE= NMR FID
##DATA CLASS= NTUPLES
##ORIGIN= UXNMR, Bruker Analytische Messtechnik GmbH
##OWNER= root
$$ XWIN-NMR		Version 3.5
$$ Mon Mar 23 13:51:04 2020 Russian Standard Time (UT+4h)  she@DPX200
##.OBSERVE FREQUENCY= 200.1315
##.OBSERVE NUCLEUS= ^1H
##.DELAY= (6, 6)
##.ACQUISITION MODE= SIMULTANEOUS
##.ACQUISITION SCHEME= undefined
##.AVERAGES= 8
##.DIGITISER RES= 18
##SPECTROMETER/DATA SYSTEM= spect
##.PULSE SEQUENCE= zg30
##.SOLVENT NAME= D2O
##.SHIFT REFERENCE= (INTERNAL, D2O, 0, 15.7039)
##AUDIT TRAIL= $$ (NUMBER, WHEN, WHO, WHERE, WHAT)
$$ ##TITLE= Audit trail, XWIN-NMR		Version 3.5
$$ ##JCAMPDX= 5.01
$$ ##ORIGIN= Bruker BioSpin GmbH
$$ ##OWNER= she
$$ F:/spectra/data/she/nmr/H-F/1/audita.txt
$$ ##AUDIT TRAIL=  $$ (NUMBER, WHEN, WHO, WHERE, WHAT)
(   1,<2020-03-23 13:49:52.68 +0400>,<she>,<DPX200>,
      <created by zg, POWCHK disabled, PULCHK disabled
       configuration hash MD5:
       00 E9 B6 7A A2 85 ED C7 34 08 36 98 17 FE 4E 26
       data hash MD5: 16K
       54 7B D0 F9 74 DF 74 56 39 54 B9 AC A6 D6 CE AA>)
$$ ##END=
$$ 
$$ hash MD5
$$ 5B A4 A7 39 1E 51 8F FC 7F 01 C0 8A 31 74 C4 0F
##$RELAX= 
##$RELAX= 
##$RELAX= 
##$RELAX= 
##$RELAX= 
##$RELAX= 
$$ Bruker specific parameters
$$ --------------------------
##$DU= <F:/spectra>
##$EXPNO= 1
##$NAME= <H-F>
##$PROCNO= 1
##$TYPE= <nmr>
##$USER= <she>
##$AMP= (0..31)
100 100 100 100 100 100 100 100 100 100 100 100 100 100 100 100 100 100 
100 100 100 100 100 100 100 100 100 100 100 100 100 100 
##$AQSEQ= 0
##$AQ_mod= 1
##$AUNM= <au_zg>
##$AUTOPOS= <>
##$BF1= 200.13
##$BF2= 200.13
##$BF3= 200.13
##$BF4= 200.13
##$BF5= 200.13
##$BF6= 200.13
##$BF7= 200.13
##$BF8= 200.13
##$BYTORDA= 1
##$CFDGTYP= 0
##$CFRGTYP= 5
##$CHEMSTR= <none>
##$CNST= (0..31)
1 1 145 1 1 1 1 1 1 1 1 1 1 1 1 1 1 1 1 1 1 1 1 1 1 1 1 1 1 1 1 1 
##$CPDPRG= <>
##$CPDPRG1= <>
##$CPDPRG2= <>
##$CPDPRG3= <>
##$CPDPRG4= <mlev>
##$CPDPRG5= <mlev>
##$CPDPRG6= <mlev>
##$CPDPRG7= <mlev>
##$CPDPRG8= <mlev>
##$CPDPRGB= <>
##$CPDPRGT= <>
##$D= (0..31)
0 1.2 0 0 0 0 0 0 0 0.06 0 0.03 0 0 0 0 0.0002 0 0 0 0 0 0 0 0 0 0 0 0 
0 0 0 
##$DATE= 1584956992
##$DBL= (0..7)
120 120 120 120 120 120 120 120 
##$DBP= (0..7)
150 150 150 150 150 150 150 150 
##$DBP07= 0
##$DBPNAM0= <>
##$DBPNAM1= <>
##$DBPNAM2= <>
##$DBPNAM3= <>
##$DBPNAM4= <>
##$DBPNAM5= <>
##$DBPNAM6= <>
##$DBPNAM7= <>
##$DBPOAL= (0..7)
0.5 0.5 0.5 0.5 0.5 0.5 0.5 0.5 
##$DBPOFFS= (0..7)
0 0 0 0 0 0 0 0 
##$DE= 6
##$DECBNUC= <off>
##$DECIM= 24
##$DECNUC= <off>
##$DECSTAT= 4
##$DIGMOD= 1
##$DIGTYP= 9
##$DL= (0..7)
0 120 120 120 120 120 120 120 
##$DP= (0..7)
150 150 150 150 150 150 150 150 
##$DP07= 0
##$DPNAME0= <>
##$DPNAME1= <>
##$DPNAME2= <>
##$DPNAME3= <>
##$DPNAME4= <>
##$DPNAME5= <>
##$DPNAME6= <>
##$DPNAME7= <>
##$DPOAL= (0..7)
0.5 0.5 0.5 0.5 0.5 0.5 0.5 0.5 
##$DPOFFS= (0..7)
0 0 0 0 0 0 0 0 
##$DQDMODE= 0
##$DR= 18
##$DS= 0
##$DSLIST= <SSSSSSSSSSSSSSS>
##$DSPFIRM= 0
$$ [...]
##$SUBNAM2= <"">
##$SUBNAM3= <"">
##$SUBNAM4= <"">
##$SUBNAM5= <"">
##$SUBNAM6= <"">
##$SUBNAM7= <"">
##$SUBNAM8= <"">
##$SUBNAM9= <"">
##$SW= 24.9337058887773
##$SWIBOX= (0..15)
0 0 2 0 0 0 0 0 0 0 0 0 0 0 0 0 
##$SW_h= 4990.01996007984
##$TD= 16384
##$TD0= 1
##$TE= 0
##$TE2= 300
##$TE3= 300
##$TEG= 300
##$TL= (0..7)
0 120 120 120 120 120 120 120 
##$TP= (0..7)
150 150 150 150 150 150 150 150 
##$TP07= 0
##$TPNAME0= <>
##$TPNAME1= <>
##$TPNAME2= <>
##$TPNAME3= <>
##$TPNAME4= <>
##$TPNAME5= <>
##$TPNAME6= <>
##$TPNAME7= <>
##$TPOAL= (0..7)
0.5 0.5 0.5 0.5 0.5 0.5 0.5 0.5 
##$TPOFFS= (0..7)
0 0 0 0 0 0 0 0 
##$TUNHIN= 0
##$TUNHOUT= 0
##$TUNXOUT= 0
##$USERA1= <user>
##$USERA2= <user>
##$USERA3= <user>
##$USERA4= <user>
##$USERA5= <user>
##$V9= 5
##$VALIST= <valist>
##$VCLIST= <CCCCCCCCCCCCCCC>
##$VD= 0
##$VDLIST= <DDDDDDDDDDDDDDD>
##$VPLIST= <PPPPPPPPPPPPPPP>
##$VTLIST= <TTTTTTTTTTTTTTT>
##$WBST= 1024
##$WBSW= 4
##$XGAIN= (0..3)
0 0 0 0 
##$XL= 0
##$YL= 0
##$YMAX_a= 215689
##$YMIN_a= -120106
##$ZGOPTNS= <>
##$ZL1= 120
##$ZL2= 120
##$ZL3= 120
##$ZL4= 120
##$ABSF1= 10
##$ABSF2= 0
##$ABSG= 5
##$ABSL= 3
##$ALPHA= 0
##$AQORDER= 0
##$ASSFAC= 0
##$ASSFACI= 0
##$ASSFACX= 0
##$ASSWID= 0
##$AUNMP= <proc_1d>
##$AZFE= 0.1
##$AZFW= 0.1
##$BCFW= 1
##$BC_mod= 2
##$BYTORDP= 1
##$COROFFS= 0
##$CY= 11.3945322036743
##$DATMOD= 1
##$DC= 2
##$DFILT= <>
##$DTYPP= 0
##$F1P= 16.9975609425685
##$F2P= -3.02152046262296
##$FCOR= 0.5
##$FTSIZE= 0
##$FT_mod= 4
##$GAMMA= 1
##$GB= 0.15
##$INTBC= 1
##$INTSCL= 1
##$ISEN= 128
##$LB= 0.24
##$LEV0= 0
##$LPBIN= 0
##$MAXI= 10000
##$MC2= 0
##$MEAN= 0
##$ME_mod= 0
##$MI= 1.114404
##$NCOEF= 0
##$NC_proc= 0
##$NLEV= 6
##$NOISF1= 3.799351
##$NOISF2= 2.8
##$NSP= 1
##$NTH_PI= 0
##$NZP= 0
##$OFFSET= 15.70392
##$PC= 1
##$PHC0= -9789.708
##$PHC1= 14.00082
##$PH_mod= 1
##$PKNL= yes
##$PPARMOD= 0
##$PSCAL= 0
##$PSIGN= 0
##$REVERSE= no
##$SF= 200.130013532006
##$SI= 16384
##$SIGF1= 3
##$SIGF2= 2
##$SINO= 400
##$SIOLD= 16384
##$SREGLST= <1H.CDCl3>
##$SSB= 0
##$STSI= 0
##$STSR= 0
##$SW_p= 3612.71676300578
##$SYMM= 0
##$S_DEV= 0
##$TDeff= 0
##$TDoff= 0
##$TI= <>
##$TILT= no
##$TM1= 0
##$TM2= 0
##$TOPLEV= 0
##$USERP1= <user>
##$USERP2= <user>
##$USERP3= <user>
##$USERP4= <user>
##$USERP5= <user>
##$WDW= 1
##$XDIM= 8192
##$YMAX_p= 0
##$YMIN_p= 0
$$ End of Bruker specific parameters
$$ ---------------------------------
##NTUPLES= NMR FID
##VAR_NAME=  TIME,          FID/REAL,        FID/IMAG
##SYMBOL=    X,             R,               I
##VAR_TYPE=  INDEPENDENT,   DEPENDENT,       DEPENDENT
##VAR_FORM=  AFFN,          ASDF,            ASDF
##VAR_DIM=   8192,          8192,            8192
##UNITS=     SECONDS,       ARBITRARY UNITS, ARBITRARY UNITS
##FACTOR=    0.0002004,     1,               1
##FIRST=     0,             0,               0
##LAST=      1.6414764,     0,               0
##MIN=       0,             -120106,         0
##MAX=       1.6414764,     215689,          0
$$ Real data points
##PAGE= N=1
##DATA TABLE= (X++(R..R)), XYDATA
$$ [...]
$$ plain form
1891 252 -298 -312 -173 854 648 63 -431 -411 622 625 50 -440 -844 167 690 278 -608 -629 -146 457 640
1912 640 52 -747 -445 501 803 -36 -702 -799 314 807 409 -464 -396 -134 537 721 50 -961 -317 710
1932 710 435 59 -748 -546 19 730 253 -499 -637 -36 352 438 10 -844 -522 210 796 -148 -312 -443
1952 -443 318 391 764 -420 -503 -175 760 615 -320 -531 -144 358 787 2 -809 -769 115 606 10 -352 -706
1973 -706 -269 344 363 -118 -322 -308 198 673 349 -464 -559 519 736 480 50 -513 -143 529 429 -234 -607
1994 -607 -569 375 375 210 -499 -565 -115 356 166 -653 -746 68 384 546 -156 -624 -297 424 700 275 -616 -220
2016 -220 148 583 254 -345 -789 -270 409 665 281 -589 -476 290 703 4 -545 -512 150 292 656 -179
2036 -179 -624 -43 703 457 -170 -334 -492 513 819 51 -701 -452 59 620 216 -520 -679 -95 391 256
$$ packed form
1891B52n50j4J39J027k06n85m94K0J033Ln75m90m04J011N23m12q86k1M83O03J83
1912F40n88p99L02R46L02q39o66r7J113M93l98q73O8K62O71J84o71j011O44J027
1932G10k75l76q07K02N65P11m77p52j38O01L88Q6m28q54L22P32N86r44j64j31
1952d43P61P3L73j184q3L28R35j45r35k11L87N02M29p85q11M0Q84M91n96l62l54
1973g06M37O13J9m81k04J4N06M75l24q13r5J078K17k56m30n63L70O72j00o63l73
1994f07L8R44%j65p09o6M50M71j90q19r3Q14L16J62p02m68L27P21K76m25q91L96
2016b20L68M35l29n99m44N19O79K56l84q70J13P66M13o99n49L3O62J42L64q35
2036a79m45N81P46k46o27j64j58J005L06p68p52K49N11N61m04p36j59N84M86j35
$$ plain form
2056 256 32 -744 -426 184 605 104 -86 -396 73 392 162 -162 -350 -182 121 452 136 -343 -563 340
2076 340 404 137 -695 -519 78 482 575 -181 -727 -328 408 545 -76 -492 -209 92 642 74 -513 -404 246
2097 246 770 62 110 -558 -104 281 394 405 -272 -330 322 799 237 -155 -459 183 448 174 -317 -527 -286
2118 -286 313 532 -58 -313 -484 243 906 208 -527 -317 88 428 411 43 -279 -431 135 703 8 -351
2138 -351 -258 182 420 -60 -225 -518 199 536 131 49 -281 -70 149 447 145 -554 -311 -61 460 410 -418
2159 -418 -458 -119 587 395 -91 -87 -264 226 322 115 -367 -297 263 432 189 -230 -531 -70 310 553 -170 -34
2181 -34 46 282 360 303 -253 -357 198 599 484 -330 -372 -67 280 213 125 -234 -169 279 191 -58 -429 -399 70
2204 70 478 -148 -271 -248 111 176 470 61 -539 -334 282 293 124 -141 -107 204 181 355 45 -370 -188 240
$$ packed form
2056B56k24p76L18O10M21n01j90l10M69L19k30l24j88J68L03L31l16m79k20R03
2076C40O4k67q32J76N97M04R3p56n46L99P36J37o21m16K83L01N50n68n87J09O50
2097B46N24p08M8o68M54L85J13J1o77n8O52M77n62l92l04O42K65k74m91k10K41
2118b86N99K19n90k55j71P27O63o98p35K10M05L40j7l68l22j52N66N68o95l59
2138c51R3M40K38m80j65k93P17L37m05q2l30K11K19K98l02o99K43K50N21n0q28
2159d18m0L39P06j92m86Mj77M90R6k07m82P0N60J69k43m19l01M61L80K43p23J36
2181c4Q0K36P8n7n56j04N55M01j15q14m2L05L47o7q8l59O5M48q8k49l71L0M69
2204G0M08o26j23K3L59O5K94m09o00K05O16J1j69k65L4L11k3J74l10m15J82M28
$$ plain form
2226 240 515 -274 -328 -260 206 178 199 -260 -174 137 145 318 -35 -136 -78 386 460 -163 -136 -300 -43 722 319
2249 319 -54 -163 -119 224 68 -102 -345 78 136 157 29 -408 -80 187 466 295 -402 -775 396 274 107
2270 107 -378 -392 24 222 337 -76 -294 -52 491 340 -70 -291 -236 96 299 171 -311 -530 21 262 160
2291 160 -95 43 -38 181 191 -135 -146 -62 178 301 19 60 -383 -111 36 312 -127 -105 -403 101 -77 296
2313 296 -205 -169 -305 82 121 187 -435 -187 210 169 261 -409 69 186 186 308 -192 -525 -104 201 369 8
2335 8 -89 -80 194 303 147 -463 -118 -149 302 291 -267 -457 282 121 431 -458 -330 -261 33 237 -73 -46 -152
2358 -152 473 280 -291 -297 -241 -219 177 -14 -220 -299 -100 134 84 -269 -437 -227 95 -56 55 -224 64 -131
2380 -131 29 406 -178 -519 -211 6 3 -138 -67 -209 198 644 270 -121 39 -90 120 387 180 -316 -166
$$ packed form
2226B40K75p89n4O8M66k8K1m59Q6L11QJ73l53j01N8M64P4o23K7j64K57P65m03
2249C19l73j09M4L43j56j70k43M23N8K1j28m37L28K67K79j71o97l73J171j22j67
2270A07m85j4M16J98J15m13k18K42N43j51m10k21N5L32K03j28m82k19N51K41j02
2291A60k55J38q1K19J0l26j1Q4K40J23k82M1m43K72J47K76m39K2k98N04j78L73
2313B96n01L6j36L87L9O6o22K48L97m1R2o70M78J17%J22n00l33M21L05J68l61
2335Hr7RK74J09j56o10L45l1M51j1n58j90P39j61L10q89J28O9K94K04l10K7j06
2358a52O25j93n71oN6K2L96j91k06p9J99K34n0l53j68K10L22j51J11k79K88j95
2380a31J60L77n84l41L08K17lj41P1j42M07M46l74l91J60j29K10K67k07m96J50
$$ plain form
2401 -166 357 212 52 -210 -261 -126 442 122 -174 -253 -210 392 179 -309 -448 -222 311 557 -91 -280 -86
2422 -86 354 151 -152 -279 -497 -189 205 56 -182 -233 -529 88 120 4 -243 -179 58 390 158 -458 -467 176
2444 176 470 71 -261 41 -160 123 1 397 -211 -425 150 383 63 -393 -211 -48 -60 115 -107 -351
2464 -351 -342 175 287 63 -158 -252 96 371 372 -83 -119 -240 18 71 1 -111 -145 399 428 9 -171 -336 165
2487 165 279 177 -202 -107 -167 112 219 234 -132 -279 282 372 107 -176 -108 175 264 330 -224 -222 -143 83 459
2510 459 252 -472 -275 270 280 -72 -356 -214 279 266 268 -110 -295 -210 148 176 -272 -352 -107 169 -168 -21
2532 -21 -405 -25 -99 74 -99 52 -1 -16 205 -47 -159 -108 108 8 45 -74 -316 -102 -105 132 114 -305 27
2555 27 -23 118 53 295 -41 -59 -42 -216 92 349 -144 -74 415 107 97 -152 -118 124 464 145 -120 -572 357
$$ packed form
2401a66N23j45j60k62n1J35N68l20k96p9M3O02k13m88j39K26N33K46o48j89J94
2422h6M40k03l03j27k18L08L94j49k38n1k96O17L2j16k47O4K37L32k32o16rO43
2444A76K94l99l32L02k01K83j22L96o08k14N75K33l20m56J82J63j2J75k22k44
2464c51RN17J12k24k21r4L48K75Jm55l6j21K58N3p0j12l4N44K9m19j80j65N01
2487A65J14j02l79R5o0K79J07J5l66j47N61R0k65k83O8K83Q9O6n54KP9K26L76
2510D59k07p24J97N45J0l52k84J42M93j3Kl78j85Q5L58K8m48q0K45K76l37J47
2532b1l84L80p4J73j73J51n3j5K21k52j12N1K16j00L7j19k42K14lK37j8m19L32
2555B7n0J41o5K42l36j8J7j74L08K57m93P0M89l08j0k49L4K42L40l19k65m52R29
$$ plain form
2578 357 245 500 0 -345 143 84 223 -38 -463 365 411 284 -173 181 59 -26 490 62 -240 -278 74
2599 74 161 146 22 -503 14 2 219 -198 -336 -1 151 23 13 -103 -209 39 282 -69 -285 80 201 -72
2621 -72 277 235 -84 -8 -113 228 281 -6 -167 -120 -5 211 -62 -184 6 58 185 -325 -244 -109 -86 187 491
2644 491 -3 -386 -170 377 271 -120 169 -136 240 252 143 -92 45 104 390 34 -14 21 -250 334 216
2665 216 -186 -152 -158 256 376 77 -349 -72 289 264 398 -158 110 83 -62 -389 16 -104 80 363 452 -90
2687 -90 -215 -331 -127 165 -86 -449 -255 204 -95 127 -352 -103 -87 70 387 406 72 -15 185 370 -11
2708 -11 -50 185 2 326 224 -317 -118 224 114 481 402 -203 18 -166 202 61 115 16 -241 181 11 124
2730 124 -141 -403 -139 81 57 -14 -61 -101 314 98 148 -161 -179 240 -105 74 50 -247 197 8 -61 -167 33
$$ packed form
2578C57j12K55n00l45M88n9J39k61m25Q28M6j27m57L54j22q5N16m28l02l8L52
2599G4Q7j5j24n25N17j2K17m17j38L35J52j28j0j16j06K48K43l51k16L65J21k73
2621g2L49m2l19P6j05L41N3k87j61M7J15K16k73j22J90N2J27n10Q1J35K3K73L04
2644D91m94l83K16N47j06l91K89l05L76J2j09k35J37N9K86l56m8L5k71N84j18
2665B16m02L4oM14J20k99m26K77L61k5J34n56K68k7j45l27M05j20J84K83Q9n42
2687i0j25j16K04K92k51l63J94M59k99K22m79K49J6J57L17J9l34q7K00J85l81
2708a1l9K35j83L24j02n41J99L42j10L67p9o05K21j84L68j41N4r9k57M22j70J13
2730A24k65k62K64K20k4p1m7m0M15k16N0l09j8M19l45J79k4k97M44j89o9j06K00
$$ plain form
2753 33 164 90 173 -8 -256 23 -106 130 109 -392 99 293 159 -27 -200 -269 136 -90 245 42 -45 -58
2775 -58 80 227 -216 -23 -107 201 -82 120 -189 -54 168 19 154 -180 -418 245 245 407 -170 -81 -146 -232
2797 -232 130 -116 -82 -18 -123 85 254 41 88 -117 213 -221 119 -24 -86 -30 329 77 -144 10 -149 374
2819 374 -27 26 -182 180 172 290 93 -69 -55 81 38 115 -80 -38 21 188 200 -207 -88 0 -256 -140 83
2842 83 -13 41 94 159 166 -47 -160 -32 301 404 105 -3 -21 153 110 -12 -324 -307 -100 125 142 -129 123 345
2866 345 338 127 -28 38 47 115 37 -162 -7 -181 25 -161 48 227 -20 202 -23 150 132 94 -130 74 120
2889 120 157 -369 -150 -23 94 10 -394 -208 -228 280 106 -85 -175 4 109 254 -101 -284 -22 -127 91
2910 91 101 68 -214 -159 79 -49 24 16 -257 -34 70 97 321 -213 -55 194 -29 100 69 120 438 203 97
$$ packed form
2753C3J31p4Q3j81k48K79j29K36k1n01M91J94j34j86j73o9M05k26L35k03q7j3
2775e8J38J47m43J93q4L08k83K02l09J35K22j49J35l34k38O63%J62n77Q9o5q6
2797b32L62k46L4O4j05K08J69k13M7k05L30m34L40j43o2N6L59k52k21J54j59N23
2819C74m01N3k08L62qJ18j97j62J4J36m3P7j95M2N9J67J2m07J19Q8k56J16K23
2842H3r6N4N3O5Pk13j13J28L33J03k99j08j8J74m3j22l12J7K07K25J7k71K52K22
2866C45pk11j55O6RO8p8j99J55j74K06j86K09J79k47K22k25J73j8l8k24K04M6
2889A20L7n26K19J27J17q4m04J86k0N08j74j91r0J79J05J45l55j83K62j05K18
2910I1J0l3k82N5K38j28P3qk73K23J04K7K24n34J58K49k23J29l1N1L18k35j06
$$ plain form
2933 97 -168 -230 123 -58 -156 -177 -42 173 43 61 -53 29 -116 187 215 -212 -271 -16 287 -106 140 287 -181
2956 -181 66 131 -127 -171 -246 -162 40 -99 -111 -126 28 46 43 236 231 6 -8 16 35 -185 -112 61 27 7 60 -85
2982 -85 -130 -331 -197 123 -290 -70 31 4 415 24 -154 67 146 180 206 -37 -77 -10 138 -141 -290 -48 -188
3005 -188 104 66 145 -251 183 138 226 77 -333 92 300 120 166 49 -35 -23 273 -196 79 51 97 180 329
3028 329 -33 0 94 -71 118 230 -240 -522 59 152 -131 202 1 168 297 280 -116 -137 -160 -163 88 55 195
3051 195 12 -34 -86 203 -161 -88 9 -29 85 -83 -63 -181 -203 -62 15 -73 124 -261 -118 49 -91 -115 -216
3074 -216 -110 222 -100 -205 132 167 31 79 -14 -335 -227 66 253 117 -136 -146 -321 175 201 -71 -317 155
3096 155 -163 51 62 -279 -99 0 336 -39 -34 3 110 252 40 -103 -143 -195 -339 -74 40 -132 -8 -197
$$ packed form
2933I7k65o2L53j81r8k1J35K15j30J8j14Q2j45L03K8m27n9K55L03l93K46J47m68
2956a81K47O5k58m4p5Q4K02j39j2j5J54J8lJ93nk25j4K4J9k20P3J73l4k0N3j45
2982h5m5k01J34L20m13K20J01k7M11l91j78K21P9L4K6k43m0O7J48k79j49K42j40
3005a88K92l8P9l96M34m5Q8j49m10M25K08j80M6j17q4J2K96m69K75k8M6Q3J49
3028C29l62L3R4j65J89J12m70k82N81R3k83L33k01J67J29j7l96k1k3lK51l3J40
3051A95j83m6n2K89l64P3R7l8J14j68K0j18k2J41P7q8J97l85J43J67j40k4j01
3074b16J06L32l22j05L37L5j36M8r3l21J08K93J87j36k53j0j75M96K6k72k46M72
3096A55l18K14J1l41J80R9L36l75NL7J07J42k12j43m0n2j44K65J14j72J24j89
$$ plain form
3118 -197 -276 -130 69 209 373 189 -57 -30 -31 101 -111 -213 214 113 189 27 163 69 -137 -120 15 -262
3140 -262 -156 -349 -107 25 -123 -29 182 84 84 -102 -37 -198 117 5 -268 88 100 82 -184 -52 103 39 87
3163 87 -354 231 201 -83 -41 -51 -96 58 69 -282 15 -148 -168 6 -204 -220 49 -59 63 319 -112 9 181
3186 181 -178 -164 13 -288 -57 26 131 291 1 -78 35 -101 -76 234 118 228 -182 110 -66 -124 -269 -93
3208 -93 -35 205 -153 104 257 -24 68 -137 -26 -206 109 96 163 -125 -185 -116 188 99 -233 148 54 29 -179
3231 -179 184 110 -109 53 61 264 160 -83 29 184 43 -154 -77 -187 -85 -14 -42 66 -17 24 -239 -151 -242
3254 -242 77 -240 134 192 -208 94 254 1 -140 -251 6 -177 222 169 -2 -77 -230 21 316 -7 -164
3275 -164 -195 -30 242 41 5 -122 57 30 54 -60 -268 -186 -22 43 126 -114 236 41 223 -132 -212 26 -206
$$ packed form
3118a97p9J46J99J40J64j84k46K7jJ32k12j02M27j01P6j62J36r4k06J7J35k77
3140b62J06j93K42J32j48R4K11r8%j86O5j61L15j12k73L56J2j8k66J32J55o4M8
3163H7m41N85l0k84M2j0m5J54J1l51K97j63k0J74k10j6K69j08J22K56m31J21J72
3186A81l59J4J77l01K31Q3J05J60k90p9J13j36K5L10j16J10m10K92j76n8j45J76
3208i3N8K40l58K57J53k81R2k05J11j80L15j3O7k88o0O9L04q9l32L81r4k5k08
3231a79L63p4k19J62QK03j04k43J12J55j41j97P7j10J02P1k8J08q3M1k63Q8r1
3254b42L19l17L74N8m00L02J60k53j41j11K57j83L99n3j71p5j53K51K95l23j57
3275a64l1J65K72k01l6j27J79k7K4j14k08Q2J64O5Q3k40L50j95J82l55q0K38k32
$$ plain form
3298 -206 -58 -208 -65 248 -62 -245 -12 18 20 -129 -327 341 15 206 177 -316 -73 73 -76 -166 473 173
3320 173 -364 -135 29 186 -299 -7 26 59 34 -191 173 110 213 -192 260 55 158 92 -231 0 -187 136
3342 136 -443 -184 109 -313 -30 -58 42 18 -301 -60 10 21 -33 -24 305 -80 -102 -15 -509 -138 2 111 171
3365 171 -46 -201 329 160 47 -123 -348 12 -93 51 -73 131 17 -37 110 96 -102 -93 -109 -88 142 -28
3387 -28 -192 -197 237 -188 75 -254 -122 166 153 267 -295 394 -45 90 -52 239 40 299 -18 225 329
3408 329 74 142 169 -222 -215 16 52 -103 -157 -87 85 -318 -51 -78 -100 -170 -207 -43 303 -176 -34 191 -111 -74
3432 -74 188 33 301 -53 -145 36 214 -107 -76 -180 206 -142 96 -72 139 91 -165 42 -209 73 123 105
3454 105 204 67 -186 -126 110 -165 404 197 302 19 225 154 205 12 -159 242 -117 -251 -28 -67 -126 -6
$$ packed form
3298b06J48j50J43L13l10j83K33L0Kj49j98O68l26J91k9m93K43J46j49r0O39l00
3320A73n37K29J64J57m85K92L3L3k5k25L64o3J03m05M52k05J03o6l23K31j87L23
3342A36n79K59K93m22K83k8J00k4l19K41P0J1n4RL29l85k2Q7m94L71J40J09O0
3365A71k17j55N30j69j13j70k25L60j05J44j24K04j14n4J47j4j98Rj6K1K30j70
3387b8j64nM34m25K63l29J32K88j3J14n62O89m39J35j42K91j99K59l17K43J04
3408C29k55O8K7l91PK31L6j55n4P0J72m03K67k7k2p0l7J64L46m79J42K25l02L7
3432g4K62j55K68l54r2J81J78l21L1j04L86l48K38j68K11m8k56K07k51K82N0j8
3454A05R9j37k53O0K36k75N69k07J05k83K06p1N1j93j71M01l59j34K23l9n9J20
$$ plain form
3476 -6 -82 98 -48 35 -24 247 -41 87 44 204 -101 -121 235 -150 91 -36 -208 317 130 40 310 -48 74
3499 74 -23 -346 122 77 -88 -203 -20 -138 -36 145 -48 222 -230 -40 65 98 24 -83 239 -184 202 105
3521 105 93 -88 -71 -147 -131 94 18 15 -18 -82 -115 -513 -289 99 24 115 107 239 -342 -106 -70 157 -65 -124 -29 -129
3547 -129 -59 -204 -155 -68 58 -178 -179 19 0 -144 -59 221 -256 -84 -228 -50 -81 123 152 196 244 58 386 -75
3571 -75 63 49 -55 -363 -46 40 173 71 -181 -80 -216 -14 78 161 26 10 -208 -39 -180 124 -55 -219
3593 -219 -245 354 -59 -136 71 96 167 -417 -34 273 -45 -284 -92 -68 76 150 11 -6 -179 -107 296 21 340
3616 340 105 149 32 -317 -62 -7 9 -283 -94 83 213 -133 152 27 -197 -34 -24 60 -98 -22 114 121 87
3639 87 116 33 107 -40 164 -117 103 160 -121 -288 11 -274 178 -115 107 63 -63 184 168 144 96 156 -142
$$ packed form
3476fp6J80j46Q3n9K71k88J28m3J60l05k0L56l85K41j27j72N25j87r0K70l58J22
3499G4r7l23M68m5j65j15J83j18J02J81j93K70m52J90J05L3p4j07L22m23L86r7
3521A05j2j81J7p6J6K25p6ll3o4l3l98K24L88p5R1qJ32n81K36L6K27k22n9R5j00
3547a29P0j45M9Q7J26k36jJ98j9j44Q5K80m77J72j44J78l1K04K9M4M8j86L28m61
3571g5J38j4j04l08L17Q6J33j02k52J01j36K02R2Q3j35j6k18J69j41L04j79j64
3593b19k6N99m13p7K07K5P1n84L83L07l18k39J92K4J44P4j39j7j73P2M03k75L19
3616C40k35M4j17l49K55N5J6k92J89J77J30l46K85j25k24J63J0Q4j58P6J36Pl4
3639H7K9q3P4j47K04k81K20N7k81j67K99k85M52k93K22m4j26K47j6k4m8O0k98
$$ plain form
3662 -142 -37 118 -107 168 221 224 45 -76 -154 92 -331 -195 139 -107 -13 299 82 -177 46 125 -347 189
3684 189 200 -18 107 -171 -206 -105 4 -226 -186 -56 503 -13 48 47 -45 -315 203 46 39 -79 59 319 392
3707 392 -39 56 171 -241 -48 -46 -60 200 162 43 -216 43 186 -96 -93 -179 88 -118 -197 3 155 36 156
3730 156 -78 88 130 -127 -237 166 80 -95 -24 -118 -155 99 2 53 138 -18 -76 -305 -11 -62 -158 125 110 191
3754 191 239 89 -19 18 169 98 66 26 -103 -108 -80 -177 273 171 -167 84 157 -35 162 -111 -98 87 182 141
3778 141 -36 95 3 147 -121 85 -211 82 -137 57 -225 -16 -48 -167 197 46 221 65 47 224 -124
3799 -124 -140 62 -80 -317 -34 -312 367 -22 18 -22 -485 -146 11 173 -21 -44 103 -96 104 -39 -1 -181
3821 -181 67 -82 108 11 45 -21 90 60 167 207 8 -130 -211 -227 159 131 207 -17 30 -123 -225 -124 54
$$ packed form
3662a42J05J55k25K75N3Lj79j21p8K46m23J36L34k46R4L12k17k59K23P9m72N36
3684A89J1k18J25k78l5J01J09k30M0J30N59n16O1jr2k70N18j57pj18J38K60P3
3707C92m31R5J15m12J93Kj4K60l8j19k59K59J43k82Lq6K67k06p9K00J52j19J20
3730A56k34J66M2k57j10M03q6j75P1r4l7K54r7N1Q5j56n8k29K94n1r6K83j5Q1
3754A91M8j50j08L7J51p1l2m0j29nK8r7M50j02l38K51P3j92J97k73J3J85R5m1
3778A41j77J31r2J44k68K06k96K93k19J94k82K09l2j19L64j51J75j56j8J77l48
3799a24j6K02j42k37K83k78O79l89M0m0m63L39J57J62j94k3J47j99K00j43L8j80
3821a81K48j49J90r7L4o6J11l0J07M0j99j38q1j6L86k8P6k24M7j53j02J01J78
$$ plain form
3844 54 94 -231 74 -241 45 296 -66 -219 -96 69 111 -128 62 10 -196 -374 52 -98 -103 173 -10 -115
3866 -115 364 292 92 63 170 69 -477 -223 316 -272 -72 147 -195 68 -106 93 30 -151 -86 40 -304
3887 -304 -293 -187 166 78 105 130 130 -177 -208 -32 10 106 -117 -190 52 22 37 144 126 201 123 -8 181 27 -138
3912 -138 -69 171 191 -78 34 -154 -34 -222 4 20 126 -28 122 -149 -1 120 328 -47 212 3 16
3933 16 -8 -53 -213 -250 -21 117 -24 -84 -14 -276 -89 271 -29 6 41 312 -153 136 106 87 127 46 -117 -202
3957 -202 123 5 -16 141 244 44 101 323 -126 -83 153 -43 -150 -54 237 41 146 111 89 75 69 -59 -23
3980 -23 -29 -89 -131 32 95 -128 -233 28 22 119 -52 73 -257 -118 154 -50 -133 -117 105 -18 -16 -111 -89 -298 -132
4005 -132 -30 190 203 -220 298 116 -178 -23 -146 -91 258 247 -279 -52 46 -36 -28 -90 -66 38 -241 188 -286
$$ packed form
3844E4M0l25L05l15K86K51l62j53J23J65M2k39J90n2k06j78M26j50nK76j83j05
3866a15M79p2k00k9J07j01n46K54N39n88K00K19l42K63j74J99o3j81O5J26l44
3887c04J1J06L53q8K7K5%l07l1J76M2R6k23p3K42l0J5J07j8P5p8j31J89j54j65
3912a38O9K40K0k69J12j88J20j88K26J6J06j54J50k71J48J21K08l75K59k09J3
3933A6k4m5j60l7K29J38j41o0P0k62J87L60l00L5L5K71m65K89l0j9M0q1j63q5
3957b02L25j18k1J57J03k00N7K22m49M3K36j96j07R6K91j96J05l5k2j4oj28L6
3980b3oo0m2J63O3k23j05K61oR7j71J25l30J39K72k04q3J6K22j23Kr5K2k09J66
4005a32J02K20J3m23N18j82k94J55j23N5L49j1n26K27R8q2Qo2K4J04k79M29m74
$$ plain form
4028 -286 30 112 -263 108 99 -27 -69 195 58 39 -42 -54 292 -18 -68 264 -309 46 98 21 121 50 -27 139
4052 139 -51 -77 -65 -36 -131 29 107 -97 173 -137 208 -12 -221 -53 28 -298 -108 164 123 -127 313 -21
4074 -21 -4 40 -79 -112 -133 -38 -145 300 89 175 71 107 -184 -45 192 262 -52 20 -15 -89 -98 -192 -246 3 -68 -188
4100 -188 -25 317 24 -97 311 330 125 -326 85 13 -120 -219 -201 135 -327 -193 -141 -68 -90 -211 38 76 -72
4123 -72 125 34 191 52 136 -87 123 135 36 205 -221 -26 -80 -244 -12 -114 -55 277 73 -42 -198 221
4145 221 314 70 -124 81 4 -87 -12 128 -19 -133 -221 -123 119 65 155 232 12 146 -47 103 -3 -186 -87
4168 -87 -118 -95 -27 -19 -58 -134 -424 223 43 -162 97 49 118 20 -105 -117 -270 131 196 -80 82 64 -48 -167 18
4193 18 -128 2 235 -281 308 128 -31 -234 24 -65 0 1 -101 105 374 7 -72 -27 -246 395 -120 -231
$$ packed form
4028b86L16Q2l75L71rj26m2K64j37j9q1j2L46l10n0L32n73L55N2p7J00p1p7J66
4052A39j90k6J2K9r5J60P8k04K70l10L45k20k09J68Q1l26J90K72m1k50M40l34
4074b1J7M4j19l3k1R5j07M45k11Q6j04L6k91J39K37P0l14P2l5p4rr4n4K49p1j20
4100a88J63L42k93j21M08J9k05m51M11p2j33r9J8L36m62J34N2P3k2j21K49L8j48
4123g2J97r1J57j39Q4k23K10J2r9J69m26J95n4j64K32j02N9L32k04j15j56M19
4145B21R3k44j94K05p7r1P5J40j47j14q8R8K42n4R0P7k20J34j93J50j06j83R9
4168h7l1K3O8Ql9p6k90O47j80k05K59m8O9r8j25j2j53M01O5k76J62j8j12j19J85
4193A8j46J30K33n16N89j80j59k03K58q9O5Jj02K06K69l67p9M5k19O41n15j11
$$ plain form
4215 -231 39 26 35 159 -119 -152 -83 -86 34 258 -184 59 -241 150 172 -29 143 -82 -36 80 107 92 483 135
4239 135 -263 62 72 -111 -95 10 -76 -41 -194 -172 59 145 117 92 -139 91 71 284 187 -250 63 -18 -238 -20
4263 -20 38 -49 -19 69 -152 -172 144 76 -53 -50 -201 -264 -46 -367 -72 68 13 144 -278 308 -115 55 124 -66
4287 -66 -43 52 -71 -214 -71 -334 -120 -244 13 54 -3 -94 150 77 -122 -145 -148 -1 0 -31 -67 213 -70 29 -220
4312 -220 123 22 -204 200 -221 -27 -13 116 -220 165 44 -114 -43 146 -126 -230 -148 62 -64 63 139
4333 139 171 6 87 169 24 126 -266 -111 -73 249 -309 -91 50 -13 -119 -82 231 -133 77 -32 -30 48 31
4356 31 -59 294 -22 -94 196 -414 187 49 201 -67 -138 -243 37 315 -169 17 262 -143 106 248 -235
4377 -235 -37 -111 195 -162 70 -56 -183 5 -195 -133 -30 -53 177 -220 6 137 337 42 75 -40 109
$$ packed form
4215b31K70j3RJ24k78l3O9lJ20K24m42K43l00L91K2k01J72k25M6J16K7j5L91l48
4239A35l98L25J0j83J6J05q6L5j53K2K31Q6k8k5k31K30k0K13r7m37L13q1k20K18
4263b0N8q7L0Q8k21k0L16o8j29Lj51o3K18l21K95J40n5J31m22N86m23J70O9j90
4287f6K3R5j23j43J43k63K14j24K57M1n7r1K44p3j99k3lJ47Jl1l6K80k83R9k49
4312b20L43j01k26M04m21J94J4J29l36L85j21j58P1J89k72j04Q2K10j26J27P6
4333A39L2j65Q1Q2j45J02l92J55L8L22n58K18J41o3j06L7L13l64K10j09KP8j7
4356C1r0L53l16p2K90o10O01j38J52k68p1j05K80K78m84J86K45m05K49J42m83
4377b35J98p4L06l57K32j26j27J88k00O2J03k3K30l97K26J31K00k95L3j15J49
$$ plain form
4398 109 -96 -197 -94 415 -97 41 40 -174 -151 55 -82 22 -51 90 117 74 62 116 35 0 -43 -255 141 -244
4422 -244 -142 39 3 98 -87 -83 368 -116 160 37 213 -228 -38 -64 82 173 179 31 179 87 146 216 -99 91
4446 91 42 155 67 -45 146 -171 -39 42 53 -13 -46 -48 315 -133 115 95 351 48 151 56 -26 37 -11 79 69
4471 69 111 100 31 -211 253 -102 -216 -69 135 -63 260 -20 -262 37 86 -35 -96 81 34 163 376 -306
4493 -306 37 154 -239 130 60 67 185 -169 403 -104 22 134 -165 -21 20 -62 111 214 -148 63 337 -26
4515 -26 135 136 84 -249 214 275 229 -59 -79 21 -64 182 57 52 -21 -246 0 24 -50 183 179 -47 4 -133 -224 -139
4541 -139 257 -36 182 1 -139 239 -113 218 136 93 -83 67 -36 24 -139 101 -44 -77 -241 -96 -8 104
4563 104 15 11 39 -149 -248 313 -134 -100 4 -66 -183 -33 -119 15 93 178 2 -57 40 22 -159 -143 25 154 185
$$ packed form
4398A09k05j01J03N09n12J38jk14K3K06j37J04p3J41K7m3j2N4q1l5m3k12L96l85
4422b44J02J81l6R5j85MM51m84K76j23J76m41J90k6J46R1Oj48J48r2N9P0l15J90
4446I1m9J13q8j12J91l17J32Q1J1o6l3kL63m48K48k0K56l03J03r5q2O3m8R0j0
4471F9M2j1o9k42M64l55j14J47K04j98L23k80k42K99M9j21o1J77m7J29K13o82
4493c06L43J17l93L69p0PJ18l54N72n07J26J12k99J44M1q2J73J03l62K11K74l63
4515b6J61Jn2l33M63O1m6k88k0J00q5K46j25np3k25K46K4p4K33mk26N1j37r1Q5
4541a39L96k93K18j81j40L78l52L31q2m3j76J50j03O0j63K40j45l3j64J45Q8J12
4563A04q9mK8j88r9N61m47L4J04p0j17J50q6J34P8Q5j76n9R7j8j81J6J68J29L1
$$ plain form
4588 185 -175 -90 -106 -153 -100 102 170 89 -149 30 94 -177 -140 258 88 9 -106 -254 33 -80 -6 -174 -138 -27
4612 -27 154 -118 269 -78 -108 -61 -120 74 -199 -29 354 -138 -184 102 -112 -57 -299 264 -286 -211 254 -55
4634 -55 -59 -226 181 21 -100 -100 -40 -82 183 105 -14 241 281 -93 86 15 215 -5 172 127 -291 96 135 55
4658 55 -154 -23 262 123 -26 -286 -160 226 -217 48 76 -66 60 -165 -112 -2 -207 91 -46 -83 -24 -199
4680 -199 -157 319 156 121 399 -14 -134 193 -172 233 37 166 99 -227 166 109 176 33 25 -35 -38 -121 25 135
4704 135 -176 97 -20 -221 55 159 206 -141 69 -124 168 -66 -147 -129 44 360 366 49 -71 218 -240 -40
4726 -40 -67 -67 -221 49 49 0 139 -66 28 140 -26 136 98 84 212 69 -25 48 -174 167 -113 18 -40 192
4750 192 -130 247 121 -73 218 -38 89 -64 -51 -216 -20 28 -47 -14 59 108 -12 33 -76 125 -206 184
$$ packed form
4588A85l60Q5j6m7N3K02O8q1k38J79O4k71L7L98j70p9j15j48K87j13P4j68L6J11
4612b7J81k72L87l47l0M7n9J94k73J70L83m92m6K86k14N5k42N63n50P5M65l09
4634e5mj67M07j60j21%O0m2K65p8j19K55M0l74J79p1K00k20J77m5m18L87L9q0
4658E5k09J31K85j39j49k60J26L86m43K65K8j42J26k25N3J10k05K98j37l7N9j75
4680a99M2M76j63l5K78m13j20L27l65M05j96J29o7l26L93n7O7j43qo0lq3J46J10
4704A35l11K73j17k01K76J04M7l47K10j93K92k34q1J8J73L16Ol17j20K89m58K00
4726d0k7%j54K70%m9J39k05R4J12j66J62l8j4J28j43r4P3k22L41k80J31n8K32
4750A92l22L77j26j94K91k56J27j53J3j65J96M8p5L3P3M9j20M5j09K01l31L90
$$ plain form
4772 184 -162 37 177 -53 38 232 -24 17 -58 84 142 -206 -230 57 203 437 129 60 3 -70 -161 -115 -49 136
4796 136 254 -121 -378 59 -195 67 -106 210 -80 -26 -112 -51 -244 252 19 375 217 29 -137 66 111
4817 111 139 4 -179 -133 -178 204 114 -52 -154 -150 -6 -161 94 -47 9 -44 8 -25 -397 -43 134 -186 -75
4840 -75 -64 -201 297 97 -130 177 -33 -125 -48 -16 17 28 85 -99 -209 175 96 53 -18 110 -110 43 182 -106
4864 -106 -144 130 -189 -84 -128 30 -78 -221 -86 67 126 208 0 238 -135 238 -81 -45 -480 -47 181 -105
4886 -105 31 62 39 77 -58 -107 -112 -16 -89 -244 228 45 315 -279 -102 93 236 119 -348 68 145 -62 71
4909 71 224 -125 163 -156 259 67 -165 -129 38 80 40 -27 -47 -134 -5 -53 -6 88 -41 -63 55 20 80 142 -224
4934 -224 -160 77 -81 -107 152 41 121 -23 -96 -296 21 270 9 147 -177 229 -78 -51 -41 -108 48 225
$$ packed form
4772A84l46J99J40k30R1J94k56M1p5J42N8l48k4K87J46K34l08o9n7p3r1M6O6J85
4796A36J18l75k57M37k54K62j73L16k90N4q6O1j93M96k33L56j58j88j66K03M5
4817A11K8j35j83M6m5L82r0j66j02MJ44j55K55j41N6n3N2l3l72L54J77l20J11
4840g5J1j37M98k00k27L07k10r2P7L2L3J1N7j84j10L84p9m3p1J28k20J53J39k88
4864a06l8K74l19J05m4J58j08j43J35J53N9Q2k08K38l73L73l19L6m35M33K28k86
4886a05J36L1k3L8j35m9nR6p3j55M72j83K70n94J77J95J43j17m67M16P7k07J33
4909G1J53l49K88l19M15j92k32L6J67M2m0o7k0q7J29m8M7R4j29k2J18l5O0O2l66
4934b24O4K37j58k6K59j11Q0j44p3k00L17K49k61J38l24M06l07K7J0o7J56J77
$$ plain form
4956 225 32 -18 9 152 70 128 59 3 209 89 294 -137 81 -84 12 -22 142 21 -27 -133 -3 300 -69
4979 -69 118 2 -11 195 108 -54 113 -207 -67 23 24 -128 27 93 -53 27 249 -11 4 182 -147 -3 206
5002 206 149 -66 193 -27 -242 -90 -12 131 66 -40 -109 247 -229 -26 -123 -143 -107 -17 -55 -103 -65 -3 205 99
5026 99 9 -107 -9 145 0 -17 207 -3 -68 -29 378 153 -108 49 -86 290 -199 21 132 64 -217 -68
5048 -68 64 -40 227 -166 -41 -136 50 -101 -135 -46 -6 96 6 -186 -11 -12 26 -203 182 82 -11 -9 263 375
5072 375 -225 -150 -170 -124 224 102 -103 231 -147 100 -106 -253 -122 117 -238 29 -78 107 -128 12 -20
5093 -20 169 -191 52 -255 223 -259 51 -159 -54 156 149 601 127 229 -63 -68 3 7 -154 180 -545 119 218
5116 218 44 30 -172 -26 -43 135 -283 -27 275 -17 49 -104 162 132 27 201 -164 -137 -85 -92 -379 -103 -301
$$ packed form
4956B25j93n0K7J43q2N8o9n6K06j20K05m31K18j65R6l4J64j21m8j06J30L03l69
4979f9J87j16j3K06q7j62J67l20J40R0Jj52J55O6j46Q0K22k60J5J78l29J44K09
5002B06n7k15K59k20k15J52P8J43o5j06o9L56m76K03r7k0L6R0l8m8L8O2K08j06
5026I9r0j16R8J54j45j7K24k10o5L9M07k25k61J57j35L76m89K20J11o8k81J49
5048f8J32j04K67l93J25r5J86j51l4Q9M0J02r0j92J75jL8k29L85j00r3KK72J12
5072C75o00P5k0M6L48j22k05L34l78K47k06j47J31K39l55K67j07J85k35J40l2
5093b0J89l60K43l07M78m82L10k10J05K10pM52m74J02k92nP1Mj61L34p25O64R9
5116B18j74j4k02J46j7J78m18K56L02k92O6j53K66l0j05J74l65K7N2pk87K76j98
$$ plain form
5139 -301 -71 248 278 104 32 314 -143 168 -62 -147 -85 57 -124 168 151 -145 123 23 -246 -73 -310 201
5161 201 77 -98 -18 51 237 129 63 18 138 -108 80 25 -48 -186 123 321 -115 84 -28 222 -54 74
5183 74 -193 -63 60 -77 320 -208 -137 -179 15 -17 123 68 44 360 316 -141 151 -57 -94 -34 -147 42 1
5206 1 -240 -70 -204 -63 -9 -63 19 -97 -123 155 -94 5 114 47 -4 -18 234 -24 189 82 -97 1 136 156
5230 156 32 -87 150 -133 -60 -123 -28 39 199 72 116 210 20 176 -124 -253 38 67 -161 164 78 -47 -13
5253 -13 -311 53 235 -45 211 -6 -59 -43 -420 -279 56 -7 -138 -9 47 52 -118 -106 -243 -98 -112 -83 -244
5276 -244 -85 89 -106 8 29 -106 126 16 120 -36 -33 139 152 187 -139 164 -131 -342 114 -89 64 -292
5298 -292 -185 83 -59 133 -83 -53 83 53 94 -179 44 -49 -29 101 4 -147 -142 -237 -42 -155 461 19 100
$$ packed form
5139c01K30L19L0j74p2K82m57L11k30q5O2J42j81K92j7k96K68j00k69J73k37N11
5161B01j24j75Q0O9J86j08o6m5J20k46J88n5p3j38L09J98m36J99j12K50k76J28
5183G4k67J30J23j37L97n28P1m2J94l2J40n5k4L16m4m57K92k08l7O0j13J89m1
5206Ak41J70j34J41N4n4Q2j16k6K78k49R9J09o7n1j4K52k58K13j07j79R8J35K0
5230A56j24j19K37k83P3o3R5O7J60j27M4R4j90J56l00j29K91K9k28L25q6j25L4
5253a3k98L64J82k80K56k17n3J6l77J41L35o3j31J29N6Nj70J2j37J45j4K9j61
5276b44J59J74j95J14K1j35K32j10J04j56LJ72J3L5l26L03k95k11M56k03J53l56
5298b92J07K68j42J92k16L0J36l0M1k73K23r3K0J30r7j51Nr5J95j13O16m42Q1
$$ plain form
5321 100 137 362 -92 -100 234 -60 -147 -126 -70 -112 -35 -217 16 -277 -342 229 -100 -91 112 106 -126 146 -2 -158
5345 -158 -22 -98 -286 -66 -20 91 -10 160 -109 -65 134 132 57 -81 302 84 -65 2 126 43 13 -117 -81
5368 -81 -64 -179 194 -60 -88 -223 63 -7 43 -49 30 52 -144 -75 83 135 228 119 51 147 63 79 -230 329 -33
5393 -33 96 238 -230 381 -202 -151 -20 162 -85 297 245 282 111 -217 131 50 -71 -158 -191 -12 559 -219
5415 -219 -54 121 -86 -164 87 184 285 183 113 -342 193 170 76 52 -169 182 110 -40 -208 120 121 -80 98
5438 98 57 -38 134 -172 141 2 27 -9 -215 83 34 -10 -212 106 -262 -88 72 -63 235 45 -94 26
5460 26 22 7 38 172 -159 -139 47 301 -40 -43 102 -96 -324 -97 40 -220 40 129 167 -244 -319 180 -16 -118
5484 -118 54 -38 -225 124 207 -38 341 109 287 -229 167 107 -88 77 -19 74 -89 -263 168 -201 -28 62
$$ packed form
5321A00L7K25m54qL34k94q7K1N6m2P7j82K33k93o5N71l29RK03ok32K72j48j56
5345a58J36p6j88K20M6J11j01J70k69M4J99kp5j38L83k18j49O7J24q3l0j30L6
5368h1J7j15L73k54k8j35K86p0N0r2P9K2j96O9J58N2R3j09o8R6q4J6l09N59l62
5393c3J29J42m68O11n83N1J31J82k47L82n2L7j71l28L48q1j21q7l3J79N71p78
5415b19J65J75k07p8K51R7J01j02p0m55N35k3r4k4k21L51p2j50j68L28Jk01J78
5438I8m1r5J72l06L13j39K5l6k06K98m9m4k02L18l68J74J60j35K98j90j39J20
5460B6mj5L1J34l31K0J86K54l41lJ45j98k28K27J37k60K60Q9L8m11p5M99j96j02
5484a18J72r2j87L49Q3k45L79k32J78n16L96o0j95J65r6R3j63j74M31l69J73R0
$$ plain form
5506 62 32 -3 221 -240 190 184 -29 274 -231 78 -232 258 220 -48 -217 48 -33 38 -25 -31 113 -79 -103 151
5530 151 -243 100 13 90 235 -7 80 -122 246 -337 106 -149 342 40 -114 -289 -84 362 43 77 -340
5551 -340 -114 -66 78 70 -254 -157 -66 -171 -56 -215 44 125 -173 94 292 -55 -104 186 -54 84 144 -84 -44
5574 -44 -29 -333 -15 114 -62 -4 37 -2 -166 -320 -123 9 106 21 -246 -199 162 -169 -47 12 -143 207 -56
5597 -56 223 117 119 26 130 -219 -31 173 -167 191 102 32 -145 -255 55 132 -148 -58 140 -262 -214 -156 -93 -48
5621 -48 113 124 -5 -43 80 -97 -76 12 174 -85 -82 -291 23 62 18 188 -121 154 -11 35 291 0 -59 -66
5645 -66 239 5 -117 18 132 255 -227 -83 120 -163 202 -3 -74 -7 105 -44 -24 51 -140 -160 -295 149
5667 149 4 -31 -185 99 10 -36 358 -2 -71 -164 219 69 85 161 -204 -94 266 281 131 177 -55 125 182
$$ packed form
5506F2l0l5K24m61M30ok13L03n05L09l10M90l8k68j69K65q1P1o3oJ44j92k4K54
5530A51l94L43q7P7J45k42Q7k02L68n83M43k55M91l02j54j75K05M46l19L4m17
5551c40K26M8J44ql24R7R1j05J15j59K59Q1k98K67J98l47m9K90k40J38O0k28M0
5574d4J5l04L18J29j76N8M1l9j64j54J97J32R7q5k67M7L61l31J22N9j55L50k63
5597e6K79j06Kr3J04l49J88K04l40L58q9p0j77j10L10P7k80R0J98m02M8N8O3M5
5621d8J61J1j29l8J23j77K1Q8J62k59Lk09L14L9m4J70l09K75j65M6K56k91n9p
5645f6L05k34j22J35J14J23m82J44K03k83L65k05p1O7J12j49K0P5j91k0j35M44
5667A49j45l5j54K84q9m6L94l60o9r3L83j50J6P6l65J10L60J5j50M6k32J80N7
$$ plain form
5690 182 191 -130 203 -342 189 53 150 -4 -123 106 -35 -111 -36 2 36 -87 74 -172 88 202 118 0 14
5713 14 -164 -111 -12 -57 276 -36 199 -53 -56 34 26 -14 -109 113 -59 161 -38 316 211 -180 -64 117 66 -174
5737 -174 28 264 341 64 -40 -122 11 -247 -212 -92 -43 -268 214 193 25 43 61 58 -253 -15 -3 -43 -193 -62
5761 -62 171 -31 197 -83 -5 128 140 19 -176 103 -16 -177 134 -6 -178 -184 -100 37 -104 -68 247 -138
5783 -138 -27 -30 121 180 324 -168 54 248 -202 46 373 -58 -54 204 194 3 120 -97 43 134 314 77
5805 77 280 169 -233 82 173 0 112 -240 115 143 -173 -466 -4 54 124 -210 -133 -37 -271 -128 177 185 37
5828 37 -2 52 -52 -62 172 239 -331 151 4 -82 -28 28 -375 71 -154 49 14 -81 -59 -21 153 -280 -52 -141
5852 -141 98 -232 -64 178 185 -4 -362 -192 -263 -152 115 -218 -51 -6 185 -98 134 9 -166 -48 -163
$$ packed form
5690A82Rl21L33n45N31j36R7j54j19K29j41p6P5L8L4j23J61k46K60J14q4j18J4
5713A4j78N3R9m5L33l12K35k52lR0qm0r5K22j72K20j99L54j05l91J16J81n1k40
5737a74K02K36P7k77j04q2J33k58L5J20M9k25M82k1j68J8J8ll11K38J2m0j50J31
5761f2K33k02K28k80P8J33J2j21j95K79j19j61L11j40j72oQ4J37j41L6L15l85
5783a38J11lJ51N9J44m92K22J94m50K48L27m31MK58j0j91J17k17J40R1J80k37
5805G7K03j11m02L15R1j73J12l52L55K8l16k93M62N8P0l34P7R6k34J43L05Qj48
5828C7l9N4j04j0K34O7n70M82j47q6N4N6m03M46k25K03l5r5K2L8J74m33K28q9
5852a41K39l30J68K42Pj89l58J70p1J11K67l33J67M5J91k83K32j25j75J18j15
$$ plain form
5873 -163 -25 -105 -162 -37 -132 87 -67 -258 94 -28 -103 -112 -16 -65 -43 296 308 76 -156 -133 36 334 -10 -209
5897 -209 117 -187 -331 332 -201 222 262 130 -73 -272 -155 -5 151 -96 -79 -190 -228 52 -178 -114 -152 -234
5919 -234 -232 -72 39 165 -259 -223 131 -279 35 -69 -6 189 -175 -14 105 -4 304 -129 -74 32 -139 -98
5941 -98 146 266 90 239 20 155 -436 -234 0 51 139 145 -167 -137 213 62 99 -211 162 157 -174 141 -55
5964 -55 -93 -23 -104 23 -177 -12 -31 122 17 -205 -208 159 216 -331 51 85 139 69 -60 57 -117 -91 124 -41
5988 -41 -97 -46 12 280 50 -19 10 105 -91 106 -122 -206 -20 296 44 64 -97 -60 -71 112 147 128 2 -134
6012 -134 -97 -7 45 13 72 34 -51 108 51 -149 -42 136 -327 174 137 -282 -23 -68 -340 -196 -241 188 50 -255
6036 -255 11 -145 -19 4 -79 75 -63 -95 -354 18 -157 -30 64 176 224 19 101 -119 68 -37 -77 176
$$ packed form
5873a63J38q0n7J25r5K19j54j91L52j22p5rR6m9K2L39J2k32k32K3J69K98l44j99
5897b09L26l04j44O63n33M23M0j32k03j99J17J50J56k47J7j11l8K80k30O4l8q2
5919b34KJ60J11J26m24L6L54m10L14j04O3J95l64J61J19j09L08m33N5J06j71M1
5941i8K44J20j76J49k19J35n91K02K34N1Q8Ol12L0L50j51L7l10L73nl31L15j96
5964e5l8P0q1J27k00J65j9J53j05k22lL67N7n47L82L4N4p0j29J17j74K6K15j65
5988d1n6N1N8K68k30o9K9R5j96J97k28q4J86L16k52K0j61L7j1J83L5j9j26j36
6012a34L7R0N2l2N9l8q5J59n7k00J07J78m63N01l7m19K59m5k72J44m5M29j38l05
6036b55K66j56J26K3q3J54j38l2k59L72j75J27R4J12M8k05Q2k20J87j05m0K53
$$ plain form
6058 176 201 -147 0 -64 39 -126 -111 -139 -27 -333 207 169 -26 -39 -12 141 180 -266 -527 17 -104 144 -57
6081 -57 142 30 106 278 151 -69 98 -233 -165 205 -117 74 25 -16 105 66 232 190 14 -182 186 -154
6103 -154 -96 134 -259 -109 -95 -53 161 -188 -258 -134 113 7 -153 -61 -72 14 -67 52 353 -89 109 -315 45
6126 45 173 44 -106 -114 313 -254 -187 83 0 115 -19 -283 -128 199 -202 -96 -93 213 289 223 -146 -268 104
6149 104 -151 245 -57 -217 179 -179 167 128 329 -31 96 275 181 35 -168 -23 105 -86 -278 -53 -12
6170 -12 -36 -75 -23 393 16 105 133 73 -110 53 149 145 130 79 -43 192 -139 -26 213 -47 -97 -35 -83 -307 -167
6195 -167 -28 -185 24 1 109 -261 23 167 157 -301 -93 49 -151 153 124 213 -131 67 148 106 -7 116
6217 116 374 -261 -130 113 153 65 39 147 13 -119 110 -357 249 -112 -215 109 14 -112 -82 -50 163 -33
$$ packed form
6058A76K5l48J47o4J03j65J5k8J12l06N40l8j95j3K7J53L9m46k61N44j21K48k01
6081e7J99j12P6J72j27k20J67l31O8L70l22J91m9m1J21l9J66m2j76j96L68l40
6103a54N8K30l93J50J4M2K14l49p0J24K47j06j60R2j1Q6q1J19L01m42J98m24L60
6126D5J28j29j50qM27n67O7K70q3J15j34k64J55L27m01J06LL06P6o6l69j22L72
6149A04k55L96l02j60L96l58L46l9K01l60J27J79r4j46k03J45J28j91j92K25M1
6170a2k4l9N2M16l77Q9K8o0j83J63R6mj5n1j22K35l31J13K39k60n0O2m8k24J40
6195a67J39j57K09k3J08l70K84J44j0m58K08J42k00L04k9Q9l44J98Q1m2j13J23
6217A16K58o35J31K43M0q8k6J08j34j32K29m67O06l61j03L24r5j26L0L2K13j96
$$ plain form
6239 -33 346 246 140 165 -138 25 -67 -77 150 90 132 10 -105 32 293 -267 137 -156 93 -278 -2 76
6261 76 -89 91 -423 -14 190 -97 -289 -112 -13 -205 -193 -112 249 -9 116 292 165 136 -111 -80 75 130
6283 130 254 27 -60 65 -244 -27 -141 74 49 -177 33 108 -154 -83 20 0 -155 3 158 -80 -56 23
6305 23 -62 89 63 66 -254 -94 -235 264 -124 -101 194 49 -89 -137 48 -5 60 21 71 44 -153 79 54 -359
6329 -359 92 83 137 -60 135 -22 183 -120 39 217 -95 -46 -224 -249 -81 70 9 10 140 129 108 -27 -339
6352 -339 203 -29 416 4 -11 188 163 -289 14 -152 100 -78 26 -76 -160 -104 -83 4 -82 42 103 184 103
6375 103 189 -165 -43 -131 -55 71 173 -30 90 -69 67 12 10 -6 187 -104 9 -63 67 -440 -59 46 -216
6398 -216 -234 -94 -21 79 49 39 156 -45 76 -107 188 219 174 91 -189 140 161 -157 -91 -133 121 20 474
$$ packed form
6239c3L79j00j06K5l03J63r2j0K27o0M2j22j15J37K61n60M04k93K49l71K76P8
6261G6j65J80n14M09K04k87j92J77R9j92J2Q1L61k58J25J76j27k9k47L1J55N5
6283A30J24k27q7J25l09K17j14K15k5k26K10P5k62P1J03k0j55J58J55k38K4P9
6305B3q5J51k6Ll20J60j41M99l88K3K95j45j38m8J85n3O5l9N0k7j97K32k5m13
6329c59M51rN4j97J95j57K05l03J59J78l12M9j78k5J68J51o1JJ30j1k1j35l12
6352c39N42k32M45m12j5J99k5m52L03j66K52j78J04j02q4N6K1Q7q6J24O1Q1q1
6375A03Q6l54J22q8P6J26J02k03J20j59J36n5kj6J93k91J13p2J30n07L81J05k62
6398b16j8J40P3J00l0j0J17k01J21j83K95L1m5q3k80L29K1l18O6m2K54j01M54
$$ plain form
6421 474 54 308 30 -20 -69 -215 -7 92 3 -16 85 -107 -197 23 45 -89 -24 -30 -70 171 116 114 5 40 149
6446 149 -31 -44 20 17 -35 -359 -94 53 236 -105 -198 128 185 50 -159 116 137 174 -103 34 102 -286 -3
6469 -3 -110 86 202 -52 -44 125 -1 194 -141 -251 -180 61 111 -146 218 239 -99 -24 99 -200 -97 52 -110
6492 -110 -63 389 -203 86 216 186 104 43 74 -163 61 -122 -65 215 248 -59 74 -170 256 -199 140 26
6514 26 381 76 38 -369 -129 193 94 80 -137 -71 -208 147 10 114 88 52 -194 14 270 194 111 262 9
6537 9 42 22 107 -176 244 -104 -98 -135 -93 -117 -153 82 191 -158 -190 159 220 -90 -101 -60 -169 223 -5 -139 187
6562 187 -70 -269 36 21 -334 172 -148 89 -182 211 -30 -77 -5 -327 105 99 -109 -81 -102 47 174 157 -44
6585 -44 -61 199 -46 44 -165 69 -40 -416 3 6 101 -107 38 -318 -252 51 -272 -77 38 -153 274 144
$$ packed form
6421D74m20K54k78n0m9j46K08R9q9j9J01j92r0K20K2j34O5om0K41n5kj09L5J09
6446A49j80j3O4ln2l24K65J47J83l41r3L26N7j35k09K75K1L7k77J37O8l88K83
6469cj07J96J16k54QJ69j26J95l35j10P1K41N0k57L64K1l38P5J23k99J03J49j62
6492a10M7M52n92K89J30l0q2o1L1k37K24j83N7K80L3l07J33k44M26m55L39j14
6514B6L55l05l8m07K40L22r9j4k17O6j37L55j37J04k6l6k46K08K56p6q3J51k53
6537IL3k0Q5k83M20l48Ol7M2k4l6K35J09l49l2L49O1l10j1M1j09L92k28j34L26
6562A87k57j99L05j5l55N06l20K37k71L93k41m7P2l22M32ok08K8k1J49J27j7k01
6585d4j7K60k45R0k09K34j09l76M19LR5k08J45l56O6L03l23J95J15j91M27j30
$$ plain form
6607 144 76 179 5 -149 -278 40 -90 73 34 -171 -63 201 -449 -36 170 -22 -54 -46 11 203 -82 -45
6629 -45 60 52 -121 -142 155 70 312 -64 -61 -63 -129 155 -44 113 378 22 62 -155 1 -175 179 241 -110 -1
6653 -1 -70 -6 110 -57 526 232 -65 85 58 -93 -19 -175 -2 104 -228 -97 -58 183 -312 -51 87 -40
6675 -40 -246 -155 -140 -136 165 115 -116 -194 -98 317 -37 -52 137 -262 -179 -142 82 49 96 -174 164 -53 -185 267
6699 267 -132 38 -59 156 -95 -18 15 77 -204 74 -350 -138 176 5 -94 -81 -101 -18 118 -123 48 116 -84
6722 -84 71 -340 -199 -117 233 -17 -164 135 -132 -88 111 221 -56 -23 -65 -5 51 -237 13 164 -209 65
6744 65 -21 4 -86 -103 217 -235 -78 11 35 120 87 -125 -38 -72 282 159 86 -47 -143 -99 -146 103 -367 -20 -81
6769 -81 16 102 -91 -127 182 -107 -50 -39 339 -176 121 32 37 -57 -84 -2 76 105 24 -144 191 179 217 52 67 -62
$$ packed form
6607A44o8J03j74j54j29L18j30J63l9k05J08K64o50M13K06j92l2QN7J92k85L7
6629d5J05qj73k1K97q5K42l76Lko6K84j99J57K65l56M0k17J56j76L54O2l51J09
6653ao9O4J16j67N83k94k97J50k7j51P4j56J73J06l32J31L9K41m95K61J38j27
6675d0k06R1J5ML01n0k31p8R6M15l54j5J89l99Q3L7K24l3M7k70L38k17j32M52
6699B67l99J70r7K15k51P7L3O2k81K78m24K12L14j71r9J3k0Q3J36k41J71O8k00
6722h4J55m11J41Q2L50k50j47K99k67M4J99J10k77L3m2O0N6k88K50J51l73K74
6744F5q6K5r0j7L20m52J57Q9K4Q5l3k12Q7l4L54j23p3j33r6M4m7K49m70L47o1
6769h1R7Q6j93l6L09k89N7J1L78n15K97q9Nr4k7Q2P8K9q1j68L35j2L8j65J5j29
$$ plain form
6795 -62 -149 137 -74 149 12 13 -77 127 -32 -55 146 -55 115 110 -65 102 -26 -44 1 221 -210 29 212
6818 212 123 122 87 -333 162 29 76 -110 43 -7 56 204 -227 34 -312 46 -137 89 270 92 -27 29 -170
6841 -170 69 -37 416 -118 -171 -246 -186 -53 119 134 30 -3 107 244 -345 -237 -53 145 -33 103 -170 -105
6863 -105 -66 -7 -241 -66 314 -197 -65 54 -159 41 69 15 -106 104 158 302 56 37 20 204 -164 -147 9
6886 9 -90 157 -305 514 -5 -71 27 -56 166 101 -71 -120 175 -29 117 -159 58 178 -114 127 289 -201 -170
6909 -170 240 -84 -121 -326 -132 -40 193 -118 -197 75 -113 186 38 -76 111 -342 -246 139 79 -256 -112 -119
6931 -119 177 -215 -9 203 -22 -315 48 -104 33 34 55 170 -48 -111 -53 -132 102 -176 -47 -22 232 -92
6953 -92 23 -239 -183 35 80 19 -285 30 -60 92 86 249 -175 90 288 62 -93 129 -31 -72 -242 -50 65
$$ packed form
6795f2q7K86k11K23j37Jr0K04j59k3K01k01J70nj75J67j28j8M5K20m31K39J83
6818B12q9jl5m20M95j33M7j86J53n0O3J48m31K61l46L58j83K26J81j78j19N6j99
6841a70K39j06M53n34n3p5O0J33J72J5j04l3J10J37n89J08J84J98j78J36k73O5
6863a05L9N9k34J75L80n11J32J19k13K00K8n4j21K10N4J44k46j9j7J84l68J7J56
6886Ir9K47m62Q19n19o6R8q3K22o5j72m9K95k04J46k76K17J20k92K41J62m90L1
6909a70M10l24l7k05J94R2K33l11p9K72j88K99j48j14J87m53R6L85o0l35J44p
6931a19K96l92K06K12k25k93L63j52J37JK1J15k18o3N8p9K34k78J29K5K54l24
6953i2J15k62N6K18M5o1l04L15r0J52oJ63m24K65J98k26j55K22j60m1j70J92J15
$$ plain form
6976 65 123 -97 67 57 59 -140 187 78 15 158 52 173 -224 -51 -17 192 -21 -191 -98 10 -51 83 -295
6999 -295 -8 236 81 -17 -136 -59 101 -265 -288 -128 -58 3 106 243 -15 37 -307 -31 -264 -252 82 148 242
7022 242 100 -46 205 -291 -199 150 120 77 -340 97 242 192 46 -172 -154 -323 -58 9 46 18 193 353 50
7045 50 -93 -150 24 2 -9 -6 160 -39 181 -230 226 -9 -34 121 10 -80 -173 94 -198 -94 79 156 3
7068 3 -146 -63 -166 -1 -76 92 -123 205 202 25 -238 132 100 -253 -74 -72 31 226 128 -51 -146 158 20 -60
7092 -60 -63 -170 -59 -179 236 96 -216 164 -61 -7 12 3 110 -75 -30 7 167 25 122 -7 -43 -80 145 227
7116 227 152 95 167 -101 -173 171 129 92 149 41 106 27 -276 -20 -132 101 -219 -9 64 89 -202 -234 6 86
7140 86 52 -166 306 -24 -41 -195 116 30 -267 136 -59 46 447 74 166 5 58 -241 122 -24 5 -66 -88
$$ packed form
6976F5N8k20J64j0Kj99L27j09o3J43j06J21l97J73L4K09k13j70R3J08o1J34l78
6999b95K87K44j55r8j19P7J60l66k3J60P0O1J03J37k58N2l44K76k33J2L34O6R4
7022B42j42j46K51m96R2L49l0m3m17M37J45n0j46k18J8j69K65O7L7k8J75J60l03
7045E0j43n7J74k2j1LJ66j99K20m11M56k35k5J55j11r0r3K67k92J04J73P7j53
7068Cj49Q3j03J65p5J68k15L28lj77k63L70l2l53J79KJ03J95r8j79r5L04j38q0
7092f0lj07J11j20M15j40l12L80k25N4J9rJ07j85M5L7J60j42R7j29l6l7K25Q2
7116B27p5n7P2k68p2L44m2l7N7j08O5p9l03K56j12K33l20K10P3K5k91l2K40Q0
7140H6l4k18M72l30j7j54L11q6k97M03j95J05M01l73R2j61N3k99L63j46K9p1k2
$$ plain form
7163 -88 23 -38 -98 -118 -109 -474 -209 -289 323 -32 115 -71 18 -110 198 51 -24 409 152 -194 42 118 126 -290
7187 -290 -123 88 53 103 -6 197 7 40 -14 179 58 142 154 -141 -40 110 -314 87 -166 157 227 -59
7209 -59 236 254 -44 -272 107 142 -140 37 -18 165 185 154 65 72 333 7 152 -68 63 -48 -93 86 116 73
7233 73 -47 -68 -99 162 135 41 -355 62 -391 88 97 -45 -278 130 180 101 -145 26 -114 -196 186 -236 160
7256 160 55 -157 -57 153 116 15 -2 -165 23 212 -90 136 139 -294 161 151 92 92 -127 67 -89 156 -23
7279 -23 -211 -3 -24 24 171 -201 226 -5 -17 -41 -24 32 4 -146 69 -65 -191 22 176 -198 -84 57 154
7302 154 87 43 45 -289 -33 50 109 148 78 155 -8 7 -188 -207 192 -163 -222 79 228 69 3 -129 236 115
7326 115 -52 -193 -257 387 67 -68 115 65 -4 130 48 -12 90 50 71 10 170 -245 59 41 -280 -101 280
$$ packed form
7163h8J11o1o0k0Rl65K65q0O12l55J47j86Q9j28L08j47p5M33k57l46K36P6Qm16
7187b90J67K11l5N0j09K03j90L3n4J93j21Q4J2k95J01J50m24M01k53L23P0k86
7209e9K95J8k98k28L79L5k82J77n5J83K0l1q9PK61l26J45k20J31j11m5J79L0m3
7233G3j20k1l1K61k7r4l96M17m53M79Rj42k33M08N0p9k46J71j40q2L82m22L96
7256A60j05k12J00K10l7j01j7j63J88J89l02K26Lm33M55j0n9%k19J94j56K45j79
7279b3j88K08k1M8J47l72M27k31j2k4J7N6k8j50K15j34j26K13J54l74J14J41R7
7302A54o7m4Kl34K56Q3N9L9p0P7j63J5j95j9L99l55n9L01J49j59o6j32L65j21
7326A15j67j41o4O44l20j35J83n0o9J34q2o0J02m0K1o1J60m15L04j8l21J79L81
$$ plain form
7349 280 10 129 -221 137 177 -71 37 209 122 25 144 6 139 140 -50 75 -138 64 -23 69 -162 7
7371 7 310 14 82 -213 -150 179 -168 32 89 -30 -256 -51 15 65 165 181 258 222 147 103 98 402 -173 -212 54
7396 54 -214 137 109 30 301 -6 -95 153 -66 -206 155 -59 193 -149 172 108 11 -21 13 222 -125 -94 125
7419 125 292 -16 43 130 -178 21 -62 -1 -235 -329 -121 -50 -42 -46 -48 126 -55 68 -413 -201 89 -110 135 -138
7443 -138 96 266 -142 -123 98 29 -4 289 240 -216 69 51 -92 205 -121 -85 140 -157 -36 -39 -138 167 107
7466 107 83 -120 263 -34 202 96 -6 168 -59 196 -246 -234 74 397 71 82 121 304 112 93 -172 241
7488 241 -174 -11 100 -129 -156 138 79 56 307 -21 -100 223 -94 -56 -289 -5 96 184 -51 -136 -95 132 204
7511 204 -9 26 120 -44 64 51 -210 -252 70 -180 -230 -2 275 -194 42 22 -3 13 -127 397 51 21 -302
$$ packed form
7349B80k70J19l50L58M0k48J08J72q7r7J19j38J33Jj90J25k13K02q7R2k31J69
7371GL03k96O8k95O3L29l47K00N7j19k26K05O6N0J00J6P7l6p5m4nL04n75l9K66
7396E4k68L51k8p9K71l07q9K48k19j40L61k14K52l42L21o4r7l2L4K09l47L1K19
7419A25J67l08N9Q7l08J99q3O1k34r4K08P1QmkJ74j81J23m81K12K90j99K45k73
7443a38K34J70m08J9K21o9l3K93m9m56K85j8j43K97l26L6K25k97J21lr9L05o0
7466A07k4k03L83k97K36j06j02J74k27K55m42J2L08L23l26J1L9J83j92j9k65M13
7488B41m15J63J11k29k7K94n9k3K51l28p9L23l17L8k33K84J01Q8k35q5M1K27P2
7511B04k13L5R4j64J08j3k61m2L22k50n0K28K77m69K36k0k5J6j40N24l46l0l23
$$ plain form
7534 -302 212 32 -89 79 6 -18 -257 189 -16 131 -29 190 -60 -248 65 -1 213 -66 61 -14 62 56
7556 56 -142 143 -36 42 -51 -31 244 84 -21 66 200 -42 -340 -3 80 99 1 45 87 51 -109 -87 -107 189
7580 189 -145 84 -102 188 125 313 -17 -286 85 248 4 -175 50 324 -54 146 117 11 102 87 -186
7601 -186 95 146 -170 -142 -30 -193 -302 -127 232 -171 50 22 -42 -52 -67 -106 340 -96 -189 22 5 217 223 48
7625 48 31 360 74 -41 -108 -116 -262 -82 -102 -76 -7 71 270 -1 107 351 -75 130 136 -64 -50 53 -69 260
7649 260 -226 -93 180 -57 -505 38 -72 156 -247 -267 -39 -108 220 -11 -6 23 -182 -50 159 -67 109 132
7671 132 241 87 -102 235 -201 168 -314 -395 2 -186 85 168 19 78 90 175 -170 77 96 154 197 -154 -28
7694 -28 -310 199 -207 -2 -187 1 -53 104 -154 -3 -50 -17 -46 81 -66 -206 158 -78 36 -82 123 192
$$ packed form
7534c02N14j80j21J68p3k4k39M46k05J47j60K19k50j88L13o6K14k79J27p5P6o
7556E6j98K85j79P8r3K0K75j60j05Q7J34k42k98L37Q3J9r8M4M2l6j60K2k0K96
7580A89l34K29j86K90o3J88l30k69L71J63k44j79K25K74l78K00k9j06R1j5k73
7601a86K81N1l16K8J12j63j09J75L59m03K21k8o4j0j5l9M46m36r3K11j7K12Oj75
7625D8j7L29k86j15o7qj46J80k0K6O9P8J99k71J08K44m26K05Ok00J4J03j22L29
7649B60m86J33K73k37m48N43j10K28m03k0K28o9L28k31NK9k05J32K09k26J76K3
7671A32J09j54j89L37m36L69m82q1L97j88K71Q3j49N9J2Q5l45K47J9N8M3l51J26
7694b8k82N09m06K05j85J88n4J57k58J51m7L3k9J27j47j40L64k36J14j18K05O9
$$ plain form
7716 192 169 84 -315 84 -26 -53 -160 -260 -61 -196 -233 2 -244 210 -45 173 -112 118 -78 227 89
7737 89 -150 -112 15 -155 -92 147 -17 15 -190 34 -300 226 -199 -295 219 231 -118 41 -6 -114 -69 -51 91
7760 91 -362 51 110 -405 -4 -13 -260 102 -75 -93 44 71 1 -14 -110 -2 322 -36 -62 104 57 46 -87 -188
7784 -188 -2 -135 39 208 33 104 -66 264 -39 70 50 -141 118 76 158 -175 159 100 -210 148 -94 399
7806 399 134 88 297 320 155 -133 -143 163 -288 269 -21 -19 235 -98 -78 67 -165 -327 97 -115 -187 -118 -205
7829 -205 66 108 -98 172 -65 240 -212 82 46 -475 -257 14 -7 -71 -87 -93 -162 -93 122 100 206 -137 199
7852 199 68 44 164 -141 -159 150 27 -132 91 294 170 174 189 155 -152 264 95 58 -152 213 56 -73
7874 -73 -106 131 13 -122 17 151 -130 -213 53 151 -209 29 62 -80 -173 -221 141 -91 356 252 64 178
$$ packed form
7716A92k3q5l99L99j10k7j07j00J99j35l7K35k46M54k55K18k85K30j96L05j38
7737H9k39L8J27j70O3K39j64L2k05K24l34N26m25r6N14J2l49J59m7j08M5J8J42
7760I1m53M13N9n15M01rk47L62j77j8J37K7p0j5r6J08L24l58k6J66m7j1j33j01
7784a88J86j33J74J69j75P1j70L30l03J09k0j91K59m2Q2l33L34n9l10L58k42M93
7806C99k65m6K09K3j65k88j0L06m51N57k90KK54l33K0J45k32j62M24k12p2O9q7
7829b05K71M2k06K70k37L05m52K94l6n21K18K71k1o4j6oo9O9K15k2J06l43L36
7852A99j31k4J20l05j8L09j23j59K23K03j24MJ5l4l07M16j69l7k10L65j57j29
7874g3l3K37j18j35J39J34k81q3K66R8l60K38L3j42r3m8L62k32M47j04j88J14
$$ plain form
7896 178 -97 93 -197 89 13 70 -220 -74 -46 -250 3 -76 105 24 -57 170 -181 -17 63 -94 27 156
7918 156 -50 -327 79 210 -227 118 263 -155 -76 -22 -384 54 55 -227 409 287 184 121 -72 133 -39 -189
7940 -189 -152 -170 47 100 20 223 227 94 -110 -38 146 303 118 -131 -179 241 -147 27 188 32 -145 -137 -48 -91
7964 -91 -38 34 -38 57 123 -147 -263 -122 -106 -187 63 -146 -122 282 37 24 -13 360 227 -5 285 -193 174 -26
7988 -26 248 -2 19 -80 -46 -52 178 5 54 -37 34 149 27 -72 -344 27 -237 43 146 131 -219 61 10 197
8012 197 -96 104 8 -45 -54 198 66 -204 44 -220 -16 -54 -123 -190 -106 -17 45 -200 104 -75 238 -186 -137 67
8036 67 7 -18 175 -110 127 -4 45 86 101 170 27 45 -360 90 120 74 71 159 -86 144 -39 -137 250 192 103
8061 103 -153 -31 -39 -340 49 -78 46 1 -210 -38 -298 -168 48 -39 -66 -49 -257 175 2 350 -24 173
$$ packed form
7896A78k75J90k90K86p6N7k90J46K8k04K53p9J81q1q1K27l51J64Q0j57J21J29
7918A56k06k77M06J31m37L45J45m18P9N4l62M38Jk82O36j22j03o3j93K05j72j50
7940a89L7j8K17N3q0K03Mj33k04P2J84J57j85k49m8M20l88J74J61j56j77QQ9m3
7964i1N3P2p2R5O6k70j16J41J6q1K50k09K4M04k45j3l7L73j33k32K90m78L67k00
7988b6K74k50K1r9L4oK30j73M9r1P1J15j22r9k72L71k64K80J03j5l50K80n1J87
8012A97k93K00r6n3rK52j32k70K48k64K04l8o9o7Q4Q9O2k45L04j79L13m24M9K04
8036F7o0k5J93k85K37j31M9M1J5O9j43J8m05M50L0m6lQ8k45K30j83r8L87n8q9
8061A03k56J22ql01L89j27J24m5k11J72k60J30K16q7k7J7k08M32j73L48l74J97
$$ plain form
8083 173 -193 119 -48 175 -199 -155 166 68 -107 67 45 106 310 105 -2 -93 -92 42 -53 -69 13 -107 -211
8106 -211 -261 -91 -92 -57 -46 219 -46 -58 1 183 11 144 105 315 -28 315 -197 -123 135 1 87 -93 -25 -48
8130 -48 -71 85 49 -113 85 -81 -166 162 172 134 -91 268 -45 68 266 141 -27 229 14 -287 -235 122
8152 122 -216 -150 -180 142 44 68 -344 166 117 -102 193 -7 159 -176 252 349 197 -71 -146 -187 213 81 12
8175 12 -75 128 177 156 57 -82 -347 197 82 42 -275 71 222 221 81 43
$$ packed form
8083A73l66L12j67K23l74M4L21r8j75J74k2O1K04k05j07r1JJ34r5j6Q2j20j04
8106b11n0J70jL5J1K65k65j2N9J82j72J33l9K10l43L43n12P4K58j34Q6j80O8k3
8130d8k3J56l6j62J98j66q5L28J0l8k25L59l13J13J98j25j68K56k15l01N2L57
8152A22l38O6l0L22r8K4m12N10m9k19K95k00J66l35M28R7j52k68p5m1M00j32o9
8175A2q7K03M9k1r9j39k65N44j15m0l17L46J51jj40l8
8191D3
$$ Imaginary data points
##PAGE= N=2
##DATA TABLE= (X++(I..I)), XYDATA
$$ plain form
0 0 0 0 0 0 0 0 0 -8 8 -8 8 -13 16 -16 24 -25 32 -40 48 -56 64 -75 88 -102 115 -132 151 -171 195 -220 248
31 248 -278 311 -348 388 -434 482 -536 593 -658 728 -805 894 -989 1097 -1217 1352 -1507
48 -1507 1685 -1890 2136 -2432 2792 -3251 3857 -4689 5916 -7909 11712 -21604 101641 215689
62 215689 12644 -54311 18367 130301 126973 75260 18110 17406 49375 90247 78772 34280
74 34280 -2392 23268 69315 69698 11442 -17275 12700 51267 41754 2559 -23291 -2350 38401
87 38401 39074 -12237 -41162 -11625 29380 32290 5629 -27169 -37433 -9541 29622 34254 4551
100 4551 -27668 -33053 -3400 36392 39106 2854 -25623 -18061 10823 36984 35458 1155 -27790
113 -27790 -13142 26292 42831 15443 -28370 -34636 12712 45587 7058 -46133 -33261 16462
$$ packed form
0@%%%%%%%qJ6j6J6k1K9l2M0m9N7p2Q8j04J20j39J63j90K17k47K83l22L66m15M68
31B48n26N89o59P36q22R16j018J129j251J386j533J699j883K086k314K569k859
48a507L192l575M026m568N224o043P108q546J0605j3825J9621l3316J23245J14048
62B15689k03045o6955P2678J11934l328n1713n7150p04L1969M0872j1475m4492
74C4280l6672K5660M6047L83n8256k8717K9975L8567r513l9195k5850K0941M0751
87C8401O73n1311k8925K9537M1005K910k6661l2798j0264K7892L9163M632k9703
100D551l2219n385K9653L9792K714l6252k8477P562K8884K6161j526l4303k8945
113b7790J4648L9434J6539k7388m3813o266M7348L2875l8529n3191J2872M9723
$$ plain form
125 16462 26333 -9680 -40164 -33005 1853 24009 1900 -39629 -44413 -3535 34952 25150 -26959
138 -26959 -58408 -19101 48385 55053 -5433 -55219 -36705 27736 67188 30951 -39656 -52898
150 -52898 6002 53574 32339 -21593 -43242 -13249 29171 26529 -19524 -44836 -17624 16632
162 16632 14507 -15908 -38677 -29046 1112 12837 -10815 -34126 -27667 -4650 6890 -1933 -23858
175 -23858 -32214 -11315 12991 11908 -7262 -23107 -24759 -3563 27303 28150 -6419 -28424 -9778
188 -9778 22554 34739 21001 -1645 -8815 7971 29710 36394 22915 -70 -7328 20457 49517
201 49517 34309 -6740 -16163 15085 42547 32859 -3975 -25143 -1058 35844 29761 -13118 -33144
214 -33144 -7348 27308 27705 -10800 -42036 -23956 22792 35079 -1803 -39584 -34442 6708 37750
$$ packed form
125A6462R871l6013l0484P159L4858K2156k2109m1529m784M0878L8487r802n2109
138b6959l1449L9307O7486O668o0486m9786J8514O4441L9452l6237p0607j3242
150e2898N8900M7572k1235n3932k1649K9993M2420k642m6053k5312K7212L4256
162A6632k125l0415k2769R631L0158J1725k3652k3311O459K3017J1540q823k1925
175b3858q356K0899K4306j083j9170j5845j652K1196L0866Q47l4569k2005J8646
188i778L2332J2185j3738k2646p170J6786K1739O684j3479k2985p258K7785K9060
201D9517j5208m1049r423L1248K7462r688l6834k1168K4085L6902o083m2879k0026
214c3144K5796L4656L97l8505l1236J8080M6748J2287l6882l7781N142M1150L1042
$$ plain form
227 37750 18975 -28709 -41603 -4362 31711 22932 -12383 -33396 -17547 16485 25124 -3836
239 -3836 -30288 -20848 6380 16518 158 -25311 -27966 -1545 17654 291 -26831 -27355 -3743
252 -3743 11237 2506 -18797 -25685 -9026 6390 1883 -10393 -15273 -15797 -9410 3403 6320 -9250
266 -9250 -23521 -19369 -1842 11991 5643 -18656 -30571 -11857 12839 12552 -7664 -24170 -19257
279 -19257 4057 19080 4643 -20047 -20991 619 17930 12809 -10082 -25195 -9917 18755 20473
292 20473 -7305 -27430 -17044 11023 23227 626 -31216 -28408 8108 27018 4140 -28978
304 -28978 -32435 -2652 26514 18171 -19420 -36628 -9969 24073 24062 -5504 -28100 -16370 15932
317 15932 26156 3280 -19163 -13640 6380 17174 10481 -7181 -17233 -3990 15123 13522 -5175
$$ packed form
227C7750j8775m7684j2894L7241L6073q779l5315k1013J5849L4032Q639k8960
239c836k6452R440K7228J0138j6360k5469k655K6421J9199j7363k7122n24K3612
252c743J4980q731k1303o888J6659J5416m507j2276m880n24O387J2813K917j5570
266i250j4271M152J7527J3833o348k4299j1915J8714K4696k87k0216j6506M913
279a9257K3314J5023j4437k4690r44K1610J7311n121k2891j5113J5278K8672J718
292B0473k7778k0125J0386K8067J2204k2601l1842K808L6516J8910k2878l3118
304b8978l457K9783K9166q343l7591j7208K6659L4042j1k9566k2596J1730L2302
317A5932J0224k2876k2443N523K0020J0794o693j7662j0052J3243J9113j601j8697
$$ plain form
330 -5175 -16545 -8119 9136 15049 197 -16644 -11033 8160 14279 3125 -9121 -10700 -113
343 -113 13056 10047 -4546 -10641 -4016 4527 9369 6459 -5658 -14112 -6409 8388 11533 74
357 74 -14896 -16585 -5 15595 7281 -14752 -19578 -3147 12633 11670 -6589 -20901 -10259 13716
371 13716 17674 -3177 -19899 -11947 9695 20289 4922 -18962 -18196 6034 20221 7907 -14452
384 -14452 -21314 -5461 17384 17809 -8476 -27278 -13127 14906 22143 755 -23487 -19795 9410
397 9410 26441 7778 -18207 -17621 4614 20033 13464 -7509 -16603 -1952 16755 13771 -2811
410 -2811 -11067 -5288 7105 12954 4568 -9156 -9599 1903 10248 7575 -2078 -10208 -5774 8637
424 8637 13327 1991 -8867 -6648 4313 12777 9840 -2980 -10546 -1478 11294 12553 2411 -8185
$$ packed form
330e175j1370Q426J7255N913j4852j6841N611J9193O119j1154j2246j579J0587
343a13J3169l009j4593o095O625Q543M842k910j2117q454P703J4797L145j1459
357G4j4970j689J6580J5600q314k2033m826J6431J5780r63j8259j4312J0642K3975
371A3716L958k0851j6722P952K1642J0594j5367k3884P66K4230J4187j2314k2359
384a4452o862J5853K2845M25k6285j8802J4151K8033P237k1388k4242L692K9205
397I410J7031j8663k5985N86K2235J5419o569k0973r094J4651J8707k984j6582
410b811q256N779J2393N849q386j3724m43J1502Q345k673r653q130M434J4411
424H637M690j1336j0858K219J0961Q464k937j2820p566R068J2772J259j0142j0596
$$ plain form
438 -8185 -9040 3328 14502 8131 -7580 -12862 -2786 9093 10754 -726 -14754 -11291 7055
451 7055 14936 1964 -14149 -13324 3294 16838 7941 -13281 -17124 1845 16859 8491 -9842
464 -9842 -16956 -4738 13086 12825 -6388 -19683 -9970 7859 12110 -561 -16443 -17244 195 13585
478 13585 5057 -13004 -18261 -5521 9804 10973 -5454 -18275 -9259 9747 12722 -1593 -13463
491 -13463 -10532 3606 12437 3961 -11133 -12601 -582 8391 4530 -5709 -13234 -8559 3717 7289
505 7289 -2837 -12296 -10792 -2412 5171 3877 -6580 -14247 -7394 5140 8308 -441 -11191 -12118
519 -12118 744 12311 5970 -9251 -12417 -1670 9147 9448 -1022 -11238 -6848 7337 12803
532 12803 3634 -7366 -8047 2929 13850 11452 -3260 -9987 991 14979 15133 2167 -8684
$$ packed form
438h185q55J2368J1174o371j5711n282J0076J1879J661j1480j4028L463J8346
451G055P881j2972j6113Q25J6618J3544q897k1222l843J8969J5014q368j8333
464i842p114J2218J7824k61j9213j3295R713J7829M251j2671j5882q01J7439J3390
478A3585q528j8061n257J2740J5325J169j6427j2821R016J9006K975j4315j1870
491a3463K931J4138Q831q476j5094j468J2019Q973l861j0239p525M675J2276L572
505G289j0126r459J504Q380P583j294j0457p667O853J2534L168q749j0750r27
519a2118J2862J1567o341j5221l166J0747J0817L01j0470j0216M390J4185N466
532A2803r169j1000o81J0976J0921k398j4712o727J0978J3988J54j2966j0851
$$ plain form
545 -8684 -4059 12436 18987 4666 -10538 -6750 8992 16346 6977 -9098 -12751 1027 13214
558 13214 6485 -8841 -14098 -6094 5087 6929 -4309 -15191 -11121 1860 6454 -1627 -10904 -12184
572 -12184 -3542 5660 3398 -7928 -12152 -4773 4160 4537 -2587 -11516 -9417 1823 6546 -1717 -11448
587 -11448 -10486 -3011 3182 1052 -7674 -13517 -8032 578 1905 -4143 -11307 -12861 -4691 3617 452
602 452 -10162 -14680 -7592 1858 4030 -4535 -15400 -12659 882 6972 -1988 -12959 -13407 -2843
616 -2843 6610 2728 -9987 -14172 -4034 6436 5116 -4575 -11915 -8156 3898 9459 124 -11667
630 -11667 -10535 789 8887 4866 -8032 -14143 -5327 6575 5331 -6648 -14770 -10888 23 5487
644 5487 -3739 -16388 -15288 -3601 3227 -2311 -11660 -14707 -7870 2174 2199 -6829 -11805 -7030 1640
$$ packed form
545h684M625J6495O551j4321j5204L788J5742P354r369j6075l653J3778J2187
558A3214o729j5326n257Q004J1181J842j1238j0882M070J2981M594q081r277j280
572a2184Q642R202k262j1326m224P379Q933L77p124q929K099J1240M723q263r731
587a1448R62P475O193k130q726n843N485Q610J327o048p164j554Q170Q308l165
602D52j0614m518P088R450K172q565j0865K741J3541O090q960j0971m48J0564
616b843R453l882j2715m185J0138J0470j320r691p340L759J2054N561r335j1791
630a1667J132J1324Q098m021j2898o111Q816J1902j244j1979q122L882J0911N464
644E487r226j2649J100J1687O828n538r349l047O837J0044K5r028m976M775Q670
$$ plain form
659 1640 5154 974 -6458 -6750 2620 9496 6630 -951 -3645 892 9187 11831 4058 -4208 -852
674 -852 8782 12079 5856 -1700 -3128 4169 10803 7646 -1090 -4052 336 6091 7603 1509 -5921
689 -5921 -5318 2791 6957 2027 -5594 -8274 -2895 4294 4389 -5231 -11113 -5583 2694 3809 -3134 -10396
705 -10396 -9491 489 6217 -384 -10315 -10106 -1107 5985 3173 -6103 -11141 -3864 5721 5309 -3029 -9335
721 -9335 -6883 1108 6055 428 -9814 -10807 -2211 3925 927 -7931 -12707 -8084 1557 3229 -5680
736 -5680 -12978 -9563 -998 3042 -1379 -9425 -10043 -1649 4830 1814 -4669 -6730 -2714 4210 6976
751 6976 1092 -5567 -4097 3655 7887 5037 -1996 -5539 -98 7782 6951 -1209 -6591 -3027 3958
766 3958 7057 1754 -7137 -7118 1133 6315 1884 -5646 -8104 -3273 3725 4158 -3762 -8942 -5375 1477
$$ packed form
659A640L514m180p432k92R370O876k866p581k694M537Q295K644p773q266L356
674h52R634L297o223p556j428P297O634l157q736k962M388N755J512o094p430
689e921O03Q109M166m930p621k680N379P189R5r620n882N530Q277J115o943p262
705a0396R05R980N728o601r931K09Q999P092k812r276n038P277R585m12q338o306
721i335K452P991M947n627j0242r93Q596O136k998q858m776M623R641J672q909
736e680p298L415Q565M040m421q046o18Q394O479l016o483k061M016O924K766
751F976n884o659J470P752M232k850p033l543N441P880q31q160n382L564O985
766C958L099n303q891J9Q251N182m431p530k458M831O998M33p920n180L567O852
$$ plain form
782 1477 3691 -473 -7264 -8177 -667 5576 2083 -5602 -6802 -1290 5050 5691 -578 -6229 -2398 6487
798 6487 8934 3117 -2807 -1566 5437 10648 7065 -560 -1886 4918 9337 8275 2850 -1649 362
813 362 7142 9402 3282 -2830 -2263 2805 7130 5295 -2087 -5875 -897 5964 5136 -1157 -5553 -2864
829 -2864 3779 6800 1484 -5191 -4200 2686 6725 4071 -2460 -4871 -283 6870 5587 -834 -4576
844 -4576 -1832 3386 5713 1994 -4336 -5343 943 6020 3015 -3357 -6479 -2637 3990 4977 -1571
859 -1571 -7442 -4681 2186 5106 1178 -5514 -6773 -353 5438 2455 -4162 -6139 -1820 3196 4318
874 4318 -644 -6232 -4600 2133 5389 2025 -3536 -5285 199 6088 5400 -1661 -4404 -100 6017
889 6017 6766 1984 -3201 -1879 4951 8277 3211 -2284 -2510 2170 6378 4838 -627 -3964 -584 4510
$$ packed form
782A477K214m164o791r13P510O243l493p685j200N512O340O41o269n651L831Q885
798F487K447n817n924J241P003N211l583p625j326O804M419j062n425m499K011
813C62O780K260o120o112N67N068M325j835p382l788M978O861q28o293m396K689
829b864O643L021n316o675R91O886M039k654o531k411M588P153j283o421l742
844d576K744N218K327l719o330j007O286N077l005o372l122L842O627R87o548
859a571n871K761O867K920l928o692j259O420N791k983o617j977M319N016J122
874D318m962n588J632O733L256l364n561j749N484N889o88p061k743M304O117
889F017P49m782n185J322O830L326n066n495k26M680M208j540n465l337L380N094
$$ plain form
905 4510 4473 336 -3561 -3561 1092 4870 1948 -4064 -4324 97 4284 3409 -1059 -4442 -1950 4488 5554
922 5554 947 -3616 -1970 3022 6143 3461 -2549 -3824 1931 5678 3596 -899 -3431 -879 4251
937 4251 5596 559 -3853 -2616 2576 5630 3319 -2252 -4267 418 5992 4609 -1075 -4034 -1345
952 -1345 4052 6106 856 -4668 -2780 3066 5212 1826 -2962 -4131 -537 4286 3323 -2102 -4705
967 -4705 -1869 2427 3717 995 -3685 -3835 1371 4875 2203 -2141 -4195 -555 4705 4908 -313 -4751
983 -4751 -1868 3887 4916 1206 -3566 -3697 1265 4921 2109 -3398 -4452 -649 2773 3002 -869 -4526
999 -4526 -2828 2437 3951 538 -3129 -3717 242 4124 3087 -2124 -4188 -243 4230 3613 -260 -3317
1015 -3317 -2122 2879 4964 642 -3766 -3042 1343 3701 1839 -2069 -3868 -736 3484 2997 -862
$$ packed form
905D510l7m137l897%M653L778k922o012k60M421M187q75m468l383K492O438J066
922E554m607m563J646M992L121k682o010j275N755L747k082m495k532K552N130
937D251J345n037m412J237N192L054k311n571k015M685N574j383n684k959K689
952a345N397K054n250n524J888N846K146l386m788j169L594M823r63n425k603
967d705K836M296J290k722m680j50N206L504k672m344k054L640N260K03n221m438
983d751K883N755J029l710m772j31M962L656k812n507j054L803L422K29l871l657
999d526J698N265J514l413l667n88L959L882j037n211k064L945M473o17l873l057
1015c317J195N001K085m322m408P24M385K358j862l908j799L132M220m87l859
$$ plain form
1030 -862 -3203 -2061 1766 4313 2066 -2678 -3326 1380 4576 2868 -1275 -3273 -779 4334 4431 -715
1046 -715 -3913 -2093 2500 3976 813 -3613 -3852 860 4005 1565 -2539 -3506 -1063 2538 3286 -645
1062 -645 -3776 -2323 2151 3465 1276 -2269 -3739 228 4128 2587 -2497 -4131 -1499 2433 3398
1077 3398 -439 -4975 -3098 1889 3391 -165 -3474 -3738 -562 2902 1892 -1790 -3938 -1226 2600
1092 2600 2765 293 -3176 -2816 1484 4149 1514 -2615 -3216 -218 3390 3289 -1004 -4403 -2092 3126
1108 3126 3258 -771 -3615 -2563 1144 3434 1165 -2673 -2951 627 3260 2077 -747 -2825 -1116
1123 -1116 2767 3497 456 -2435 -1247 1558 3380 2598 -1397 -2956 -2 3885 2667 -902 -2681
1138 -2681 -1236 2455 3568 269 -3044 -1752 2118 3551 1740 -1110 -2004 847 3665 3108 -413
$$ packed form
1030h62k341J142L827K547k247m744o48M706L196j708m143j998K494N113R7n146
1046g15l198J820M593J476l163m426k39M712L145k440m104r67K443L601P48l931
1062f45l131J453M474J314k189l545j470L967L900j541n084j634K632L932R65
1077C398l837m536J877M987J502l556l309k64L176L464j010l682k148K712L826
1092B600J65k472l469L60M300K665k635m129o01K998L608j01m293l399K311N218
1108C126J32m029k844J052L707K290k269l838k78L578K633j183k824k078J709
1123a116L883P30l041k891J188K805J822p82l995j559K954L887j218l569j779
1138b681J445L691J113l299l313J292L870J433j811k850q94K851K818n57l521
$$ plain form
1153 -413 -1764 -58 2343 3831 1363 -2072 -1896 1982 4028 1821 -1578 -2665 -175 3472 3181 -1076
1169 -1076 -3502 -1014 2799 3101 81 -2760 -2387 1420 3375 949 -2056 -2019 549 2614 2646 -57
1185 -57 -2538 -1367 2286 2865 361 -2061 -2686 214 3273 2081 -2339 -3537 -578 2498 2291 -930
1201 -930 -3669 -2191 1670 2928 -96 -2851 -2316 474 2686 1559 -1535 -3194 -736 2327 1968 -722
1217 -722 -2709 -2203 1119 2993 1089 -2478 -2453 559 2824 1596 -1205 -2616 -764 3132 2802 -137
1233 -137 -2096 -493 2245 3201 1527 -1405 -1089 2013 3593 1709 -78 -1333 -157 2397 2884 280
1249 280 -2140 -1085 1283 2396 981 -1656 -2665 -309 2516 1518 -1483 -2944 -850 1820 2771 298
1265 298 -2558 -1231 2063 3134 916 -1112 -1091 1303 3141 2597 -184 -1185 591 2893 3147 1043
$$ packed form
1153d13j351J706K401J488k468l435J76L878K046k207l399j087K490L647k91m257
1169a076k426K488L813L02l020k841L73L807J955k426l005L7K568K065L2k703
1185e7k481J171L653N79k504k422o25K900L059j192m420j198K959L076k07l221
1201i30k739J478L861J258l024k755N35K790K212j127l094j659K458L063l59k690
1217g22j987N06L322J874j904l567K5L012K265j228k801j411J852L896l30k939
1233a37j959J603K738R56j674k932L16L102J580j884j787j255J176K554M87k604
1249B80k420J055K368J113j415k637j009K356K825r98l001j461K094K670R51k473
1265B98k856J327L294J071k218k028K1K394J838n44k781j001J776K302K54k104
$$ plain form
1281 1043 -1053 -737 2275 3975 1876 -1174 -1219 1163 3500 2641 -424 -1976 396 3312 2720 191
1297 191 -1826 -701 1911 3203 743 -1457 -1492 630 2035 1911 -355 -2191 -1308 2030 2065 -86 -2166
1314 -2166 -1656 615 2528 1152 -1968 -2788 105 2924 1997 -638 -2232 -1028 1734 2546 -331 -2244
1330 -2244 -1676 880 1650 624 -1617 -2832 -559 1261 1084 -1368 -2799 -2123 108 1403 -444 -2930
1346 -2930 -2928 27 1599 545 -1263 -2681 -814 2141 1929 -349 -1988 -487 1857 2164 506 -1204
1362 -1204 -1010 1153 2734 1338 -814 -1372 398 1978 2315 286 -1946 -892 1650 2300 745 -1328
1378 -1328 -1772 831 2485 1330 -1614 -1918 126 2036 1493 -854 -2249 -1069 1740 1558 -449 -2046
1394 -2046 -1740 203 1326 495 -1567 -2088 -573 1344 1324 -452 -1621 -1009 1191 2204 1022 -1403
$$ packed form
1281A043k096L16L012J700k099l050m5K382K337q59l065j552K372K916n92k529
1297A91k017J125K612J292k460k200l5K122J405j24k266j836Q83L338L5k151k080
1314b166N10K271J913j376l120q20K893K819r27k635j594J204K762Q12k877j913
1330b244N68K556P70j026k241j215K273J820j77k452j431O76K231J295j847k486
1346b930KK955J572j054j808j418J867K955k12k278j639J501K344L07j658j710
1362a204J94K163J581j396k152n58J770J580L37k029k232J054K542O50j555k073
1378a328m44K603J654j155k944l04K044J910n43k347j395J180K809j82k007j597
1394b046L06J943J123q31k062n21J515J917k0j776j169O12K200J013j182k425
$$ plain form
1410 -1403 -911 1272 2547 1800 -401 -1204 359 2278 2001 -253 -1419 -796 1425 2035 764 -1801
1426 -1801 -1625 245 1214 729 -1225 -1964 -1099 1431 1689 -395 -2152 -1573 682 1873 823 -1606 -2028
1443 -2028 363 2203 1272 -1124 -1887 -265 1511 1729 -307 -2121 -1194 1161 1644 -150 -1369 -1768
1459 -1768 -516 1324 819 -1001 -2152 -1072 829 1247 -257 -2294 -1997 541 1402 134 -1881 -1968
1475 -1968 -581 1189 703 -1379 -2574 -933 953 500 -750 -1851 -1539 252 1176 94 -1401 -1363
1491 -1363 -107 1026 1315 -452 -1346 -572 1685 1761 225 -1068 -964 1136 2145 952 -1025 -1305 430
1508 430 1858 817 -559 -1808 -774 1092 1274 -373 -1762 -1068 260 1247 272 -1074 -1794 -233
1524 -233 1427 1220 -239 -1644 -579 864 2013 313 -1711 -939 747 1606 962 -1033 -1806 -218
$$ packed form
1410a403M92K183J275p47k201q03J563J919k77k254j166O23K221O10j271k565
1426a801J76J870R69m85j954p39Q65K530K58k084j757N79K255J191j050k429m22
1443b028K391J840r31k396p63J622J776K18k036j814R27K355M83j794j219l99
1459a768J252J840n05j820j151J080J901M18j504k037K97K538Q61j268k015q7
1475a968J387J770m86k082j195J641J886m53j250j101L12J791R24j082j495L8
1491a363J256J133K89j767q94P74K257P6j536j293J04K100J009j193j977k80J735
1508D30J428j041j376j249J034J866J82j647j389O94J328R87r75j346p20J561
1524b33J660k07j459j405J065J443J149j700k024P72J686Q59o44j995p73J588
$$ plain form
1540 -218 1480 1197 -1144 -1728 -289 1119 1224 251 -1285 -1184 254 1518 386 -626 -1673 -221
1556 -221 1044 1368 -415 -1314 -800 1033 1340 513 -1445 -1685 8 1491 325 -1446 -1688 -494 1134
1573 1134 865 -619 -1685 -501 457 798 30 -829 -904 97 1244 754 -389 -805 -197 940 1264 -16
1591 -16 -1167 -1224 961 1659 -48 -1269 -987 344 1260 388 -952 -1553 -419 1431 700 -532 -1357 -1036
1609 -1036 657 1283 222 -941 -1283 267 1202 467 -360 -1235 -291 986 1129 -243 -1514 -888 573
1626 573 1099 401 -1313 -1335 432 1001 428 -674 -979 -341 917 1096 -199 -1082 -540 503 963 458
1644 458 -815 -1120 -26 1213 1210 -306 -1318 -272 990 1066 227 -1303 -1017 361 1244 93 -1095
1661 -1095 -1139 83 1272 785 -817 -1076 -225 990 1160 53 -966 -570 685 1410 407 -516 -996
$$ packed form
1540b18J698k83k341n84J439J408J05r73j536J01J438J264j132j012j047J452
1556b21J265L24j783q99N14J833L07q27j958k40J693J483j166j771k42J194J628
1573A134k69j484j066J184R58L41p68q59p5J001J147m90j143m16O08J137L24j280
1591a6j151n7K185O98j707j221K82J331R16q72j340o01J134J850p31j232q25L21
1609a036J693O26j061j163l42J550R35p35q27q75R44J277J43j372j271O26J461
1626E73N26o98j714k2J767N69n73j102l05O38J258J79j295q83N42J043M60n05
1644D58j273l05J094J239lj516j012J046J262P6q39j530K86J378Q83j151j188
1661a095m4J222J189m87j602k59Q51J215J70j107j019L96J255P25j003r23m80
$$ plain form
1678 -996 -339 1022 825 -551 -1341 -318 821 1050 -230 -1297 -1144 106 984 229 -1233 -1092 -27
1695 -27 816 633 -249 -994 -470 729 773 3 -712 -480 467 1049 561 -688 -967 -38 1105 909 -598
1714 -598 -1108 -911 671 896 -186 -1143 -608 485 797 539 -644 -1022 270 1070 720 -406 -672 -456
1732 -456 623 1042 327 -848 -507 378 997 417 -432 -757 -112 1006 825 -203 -1244 -464 723 893
1750 893 -17 -910 -1277 336 1141 573 -746 -763 236 851 853 13 -997 -358 776 630 -161 -767 -520 257
1770 257 1001 485 -682 -893 -406 615 1000 -89 -1062 -572 685 999 31 -905 -577 180 755 741 -512
1789 -512 -907 -74 716 825 -330 -322 -290 124 905 3 -834 -534 -73 835 633 -300 -1261 -600 929 497
1809 497 -347 -1088 -408 280 924 321 -886 -736 41 739 310 -523 -690 1 982 455 -345 -803 -273 165
$$ packed form
1678i96O57J361j97j376p90J023J139K29j280j067J53J250Q78p55j462J41J065
1695b7Q43j83q82p45N24J199M4p70p15K32R47N82m88j249k79R29J143j96j507
1714e98n10J97J582K25j082r57N35J093L12k58j183l78J292Q00l50j126k66K16
1732d56J079M19p15j175L41Q85O19n80q49l25O45J118j81j028j041P80J187J70
1750H93r10q93l67J613Q05n68j319j7R99O15Kq40j010O39J134j46p91o06K47P77
1770B57P44n16j167k11M87J021L85j089r73M90J257L14r68r36L28P57N75j4j253
1789e12l95Q33P90J09j155QL2M14P81r02q37L00M61R08k02r33r61O61J529m32
1809D97q44p41O80O88O44o03j207J50P77O98m29q33j67O91R81n27q00m58N30M38
$$ plain form
1829 165 787 360 -696 -681 -118 694 589 -569 -762 -207 515 1104 -31 -947 -690 623 815 418 -580
1848 -580 -382 90 909 406 -471 -684 -227 626 800 -264 -613 -549 280 770 -15 -800 -797 -102 320 638 -571
1869 -571 -1208 -85 755 642 -198 -492 -298 537 958 507 -390 -505 249 653 519 -296 -791 -154 405 848
1889 848 2 -748 -540 6 758 -54 -745 -678 -3 755 565 -461 -582 -234 770 1031 -5 -735 -340
1908 -340 405 809 286 -572 -570 178 486 685 -214 -849 -540 427 493 43 -604 -443 -15 552 411 -303 -595
1929 -595 -347 436 429 -233 -681 -28 484 927 -93 -658 -338 298 659 -49 -502 -551 -258 257 415 -82 -608
1950 -608 -315 471 685 164 -629 -613 204 827 608 114 -687 78 739 426 -173 -742 -169 579 814 308
1970 308 -258 -301 195 906 -84 -574 -498 -161 45 596 -196 -734 -572 288 612 333 -503 -133 142 530 466
$$ packed form
1829A65O22m27j056J5N63Q12j05j158j93N55P22N89j135r16K57J313J92l97r98
1848e80J98M72Q19n03q77k13M57Q53J74j064l49O4Q29M90p85p85LO95M22L18j209
1869e71o37J123Q40j13q40k94J94Q35M21m51q97j15P54M04j34q15m95O37N59M43
1889H48q46p50K08N46P52q12o91O7O75P58j90j026j21L48J004K61j036p30L95
1908c40P45M04n23q58KP48L08J99q99o35L09R67O6m50o47J61M28N67j41p14k92
1929e95K48P83po62m48O53N12M43j020n65L20O36L61p08m53m9K93N15J58m97n26
1950f08K93P86K14n21p93J6Q17O23k19m94q01P65O61l13n99n69N73P48K35n06
1970C08n66m3M96P11r90m90P6L37K06N51p92n38J62Q60L24k79q36L70K75L88o4
$$ plain form
1991 466 -190 -479 113 771 589 35 -642 -116 433 844 76 -362 -520 118 525 219 -368 -491 -41 758
2011 758 335 205 -386 -380 247 543 39 -263 -230 -130 989 460 -205 -448 -289 361 828 -281 -824 -343
2031 -343 482 496 268 -764 -592 63 235 458 -160 -587 -189 582 190 -201 -461 -695 416 484 245 -384
2051 -384 -621 9 429 325 -601 -495 15 217 254 -291 -326 -732 206 606 -84 -112 -266 -189 265 307 -297 -371
2073 -371 -175 257 362 -293 -260 -344 313 811 114 -442 -469 5 400 250 -252 -589 -213 373 465 -261 -610
2094 -610 -128 276 369 -46 -400 -673 -11 436 205 -230 -393 -338 162 743 52 -829 -225 306 235 210 -196
2115 -196 -424 0 274 350 -217 -347 -187 452 364 -81 -668 -406 419 280 -36 -402 -363 34 486 559 -274
2136 -274 -379 15 290 313 6 -658 -557 259 830 381 -83 -476 -257 427 79 -70 -839 -345 384 298 285
$$ packed form
1991D66o56k89N92O58j82n54o77N26N49M11p68m38j58O38M07l06n87j23M50P99
2011G58m23j30n91OO27K96n04l02L3J00J119n29o65k43J59O50M67j109n43M81
2031c43Q25J4k28j032J72O55J72K23o18m27L98P71l92l91k60k34J111O8k39o29
2051c84k37O30M20j04r26J06N10K02L7n45l5m06R38M00o90k8j54P7M54M2o04p4
2073c71J96M32J05o55L3q4O57M98o97n56k7M74L95j50n02l37L76N86R2p26l49
2094f10M82M04R3m15l54k73O62M47k31m35j63N5N00N81o91q81O04N31p1k5m06
2115a96k28M24K74P6n67j30J60O39q8m45n87K62Q25j39l16l66L9L97M52P3q33
2136b74j05L94K75K3l07o64J01Q16N71m49m64l93K19O84l48j49p69M94P29q6j3
$$ plain form
2157 285 -74 -435 319 506 37 -309 -153 88 387 192 -15 -451 -216 325 448 -85 -357 -328 -178 332
2177 332 342 -214 -174 -16 512 222 -226 -376 -231 -56 475 -194 -361 -125 42 276 116 -179 -393 -56 404
2198 404 644 -139 -455 -212 162 506 -132 -680 -299 105 195 30 -198 -330 143 168 173 -122 -432 -218 130
2219 130 591 121 -366 -74 234 300 219 -83 -246 -64 105 305 195 -509 -88 202 206 392 -202 -660 235
2240 235 284 207 -374 -579 -158 221 442 113 -472 -552 90 209 397 -329 -317 -195 479 219 -231 -319 216 135
2262 135 213 -70 -524 -227 186 260 104 -327 -475 377 408 -25 -265 -519 -83 12 260 -209 -365 -16 401
2283 401 392 -121 -218 -190 175 305 10 -338 -374 -15 259 286 6 -467 -108 15 198 108 167 -169 164 397 320
2306 320 -127 -5 -106 343 213 -95 -244 -129 99 297 170 -325 -304 2 349 119 -429 -383 -305 64 207
$$ packed form
2157B85l59l61P54J87m69l46J56K41K99j95k07m36K35N41J23n33k72K9J50N10
2177C32J0n56M0J58N28k90m48j50J45J75N31o69j67K36J67K34j60k95k14L37M60
2198D04K40p83l16K43L74L44o38n48L81M04R0j65k28j32M73K5Nk95l10K14L48
2219A30M61m70m87K92L08O6q1l02j63J82J69K00j10p04M21K90MJ86n94m58Q95
2240B35M9p7n81k05M21L79K21l29n85q0O42J19J88p26J2J22O74k60m50q8N35q1
2262A35P8k83m54K97M13P4j56m31j48Q52L1m33k40k54M36R5K48m69j56L49M17
2283D01rn13r7K8L65J30k95l48l6L59K74K7k80m73L59J23J83r0N9l36L33K33p7
2306C20m47J22j01M49j30l08j49J15K28J98j27m95K1L06L47k30n48M6P8L69J43
$$ plain form
2327 207 35 -263 -447 202 320 139 -310 -526 -13 611 378 -85 -544 -61 307 309 8 -344 -51 -34 291
2348 291 199 -358 -226 -253 484 78 -225 -526 -460 309 189 -50 -276 110 155 408 2 -477 -550 284 -33 221
2370 221 -41 -465 -262 167 310 -172 -499 -32 167 14 236 -225 13 7 71 292 -153 -400 -298 -40 368
2391 368 212 -255 -103 -289 426 426 -159 -248 74 486 510 -79 -201 -71 -26 370 262 -343 -302 204 207 195 -108
2414 -108 -81 110 475 -5 -248 45 -365 202 184 -185 -268 -357 109 613 95 -146 -342 -124 405 287 -80
2435 -80 -504 -83 201 269 82 -107 -189 -107 256 256 -464 -469 40 318 192 92 -308 -159 387 414 10 -342 -161
2458 -161 -22 403 -72 -132 -321 -66 203 291 126 -456 -84 38 66 522 -129 -254 -100 20 157 -83 -250
2479 -250 -129 145 236 184 -155 16 -41 179 33 -350 -433 -223 79 160 -63 -137 40 150 136 37 -444 -183 63
$$ packed form
2327B07j72k98j84O49J18j81m49k16N13O24k33m63m59M83L68Kl01l52K93J7L25
2348B91r2n57J32k7P37m06l03l01O6P69j20k39k26L86M5K53m06m79p3Q34l17K54
2370B21k62m24K03M29J43m82l27M67J99j53K22m61K38oO4K21m45k47J02K58M08
2391C68j56m67J52j86P15%n85q9L22M12K4n89j22J30M5L96j08o05M1N06Lj2l03
2414a08K7J91L65m80k43K93m10N67j8l69q3q9M66N04n18k41j96K18N29j18l67
2435h0m24M21K84O8j87j89q2Q2L63%p20nN09K78j26j00m00J49N46K7m04l52J81
2458a61J39M25m75o0j89K55K69Q8j65n82L72J22K8M56o51j25J54J20J37k40j67
2479b50J21K74R1n2l39J71n7K20j46l83q3K10L02Q1k23p4J77J10j4r9m81K61K46
$$ plain form
2502 63 166 39 -273 -163 -8 178 398 -113 -424 0 456 386 -109 -307 -76 465 489 -428 79 -89 -77
2523 -77 332 35 -185 -161 -304 111 96 -257 -297 -74 213 -2 -188 75 -69 95 -22 4 -36 -60 65 418
2545 418 45 67 -325 75 129 67 270 -396 -290 122 120 170 -184 -376 -12 448 -2 175 -5 -241 223 402
2567 402 91 -213 -357 248 130 -11 -100 -361 -280 87 412 159 -149 -313 -129 75 182 -227 -426 -228 -53
2588 -53 110 -137 -350 -112 307 87 -108 -372 -363 -79 232 48 34 -72 68 74 304 -40 -153 -55 -20 -1 -286
2611 -286 -427 -25 263 394 -296 -2 -186 -29 116 -101 -118 47 97 -16 132 273 -109 -256 204 223 134
2632 134 269 -120 -124 371 234 -29 164 8 26 252 65 -154 -101 14 297 25 -196 -149 -11 285 511 181
2654 181 -219 18 83 339 -97 19 -124 -214 448 -81 -259 -244 -38 421 186 -134 86 -146 -325 -135 39
$$ packed form
2502F3J03j27l12J10J55J86K20n11l11M24M56p0m95j98K31N41K4r17N07j68J2
2523g7M09k97k20K4j43M15j5l53m0K23K87k15j86K63j44J64j17K6m0k4J25L53
2545D18l73K2l92M00N4o2K03o66J06M12kN0l54j92L64M60m50J77j80k36M64J79
2567D02l11l04j44O05j18j41q9k61Q1L67L25k53l08j64J84K04J07m09j99J98J75
2588e3J63k47k13K38M19k20j95k64RK84L11j84j4j06J40OK30l44j13R8L5J9k85
2611b86j41M02K88J31o90K94j84J57J45k17j7J65N0j13J48J41l82j47M60J9q9
2632A34J35l89mM95j37k63J93j56J8K26j87k19N3J15K83k72k21M7J38K96K26l30
2654A81m00K37O5K56m36J16j43r0O62n29j78J5K06M59k35l20K20k32j79J90J74
$$ plain form
2675 39 -436 -287 92 516 65 -73 -104 -1 398 174 8 -44 -72 406 29 156 -39 -151 323 156 -59
2696 -59 55 -219 32 199 121 8 259 96 4 236 -147 -171 -112 146 440 149 -13 16 -189 -233 -27 198
2718 198 9 -370 24 201 -284 -356 -167 -167 92 188 -39 0 -299 -74 214 -100 -82 -139 46 -67 89 74 -25
2741 -25 85 202 148 -139 59 -143 333 28 39 -222 -221 231 -11 151 -122 -334 87 -54 70 108 -71 93
2763 93 126 204 -244 -95 -170 406 199 -6 -74 -264 106 176 106 420 140 51 -150 282 -191 1 -144 63 235
2786 235 -78 258 -212 102 -165 -141 -145 91 -117 -233 43 49 -526 -146 171 -153 157 8 112 -140 217 194
2808 194 57 -86 -224 248 155 215 -79 -94 -84 -140 179 50 -282 108 5 93 44 4 247 255 270 363 -134 -193
2832 -193 258 413 222 -215 58 -115 90 -54 -146 -12 -1 412 -19 155 -445 -111 166 231 220 -64 -183
$$ packed form
2675C9m75J49L79M24m51j38l1J03L99k24j66n2k8M78l77J27j95j12M74j67k15
2696e9J14k74K51J67p8j13K51j63r2K32l83k4N9K58K94k91j62K9k05m4K06K25
2718A98j89l79L94J77m85p2J89%K59R6k27L9k99K25K88l14J8n7J85j13J56j5r9
2741b5J10J17n4k87J98k02M76l05J1k61JM52k42J62k73k12M21j41J24L8j79J64
2763I3L3P8m48J49p5N76k07k05o8j90L70P0p0L14k80q9k01M32m73J92j45K07J72
2786B35l13L36m70L14k67K4mK36k08j16K76On75L80L17l24L10j49J04k52L57k3
2808A94j37j43j38M72r3O0k94j5J0n6L19j29l32L90j03Q8m9m0K43QJ5R3m97n9
2832a93M51J55j91m37K73j73K05j44r2J34J1M13m31J74o00L34K77O5j1k84j19
$$ plain form
2853 -183 -132 -38 183 105 138 -151 92 -121 -34 -109 262 57 69 12 -77 -121 54 119 240 80 -103 16 56 250
2877 250 -95 172 -69 83 -77 -117 -56 -204 63 114 226 28 135 140 -81 155 180 -49 54 -74 106 331
2899 331 -251 -97 -47 -69 51 -181 -27 -73 22 -46 405 15 -70 -10 486 355 -65 -92 143 -84 183 -27 32
2922 32 -10 249 342 207 -37 -306 -83 -53 83 -99 -82 -233 210 -218 -49 39 27 44 336 -43 -254 70 -108
2945 -108 90 139 -221 85 -41 -50 101 165 -255 136 38 253 -107 -462 -213 39 -34 -117 -85 -51 61 -106 211
2968 211 237 -98 36 -72 -94 89 -92 62 37 360 -132 163 -100 -43 -88 88 241 -280 -181 166 240 -108
2990 -108 138 -192 282 266 210 -148 24 -19 -44 151 -105 -202 107 400 256 184 287 -313 239 -349 51 27
3012 27 253 -205 151 158 -73 331 -178 129 -239 67 -198 6 192 74 -184 -215 170 -193 197 -61 91
$$ packed form
2853a83N1R4K21p8L3k89K43k13Q7p5L71k05J2n7q9m4J75O5J21j60j83J19M0J94
2877B50l45K67k41J52j60m0O1j48K67N1J12j98J07Nk21K36K5k29J03j28J80K25
2899C31n82J54N0k2J20k32J54m6R5o8M51l90q5O0M96j31m20k7K35k27K67k10N9
2922C2m2K59R3j35k44k69K23L0J36j82J7j51M43m28J69Q8j2J7K92l79k11L24j78
2945a08J98M9l60L06j26rJ51O4m20L91r8K15l60l55K49K52p3q3L2L4J12j67L17
2968B11K6l35J34j08k2J83j81J54k5L23m92K95k63N7m5J76J53n21R9L47P4l48
2990a08K46l30M74j6n6l58J72m3k5J95k56r7L09K93j44p2J03o00N52n88M00k4
3012B7K26m58L56Pk31M04n09L07l68L06k65K04J86j18k58l1L85l63L90k58J52
$$ plain form
3033 91 -79 333 116 -74 -149 88 -28 -74 94 6 -84 -224 -93 43 -239 -11 -117 -167 -158 107 191 -370 82
3056 82 16 103 -136 104 162 208 -88 -38 155 144 42 -136 358 -49 5 -158 297 13 -22 119 -83 287 47
3079 47 166 -112 -106 -85 -101 94 -159 -336 80 -163 -171 158 -136 -129 51 -123 -15 -140 -60 -367 131 -81 32
3102 32 1 -281 -93 -33 -176 13 220 -43 -125 259 -141 -437 85 -125 77 -3 -158 19 48 54 247 134 -25
3125 -25 -60 -139 347 -85 -315 82 155 65 225 -49 -180 104 260 201 224 -2 -233 -48 242 -141 224 127 49
3148 49 352 4 111 -17 143 -35 141 246 -183 -108 -18 25 64 195 -198 84 -175 151 182 27 78 241
3170 241 -113 1 40 232 18 -2 130 -90 273 -69 92 -67 -3 143 -192 -239 320 -46 -115 -83 233 95
3192 95 -40 -51 -247 214 16 358 -179 -204 79 -149 61 -198 -44 -158 120 -125 42 110 -38 276 253 57
$$ packed form
3033I1j70M12k17j90p5K37j16m6J68q8r0j40J31J36k82K28j06n0RK65Q4n61M52
3056H2o6Q7k39K40N8M6k96N0J93j1j02j78M94m07N4j63M55k84l5J41k02L70k40
3079D7J19k78OK1j6J95k53j77M16k43qL29k94PJ80j74J08j25Q0l07M98k12J13
3102C2l1k82J88O0j43J89K07k63q2L84m00k96N22k10K02q0j55J77K9OJ93j13j59
3125b5l5p9M86m32k30L97P3r0J60k74j31K84J56n9K3k26k31J85K90l83L65r7p8
3148D9L03l48J07j28J60j78J76J05m29P5R0M3L9J31l93K82k59L26L1j55N1J63
3170B41l54J14L9J92k14k0J32k20L63l42J61j59O4J46l35m7N59l66o9L2L16j38
3192I5j35j1j96M61j98L42n37k5K83k28K10k59J54j14K78k45J67O8j48L14k3j96
$$ plain form
3214 57 92 -191 -179 -102 65 -37 -436 277 220 77 70 -86 2 -32 -110 181 -198 18 -95 134 21 -24 105 47
3238 47 -74 -137 67 40 121 135 -37 144 -91 232 -22 190 85 -303 -146 -59 -77 28 -21 279 81 -323 -36
3261 -36 243 -38 -54 159 -161 -258 271 74 203 33 -50 78 76 -299 -153 -96 -6 -59 102 250 -53 78 -75
3284 -75 230 -153 179 174 154 192 -116 -86 195 45 -178 -231 -93 89 159 -45 -317 -167 56 54 35 17 197 -220
3308 -220 -124 295 498 -174 -130 95 -111 271 -79 177 -99 -88 189 52 -158 28 12 192 5 -166 96
3329 96 68 52 67 17 -164 140 42 -107 -251 103 -57 3 48 55 -4 -177 50 162 51 175 -216 7 336 26
3353 26 -253 -131 -104 20 -10 -99 -60 -17 139 116 -56 -44 -15 97 153 77 -235 -90 -78 -77 231 21 -60 -122 -302
3378 -302 206 108 -93 367 -493 165 299 84 -83 198 322 167 70 261 233 34 34 -61 -5 41 -7 132 244
$$ packed form
3214E7L5k83J2P7J67j02l99P13n7j43pj56Q8l4p8K91l79K16j13K29j13m5J29n8
3238D7j21o3K04k7Q1J4j72J81k35L23k54K12j05l88J57Q7j8J05m9L00j98m04K87
3261c6K79k81j6K13l20r7N29j97J29j70q3J28kl75J46N7R0n3J61J48l03J31j53
3284g5L05l83L32nk0L8l08L0K81j50k23n3J38J82P0k04k72J50K23kj9j8J80m17
3308b20R6M19K03o72M4K25k06L82l50K56k76J1K77j37k10J86j6J80j87j71K62
3329I6k8j6J5n0j81L04r8j49j44L54j60O0M5Pn9j73K27J12j11J24l91K23L29l10
3353B6k79J22K7J24l0q9L9M3J56k3j72J2K9J12N6p6l12J45J2JL08k10q1o2j80
3378c02N08r8k01M60q60O58J34k15j67K81J24j55r7J91k8j99%r5N6M6m8J39J12
$$ plain form
3401 244 -200 151 -202 53 -139 147 -33 -330 -152 243 163 161 -116 17 -147 -144 -16 187 -3 -292 149 14
3423 14 -288 -219 -98 27 -66 -69 166 -143 -130 -35 -98 -9 -14 -65 206 -8 -210 -188 -40 21 -160 221 112 -87 148
3448 148 71 -79 66 -181 -66 137 -10 -23 152 17 88 56 36 351 25 115 -72 -129 76 0 -124 317 6
3471 6 36 90 -84 -43 -101 -85 2 169 103 24 18 -369 77 -167 -28 119 -337 128 18 128 34 -157 -143 13 247
3496 247 45 0 -142 256 -406 197 -233 8 -265 -65 -28 -19 35 58 166 164 -26 -151 114 197 183 319 113
3519 113 106 85 -197 -15 216 151 -201 -62 -37 268 137 21 158 -73 275 8 86 -266 20 -42 84 186
3541 186 109 100 -4 23 142 98 -198 245 -107 -77 120 137 -68 56 -107 90 -45 4 300 79 47 -122 106
3564 106 -410 168 25 -125 15 -192 108 463 -154 -156 113 -162 -84 -164 -315 25 -25 -25 163 170 33 -92 -12
$$ packed form
3401B44m44L51l53K55j92K86j80k97J78L95q0kk77J33j64LJ28K03j90k89M41j35
3423A4l02O9J21J25r3lK35l09J3R5o3Q9nn1K71k14k02K2J48O1j81L81j09j99K35
3448A48p7j50J45k47J15K03j47j3J75j35P1l2k0L15l26R0j87n7K05p6j24M41l11
3471FL0N4j74M1n8J6Q7J67o6p9ol87M46k44J39J47m56M65j10J10r4j91J4J56K34
3496B47k02m5j42L98o62O03m30K41k73K00L7RN4K3J08kj90j25K65Q3j4J36k06
3519A13pk1k82J82K31o5l52J39K5L05j31j16J37k31L48k67P8l52K86o2J26J02
3541A86p7rj04K7J19m4k96M43l52L0J97J7k05J24j63J97j35M9K96k21l2j69K28
3564A06n16N78j43j50J40k07L00L55o17kK69k75P8q0j51L40n0%J88Pj37j25Q0
$$ plain form
3587 -12 49 126 -174 1 -239 24 -66 -194 80 -121 76 -227 -272 -98 -461 -119 15 48 8 132 -266 47
3609 47 -71 -45 -138 -48 230 246 -174 -22 244 -28 232 170 5 -220 -181 -119 42 -251 -174 -18 -92 203 16
3632 16 261 81 293 -5 43 -187 127 -98 341 75 -112 204 60 52 -237 -164 69 -18 -37 -141 103 -93
3654 -93 -200 69 -140 102 -283 -81 148 -272 -219 -119 167 11 -173 -162 358 -79 234 102 -73 -266 -23
3675 -23 -86 76 119 -25 7 68 23 -221 -98 29 7 42 162 100 -96 13 283 -68 -196 337 -252 -143 232
3698 232 -73 -25 169 103 -135 35 -235 70 102 -35 97 195 -25 -54 107 45 -79 -200 27 -197 382 -120
3720 -120 -17 -112 -18 446 72 -56 54 -308 14 144 -404 -126 158 79 138 143 540 -157 -165 -20 -202 -103 7
3743 7 -52 -43 90 206 -2 -253 -77 127 -94 -308 53 45 -23 -106 49 278 307 -15 160 -79 41 -239 -323 -330
$$ packed form
3587a2O1P7l00J75k40K63r0j28K74k01J97l03m5J74l63L42J34L3m0J24l98L13
3609D7j18K6r3R0K78J6m20J52K66k72K60o2j65k25L9O2J61k93P7J56p4K95j87
3632A6K45j80K12k98M8k30L14k25M39k66j87L16j44qk89P3K33q7j9j04K44j96
3654i3j07K69k09K42l85K02K29m20N3J00K86j56j84J1N20m37L13j32j75j93K43
3675b3o3J62M3j44L2O1m5k44J23J27k2L5J20o2j96J09K70l51j28N33n89J09L75
3698B32l05M8J94o6k38J70k70L05L2j37J32R8k20k9J61o2j24j21K27k24N79n02
3720a20J03r5R4M64l74j28J10l62L22J30n48K78K84p9N9NL97o97qJ45j82R9J10
3743Gn9RJ33J16k08k51J76K04k21k14L61qo8q3J55K29K9l22J75k39J20k80q4p
$$ plain form
3767 -330 -15 127 73 48 -18 -321 88 -107 -78 -218 -124 172 -25 -65 -135 -116 116 235 -109 225 50 -47 -26
3790 -26 32 -167 192 -81 2 332 -53 209 -76 16 -27 93 150 310 -266 -45 67 -201 -33 -19 -153 -30
3812 -30 -123 122 213 -10 142 -157 -82 -83 105 332 13 -103 184 204 54 86 10 -254 127 81 -39 -146 7
3835 7 -198 -171 107 236 141 191 11 56 391 -188 31 -34 153 -272 153 -111 90 0 139 45 -80 156 16
3858 16 218 99 -190 -59 45 -189 -36 -62 45 -540 -68 85 -118 7 -116 63 234 195 31 -48 -127 16
3880 16 -2 38 17 -91 -216 110 -163 -137 -180 -31 -48 -6 -221 39 -134 170 -70 -257 164 -66 -188 -26 54
3903 54 -176 168 148 87 197 139 -354 28 177 248 84 84 -251 -61 133 -145 -17 -114 206 1 -51 65 -118
3926 -118 73 449 44 104 442 150 -25 1 -73 -5 -128 -75 -12 -121 125 -62 -384 -234 34 50 141 239 -174
$$ packed form
3767c30L15J42n4k5o6l03M09j95K9j40R4K96j97m0p0J9K32J19l44L34j75r7K1
3790b6N8j99L59k73Q3L30l85K62k85R2m3J20N7J60n76K21J12k68J68J4j34J23
3812c0r3K45R1k23J52k99P5jJ88K27l19j16K87K0j50L2p6k64L81m6j20j07J53
3835Gk05K7K78J29r5N0j80M5L35n79K19o5J87m25M25k64K01r0J39r4j25K36j40
3858A6K02j19k89J31J04k34J53k6J07n85M72J53k03J25j23J79J71l9j64p9p9J43
3880A6j8M0k1j08j25L26k73K6m3J49j7M2k15K60j73L04k40j87M21k30j22J62Q0
3903E4k30L44k0o1J10n8m93L82J49P1j64%l35J90J94k78J28r7L20k05n2J16j83
3926a18J91L76m05O0L38k92j75K6p4O8j23N3O3j09K46j87l22J50K68J6R1R8m13
$$ plain form
3949 -174 -31 408 -327 63 -92 -334 -59 23 191 81 339 -41 -253 -109 -333 165 -92 29 -84 -49 -209
3970 -209 -114 -272 59 -157 196 99 -89 46 443 -36 -171 168 -168 151 174 34 -141 -14 -60 -168 135
3991 135 -97 89 -134 -150 -79 -31 157 -91 -101 190 -141 -263 47 -149 131 -16 188 -25 212 -121 -154 121
4013 121 -32 45 81 27 -215 -163 111 165 -147 129 285 232 65 82 128 -44 147 256 -15 -209 30 58 210
4036 210 229 -331 60 313 -149 140 261 -93 256 21 67 -72 -19 -127 63 -205 130 180 118 98 151 17
4058 17 210 129 270 105 216 56 -66 -72 -80 109 234 -82 -192 -30 22 186 251 288 -174 -54 11 -194 -100 116
4082 116 247 82 236 11 93 154 -31 -72 -149 19 203 225 -400 123 287 22 -128 41 270 -103 118 -445
4104 -445 -209 153 -72 57 65 -149 193 71 -19 89 -29 -117 224 -108 -326 -21 -107 -33 -27 378 -191 168 67
$$ packed form
3949a74J43M39p35L90j55k42K75Q2J68j10K58l80k12J44k24M98k57J21j13L5j60
3970b09R5j58L31k16L53r7j88J35L97m79j35L39l36L19K3j40j75J27m6j08L03
3991A35k32J86k23j6P1M8J88k48j0K91l31j22L10j96K80j47K04k13K37l33l3K75
4013A21j53P7L6n4k42N2K74N4l12K76J56n3j67J7M6j72J91J09k71j94K39K8J52
4036B10J9n60L91K53m62K89J21l54L49k35M6j39N3j08J90k68L35N0o2k0N3j34
4058A7J93q1J41j65J11j60j22oqJ89J25l16j10J62N2J64O5L7m62J20O5k05R4K16
4082A16J31j65J54k25Q2O1j85m1p7J68J84K2o25N23J64k65j50J69K29l73K21n63
4104d45K36L62k25J29Qk14L42j22r0J08j18q8L41l32k18L05q6P4OM05n69L59j01
$$ plain form
4127 67 -158 307 29 50 342 222 -95 203 274 -139 76 294 -15 12 -8 -7 -8 -31 -191 190 9 6 27 -35 211
4152 211 -189 -129 -287 -152 -265 219 273 50 -59 -184 89 -127 -1 17 81 -16 119 139 -66 -85 93 -307
4174 -307 48 -62 -17 -16 32 124 42 5 5 -66 150 -2 -130 135 161 -10 166 113 57 110 -178 92 187 258 -40
4199 -40 -94 195 -210 -67 202 -98 -122 311 -76 156 67 -54 118 -45 151 -101 -163 106 270 136 239 -96
4221 -96 86 -27 -35 -131 96 27 397 -109 8 79 -62 -42 -145 276 -93 -46 -73 327 -11 -67 51 -93 285
4244 285 -91 -185 -128 110 54 -162 -132 -267 -30 119 -80 156 31 309 -100 -7 -303 -253 88 -323 -306 18
4266 18 -74 -305 -83 -86 -104 3 151 35 -149 93 -10 -19 -120 -182 -126 -240 144 -21 -99 -207 -11 377 -80
4289 -80 -83 212 92 288 3 -99 35 278 -94 60 -119 -205 176 -95 -65 -128 -4 193 -41 -163 151 123
$$ packed form
4127F7k25M65k78K1K92j20l17K98P1m13K15K18l09K7k0Jjk3j60L81j81lK1o2K46
4152B11m00O0j58J35j13M84N4k23j09j25K73k16J26J8O4r7J35K0k05j9J78m00
4174c07L55j10M5JM8R2q2l7%p1K16j52j28K65K6j71J76n3n6N3k88K70R5P1k98
4199d0n4K89m05J43K69l00k4M33l87K32q9j21J72j63J96k52o2K69J64j34J03l35
4221i6J82j13qr6K27o9L70n06J17P1j41K0j03M21l69M7k7M00l38n6J18j44L78
4244B85l76r4N7K38n6k16L0j35K37J49j99K36j25K78m09R3k96N0L41m11J7L24
4266A8r2k31K22lj8J07J48j16j84K42j03rj01o2N6j14L84j65p8j08J96L88m57
4289h0lK95j20J96k85j02J34K43l72J54j79q6L81k71L0o3J24J97k34j22L14k8
$$ plain form
4311 123 -170 -86 185 -99 -31 -56 214 163 -232 -95 183 -18 -122 -54 -109 -72 28 -238 84 -214 256 -188
4333 -188 -40 -227 22 5 -34 23 32 192 151 67 45 -162 18 24 87 261 -280 -27 -62 303 11 130 -25 -93
4357 -93 119 -26 -19 130 -43 349 -24 138 177 -225 29 259 -304 -91 -52 -1 56 -43 -60 -46 282 -328 21
4380 21 -398 -9 -153 -15 -105 -126 -76 -143 100 -20 25 98 281 25 297 -47 -162 19 -25 22 -294 279 -83
4403 -83 -258 217 116 120 -189 -82 -59 238 -65 -334 68 64 99 72 52 -123 265 -62 -23 -128 -264 -121 -60 -247
4427 -247 -69 335 212 -134 333 320 -103 -16 198 122 13 13 164 -252 -359 122 138 261 16 -48 98 -143
4449 -143 42 118 -14 300 -31 -16 -82 32 -124 197 -69 -57 157 35 -5 -135 103 83 -293 -264 236 35
4471 35 -72 97 -114 -31 279 84 344 142 305 34 128 -116 -43 190 -365 -83 -20 -138 245 37 -262 24
$$ packed form
4311A23k93Q4K71k84O8k5K70n1l95J37K78k01j04O8n5L7J00k66L22k98M70m44
4333a88J48j87K49j7l9N7RJ60m1q4k2k07J80OO3J74n41K53l5L65k92J19j55o8
4357i3K12j45PJ49j73L92l73J62L9m02K54K30n63K13L9N1N7r9j7J4L28o10L49
4380B1m19L89j44J38r0k1N0o7K43j20M5P3J83k56K72l44j15J81m4M7l16N73l62
4403h3j75M75j01Ml09J07K3K97l03k69M02mL5k7k0j75L88l27L9j05j36J43O1j87
4427b47J78M04j23l46M67j3m23Q7K14p6j09%J51m16j07M81J6J23k45o4J46k41
4449a43J85P6j32L14l31J5o6J14j56L21k66J2K14j22m0j30K38k0l76K9N00k01
4471C5j07J69k11Q3L10j95K60k02J63k71R4k44P3K33n55K82O3j18L83k08k99K86
$$ plain form
4493 24 199 153 -4 61 -16 227 -117 -156 -83 121 66 178 -162 -34 68 -147 -265 -215 188 84 -130 7 53
4516 53 -21 144 31 22 25 65 93 -112 -167 -3 -157 -88 30 -19 233 175 228 265 187 199 -156 5 -134 149 116 -452
4542 -452 -124 82 -275 46 122 -187 148 276 -27 -195 92 64 73 173 -101 163 84 46 8 222 16 110 -197
4565 -197 -212 -22 -38 9 43 36 195 -156 -17 -10 193 53 -58 -247 98 100 -43 -209 -157 -245 -83 230 83 -330
4589 -330 112 116 95 180 -58 218 26 28 20 69 268 37 -103 246 -148 231 -75 -130 264 265 36 -82 -227 -42
4613 -42 45 -13 -10 9 -11 -343 125 -62 40 31 -154 -33 -213 -43 -67 118 191 -135 116 32 -113 33 -27 -151
4637 -151 106 -175 -45 -50 -96 -23 90 1 -171 167 153 -232 -122 153 -162 -30 -110 -131 57 161 36 -54 -47 -23
4661 -23 -84 80 29 -235 -230 236 -2 -74 -88 36 245 -133 -454 111 -29 -111 -214 -4 63 71 239 56 240 -10
$$ packed form
4493B4J75m6j57O5p7K43l44l9P3K04n5J12l40J28J02k15j18N0M03j04k14J37M6
4516E3p4J65j13rLM0K8k05n5J64j54O9J18m9K52n8N3L7p8J2l55J61j39K83l3n68
4542d52L28K06l57L21P6l09L35J28l03j68K87k8RJ00k74K64p9l8l8K14k06R4l07
4565a97j5J90j6M7L4pJ59l51J39PK03j40j11j89L45Kj43j66N2q8J62L13j47m13
4589c30M42Mk1Q5k38K76j92KqM9J99k31j40L49l94L79l06n5L94Jk29j18j45J85
4613d2Q7n8LJ9k0l32M68j87J02rj85J21j80J70k4J85P3l26K51q4j45J46o0j24
4637a51K57k81J30nm6P3J13q9j72L38j4l85J10K75l15J32q0k1J88J04j25r0PK4
4661b3o1J64n1k64NM66k38p2j4J24K09l78l21N65j40q2j03K10O7QJ68j83J84k50
$$ plain form
4685 -10 -49 -157 -30 -64 102 -126 -65 -113 -170 -214 41 247 136 -30 50 -75 -82 147 -37 200 42 203 54
4708 54 135 91 130 6 15 -56 -202 -50 127 378 45 44 -335 -130 52 93 -31 -226 -111 -109 -95 -126 113 -27 -280
4733 -280 -24 73 -38 -269 -393 -281 -59 -8 234 -129 114 -66 -69 -157 -86 -124 -60 219 41 -269 97 -52 -112
4756 -112 21 -192 -111 114 -261 104 -109 -149 222 116 126 -124 37 -61 -100 49 153 0 -82 30 203 -183
4778 -183 20 350 -280 -22 -126 -107 21 51 102 -109 123 -154 -159 -41 270 225 218 14 40 -144 0 112 -119
4801 -119 -150 100 -9 7 125 -99 173 77 157 31 -96 -42 -52 -44 221 88 -2 119 -255 -357 108 14 179
4824 179 312 134 -47 132 -34 -23 -111 -131 -16 -199 -97 -123 362 115 -24 -241 225 147 -5 -3 -59 -12 23
4847 23 -174 12 -88 73 161 18 193 170 -381 241 -135 115 -119 191 -153 -136 239 -103 3 196 291 10
$$ packed form
4685a0l9j08J27l4J66k28O1m8n7m4K55K06j11j66Q0j25pK29j84K37j58J61j49
4708E4Q1m4L9j24Rp1j46J52J77K51l33jl79K05J82M1j24j95J15KJ4l1K39j40k53
4733b80K56R7j11k31j24J12K22N1K42l63K43j80lq8P1l8O4K79j78l10L66j49o0
4756a12J33k13Q1K25l75L65k13m0L71j06J0k50J61r8l9J49J04j53q2J12J73l86
4778a83K03L30o30K58j04J9J28L0N1k11K32k77nJ18L11m5pk04K6j84J44J12k31
4801a19l1K50j09J6J18k24K72r6Q0j26j27N4j0QK65j33r0J21l74j02M65r4J65
4824A79J33j78j81J79j66J1q8k0J15j83J02k6M85k47j39k17M66p8j52Kn6M7L5
4847B3j97J86j00J61Q8j43J75k3n51O22l76K50k34L10l44J7L75l42J06J93R5k81
$$ plain form
4869 10 -194 -193 -92 47 -53 -106 89 55 53 21 195 -9 336 -12 -3 1 -104 -249 -30 -482 -4 32 -34 -240 -258
4894 -258 -121 214 85 -62 423 -260 42 -86 -44 -230 137 182 -104 -119 -32 36 94 183 -15 13 -61 184 -33
4917 -33 -286 -18 48 -236 -79 178 -187 -127 -14 301 68 -31 -207 -1 -58 -101 47 -88 -117 48 -199 -93
4939 -93 -57 -60 10 100 51 -191 163 1 52 38 -99 -139 112 84 -60 -70 -21 59 33 -63 72 154 29 36 10 -82 292
4966 292 250 -8 85 196 123 5 -253 -152 -200 -65 -142 58 161 -245 25 -40 -260 42 2 -270 112 75 85
4989 85 -24 -99 -49 -219 -45 -41 4 -409 64 247 139 426 262 81 74 -179 171 420 175 -220 -94 25 90
5012 90 -322 -120 -70 15 189 -162 236 -37 -80 -44 -177 113 -42 -66 100 241 -45 -87 9 87 -54 -186 190
5035 190 104 55 -169 315 14 -90 128 -435 -139 -21 141 -6 -175 -98 -69 -100 -68 -401 181 -74 -26 55 -139
$$ packed form
4869A0k04JJ01J39j00n3J95l4kl2J74k04L45l48RMj05j45K19m52M78L6o6k06j8
4894b58J37L35j29j47M85o83L02j28M2j86L67M5k86j5Q7O8N8Q9j98K8p4K45k17
4917c3k53K68O6k84J57K57l65O0J13L15k33r9j76K06n7m3J48j35k9J65k47J06
4939i3L6lP0R0m9k42L54j62N1j4j37m0K51k8j44j0M9Q0k6r6J35Q2j25Pk6r2L74
4966B92m2k58R3J11p3j18k58J01m8J35p7K00J03m06K70o5k20L02m0k72L82l7J0
4989H5j09p5N0j70J74MM5m13M73J83j08K87j64j81pk53L50K49k45l95J26J19O5
5012I0m12K02N0Q5J74l51L98k73m3L6j33K90j55k4J66J41k86m2R6P8j41j32L76
5035A90q6m9k24M84l01j04K18n63K96J18J62j47j69P7K9l1L2l33N82k55M8Q1j94
$$ plain form
5058 -139 -50 -26 -23 376 -124 -233 156 68 50 -178 -78 62 219 -48 133 175 247 -132 20 48 -203 -25 -36
5081 -36 13 213 -179 69 -44 -161 -105 -178 245 111 -36 -11 -124 -30 21 -59 -286 56 -129 216 -43 156 32
5104 32 188 102 -69 -66 -21 196 154 97 -72 79 37 82 207 -80 -235 -71 -56 28 77 169 -77 -62 -127 108 63
5129 63 57 -35 -77 -192 246 141 -84 -215 -157 -61 -45 81 -155 -118 203 -107 -124 21 98 241 -102 120 -167 -142
5153 -142 -127 156 248 46 -298 96 -43 -10 25 67 -347 62 196 -269 137 27 158 313 -133 -48 -11 -106 -226
5176 -226 -18 -73 11 -81 -197 172 99 121 165 -37 142 180 19 80 61 140 117 -31 -162 -147 -157 59 -41 118
5200 118 -27 266 -181 -203 115 81 113 17 87 267 5 -107 159 16 -63 14 221 136 94 101 -159 -150 -200 -170 178
5225 178 -173 -35 5 -96 144 -53 20 -21 -48 -76 -22 165 -234 -285 -18 -105 4 136 -27 -109 -150 -26 -78 153
$$ packed form
5058a39Q9K4LL99n00j09L89q8j8k28J00J40J57k67J81M2P2l79J52K8k51J78j1
5081c6M9K00l92K48j13j17N6p3M23j34j47K5j13R4N1q0k27L42j85L45k59J99j24
5104C2J56q6j71LM5K17m2n7j69J51m2M5J25k87j55J64J5Q4M9R2k46J5o5K35m5
5129F3or2m2j15M38j05k25j31N8R6J6J26k36L7L21l10j7J45P7J43l43K22k87K5
5153a42J5K83R2k02l44L94j39L3L5M2m14M09J34m65M06j10J31J55m46Q5L7r5j20
5176b26K08n5Q4r2j16L69p3K2M4k02J79L8j61O1j9P9k3j48j31J5j0K16j00J59
5200A18j45K93m47k2L18l4L2r6P0J80k62j12K66j43p9P7K07q5m2Pk60Rn0L0L48
5225A78l51J38M0j01K40j97P3m1k7k8N4J87l99n1K67q7J09J32j63q2m1J24n2K31
$$ plain form
5249 153 -34 179 235 16 48 166 75 -154 -38 -166 -148 -86 153 148 -146 11 -194 -77 -393 -82 268 22
5271 22 200 -29 10 -134 253 -66 139 322 45 98 -97 60 -277 32 -68 5 -186 -70 -48 -131 -10 212
5293 212 113 82 374 27 4 304 351 -132 18 -190 24 30 141 -161 75 86 -141 223 354 116 -161 140
5315 140 29 133 185 -158 -165 62 -96 142 54 -145 -212 46 -12 -131 94 119 113 -10 -85 180 18 37 80 -84
5339 -84 270 -256 -5 114 -197 181 -15 105 -105 -31 58 -103 -249 -217 100 -100 15 18 -36 60 89 5 -56 47
5363 47 38 -94 -185 -234 322 53 190 261 -44 -292 135 -313 153 -12 35 122 -83 -7 50 -55 22 297 -67 175
5387 175 -208 106 -126 79 126 121 -98 -273 -57 -258 16 243 -11 -181 205 177 54 -100 106 -26 65 294
5409 294 240 101 237 138 16 105 82 -162 28 32 50 282 -126 -12 95 -44 80 -358 87 -14 6 -51 -71
$$ packed form
5249A53j87K13N6k19L2J18r1k29J16j28J8O2K39nk94J57k05J17l16L11L50k46
5271B2J78k29L9j44L87l19K05J83k77N3j95J57l37L09j00P3j91J16K2q3J21K22
5293B12r9l1K92l47k3L00M7m83J50k08K14OJ11l02K36J1k27L64J31k38k77L01
5315A40j11J04N2l43pK27j58K38q8j99o7K58n8j19K25K5oj23p5K65j62J9M3j64
5339h4L54n26K51J19l11L78j96J20k10P4Q9j61j46L2L17k00J15Ln4R6K9q4o1J03
5363D7rj32r1m9N56k69J37P1l05k48M27m48M66j65M7Q7k05P6N7j05P7K75l64K42
5387A75l83L14k32K05M7nk19j75K16k01K74K27k54j70L86k8j23j54K06j32R1K29
5409B94n4j39J36r9j22Q9k3k44J90MJ8K32m08J14J07j39J24m38M45j01K0n7k0
$$ plain form
5432 -71 113 253 92 -124 37 -74 -85 81 -62 -35 152 62 23 207 -196 -31 253 168 171 -67 -194 0 36
5455 36 193 129 124 258 -122 -181 -175 135 100 159 -113 -76 98 -30 -172 137 -86 -171 -228 -252 -104 24 -196 -1
5479 -1 146 -66 222 -125 52 -107 -476 210 115 13 44 -249 -51 -81 -10 -8 111 -4 -109 -65 -275 -119 109
5502 109 130 -116 193 39 -99 64 437 34 -135 -58 29 -33 112 50 -94 176 -91 154 -75 -49 113 14
5524 14 66 161 192 13 -172 127 240 -55 -52 -56 -110 117 378 -44 70 6 -68 126 73 -87 -132 91 -250 -298 -151
5549 -151 -292 86 -260 -146 133 81 -44 97 -45 -242 73 90 207 -32 45 -65 250 201 130 50 39 -79
5571 -79 -110 -7 -106 46 242 27 -94 313 -94 -193 -39 186 3 -175 246 28 113 1 259 4 -112 49
5593 49 -77 49 140 64 -46 -214 -86 132 253 346 144 130 -16 -175 -327 -235 156 331 -68 -28 200 -29
$$ packed form
5432g1J84J40j61k16J61j11j1J66j43K7J87r0l9J84m03J65K84q5Lk38j27J94L6
5455C6J57o4nJ34l80n9OL10l5N9k72L7J74j28j42L09k23q5n7k4J48J28k20J95
5479aJ47k12K88l47J77j59l69O86r5j02L1k93J98l0P1KJ19j15j05M4k10J56K28
5502A09K1k46L09j54j38J63L73m03j69P7Q7o2J45o2j44K70k67K45k29K6J62r9
5524A4N2R5L1j79j85K99J13k95Lmn4K27K61m22J14o4p4J94n3j60m5K23l41m8J47
5549a51j41L78l46J14K79n2j25J41j42j97L15J7J17k39P7j10L15m9p1q0j1j18
5571g9l1J03r9J52J96k15j21M07m07r9J54K25j83j78M21k18Q5j12K58k55j16J61
5593D9j26J26R1p6j10j68J28K18J21R3k02j4j46j59j52R2L91J75l99M0K28k29
$$ [...]
8191A90
##END NTUPLES=NMR FID
##END=
