##TITLE=1H_EC-3230(4)-3
 CDCl3, 8 sc, 
 28.8.2020
##JCAMPDX= 6.0         $$ Bruker NMR JCAMP-DX V2.0
##DATA TYPE= NMR FID
##DATA CLASS= NTUPLES
##ORIGIN= UXNMR, Bruker Analytische Messtechnik GmbH
##OWNER= root
$$ XWIN-NMR		Version 3.5
$$ Fri Aug 28 11:04:01 2020 Russian Standard Time (UT+4h)  she@DPX200
##.OBSERVE FREQUENCY= 200.1315066352
##.OBSERVE NUCLEUS= ^1H
##.DELAY= (6, 6)
##.ACQUISITION MODE= SIMULTANEOUS
##.ACQUISITION SCHEME= undefined
##.AVERAGES= 8
##.DIGITISER RES= 18
##SPECTROMETER/DATA SYSTEM= spect
##.PULSE SEQUENCE= zg30
##.SOLVENT NAME= CDCl3
##.SHIFT REFERENCE= (INTERNAL, CDCl3, 0, 15.7039)
##AUDIT TRAIL= $$ (NUMBER, WHEN, WHO, WHERE, WHAT)
$$ ##TITLE= Audit trail, XWIN-NMR		Version 3.5
$$ ##JCAMPDX= 5.01
$$ ##ORIGIN= Bruker BioSpin GmbH
$$ ##OWNER= she
$$ F:/spectra/data/she/nmr/H-F/1/audita.txt
$$ ##AUDIT TRAIL=  $$ (NUMBER, WHEN, WHO, WHERE, WHAT)
(   1,<2020-08-28 11:02:36.65 +0400>,<she>,<DPX200>,
      <created by zg, POWCHK disabled, PULCHK disabled
       configuration hash MD5:
       00 E9 B6 7A A2 85 ED C7 34 08 36 98 17 FE 4E 26
       data hash MD5: 16K
       26 7A 16 80 B2 6A 7A 2B AB F9 FF A9 83 53 4F 97>)
$$ ##END=
$$ 
$$ hash MD5
$$ CB 8C 36 5B DC AC D0 8C FA 93 45 C2 ED BD 61 F1
##$RELAX= 
##$RELAX= 
##$RELAX= 
##$RELAX= 
##$RELAX= 
##$RELAX= 
$$ Bruker specific parameters
$$ --------------------------
##$DU= <F:/spectra>
##$EXPNO= 1
##$NAME= <H-F>
##$PROCNO= 1
##$TYPE= <nmr>
##$USER= <she>
##$AMP= (0..31)
100 100 100 100 100 100 100 100 100 100 100 100 100 100 100 100 100 100 
100 100 100 100 100 100 100 100 100 100 100 100 100 100 
##$AQSEQ= 0
##$AQ_mod= 1
##$AUNM= <au_zg>
##$AUTOPOS= <>
##$BF1= 200.13
##$BF2= 200.13
##$BF3= 200.13
##$BF4= 200.13
##$BF5= 200.13
##$BF6= 200.13
##$BF7= 200.13
##$BF8= 200.13
##$BYTORDA= 1
##$CFDGTYP= 0
##$CFRGTYP= 5
##$CHEMSTR= <none>
##$CNST= (0..31)
1 1 145 1 1 1 1 1 1 1 1 1 1 1 1 1 1 1 1 1 1 1 1 1 1 1 1 1 1 1 1 1 
##$CPDPRG= <>
##$CPDPRG1= <>
##$CPDPRG2= <>
##$CPDPRG3= <>
##$CPDPRG4= <mlev>
##$CPDPRG5= <mlev>
##$CPDPRG6= <mlev>
##$CPDPRG7= <mlev>
##$CPDPRG8= <mlev>
##$CPDPRGB= <>
##$CPDPRGT= <>
##$D= (0..31)
0 1.2 0 0 0 0 0 0 0 0.06 0 0.03 0 0 0 0 0.0002 0 0 0 0 0 0 0 0 0 0 0 0 
0 0 0 
##$DATE= 1598598156
##$DBL= (0..7)
120 120 120 120 120 120 120 120 
##$DBP= (0..7)
150 150 150 150 150 150 150 150 
##$DBP07= 0
##$DBPNAM0= <>
##$DBPNAM1= <>
##$DBPNAM2= <>
##$DBPNAM3= <>
##$DBPNAM4= <>
##$DBPNAM5= <>
##$DBPNAM6= <>
##$DBPNAM7= <>
##$DBPOAL= (0..7)
0.5 0.5 0.5 0.5 0.5 0.5 0.5 0.5 
##$DBPOFFS= (0..7)
0 0 0 0 0 0 0 0 
##$DE= 6
##$DECBNUC= <off>
##$DECIM= 32
##$DECNUC= <off>
##$DECSTAT= 4
##$DIGMOD= 1
##$DIGTYP= 9
##$DL= (0..7)
0 120 120 120 120 120 120 120 
##$DP= (0..7)
150 150 150 150 150 150 150 150 
##$DP07= 0
##$DPNAME0= <>
##$DPNAME1= <>
##$DPNAME2= <>
##$DPNAME3= <>
##$DPNAME4= <>
##$DPNAME5= <>
##$DPNAME6= <>
##$DPNAME7= <>
##$DPOAL= (0..7)
0.5 0.5 0.5 0.5 0.5 0.5 0.5 0.5 
##$DPOFFS= (0..7)
0 0 0 0 0 0 0 0 
##$DQDMODE= 0
##$DR= 18
##$DS= 0
##$DSLIST= <SSSSSSSSSSSSSSS>
$$ [...]
##$SUBNAM2= <"">
##$SUBNAM3= <"">
##$SUBNAM4= <"">
##$SUBNAM5= <"">
##$SUBNAM6= <"">
##$SUBNAM7= <"">
##$SUBNAM8= <"">
##$SUBNAM9= <"">
##$SW= 16.880792210976
##$SWIBOX= (0..15)
0 0 2 0 0 0 0 0 0 0 0 0 0 0 0 0 
##$SW_h= 3378.37837837838
##$TD= 16384
##$TD0= 1
##$TE= 0
##$TE2= 300
##$TE3= 300
##$TEG= 300
##$TL= (0..7)
0 120 120 120 120 120 120 120 
##$TP= (0..7)
150 150 150 150 150 150 150 150 
##$TP07= 0
##$TPNAME0= <>
##$TPNAME1= <>
##$TPNAME2= <>
##$TPNAME3= <>
##$TPNAME4= <>
##$TPNAME5= <>
##$TPNAME6= <>
##$TPNAME7= <>
##$TPOAL= (0..7)
0.5 0.5 0.5 0.5 0.5 0.5 0.5 0.5 
##$TPOFFS= (0..7)
0 0 0 0 0 0 0 0 
##$TUNHIN= 0
##$TUNHOUT= 0
##$TUNXOUT= 0
##$USERA1= <user>
##$USERA2= <user>
##$USERA3= <user>
##$USERA4= <user>
##$USERA5= <user>
##$V9= 5
##$VALIST= <valist>
##$VCLIST= <CCCCCCCCCCCCCCC>
##$VD= 0
##$VDLIST= <DDDDDDDDDDDDDDD>
##$VPLIST= <PPPPPPPPPPPPPPP>
##$VTLIST= <TTTTTTTTTTTTTTT>
##$WBST= 1024
##$WBSW= 4
##$XGAIN= (0..3)
0 0 0 0 
##$XL= 0
##$YL= 0
##$YMAX_a= 85118
##$YMIN_a= -58778
##$ZGOPTNS= <>
##$ZL1= 120
##$ZL2= 120
##$ZL3= 120
##$ZL4= 120
##$ABSF1= 10
##$ABSF2= 0
##$ABSG= 5
##$ABSL= 3
##$ALPHA= 0
##$AQORDER= 0
##$ASSFAC= 0
##$ASSFACI= 0
##$ASSFACX= 0
##$ASSWID= 0
##$AUNMP= <proc_1d>
##$AZFE= 0.1
##$AZFW= 0.1
##$BCFW= 1
##$BC_mod= 2
##$BYTORDP= 1
##$COROFFS= 0
##$CY= 11.3945322036743
##$DATMOD= 1
##$DC= 2
##$DFILT= <>
##$DTYPP= 0
##$F1P= 16.9975609425685
##$F2P= -3.02152046262296
##$FCOR= 0.5
##$FTSIZE= 0
##$FT_mod= 4
##$GAMMA= 1
##$GB= 0.15
##$INTBC= 1
##$INTSCL= 1
##$ISEN= 128
##$LB= 0.24
##$LEV0= 0
##$LPBIN= 0
##$MAXI= 10000
##$MC2= 0
##$MEAN= 0
##$ME_mod= 0
##$MI= 1.114404
##$NCOEF= 0
##$NC_proc= 0
##$NLEV= 6
##$NOISF1= 3.799351
##$NOISF2= 2.8
##$NSP= 1
##$NTH_PI= 0
##$NZP= 0
##$OFFSET= 15.70392
##$PC= 1
##$PHC0= -9974.494
##$PHC1= 12.20092
##$PH_mod= 1
##$PKNL= yes
##$PPARMOD= 0
##$PSCAL= 0
##$PSIGN= 0
##$REVERSE= no
##$SF= 200.130013532006
##$SI= 16384
##$SIGF1= 3
##$SIGF2= 2
##$SINO= 400
##$SIOLD= 16384
##$SREGLST= <1H.CDCl3>
##$SSB= 0
##$STSI= 0
##$STSR= 0
##$SW_p= 3612.71676300578
##$SYMM= 0
##$S_DEV= 0
##$TDeff= 0
##$TDoff= 0
##$TI= <>
##$TILT= no
##$TM1= 0
##$TM2= 0
##$TOPLEV= 0
##$USERP1= <user>
##$USERP2= <user>
##$USERP3= <user>
##$USERP4= <user>
##$USERP5= <user>
##$WDW= 1
##$XDIM= 8192
##$YMAX_p= 0
##$YMIN_p= 0
$$ End of Bruker specific parameters
$$ ---------------------------------
##NTUPLES= NMR FID
##VAR_NAME=  TIME,          FID/REAL,        FID/IMAG
##SYMBOL=    X,             R,               I
##VAR_TYPE=  INDEPENDENT,   DEPENDENT,       DEPENDENT
##VAR_FORM=  AFFN,          ASDF,            ASDF
##VAR_DIM=   8192,          8192,            8192
##UNITS=     SECONDS,       ARBITRARY UNITS, ARBITRARY UNITS
##FACTOR=    0.000296,      1,               1
##FIRST=     0,             0,               0
##LAST=      2.424536,      0,               0
##MIN=       0,             -58778,          0
##MAX=       2.424536,      85118,           0
$$ Real data points
##PAGE= N=1
##DATA TABLE= (X++(R..R)), XYDATA
0@%%%%%%%%%%%%%%%%%qJ6j6J6j6J8k6L2l4M2n0N8o9P7q8J04j20J36j53J73j95
38a03K20k46K74l06L41l80M22m68N16n72O34o99P69q46R33j027J132j250J379
57G23j523J689j880K099k355K661l030L492m096M908o084Q044k1825R0333q2163
72i007m9771N1708l866K381J9274l1289J0178L0759p0373O7255L0499o4641l4540
85e1433R0150r547m6316L4310k2959J5294K488K954k292O858m1485K1235O8628
98F7885p2627j6787L1604K4322l3907P214J869j3842J4553j5963L3304k3150k0574
111a6099j926M5162l518o0840L1732J6047j5476j1823L0750l1029J752Q042m254
124a1480K8213m3706j709K4032J8950m2726R122K2762k8854J3928P257M129l0170
$$ y = [0, 0, 0, 0, 0, 0, 0, 0, 0, 0, 0, 0, 0, 0, 0, 0, 0, 0, -8, 8, -8, 8, -8, 10, -16, 16, -18, 24, -26, 32, -37, 40, -48, 56, -64, 72, -81, 92, -103, 117, -129, 145, -161, 180, -200, 222, -246, 270, -302, 332, -367, 402, -444, 489, -538, 594, -656, 723, -800, 889, -991, 1108, -1247, 1414, -1616, 1876, -2220, 2688, -3396, 4648, -17177, 73156, -9007, -58778, -7070, -10936, -8555, 10719, -20570, -10392, 20367, -50006, 17249, 47748, -16893, -51433, 38717, 29170, -17146, 17164, -5795, 9499, 11987, 14941, 12649, 19507, -21978, -743, 67885, -4742, -21529, 10075, 34397, 490, 7704, 9573, -4269, 10284, -5679, 27625, 4475, -16099, -18025, 27137, 23619, -37221, -5489, 10558, -4918, -16741, 14009, -17020, -15268, -7226, -11480, 16733, -26973, -28682, -4650, 14300, -28426, -19304, 3458, -25396, -11468, -4211, -82, -30252]
137c0252J9353J706J2874p709l3799M3012k75j9526k699L4734l0565n572K9602
150A0884p099J245k5240K1681J3052r96l1049J9457K2770l1089R181R616Q029
163B0442l4747K4060J2305j1751m191j1204K8267p623j0082p788L0514k2359j1050
176e207K9922j1693q066j0360K8936j1949o206n820R440J0359k4322R516O443
189A0993L488l2329K8735Q893k6443L620L060J4698j7788J365l857J9281j7818
202d102q432K6767j4069p697k328K6414k0723m894P667M049P57j5391J5045k478
216E85L072k0223K3448M455k5133J0220P702M936k0694J3600j265M844j0087N07
230d033J7528j7265R38k22K0379k1241l597J5056j242n525p127J8187j2601M727
$$ y = [-30252, -10899, -9193, 3681, -4028, -37827, 5185, 4910, -14616, -17315, 17419, -13146, -18718, 10884, 3785, 5030, -20210, 1471, 14523, 13527, -17522, 1935, 24705, -6384, 2797, 12413, 20442, -14305, 9755, 22060, 10309, 6118, -5086, 23181, 15558, 5476, -2312, 28202, 5843, -5207, 24715, 13022, 4956, -5404, 23532, 11583, 5377, -443, 8997, 19356, -4966, 4550, 10993, 14481, -17848, 10887, 19780, -6663, -3043, 17, 14715, -3073, -1708, -5565, 13716, -4102, -12534, 14233, 164, -7533, -9861, 16553, -4170, -9064, -1397, 2652, 3409, -11982, 3063, 585, 3657, -16566, 6882, 11337, -13796, -3576, 4126, 9062, -11632, 1968, 703, 5547, -4540, -4033, 13495, -3770, -2832, -3054, 17325, -3916, -7513, 7543, 6301, 776, -6351, 11836, -765, 3962]
244C962r605J4252O89j8818J2369L829J510j8600J7388l069k665k490K608P983
258I343j6794J0174l260J0605j5857J287J2570p186l476j746J4563j7599Q014
271F38j700M329l054r345J4077m806P93j0846J6299o977m216M139J001K415j3759
286a1012J6810p495K570p395N728O106r834L122q81R865j7791J2111J091l459
300d64k050j275J2702j2870L726l253J1074r960j121P825l073j80r003J8599j1297
315f20j140L38O141m79r695Q689k113M717j4015J3699j04p653J358J991Q071j5637
331f452Q152j81M887j0084K779P996q037J726n217J5163j4122K72N067K503m123
346C29o495J2000o209J891q735J3828n356p161O364L68L203j4253J2321j195n45
$$ y = [3962, -5643, 8609, 9298, -9520, 2849, 6678, 8188, -10412, 6976, 3907, 1242, -1248, 1360, 9343, -7451, 2723, -537, 10068, -5789, -4502, 8068, 882, -2594, -4340, 10223, -7376, 638, -1062, 3267, 213, -9132, 4945, 139, 932, -9914, 6385, -592, -4808, -669, 332, 2747, -11012, 5798, -1697, 873, -6522, -794, 5312, -4522, -1400, -2281, 7584, -10207, 1904, 2995, -464, -2514, -3789, 8913, -3957, -231, -3484, 7590, -2370, -3491, 4334, 1261, 1081, -7922, 10677, -620, -1760, -1422, 4719, 4240, -5455, 3234, 1121, 5838, -8177, 5522, 5418, -2235, -877, 1114, 9185, -6452, 1700, 1519, 6406, -3678, -899, 7097, -940, 786, -4431, 10732, -3390, -3118, 1949, 4452, 329, -6166, 5834, -375, 1516, -7219, 6609, 1253, -5908, 456, 824, 4027, -10226, 2095, 900, 355]
361C55p291O564M447j1119N756k531R666j4213M489N941k830l958k022J2233j1136
376e649L002k920R176p262m039R331l431Q88q969J3591m977k283k257O769J095
391B065j0804J0243l489M298j0418P842L691o468q83K031Q246j2895O303p33M794
406C823p661j69J0325q564J309l737J1519q437j421K692L653k782p744J2919o922
421a197J664n808R098j309p815M947J080L178j2159J0177r18j071m860L281O927
436E215j1616M504m01O969j0591K256M927j651k733m103J3275j0560J065lO260
451B813m802n390Q585j644j58q211J2705m062l364n56N074K938j2565R211K27
466H01J783q913O371M211n666j083M54J0624j3726L787L224K993o202k448J0678
$$ y = [355, -6936, -372, 4075, -7044, -1288, -3819, 5847, -8366, -3877, 2064, -766, -4724, -6746, 5487, -5649, -2647, -5567, 3609, -3653, -7692, 1639, -1792, -904, -9873, 3718, -1259, -3542, -5799, 970, 2065, -8739, 1504, -1985, 2313, -8105, -263, 3428, -3040, -3923, -1892, 6354, -6541, -238, -971, 3823, -3838, -4007, 6318, -2246, -937, -4674, 6845, -1592, -3013, -321, 3332, 550, -7194, 5725, -1197, 467, -5341, 3757, 2448, -5367, -420, 660, 3838, -8321, 1856, 938, -133, -4993, -1712, 5215, -6401, -1897, -2298, 4671, -5920, -3664, 1263, -388, -3121, -7224, 6051, -4509, -3444, -3447, 2813, -1989, -7379, 1206, -438, -596, -8807, 3898, -164, -3528, -4084, 990, 3928, -8637, 574, 801, 2584, -6329, 42, 4253, -1413, -2496, -2042, 8582, -5144, -1357, 1867, 4860, -1342, -3790, 6888]
481F888n207o47m770J2247o545l931L923L336k11j0514J1569j484j217o392P791
496D836K153q043L140N76N988j2627O776L283j633n284O34R378q543k80p05R326
512H975r462j156O294j165j033p715J2224m166l291k521P664j050p301N580j309
527E68L437r701P813P66l573k346K054O861j0330L527K95M400p460J797N132m403
543a163L39k790R310p479o73J667M357l529n213Q860l503O91n305Q620k253n300
559c364K706L308J948r668O622J06J942o693L584M618o977K636r62N997q403K414
575a86K763Q42l908k684Q574n828J109k747P483n554l175O097r52J12p014Q754
591C686k364q45l620M788J804p809N514m49K136p719N348K281k641k374l97P992
$$ y = [6888, 1681, 1034, -3736, 8511, 1966, -1965, 1958, 5294, 5083, -5431, 6138, 4654, 3437, -2955, 4836, 6989, -1054, 2086, 2662, 8650, -3977, 2799, 6082, 4449, -835, -201, 9177, 634, 354, -351, 8975, -487, -1643, 4651, 3486, 2453, -5262, 6962, 2796, -495, -3016, 4648, 3598, -3703, 1877, 568, 4005, -5696, 2117, 2883, -690, -3036, -982, 5879, -4451, -924, -629, 3771, -3689, -1892, 3240, -1163, -824, -3614, 5696, -1783, -2456, -789, 3568, 39, -5174, 3686, 183, 874, -4431, 4189, 1936, -3364, -658, 2650, 4598, -5070, 1552, 1658, 3600, -3093, 491, 5109, -1868, 768, -194, 5803, -2600, -186, 2577, 3419, -489, -3173, 5401, -427, 682, -2065, 5418, -136, -3311, 2786, 1834, 1946, -5068, 3686, 1322, 477, -3143, 1645, 3449, -4360, 1154, 705, 2841, -4878, 470, 2751, 110, -2264, -2661, 5331]
607E331q050J929n15M282n233j115O814l865m03l664Q904n495k30o89L111J48
623A260o334P657k851K29m311O647k79n171J323J577M106q994M833N43J060m598
639c303J518N729o345P18o55P151p227k5K566Q92p50m979Q180m422l65j560N721
656B844j884n048M112N47J771p330O610r59q85j854J756L820o531K574K82L960
672C785p145K440L086j807o16k429O983n774P14J78L829l027l404N641j616R34
688A772n642O942k008j790O89P36J989n742M639j000J831n446L931J834m123J883
704D95j493M739o597L125L51R60l008q89N651m520J035k478N852m265j035K883
720H06p00M05m480O430k952J86k507M357r8m844L716j045K973o188M637M11j323
$$ y = [5331, -2719, -790, -1305, 2977, -2256, -3371, 3443, -422, -825, -4489, 4415, -1080, -1310, -1999, 1112, 1260, -5074, 2583, -268, -39, -4350, 2297, 2018, -3153, -1830, -253, 3853, -5141, -308, 235, 1295, -3303, -1785, 3944, -2401, -1683, -2338, 4813, -2414, -2439, 127, 1019, 269, -4710, 3470, -952, -1317, -2877, 2844, 960, -4088, 24, 571, 2342, -4988, 1622, 663, -222, -2076, -320, 3500, -3031, -457, -175, 3785, -3360, -920, 2166, 359, -257, -2686, 4297, -1477, -763, -585, 3244, 217, -3187, 2454, 838, 1772, -3870, 3072, 1064, -726, -37, 699, 2688, -3054, 1585, 585, 2416, -3030, 901, 2735, -1388, 495, -998, 3741, -2856, 269, 620, 1580, -1428, -2317, 3334, -1186, -151, -2629, 3223, -1042, -2077, 806, 106, 511, -3969, 2461, -491, -305, -2812, 1545, 1447, -3397, 319, -726, 2247, -3941, 696, 1107, -216]
737b16j571R25M334o101K671j077L808m716N25M089k563m10j780O264m964L53
753d29J7K910j476m161N595j671R11m810N877q71k949O13J741K058o629M767o61
770H32J591m416K058L479m342M72o67M836o014J549J476Q75k217k329N872l553
786d98J86k498N501k701k501K561O89K96n497O030j318k93k888L166K286n398
802b877K384J96L013o130K845K010q99j888p01N763n239R55m72L738l285j460
818b047L795r66M0l901O424l000p21m98K395P71n034M142m05J282m783L996R00
835B390k523m26M49M343o222K330L39J689l370N1L652k876L43k122N554m257m38
852a094J278Q56l78l912N331k244J00k805L996n31k782J692k0K188n742M244j42
$$ y = [-216, -1787, -862, 3472, -2629, 42, -1035, 2773, -1943, -1418, 2671, 108, -302, -2082, 4182, -782, -429, -412, 2498, 1022, -3139, 2456, 785, 1696, -3114, 2763, 1892, -1057, -444, 1297, 3355, -3274, 1493, 832, 2423, -1993, 65, 3544, -798, -326, -993, 3843, -2171, -622, 854, 1729, -488, -2817, 3055, -498, -312, -2810, 2691, -10, -2511, 50, 739, 1035, -4462, 1568, 250, -43, -2931, 235, 2521, -2877, -493, -297, 2716, -3414, -569, 1441, 542, -1346, -2047, 3716, -1523, -568, -1040, 2698, -587, -2047, 1748, 782, 822, -3079, 3345, 345, -376, -874, 1521, 2292, -2742, 1400, 995, 2277, -2506, 1490, 2390, -133, -559, -110, 4233, -1989, 341, 680, 2369, -1001, -950, 2702, -174, 169, -1953, 3601, -656, -1094, 184, 1040, 662, -3250, 2081, -163, -63, -2868, 1128, 597, -2185, -493, -513, 1675, -4067, 177, 35]
869C5j29k618J648K940m739J966q03L547m707J079K537j171p01j928N198l439
885a285L13r80L618j891k555L904j042P73m268N019q46j280n73J764J893n308
901b744L453l30J869m355K375K481k756j57n01M626m985J091M25K054k569j697
917a720M572k526K39k649M992k111j752R49J238M79m433L969p85N88l607K899
933C42J394l684J201k43L297n263K342Q70N87k438m55L978l560N94j436M251k822
950a045j187J968M97p55k999M711j764j83j531L057M37l796K170L4J899m168K858
967B03M12n09j118j2L765m310J601l42K699l055o4K288j267N83k403M410k724
984A57L04n34J906l99k884L267j109J147l356L361p03j101L75K28J617l916K930
$$ y = [35, -94, -2712, -1064, 1876, -2863, -897, -1700, 1847, -2860, -1781, 756, -415, -1116, -3044, 2154, -1285, -972, -1952, 1666, -225, -2780, 1124, 82, 855, -3413, 1606, 760, -520, -1093, 671, 2564, -2744, 709, 379, 2248, -2107, 268, 2749, -7, -164, -665, 3961, -1024, 67, 492, 2546, -23, -1720, 2852, 326, 565, -2084, 2908, 797, -955, -6, 1232, 1711, -2722, 1247, 462, 1050, -2557, 342, 1736, -1948, -747, -990, 2307, -2956, -614, 256, 843, -1595, -2050, 1928, -1632, -1038, -2474, 1777, -1045, -2232, -264, 233, -522, -3521, 1190, -574, -757, -2288, 769, 1206, -2590, -420, -386, 1513, -2655, 203, 615, 106, -1012, -1024, 2741, -1569, 32, -310, 2389, -666, -730, 1558, 291, 874, -1529, 2881, 157, 461, -73, 1833, 1434, -1450, 1817, 708, 1855, -1501, 1860, 1157, 56, 431, 659, 2276, -1640, 1290]
1001A290o57J180k739J211J808k258R72j412K944l478J082L72N32p81j752L518
1017A832k412Q93k031K830j416q54J320o04J343l550L666j468M03j258J080J252
1033A026k766K047j267K255l240J988L81p05k06o52L118l473J456m97J772j936
1049f99p2K307j591R89k459L705j894m77J73J374j61k491L059j613J456k430J946
1066A122n8j151O19k78K096l641K103j26L22j254J33K205k402J081j693K976k256
1083b02j77O80M06L4k457L319j890Q38j689K079o20j499J454p11J779l430K688
1100F02q62L82j440O99J676k630J772j451K332k201O53O15l67J53j515K783k255
1117a054J171r51J423k45j553K084j445J553k403K547p43m56j37L18Q41k114K314
$$ y = [1290, 633, 1813, -926, 285, 2093, -165, 807, -605, 2339, -1139, -57, 315, 847, 66, -1686, 1832, -580, 313, -1718, 1112, -304, -1158, 162, -442, 901, -2649, 1017, -451, -48, -1306, -226, 1026, -1740, 307, -960, 1295, -1945, 43, 424, -281, -487, -1139, 1979, -1494, -38, -535, 1237, -699, -771, 1536, -55, 934, -1525, 2180, 286, -191, -18, 1356, 1195, -1296, 1763, 150, 1606, -824, 1122, 1064, -87, 532, 254, 2350, -1291, 812, 686, 1008, -246, -113, 2092, -310, 771, -922, 2054, -202, -379, 301, 707, 741, -1716, 1603, -287, 551, -1138, 941, 321, -1178, 276, -435, 1344, -2086, 602, -260, 122, -1318, -619, 1057, -1573, 199, -1252, 1080, -1121, -468, 147, -220, -67, -1582, 1201, -1054, 117, -834, 589, 344, -1209, 875, -570, 983, -1420, 1127, 384, -72, -209, 109, 950, -1164, 1150]
1134A150j151R66j914J543K73j372J401j294K010k723J738j09L41r11k7J608k118
1151e89R62o77J942k053K23P58m52L14j594K769j854N61q99J201j37j766J886
1168E95p18J239k915K502o27l23l74J36J430k002J133o47J372k153P71Q95j138
1185h24Q81j489K913k719R10LO12n85j328K604j577O81j573K619j354l99O06Q3
1203F4J044k719K328l57M52j779J058J050k092J301m62K004l148J527L15K40j050
1220b24m32K238j725K82p72K101j511n99J468n77P42k495K931j448J14j176J778
1237F95R0k202J606l79J029k633K191j6r27p1o9K096k776J097j16J299j762m87
1255a335K337j424K54j523K666j572K9l41J136K8j994K037m82L68j955K200j06
$$ y = [1150, -1, 965, -949, 594, 867, -505, 896, -398, 1612, -1111, 627, 518, 859, -52, -79, 1529, -589, 373, -304, 1638, -415, -192, 566, 114, 428, -1166, 1603, -251, 310, -589, 612, 475, -1291, 595, -123, 1116, -1799, 703, 76, -247, -621, -485, 945, -1057, 76, -571, 801, -1352, -581, 314, -824, 57, -1432, 1481, -1238, -328, -325, 287, -298, -1626, 978, -599, 82, -1491, 1128, -226, -625, -19, 64, 1108, -1611, 717, 360, 812, -967, 91, 1141, -951, 350, -112, 1892, -1256, 271, 586, 826, -224, -656, 1582, -143, 139, -633, 1468, -43, -642, 826, 249, 991, -1504, 1427, -21, 93, -1083, 695, 785, -1417, 189, -190, 839, -1794, 397, 381, -546, -617, -686, 1410, -1366, -269, -385, 914, -848, -1335, 1002, -422, -168, -1691, 975, -597, -568, -909, 227, 255, -1739, 298, -184, 184, -1771, 429, 323]
1272C23j009J41K15J484k644J916n01O91j583P06J532j916O99o09K163k301L55
1289c38O44K10l28j031K270j281J51j159K338r97j334J252L0N66k405K141k14
1306E15j02r92J030P38k046J016k01J308k531R79J029p55k13m88K375k317L97
1323b58l61J667j484n21J760p51J17j690K472q88n63k36Q53M45k240J898j34K25
1341C11j787J753L77j212j7N9J965k668R67J31Q13j446%K054j317n3o67K324j684
1360i7k60M35O74m22j404K062p64N9j007J582M5j709P66M80R89k436J466j88K85
1379E56p80J01J597j939M03%J685k038J40R02j82k75j224K526j648K6l24J263
1397G89k41j565J429m81P05j882J749k41p51NL26J201k234J127k5R04j719N98
$$ y = [323, -686, -545, -330, 1154, -1490, 426, -75, 616, -967, -261, 1271, -645, 54, -555, 1608, -693, -338, 306, 516, 188, -843, 1427, 146, 297, -862, 1476, 479, -855, 397, 427, 993, -1412, 729, 515, 413, -579, 451, 1189, -857, 159, -42, 1266, -1265, -286, 743, -12, -225, -713, 1662, -655, -258, -619, 1048, -436, -957, 803, 52, 169, -1521, 951, 63, -500, -736, 117, 562, -1678, 220, 86, 311, -1476, 277, 654, -558, -575, -516, 1449, -1219, -252, -121, 692, -754, -754, 1300, -17, -70, -737, 1587, -97, -357, 78, 752, 330, -1074, 988, 224, 283, -724, 858, 903, -806, -40, 440, 1429, -1007, 459, 271, 556, -224, -123, 1474, -465, -62, -62, 1623, -415, -275, 627, 445, 170, -1054, 1472, -176, -150, -474, 789, 548, -1017, 412, -69, 636, -1246, 503, 262, -489, -484, -158, 1043, -1191, -64, -89, 815, -904, -306]
1415c06J040j050N8p34K195j988M92p0Q07l13j108J784q82M12j547K003m58p53
1433d18L83K78K61j684J705n95M61j205J103O07j558Q23k89J590j952K42O57J38
1451E47p25n78J849j468M09o05J358p53l08Q29l36K72j407J821p75k13m53R24
1469C88K96j471P30NP94j819J307q6k76j58N4J142j976J028m61R44j035P4R40
1488D20o81M69j025J844j314k04J50P62k04j149J354l97L24j214J434l94n27j24
1506d76O59O51j762J160j25J74j079N38R64j069K57k33J354j602N14Q8M07l85
1524C5o14J469r18K36m83J254q23o27O84j22K55j197J393l23r4n91N68N68j247
1543e77O36k86P01j424J074Pk18Q7o20J318j306P56n98P54o36kN63k96L24q35
$$ y = [-306, 734, -316, -258, -992, 1203, -785, -293, -363, 444, 131, -977, 807, -75, 337, -1210, 793, 335, -418, -35, 243, 504, -1180, 525, -70, 391, -814, 289, 896, -662, 161, -128, 1462, -490, -248, 409, 547, -178, -756, 1093, -375, 34, -571, 787, 34, -274, 555, 219, 491, -916, 905, 130, -83, -536, 388, 684, -787, -57, -52, 742, -1077, 230, 144, -132, -290, -236, 906, -1070, -42, -503, 441, -594, -520, 420, -261, 208, -817, 1027, -287, -491, -341, 421, 217, -932, 422, 25, 349, -865, 569, 175, -352, -476, 183, 834, -928, 232, 107, 281, -798, -260, 704, -365, -108, -341, 1013, -589, -75, 13, 420, 35, -579, 890, -28, 208, -275, 979, 156, -471, 213, 91, 346, -851, 542, 219, 125, -466, 102, 670, -577, 59, -227, 474, -950, 124, 131, -87, 0, -620, 698, -608, 148, -450, 304, -332, -334, 229, -67, 257, -578]
1563e78J164r94L08QL92J59j403J247k45J86q35P49J9m82M18m18J098j536J241
1582D98n26L70o59j35J060p51J58m47J258j163K33K03j84J66q32J422r04M50m72
1601b55Q36m57n29N85l09O49j210R71k52q4l97M08O97j275Q56n86Q72j335P41
1620g4M10n33J27m82J220j322M94m25R59o59k68J021o21R5o75J167n77k31M46
1639G2J37K19j546J425j84R7q42O19O27r56R1p0J202j427P41j32K03m31k10R24
1659E59q15M49m68R43r21J23K24L1J09r79J463o11J55o65J006k35q29O79k1M76
1679F73j394J069o2p2n93L40R05j421O66j48O74j236O40K73m12n5m84J387q75
1698a25N1j18N59l00n07P07m12L14q42J271o86k08J48J71N86j345Q87k05K06o22
$$ y = [-578, 586, -408, -100, -92, 300, 459, -944, 303, 58, 244, -591, 158, 177, -305, 113, -305, 793, -743, 498, -28, 342, -317, -452, 608, -143, 15, -432, 826, -337, -104, 99, -85, 81, -751, 671, -233, 217, -255, 581, 124, -405, 180, -129, 520, -690, 281, 29, -55, -452, -44, 653, -622, 234, -352, 520, -815, -74, 336, -197, -70, -552, 668, -654, -160, -585, 374, -285, -553, 468, -153, -58, -733, 434, -143, -374, 72, 209, 428, -1118, 307, 123, 220, -622, -3, 624, -332, -241, -311, 891, -536, 205, 73, 276, -155, -365, 559, -256, 193, -275, 668, -253, -130, 94, 125, 234, -745, 718, 107, 262, -403, 603, 368, -461, 218, 197, 673, -721, 348, 286, 214, -379, -39, 866, -555, 111, -37, 637, -599, 41, 314, -98, -153, -637, 750, -125, -74, -192, 367, 67, -440, 267, -145, 169, -673, 598, -88, -296, -148, 23, 609, -736, 151, -54, 152, -470]
1718d70M15N31r00L80l72J367j551M09O30qo10j96R23q15K29l55J215p71j49K95
1738A97P1M1j033J122k34m0m53N50K97q57M71j15P03j437R36R3k73J5l75J140
1758H19j279L55pP10r24k38P83j01p5q39J399n84q1n52P49O0r52P47J08J86r14
1779f30P04j27j31o2KR18j289O70k68N05o75q9R68p10P3n51J412j169L70o1K58
1800A18l3p22J151n16J5l77M66L9o59M68J49M69j262J112k16pk95J38M58q43L47
1821@l16J037j246L54L89k12rn41J101o87K72m07O24m48n79P91p8J99q43J199
1841F00o52m8k46L98K66r75P70k72O56q15L19J66l86J27k14R24j044L09J11K29
1861B23k36l32N77k92J68o12P57m47o1K97J10K42q88J132p54K56m87P25o5n18
$$ y = [-470, -55, 476, -424, -44, -416, 951, -600, -191, 439, 431, -179, -375, 548, -267, -38, -393, 822, 51, -98, 197, 268, 309, -724, 398, 164, 124, -329, 221, 518, -339, 132, 17, 720, -717, 219, 312, 39, 54, -321, 819, -460, -105, -112, 598, -326, -564, 219, 118, 43, -796, 603, 19, -62, -614, 135, 195, -757, -10, 98, 284, -630, 74, -53, -184, -246, -244, 674, -615, 55, -213, 292, -383, -472, 496, -214, -141, -692, 720, -449, -79, -140, 118, 85, -637, 514, -2, 13, -364, 102, 141, -518, -50, 99, 568, -694, 418, 202, 195, -100, 38, 496, -347, 0, -316, 721, -525, -171, 218, 6, -3, -544, 557, -130, 142, -265, 359, -89, -668, 123, 45, 244, -599, 600, -52, -100, -346, 52, 318, -657, 113, -159, 497, -318, 1, 167, -219, -92, -306, 618, -426, -117, -6, 223, -13, -345, 232, -60, 108, -504, 253, -194, -255, 42, 152, 394, -494, 638, -116, 140, -347, 378, 313, -205]
1881b05L64l42P33r67O84k19P8j58k22N40l95L52n33J011r52L04J49j83k2l80
1901c63R33p35L68l90N66k51m95N96l39M68o88M01O3m41J23J34O13j222P86k24
1921i7K55o19K09N32l39K54n59R40j058N46k44L69j75l36M57l99L79n03R01m56
1941E7k52K65l8J31q46Q68k32K51o86N83N5k09K71k36O03r90M95L1K25k00m46
1962c00R76q91Q1r3P28o16j45L32N1L8l85Q15n81kj35M08K32q12M27k37L92q44
1984e61N46J29j41o1o4L22o48M17j89N58o33J04L90o18K27j43N46m32K28l29M78
2005A26r1m95R36p23K97n69O94k91l51L20k1L68o61M69q0Q9l77M65K75r24N74
2026C0k90N07m41K20K9J07k93k13P85o62Qo5O05m56KM93j41Nl47O45m54r5q6J70
$$ y = [-205, 159, -183, 550, -417, 267, 48, 126, -32, -254, 286, -109, 243, -290, 721, -231, 73, 222, 39, 17, -363, 570, -165, 203, -187, 379, 128, -367, 229, -110, 358, -330, 71, 134, -307, -184, -50, 563, -659, 127, -97, 158, -461, -252, 280, -59, 195, -364, 576, -482, 64, -180, 189, 14, -322, 135, -264, 115, -388, 513, 57, -195, 70, 32, 163, -683, 185, -47, 204, -482, 101, 156, -53, 218, -18, 585, -405, 90, 121, 346, 146, -300, 676, -215, -134, -227, 501, -115, -260, 72, 123, 161, -224, 591, 10, 8, -127, 281, 513, -299, 128, -109, 283, -561, -15, 114, -27, -88, -152, 170, -478, -61, -250, 308, -325, -221, 169, -449, -222, -365, 181, -251, -23, -352, 126, 35, -460, 476, -247, 50, -519, 175, -116, -467, -147, -168, 200, -461, 8, -72, 17, -360, 105, 380, -544, 30, -260, 247, -194, 26, 55, 162, -131, -344, 441, -221, -213, -278, 327, -129, -127, 366, 225, 230, -117, 528, 74, -21, -107, 63]
2050F3K72p69O89l19L15p90R34l51k07J28j1L65p22N01N7K25n70qL79k09P7n37
2072d88Q45n93O2J74k4M3n09J056o11n8n32Q14j61k37K47j21L69n79L02j07J85
2093G7l08m3M04n85L69O1O60j028J66M93m3q3k76N63o93K62J08J78l92l28M54
2114A6J07j19m39O54j64K82n89K66J64n80N75k58K63p66O77J82k47k0k35Q66j030
2135c95M81k93K67r6l65O02k72K45n36P73n91q6K12oQ8l64N29j89j60N1R8K33
2157B26m37K20o2L82p68L05J70R0k68oN71n31J97n09N96m46j06M49R4j3m19N84
2179C19m33K83m70M19J5k58L78k30K28p19N83o1j07K4R3K92m65J36j16K78m91
2200c02K59L42m2k92j54N50n60L55j84J4k27j68P40j65Q7m91M70j66j68j66L47
$$ y = [63, 335, -434, 255, -64, 251, -539, 395, 44, -163, -35, -46, 319, -403, 98, 155, 380, -190, -198, 181, -28, 49, -488, 357, -236, -174, 0, -24, 19, -490, 566, -45, -103, -635, 179, 18, -219, 28, -93, 276, -303, -1, -108, 77, -231, -274, 130, -455, -86, -25, 635, -393, -227, 266, 223, 140, -136, 427, -266, -4, 104, 282, -110, -438, 16, 123, 4, -435, 219, 55, 337, -252, 14, 178, -402, 173, -85, 178, -588, 89, 271, 24, 4, -231, 635, -395, 86, -207, 60, -36, -401, 201, -71, 174, -362, 411, -180, -266, -54, -60, 28, -336, 193, 4, -156, -105, -7, 226, -211, 9, -53, 329, -439, -134, 36, 126, -142, -148, 423, -108, 89, -420, 176, -270, -376, 73, 167, 154, -265, 319, -114, 169, -301, 118, 133, -125, 253, 23, 251, -468, 115, 54, -53, -29, 64, 356, -109, 27, -89, 189, -302, -43, 299, 257, -35, -189, 361, -199, 156, -28, -14, -241, -409, 331, 166, 253, -238, 232, 66, -102, -268, 79]
2221G9M70j250R21m12K95l98L4N22n16J99l70P47o81K4J89J50k10q8N92k97j2
2242a2j08K72j71l54M56m4j20k88N72k19K65m38K99K31n73L24q9K86n66L47P6
2263A46m6j57L7K84n32K66J4M36l89j05M07q6N0n55M10n11M82l84J48K99n75M87
2285A26k98M18m16L38k23q7J44j16K86j99j42j16K63k86Q8M36m60M92n68N59m05
2306a66Q8nJ15k77L3L59n38N33o85N94k80J83R5l34L73p2rj05K93k39pL03k58
2329fJ48k08L44l44L8l7K27j69K3K78n80N66k59K16l33J33K24l89M03n85P72o10
2351a48R7m1J82ok93K84j3K1k78J41J47k48O3j36J69l13K40N7N1j97pN57o59L96
2375F6j77K84m60J15J48J46l3k59K22k30K57j29J84j87J74j79j42L03l30M51k07
$$ y = [79, 549, -701, 220, -192, 103, -295, -261, 261, -255, -56, -426, 321, -360, -336, -147, 3, -207, -295, 297, 0, -12, -120, 152, -19, -373, 83, 39, -81, -369, 203, -16, 249, -189, 110, 341, -232, 92, 3, 289, -277, 70, 146, 100, -57, -20, 264, -268, -2, 12, 448, 59, -46, 361, 275, 325, -230, 180, -331, 151, -233, -85, 214, -361, 126, -172, 246, -170, 168, -55, -142, 2, -114, 172, -27, -169, -285, -22, -308, -220, 216, -244, 248, -320, 239, -166, -78, -83, 32, -245, -212, 147, -391, 142, -543, 51, -229, -46, 49, -285, 88, 16, 7, -98, 195, -44, -51, 252, -6, 142, -66, 278, -66, -28, -65, 162, -7, 16, 294, -286, 280, 21, 237, -96, 37, 261, -128, 275, -310, 462, -148, -51, -92, 90, 84, -209, 75, 62, 83, -195, -54, 93, -155, -92, -228, -59, -372, -132, -75, -24, -221, -228, 329, -330, 66, -111, 173, -287, -172, -24, 122, 89, -170, 52, -178, 79, -50, 134, -53, 121, -58, -200, 103, -227, 224, 17]
2396A7j10P5p0K67m70L33r7K49l09K46k73K42l0q5J72Km8k90N49m50MK88j65k5
2420B2LJ91L6k89n6L00j13j01L32j49Ok82J19Kk02R3K1K20k54K9nJ74k33O3J56
2445H3J4n7l35K15k7l1K34j72mJ35K89n10P7j25J97M2k94N42m42K60l85K58J58
2468A22k14j39J80O9j10J23k45L15k25n5K47q6J04j81J03J34P2k33K69j20j60
2489c0M50m12L48n22N43l27n9K42k02J39o83O23N9j58j15R3Q4j05L6m12N81l42
2511a69M2J60j4J77k58J04j69J87j57L58k97l38L57k45L05k48M49k31j7k00L41
2532A37k23r7O8L4L34m33L12R1j91l40K27K71j16Q7k37K30j34k81O76l47p0k76
2554b78L62L6j54o1K33q3k56J92l6K44k44Q3j55O4J43j84K88l63K22j48J61j99
$$ y = [17, -93, -18, -88, 179, -291, 42, -55, 194, -115, 131, -142, 100, 70, -15, 157, 159, 111, -179, 370, -80, -76, 212, 47, 22, 25, 216, 252, -37, -93, 207, 94, -7, 325, 176, 182, -100, 19, 21, -181, -88, -67, 153, -101, -72, -77, 97, -136, -73, 83, 97, 40, -295, -80, -107, -138, 96, -76, -80, 55, 344, -166, -89, -214, -17, 25, -269, 273, -169, 91, -294, -36, 122, -92, -231, -51, 18, -92, 31, -214, 101, -124, -179, 68, -18, 86, -95, 8, 142, 214, -19, 250, 130, -30, 420, 8, 356, -166, 377, 50, -9, 233, 31, 170, -513, 110, 169, 11, -104, -11, 73, -32, 4, -408, 173, -169, -127, 33, 19, 196, -62, 42, -127, 60, -97, 261, -36, -374, -17, -262, 43, -205, 244, 13, -4, -204, 137, -86, -183, -115, -81, 253, -180, 132, 223, 32, -308, -81, 190, 74, 161, -76, 154, 20, -261, 415, 68, -2, -278, 84, 120, -34, -95, 138, 55, -201, -9, -45, 199, -45, 38, -117, -53, 90, -94, 194, -169, 53, -95, 66, -133]
2576a33J96m5R5o6k9K09l33p0N4J28j43LR0J21r7qJ99k46k24K23K00j30k29L98
2600A63k99o3J28K24R0l44R2p5K23l46J28J38pl18J27K13m33N25l01K81k1mP2
2623A93k62K37l92L27o4J09l2q4L91m53P7l00J59J10j16J07p5J5k8O24n93M0L18
2646C08j42j4l28J89j5m2j28L47j30j5N0Q4p6q4K33r8j30j27K0mjM2J22O0l19
2671a98R1K82l13J37k90K31L9J12k30L29k00k8J11j46M8k77M94m18K07j16K07
2692G2j46o6M06k99J73l12L42j90J45m8L2J5j96J91r9J31l00J76K77k50l1K8N4
2715A05l25M15k37L49j96R6k00l36L53P2j05K23l41K92k68P0o9L34k39J46l01
2736a62P0J46k87L39k60K89m78M35j39J17j51J22Q4l83K39j67J27j9N2J7N9J03
$$ y = [-133, 63, 18, 113, 47, 18, 227, -106, -176, -122, 6, -137, -134, -44, 77, -20, -28, 171, -75, -299, -76, 124, -6, -235, 163, -136, -199, -71, 153, 243, -101, -9, -84, 139, -207, -79, 59, 52, -266, -139, 74, -359, 166, -135, 146, 125, 121, 193, -69, 168, -224, 103, 39, 148, 116, 32, 423, -30, 47, -253, -94, 16, -100, 7, -68, -53, -81, 543, -50, -10, 308, 166, 152, -176, 13, -2, -44, -172, 175, 45, 30, 80, 164, 88, 4, 237, 139, 9, -118, -98, -102, -103, -61, 61, 121, -198, -107, 175, -138, -1, -291, -60, -21, 91, -139, 190, -10, -38, 73, -73, -25, -302, 192, -226, -19, -135, 72, -74, -140, 266, -33, 140, -172, 170, -20, 125, 77, 109, 124, -72, 119, 20, 151, -149, 27, 304, 54, 23, 51, 105, -220, 195, -42, 307, 111, 207, 7, -329, 24, 96, -9, 214, -127, 165, -103, -33, -102, 232, -7, 139, -162, -92, 54, -233, 106, -154, 135, -343, 92, -47, 70, -81, 41, 125, -258, -19, -186, -59, -78, -26, -9, 50, 153]
2758A53k73L82m96J77l3J05J39j27K3j65J88k30L28J6q8l57P1K88j59J4Q8kj58
2781a16Q3J09k96K07l45M43M5m1m05L24j42M5J71k54K26k0M7Pm5r1m8N02n14K32
2805A24J69k56n5m3L8m4R7j79K70k01qJ30O5L9j32J89k53J69l25K30k69L89j36
2828Ho3J84m24N67k27k48K09L7R0k97J49k0J59k56K41q4j40K1J05j05lJ21R9J36
2852B59l32J23j15o4K04l69K88j76J70j45K63j25j03J86m04M23k44K38r9p9J45
2873D4q6o4J67k48J76N9k62L47k93r8m2J66m2M5K39J7l4j93k12N56l87M1J12O0
2897F8j9j49K8j42J90Q2j53p5J34p1K4M2l9L6N4r0J22J89k18N8j35p7L27l96J07
2922a03l36N71n8r6j7n5K35j40K63l08K51j51j97K89j19Q4k44R9p0J96L9l19J24
$$ y = [153, -120, 262, -234, -57, -90, 15, 154, 27, 50, -115, 73, -157, 171, 187, 99, -258, -187, 101, -58, -44, 44, 42, -116, -33, 76, -220, -13, -358, 85, 130, 89, -316, 8, -134, -89, 82, -172, 54, 34, 81, 88, 43, -48, -96, 406, -108, 124, 293, 37, -18, -61, -23, -67, 30, -149, 121, -80, -88, 42, 107, 146, 14, 203, -50, 119, -206, 24, -245, 144, 8, -55, 129, -295, 272, 45, -203, 6, 43, 133, -164, -15, -35, 124, -132, 109, 25, -115, -94, 11, -94, -97, 24, 123, 259, -73, 50, -65, -129, 75, -294, -6, -182, -12, -157, 106, -19, -122, 64, -340, 83, -161, 77, -22, -101, 44, -42, -106, 61, -187, -11, 48, -214, 133, -160, -258, -300, -134, -176, -131, 108, 125, 91, -102, -314, 242, -145, -104, 8, 68, 49, -100, -72, -214, -24, 58, -95, -170, -36, -107, -83, -41, -80, -44, 10, -80, 42, 231, 13, 71, -64, -141, 186, -210, -103, -439, 132, 74, -22, -39, -94, 141, 1, 264, -44, 207, 56, -141, 148, 29, 113, -131, -32, -102, 94, 133, -186, -62]
2945f2j2Q9k54K04J65j83j36K1L16O4k65O8J05j50j60K9R9K15N3j78Kk7N4k58
2969b01L38m76K56J95o0m9J56k3k00O2l8N8k16K80r2L07m40R2K6J63R3l01R2P
2993B9P6m9O0r1q5O2p0L49j17l05K00l0Q8k4J93k22K58l33J26j82o6J42K08p8
3017A39k72j71K57o0NJ52j85N1Qo7K47k30L10m13K63qK89j93j5J9j22K41m51J77
3041b9n1K00n8k05K29k68K72O8P9k02j28L33j85J05j20J4j14K12j19j80N3j34
3063b28K52r0J8K7k4l7j21K83r5J57k91K18L0j73J37k99L52q1k35K10L1j50J90
3086H1R6m46L24k19J40r0L00j1j41j76J35K20m65L84p6k68K26r8K68j21k00K54
3108A17M6k53O9j90J68N1K64l82J88O6O6k50j55J72M7J2J73l67J56j53J72J35
$$ y = [-62, -74, 15, -239, -35, 130, -53, -189, -168, 148, 212, -53, 15, 120, -30, -190, -161, -62, 153, 206, 28, 30, 3, 57, -201, 137, -339, -83, 112, 52, 3, 159, 136, -64, -2, -40, 18, -198, 82, -10, 297, -143, -51, -25, 138, 231, -70, 22, 29, 105, 56, 116, 25, -60, 2, -68, 281, 164, -141, 59, 29, 117, 93, 286, 64, 322, -11, 115, -67, -133, 9, 217, 139, -133, -304, -47, -107, -102, 50, -135, -84, -76, -143, 104, -126, 184, -229, 34, 26, 315, 122, 107, 126, 4, 245, -206, -29, -80, 120, 62, -143, 86, -182, 90, 158, 237, 35, -93, 240, 55, 160, 40, 54, -60, 152, 33, -147, -94, -228, 24, -66, -48, -21, -45, -82, -203, 80, -15, 142, -149, 69, 99, -74, 63, -236, 116, 35, -200, 10, 41, -109, 81, 177, -269, 55, -164, -24, -114, 186, 175, 34, -142, -7, 213, -252, 132, 56, -212, 14, -84, 184, 63, -137, 117, 163, -90, -21, -211, -43, 8, 272, -110, 78, 144, 210, -40, -195, -23, 24, 36, 209, -158, -2, -155, 17, 152]
3130A52j33j9k41L32j61j6J40J2l4J44j28M1K19n08J68K3K2N0j1J64m3j87j21
3153a35N1J15n1N7m5P0J80m29N2L09k58K03k82J38k92L59q7m5L34l30K66r9j48
3176f7J89l08J94M1r4QK07l34J93K24m09J45l4K59k43q0K19o1j14o0J34J27j52
3199a6kk10jN86j99l6M3k98j4J85N5j08M3J44j68L0j63M2J63k03K16m9J3j41L22
3224B34k86K92l05P5nk77J56J0O4M9J23j7l8pO8o6k22K79k27K42j22m4q2J49P5
3249A18k95K31J05m4P9Q9m09K31j76j6J81k7q1j50J50N3q6J28j00j87J87L2j5
3272bj21j01J89J7n7R0o7J77L0k94J38J17k82J01J55j79J38j04P2J2N4j67k0K28
3296A24K6Q7l73J77q0n4P4R1m9k5N0j46oJ88j26k2K32k16J86j55L23k45j54R9
$$ y = [152, 19, 0, -241, 91, -70, -86, 54, 66, 32, 176, 48, 89, 308, -200, -32, -9, 13, 63, 52, 216, 173, -14, -135, -84, 31, -20, 37, -8, 62, 242, -187, -135, 174, -84, 119, -163, -25, -317, 42, -45, -90, 244, -86, 180, 81, -67, 122, -186, 8, 49, -45, -37, 170, -164, 29, 253, -156, -11, -45, 214, -29, -109, 110, 49, -65, -125, 9, 136, -16, -18, -228, -229, 357, 158, 122, 165, -133, -147, 38, 93, -15, 28, 172, 4, 34, -129, -87, 76, -127, 89, 40, 53, -88, 234, -52, 240, -65, 10, 5, -272, -116, -106, -42, 7, 130, 113, 75, 68, 136, 70, -152, 127, -100, 142, 20, -24, -106, 43, 118, -177, 54, 159, 115, 194, 283, -126, 105, -71, -87, 94, 67, -14, -164, -14, 39, -47, 81, -19, -206, -19, 13, -2, -123, -224, -35, -18, -75, 15, -52, 125, 155, -139, -1, 116, -166, -65, 90, -89, 49, -55, 17, 29, 83, -84, -104, 124, 150, 237, -136, 41, -39, -93, -19, 72, 23, -2, 48, -98, -104, 84, -42, -64, 168, -48, 138, -17, 306, 61, -93, 6]
3320FK5m3J82j08J3n5O0N6m6j67J43J98J05k56j97n2L1k7J04J4J9J00j96L7K90
3345B36k59l90M98J13q2j65r7J36J41j63P4J9o6K7Po8J00j63K76j48j5k4J01k30
3369a42J66p3q6M9j35L08k07K53k89K8K12o9O1k9po8nJ04j88l3L45l14L97j24
3393A54o4k81J52K0k9Q9N2r2j97K09q0J12L8j67K66j39N2O4j81J97r7j42R7Q7
3417A20J9j20k6J28j06j56J82K0j47N0r0J74j01j09J9K12J90j75k61L28j02pq4
3440d2n5K3K99l76L05k47K62Q8k91K0J10j24O6m1n1q1lj9M43j01m7l09NK20j58
3465a04J02J27l0k37k6L9J26R2j2k84L1J76M2N1n0k89K89j51L79m47K21m8K56
3488B53j64j66R3M6q2R6l2j3Q6j75K8j09J96n8J62l25J80j8J7p4J73m33M91l56
$$ y = [6, 31, -12, 170, 62, 75, 20, 80, 136, 90, -77, 66, 264, 369, 113, -84, -136, -105, -132, -28, -14, 5, 105, -91, -54, 236, -23, -413, 85, 198, 116, -49, -146, -10, 131, -32, 42, 61, -5, 22, 29, -39, 61, -102, 174, 26, 11, -13, 88, -142, 24, -49, -135, -86, -221, 87, -120, 133, -156, -128, 84, 15, 76, 47, 40, -28, -33, 71, -117, -150, 195, -119, 278, 154, 90, -191, -39, -19, -48, 41, 93, 1, -196, 13, -67, 45, 83, -84, 182, 43, 95, 159, -22, 175, 78, -64, 33, 120, 139, 19, -7, 121, 15, -141, 41, 61, -86, -36, -126, 48, -53, -162, -143, 69, 259, 84, -177, 151, 49, 42, -42, -97, -74, 225, -151, 154, -93, 169, 257, -34, -14, 96, -28, 38, -3, -54, -135, -138, -157, 286, 185, 138, -171, -166, 54, -104, -2, 125, 95, -142, -168, -129, -3, 89, 77, -207, -176, 0, 42, 93, 43, -246, 43, -108, 271, -176, 45, -3, 253, 89, -77, 16, 62, -20, 76, 44, 31, 117, -58, -30, -139, 57, -1, 161, -164, 16, -2, 15, -59, 114, -319, 172, -184]
3512a84P21K99j770J226p11R0L23N6k71M81K97k17J58m62Q1O4K23m46J9m8n52
3533f23N96P0J11JQ8l92k00J42O58J60j123N26P7J27k7n41O3J40J06J40j35j16
3555a52jj01L70L03o21P33o48L83l75k0K33p47J144q60m85R86n01K96M6p1N3L
3577c2J17j59R0J57j99m4pn0pj96L59j27Q3J87k69O0jJ16k74L02q1K0J39l55K57
3602H6j14J83k2k59n1J51j89K05Q7N7J09J00l12J6J53m72K79J44j86J49l02L03
3624A15lr7J52l13J57k5L7K4R7j92O1r9M4K32k29j51J48Oq1%L60j15Qp9k06oK49
3651I4J4k99L2K08N9k33q6K98j61N2P2p2N3m50K71K00q3m0Q6n0J58r6Q0k14l2
3676a39J87O7O7k91J28KJ8LR7j34k80L63j52J27j18J01pJ7J43l06OJ26k40p5L13
$$ y = [-184, 537, 836, -934, 292, -419, -329, -6, 50, -221, 260, 557, 340, 498, 36, 117, 181, 404, -42, -23, -71, -623, -27, 43, 154, 155, 243, -149, -349, -207, 451, 611, -512, 14, 91, 218, 191, -350, -287, -147, -41, 99, -36, -152, -153, -254, 116, 419, -202, 531, -117, 266, -109, -129, 104, -643, 501, -359, -844, 142, -359, -63, -17, -88, -35, -32, 85, -74, 16, 173, -26, -70, -77, -127, -134, -330, 29, -98, -15, 172, -97, -37, -38, 78, -196, 106, 25, 45, 184, -171, 86, -28, 155, 133, -126, -177, -26, -215, -10, 77, 134, 243, 343, 31, 47, 200, -272, 7, 151, -35, 114, -188, 115, 112, 15, 167, -146, 11, -14, 23, 47, 144, -48, 13, -86, -42, 190, -39, -190, -42, -36, -117, -117, 243, 128, 136, 57, -149, -155, 94, 108, -191, -159, 49, 108, -125, -211, 87, -74, -22, 50, -22, 31, -419, -148, 52, -31, -71, 15, -35, 123, 27, 107, -107, -139, 48, 115, 182, -109, 19, 21, 39, 42, 139, 5, -275, 88, -64, 63, -55, 46, 39, 56, 199, -107, -101, 25, -215, -290, 23]
3701B3R1m0No2j28J4J37j78K05JO1j10n7K4j74K59m5j15K37p5j41J86O1r8r9p2
3727i0q4K49O5j37J20j03o7J58k79J02L1m5J11l3J7r3L16m91K37L1J67k42j5R9
3751B4J65m0m33J1P1K21j3k79K79r6nJ64m1j41N8r8P6O6k0j09O5J97l05K97j25
3776a1j58J43K6O8j3k16J56j74R0K70j73R0j0j77l4L11l32Q6M3k0l1Q8N7M3k31
3801a09O5K18l57j9L20J2j52k3j8K8J16j15J27K1n0L7m49N30j31k1k4P2j36R7
3825C9N0j81k3J88k59K44j56M5J64l19M27q6k44J63k73K52r7NkJ66j94K02l16
3848b05J34K53k49J73j62L33l50L32k71J90j42OQ0l2m6J40k69po0J87p9L5R0p6
3872EJ12k17k9J50m1J46rk56K20M7k00j10K19k9j92J52n9L81k89L5j1Kp5j79N3
$$ y = [23, 114, 74, 79, 17, -111, -97, 40, -138, 67, 68, 129, 19, -38, -14, -188, 71, 26, -89, 148, 73, -68, 118, 179, 81, -18, -90, -174, 75, 140, 3, 123, 20, -47, 111, -168, -66, -35, -80, 31, -2, 15, -78, 238, -253, -16, 15, 182, -60, -75, 24, 189, 149, -284, -273, -202, 19, 6, -273, 6, -90, -95, 69, 28, -113, -55, -153, -77, -11, -31, -140, -75, 122, -183, 114, -11, -169, -26, 0, 68, 55, -161, -5, -179, -89, 181, 8, 98, 88, -89, -123, 188, -144, -58, -15, -35, -66, 22, 79, 122, -109, -44, 174, -183, -202, 118, 130, -22, -45, -63, -35, 81, -34, 93, 114, 64, 101, -348, 182, 51, 30, 6, 78, -58, 39, 89, -92, -115, 73, -186, 58, -98, -53, 111, -208, 219, 133, -111, 52, -221, 31, -66, -61, -63, 103, -91, 111, -205, -71, 182, -67, 106, -56, 277, -73, 259, -12, 178, 36, 42, 122, 90, 44, 184, -85, -92, -152, 35, -44, -9, 81, 5, 117, -100, -129, 21, -20, 126, 117, -139, 81, 128, -72, -182, 37, 8, -184, -32, -91, 290, 1, 36, 25, 27, -48, -227, -174]
3897a74J57N9K4q8o4J81k49Q3J53n2j30J13j24M8J41p8j49J20N4l5n0J24n2oP
3922A3j13J48o8r2J15o1K35p6k44K81j3j16L8j94L46m71L63Q3j80k3m9K7J05j97
3946a43N1Q8J59L5l49P2K36k37R5o2OJ72mj32j61J72n0J41pm0r9OJ37k63J32K3
3972b2O6J55j74m7K55j00j36K5l96L16J98j46J79l61K73l7L30m45J38k60K98j35
3994b6M2N6k85K45l7K52j80j01P6o5p3M21j34j02o5k2m1P4LJ98k82mj09Q1J58
4019H0k99M14j08m06K70K05k05N0m1M9j15l4J55p6Q0j11N8J70m0o9j68j34P4R0
4043a11m2L47k35J56j02p7j3J40m5k6N2l1N0J8j80K0K63l49Q4K62O3k22K26l07
4067e9l1L6L7O2q4K50j41j60k7L0jR6j42O1J51Q0k07J30L9k14K32l62l8L49q0
$$ y = [-174, -17, 42, 66, -22, -86, 95, -154, -71, 82, 30, -100, 13, -111, -63, 78, 0, -149, -29, 25, -10, -60, 64, 12, 6, 13, -100, 48, -20, -112, 3, -58, 177, 101, -143, 138, 125, 9, 47, -147, 199, -272, 91, 174, -6, -29, -78, -51, 54, -143, -92, -4, 155, 190, -159, -87, 149, -88, 7, -55, -49, 123, 119, -13, -174, -2, -52, 89, 82, 42, -57, -51, 86, -177, -45, -22, 44, 199, 25, -22, 233, 133, -3, 22, -374, -58, 140, -6, 173, -188, 85, 48, 378, -67, 71, -189, 109, -26, 16, 72, -213, 32, -5, 247, 67, -34, 42, -23, -96, 325, 191, 89, 24, 2, -39, 35, 38, 236, -46, -50, -159, -78, 80, -219, 195, 87, -319, -49, 156, -49, 1, -40, 9, -106, -140, 15, -61, 19, -92, -34, 136, 96, 27, -141, -275, -201, -111, -153, 194, -41, 115, 13, -64, -77, 63, 18, -8, 44, 13, 63, 81, -99, -79, 184, -165, -81, 181, 244, 22, 248, -59, -90, -54, -17, 45, -39, 211, 70, -90, -117, -87, -88, 8, -134, -73, 78, 158, -49, 81, 120, -94, 138, -224, -262, 87, 7]
4092GJ87j64j15n2L14j08j03K07l96J38j19K47j35o8K04M0O6l22J77J79l00m2
4114a58L01Q0n83N33n0j53J15l23J16K04ML0p7m3K55k38m5J21Jk50J71M9j07K31
4138A84k19L9k43J24J38j91K59k00J27l6o2K85j92J26l59J84j93MK13J95k61K17
4160A39L8r0j62KL41j90k2J84j05L8n01L94k06J70J2J99L0l68J96k29L07k07J59
4183A29J22k54j10K39k81p0J10M2J32O9j19M1mR8P4o9M6l18J9l4K47p8k6j22M9
4208f8N6k69L7K90j06L8m0K58k80Q5P5p8k04J52R2r9l3J52n2k36L11j9j5j70l8
4233a61J04J66l06R2L1J18J77l01Pk5J81k13M6j25L30k71L54R6k16k65J47jJ69
4256A34r4kk8j76J78J23o0j02OJ09j22j48J67J87j12M7j56l24M95k98K12q5l2
$$ y = [7, 194, 30, -85, -137, 177, 69, -34, 173, -223, -85, -204, 43, -92, -160, 44, 84, 150, -172, 5, 184, -116, -158, 143, 223, -360, 173, 123, -30, 85, -238, -122, 82, 86, 116, 39, -4, 251, 13, -32, 89, 90, -160, 11, 60, -47, 184, -35, 4, -239, -115, 23, -168, 91, -109, 18, -18, -80, 205, 13, 139, -220, -36, -229, -225, -12, 183, -78, 139, 177, 87, -75, -73, 268, 78, 56, 240, 135, 173, -328, 66, -140, 30, 42, 241, 271, -97, 99, -130, 177, -30, 129, 251, -3, -113, 126, -155, -225, -115, -73, 59, 128, 9, 50, 46, 144, 218, 149, 195, -123, -104, -138, 109, 31, 5, -117, -68, -12, -281, -244, 46, -60, -22, -62, 196, -84, 1, 76, -2, -206, -54, 38, -61, -94, 58, 6, -230, 81, 62, 47, -123, -161, -57, 109, -197, -105, -74, 44, 221, -80, -73, -98, 83, -130, -84, -209, 121, -150, 204, 300, 84, -181, -34, -35, 134, 40, 38, 10, -166, 12, 135, 75, -27, -21, 88, -34, -182, -15, 172, 60, 107, -49, -373, 122, -176, 36, -49, -81]
4279h1M8J34j14q7J42p2j25L98m01K90L5k17n8Q2N5r0j22Q1K45k07j0J11L1k52
4303a84K04j0J28k49j51K35Q6r5j25K65j75J4J18L9j30j11M09k81L0l8m5Rq1N5
4327h3j84L10l10L45M6k88K61j61K71n16M38j15j22K35j95oq8K34j23J42j71J30
4349E0M9L6k33K9J93k46L2K10j48J16k9k34J0L99m26M48k02M6O8k2j99o2K17k34
4373a32L83k16j5k50J12J17p0j3J17PJ9j41K24j08M7J10k19p4N0m3QJ24J54k30
4397c9O8J63k54k1L35l29K39k05n2J84J07k29m9R2K4P8j98q6l7L50q3k48L21J7
4421A48J83l81O01o1m07K03p41R44m02J86k12j98J66q3L40j80J64J9k24k0o3n3
4443g1J79M4O9k16J38R9j83j26K21l81R4J48J08j62j03P7m6J26j07K1K13j12N0
$$ y = [-81, -33, 101, -13, -100, 42, -30, -155, 243, -158, 132, 167, -50, -108, -26, 29, -61, -183, -102, 143, -64, -74, 37, 68, -184, 20, 10, 138, -111, -262, -27, 59, -36, -161, 104, -71, -57, 61, 100, -30, -141, 268, -13, 17, -21, -66, -57, -138, -83, -267, 43, -267, 78, 124, -164, 97, -64, 207, -309, 129, 14, -108, 127, -68, -74, -162, 72, -51, 91, -80, 50, 99, 135, -98, -69, 124, -122, -90, 120, -28, 88, 59, -175, -165, 234, -192, 256, 54, 100, 168, 146, -53, -115, 102, -132, 251, 35, 20, -230, -118, -1, -71, -84, 33, 40, 59, -82, 142, 34, 81, 191, -28, -102, -52, -95, -87, 37, 191, -39, 29, 192, -62, -83, 252, -77, 162, -43, -95, 89, 196, -33, -82, 10, 34, 112, -86, -172, -209, 141, 58, -190, 131, 148, 331, -50, 551, 490, 83, 286, -455, 489, 87, 273, 61, -137, 29, -54, 286, 106, 270, 289, 65, 45, -18, -71, 108, 152, 221, 5, 143, 242, 59, -67, 154, -227, -133, 15, 123, -39, -142, -65, -111, 15, -92, -71, 142, 30, 80]
4466H0j08L6Q0j63lo9L98k49j4Q0J81j04k35J88j61P5j37Q1J87j73R7l2j49M9
4490f5J65k8l43M90M5J9j35q4j97J27k32k6J00L20q3j3O0j14O7Q5q3r1M1L6J49
4515B10k29m8j79K31K4K76j66j23r5k6Q4J40J01p4q4j20L01k55k44nK20j0M3J6
4539a2j43L89j09j79J63j18L0R9j25J5K15k38o4j08J44Q9m6J31j98J47P7m7j49
4562c7p0K95l25K33j79r2k23L00Q2OK23m08O8R3M8j4J7n3O1J63l15nj78L31q4
4587f3K52p2J74k40j28J51j00O3n6k9M5J01R4q3j23n9K1P9j95J14l4j97J97K01
4611A13m1r1L19j30k83N4Q2k2j60J62l1N1j50r8K02O3k8j5R1j3P1j28J01j41J30
4636A08j41L01j63o7M5k18J47l8K9j70R0K24m06L10K04k20k8j91K26j04j45J39
$$ y = [80, -28, 8, 88, -75, -78, -147, 251, 2, -12, 68, 249, 145, -90, 98, -63, 12, -125, -44, 143, -30, 67, 35, -114, -65, 100, 72, -271, 219, 264, 283, 148, 64, -133, -6, -238, -264, -164, 156, 73, 60, 120, 6, 73, 158, 75, -16, 25, 61, 210, -19, -67, -246, -15, 9, 285, 119, -4, -99, -125, -41, 99, 200, 126, 42, -78, 223, -32, -276, -281, -61, -71, -28, -12, -155, 234, 125, -54, 109, -9, 21, 120, -5, 10, 225, -13, -77, -185, -41, 48, 2, 133, -65, 82, 159, 112, -37, -107, 188, -137, 96, -83, -175, -398, -98, -16, -10, 213, -195, -127, -34, 14, 0, 17, -36, 25, 188, -127, -132, -310, 21, -63, 189, 117, 291, 51, -77, 74, -26, 37, -19, -48, -3, 98, 192, 109, -14, -73, -52, 27, -168, -54, -88, -285, -88, 113, 72, -19, 300, 170, -113, -59, 23, 1, -159, 3, -28, 23, -127, -225, -23, 40, 12, -3, 88, 75, 146, 18, 119, -22, 108, -33, 268, 105, 38, 83, -135, 12, -26, 3, -167, -77, 147, -259, 51, 255, 35, 7, -184, 42, -62, -207, -68]
4658f8K09l65L9N02l92P3J50r6k43R0J22m2O1j9k5J28n3m9j9Q8j48m5l0J56Lm61
4684d34M55m1P8j59k1O0J63j39O6J20k63l6L2J23J24Lj88J1K97k21j93K67o3K1
4708F2jj02qn7J21K9k68K53p4j13K1M2m3J17R4p1j86J33J98m68M60o9p2Q7m09
4733c24N31j84j58J57J6J10K0k64J32n1l6J2P2j77K17j32o7Q9rM3j01O0K09j04
4757F1PM8l40J87J23K2j80n8o2K88r9K67j89R0n7j38P3O3P0k95R0q3J47R5N0r9
4783H1l87J97P7J9o8J03k04J68j73M8J96j57Q4j36J95k21K26J00j48K9J83r0l9
4806H3O3l3L0r2J65m27J47J78j41k2k1J53ro9J55K4k56k02J76K58k71J85k0j64
4830a10J90L6j49k1J68k74N3K7L02j89j03R0J38p8J82l35J09J23j94J1J63r0j80
$$ y = [-68, 141, -224, -185, 317, -75, -2, 148, 52, -191, -101, 21, -21, 40, 21, -4, 124, 71, 22, 3, 91, -57, -102, -132, 24, 27, -434, 21, -20, 58, -101, -122, -62, 101, -38, 28, 148, -115, -151, -119, 4, 128, 131, -57, -46, 251, 30, -163, 104, 41, 62, 61, -41, -49, -106, 15, 44, -224, 29, -45, -158, -137, -95, -138, -21, 73, 2, -184, -51, 147, -321, 139, 70, -2, 85, -324, 207, 23, -135, 22, 38, 148, 168, -96, 36, -15, -51, -39, 33, -144, 73, -59, -126, -37, -46, -3, -104, -44, 165, 61, 68, 116, -224, -37, 86, 108, -72, -130, -192, 96, -3, 264, 75, 165, 108, -30, 43, 106, 176, -119, -29, -112, 35, 130, 180, 81, -306, -109, -32, -13, -81, 22, -182, -14, -187, -139, 57, -100, -16, -152, 43, -178, 48, 148, 0, 29, 212, 122, 83, 146, 113, 143, 51, 216, -211, -64, 114, -27, -49, -70, 83, 74, 5, 160, 184, -72, -274, -98, 160, -111, 74, 54, -110, 80, 116, -33, -54, 114, -160, -107, -80, 222, 33, -70, 20, 158, 80, 262, -73, 36, 159, -35, -24, 139, 49, -131]
4853a31J77j79n3M96m46R7k3P2j44K11n2r5k8J86J41p9J06m61L69n2k1k83K65
4876G3j72PP2Q0o1R6k09J19r8K43j73j4l2m6L17l42L6l6K99k0J21k04O8j60M3
4901GM0o5j10K9M5K72k98J5QJ79p2j2l7J19R0j76n7P8J52k19k75J89K34j50K43
4926B29k93K00L4l54J85L7ol1K4r7R3k35L79l86k12Q5L19K45j62j26j65K47n9
4949d9Q7J32k51K33k91L05j68oJ35L0l9ol2j50P3K14r8j81r4QJ04O9R4l64K08
4974c7j11M5L16k48j72K37j66P0K03l78J77M17n42K08J14j93k2P6l6qJ4K18k42
4997f0P7p1j77L1J25j21L04j23J74j77p8M3J2j07K45j46J24k13J03j57R2O1L1
5020hj58j4J59J87q7n10M50K2j23l7J73o9Oj03K7M8J35J16m89J99J40L1k57M08
$$ y = [-131, 46, -133, -186, 310, -136, -39, -62, 10, -134, 77, 25, -70, -98, 88, 229, 150, 256, -205, 164, 112, 91, -192, 73, -99, -92, -20, 60, -1, 95, -114, 5, -93, 150, -23, -37, -69, -115, 202, -140, -104, -140, 159, 139, 260, 56, 124, -36, 7, 47, -18, -128, -99, -54, 218, -80, -65, -57, 122, 50, 38, 1, 120, 210, 34, -23, 55, 207, -12, -287, -98, 136, -14, 229, -64, 136, 170, -184, 1, 38, 32, 1, 25, -72, 21, -214, 165, -221, -433, -348, -29, 216, 54, -72, -237, 10, -49, 38, 170, -81, 152, -139, 166, -2, -8, 127, 157, 118, 112, 80, -70, 3, 217, 119, -62, -156, -148, -44, 25, 119, -245, -37, -148, -103, 213, -35, -207, 30, -136, -66, 137, -241, -64, 353, -189, 19, 133, -60, -82, -6, -42, -50, -36, 182, -60, 17, -54, -231, -200, -75, -196, 108, -15, 159, -18, -96, -53, -41, -148, 97, -49, 75, -138, -35, -192, -100, -39, -8, -166, -180, -21, 166, 79, -431, 19, 41, -82, -119, 54, -15, -9, -112, -85, -37, 98, 214, -275, -76, 64, 95, -162, 246]
5044B46k69P9j47L4l8j1q8L82j12j65j9M6J07m8p2j19J4L67j33m7J18qm0j73l4
5069a30K3P1j26K54M9m1N5l70N49m08l2J0J34j16L6OK8J82j41j40K37j15j18J88
5093H5J29l63L8q2Q5L06K6j20j02R5j56J06J56k90k0J48ok4j45K42j24m7M2J4
5117gJ89k48K15k19J19K14j66n8j01J49j3q4l3r1M18j64L6n57L38qJ99M8p4q1
5141B1J98k61M2P7l34K84j59K7J90J8j17p7J91j04L9M4N3j18O0k54P6j4M7p7R2
5166e6N4j04L39l06k7J30p0J01j68Q1J02J22l46K18m0K28k84j29L37j99Q1k00
5188a36L65k76J39k28l8N25j95L1l63K44l9J59j74P8j49J17j9m5M0O5k40K46r3
5211A4L9r3K8Q7k17J47j71M27o0j03k00L91j62Nj31j77L43k14K84m29K34J36j20
$$ y = [246, -23, 56, -91, -57, -95, -106, -194, 188, 76, -89, -108, -62, 45, -3, -75, -194, -180, 187, 54, 7, 125, 117, 77, -96, -130, -107, -36, -162, 92, 141, 100, 155, -215, 334, -74, -106, -96, 38, -78, -42, -36, -8, 174, 33, -107, 130, 15, -103, 85, 214, -149, -111, -193, -108, 198, 224, 104, 2, 97, -59, 47, 203, -87, -107, 41, 35, 11, -134, 108, -16, -63, -21, -7, 182, -66, 149, -70, 49, 263, 97, 39, -62, 87, 74, -10, -43, -134, 284, 120, 156, -401, -63, -71, 128, 176, 102, 21, 219, -42, 0, 77, -257, 27, -132, -105, 85, 103, -14, -91, 100, -4, 35, 79, 132, 14, 74, -180, -104, -118, -71, -148, -56, -2, -106, 233, -73, -100, 30, -40, 61, -107, -26, 76, 198, -148, 70, 30, 258, -26, -155, 182, -17, 64, -136, 229, -47, 92, -136, -174, 351, 156, 187, -176, 68, 29, 188, 14, 92, -57, 60, 41, -4, 36, 101, -139, 107, 14, 53, -40, -12, 75, -142, 5, -166, 261, 201, 98, -102, 289, 127, 132, 1, -176, 167, -47, 237, -192, 42, 178, 58]
5234E8R6j03N2r7m2rL36l29J16j43K88l42J50N6l9k43J36j7K25j49m1j88K03n1
5258g7J54j65p1K97k90K68j1m2oJ51k20P7k46O6J76j86J24qr5K20q8j04j44L9
5282a81Q7K17j00N3k31K00j85o8K39r7R3N8r6r0M9J12p2K37r7m7l47K71p6J48
5306G7J7k16N6j00J92jJ66k85M58l60o7l1n2K38J0RJ28l87J8K19J9m35J30J70
5330b7J44n6j29J64j70N4r1N1K34l28p7m0K43J42k78L42q6k9J0l7R5l24K05J07
5354A19j31j2J00k56J00J27l68J60Q6o6J4J60R7p7R7J15m79M76k69R0k39J97j72
5377a31l7J54N8p4K2N4l5L45m68K61o5j26K56j30r6J27k51K43k24J54m4K0M2L4
5401H9p2l5Mj3l1j2J14K7j66M9j07M54k17j43j02K47j03j73K26J25k13L50l85
$$ y = [58, 154, 51, 103, 6, -36, -45, 291, -38, 78, -65, 223, -119, 31, 87, 48, -195, -59, -76, 149, 0, -41, -229, -26, -77, 77, -88, -159, 138, -152, 116, 105, 63, 57, 208, -12, 65, -181, -115, 61, -125, -1, -9, -104, 116, 28, -76, -220, -181, -94, 123, 23, 76, -155, 45, -140, -208, 31, -66, 27, 85, -11, -101, -52, 60, -12, 225, 128, 81, -266, 5, -71, 77, 94, -122, -66, -166, 26, 25, 191, -94, 364, 4, -63, -94, -146, 92, 102, 111, 239, -148, -130, 89, 108, -327, -197, -27, 117, 61, -68, 96, -74, -20, -111, -60, 174, -154, -231, -271, -28, 114, -164, 178, 92, 63, 73, 36, 131, -193, 12, 119, -12, -24, 76, -180, -80, 47, -321, -161, -75, -141, -127, 33, 130, 53, 150, 265, -214, 262, -7, 83, -156, 41, -131, -168, -14, 44, -30, -8, 46, 11, 356, -112, 149, 84, -42, 214, 84, -12, 115, -136, 107, -117, 37, -7, 13, 55, 89, 17, -18, -14, -27, -58, -70, 44, 71, -95, -46, -153, 301, 84, -59, -161, 86, -17, -190, 36, 161, -52, 298, -87]
5424h7J41n3K16j56p3k6j45M17l9j80k6P3M1J17l08K46l58J66kQ3m0M8O7k38p0
5449a86J14P9L0j4j85Q1P7l9j8m0k9M8P0j2Q8j16K08O6l80K05k8q7j16k1K10J28
5475A33J8k00k6J36N4o3m60L39K29j09K24l5l95K91Ll30M62j46m3l75K51Q5n3
5498a0j01J2J16j10K4j21L20q0m7J76j14N1J78m56K33n7PJ02k69K99r0K8O1j7
5522A35j6l49K24j37L83ll23K55j13o5Q9k6j72M02l21Q1j2q5L6j7R9M1j20j06
5546a20L3l6o9K67k51Q2K92l13K26j05K21l33J52r7L11k12r3J8o1RK18j34j20
5569a15K32j50j12J17M5j22J24n2J45k31K32K73l96l94N75j26j25j80K16O2m0
5590b2k81L81L8q3J40j40l32M26j0j74j09K59j88O8J52k13K95l76K64l64K77k40
$$ y = [-87, 54, 1, 217, 61, -12, -38, -183, 234, 195, 15, -11, 62, 103, 220, -88, 158, -200, -34, -36, 47, 7, 55, 122, -116, -186, -72, 7, 37, 23, -162, -81, -4, -43, -61, -101, -130, -82, -12, -24, 64, -52, 156, 222, -158, 47, 19, -68, -184, -205, 5, 133, 151, -49, -75, 61, 115, 52, -408, -69, 160, 51, 275, 240, -155, 136, 139, -191, 271, 125, 82, -293, -42, 43, -10, -111, -99, 17, -93, -69, -190, 130, 50, 3, 179, 65, 116, 294, -162, 71, 14, 21, 123, -146, 153, 63, 91, 152, 135, 119, -230, -6, -143, 240, 237, -86, 169, 56, -9, 80, 54, -118, 284, -37, 44, 32, -53, -17, -34, 65, 106, -14, -120, -87, -123, -192, 75, -176, -94, 198, -115, 111, 6, 227, -106, 46, -51, 260, 48, -45, -27, -88, -79, 139, 5, -115, 117, -33, -145, -28, 17, -105, 19, -33, 112, -119, 113, 386, -10, -404, 171, 45, -80, -260, -44, 18, -22, -303, 78, 116, 33, 173, 33, -299, 127, 117, -57, -166, 93, -95, -27, 125, -88, 207, -169, 95, -269, 8, -232]
5612b32M19k59O9l8J31k63L01j19p8j36J19K22j18J42j94K50k29k09L66n5k02
5633a13K7J24p1K71J10k74m9M4j0j08R8o0j14J39L1m2qj21K3J79m0j04K5L6k23
5658b30K16o9K15m4n2K0Jk09J16J2L47k17PK5m02L55q6l62L72Mj6K55j80j75L22
5683B25k64J66K9k10N7M7j92J02J41j70J65j31Q0J3j55n4Q4K06j04j30K3J16l6
5706HP9j28N4o1J21j12J70j33J04o8M6j1J43k51k8K71j76o4L48j13m18L65j5N0
5730A81J1j31L5l21J41J94j16J92j94P5k01l6R1J95N3k29R9l9r2K70o7k45Mj48
5754b78L76N4j49J59j61Q0n9m7kJ35j4r4JJ49k73K84k22K01k78K27j19J27M9J18
5778B64l00K17j04l23M88l73M3J78j5J0L2j27J6J57j6k45L30j00j22K1K25k39
$$ y = [-232, 187, -72, -3, -41, 90, -173, 128, 9, -69, -205, -86, 136, 18, 160, -34, 216, -13, -222, 144, 89, -113, -86, 38, -33, 238, 348, 74, 25, 69, 59, -49, 49, -11, -125, 14, 45, 3, -5, -126, -103, 76, 36, -68, -43, -7, -230, -14, -83, 132, 88, 36, 56, 57, -152, -36, -24, 323, 106, 113, 138, -264, 91, 5, -357, 15, 19, 3, 258, 78, -97, 225, -39, 127, 156, -54, 3, 50, -142, -40, 101, -69, 96, -35, 45, 58, -97, -151, -67, 139, 35, -95, -72, 44, 8, 87, -41, 13, -48, 73, -39, 131, -2, 102, 34, 80, 69, 212, -39, -67, 204, 28, -36, 312, 199, -219, 146, 131, 181, 192, 61, 96, -225, -84, 110, -6, 186, -8, 67, -134, -170, -79, 116, 169, -60, 39, 0, -92, 178, 111, -134, -130, -278, 98, 152, 3, 162, 1, 81, 22, -25, -27, 108, 94, 0, 1, 150, -123, 161, -61, 140, -138, 89, -30, 97, 146, 264, -36, 181, 77, -246, 242, -131, -88, 90, 75, 85, 117, -10, 6, 163, 147, -98, 232, 132, 10, 31, 256, 17]
5800A7K95n30NJ08J38qp3q3J69J40o2k35J06K58k25K5q3j64J95J75j22j95J57
5823HJ0l13K82r8J24q1K18o7r7K62j20j69N1k3o5K28l70J05J15j06J45r1J53j89
5847h8K72j76J13m4r3m8Q0p8k0K57j95j7KR1k31k5K60j93mL08l11K13k3K4K6j94
5873i4kJ88j17Q5j36K24k50J93J21k25K39j76p0J55j40J59o9J91j66k18J61j30
5895g7OJ03J13m7m9P4k02J69j41J29k18L02k27n4L14l75J14n6M59k38m9p6j74
5918b00K16N6k8j73J81J21k26K11j22m7O8k16J37j5K22l13K11Q1J02k58k73K8
5940b37L04j50M9j45J67j2O3k72J71p3L10k66Q9J44n0M9Oq2l87K93K53m10K43
5963E7K13l54P8J20j40m4JM23m14rM0J17j00J24q3l6Q7k85K17j19K17j19J61j43
$$ y = [17, 312, -218, -213, -105, 33, 25, -48, -131, 38, 178, 116, -119, -13, 245, 20, 45, -38, -202, -7, 168, 46, -149, 8, 18, -295, -13, -111, 13, -68, 150, 83, -14, 248, 128, -41, 10, -13, -78, 150, -220, -115, 0, -106, 39, -52, 101, -88, 184, 8, 121, 77, -16, -64, 16, -62, -82, 175, -20, -37, -35, 56, -175, -200, 60, -133, -137, 171, -140, 73, 50, 74, 100, -94, -96, 92, -25, 60, -76, 148, -102, 91, 212, -13, 226, 50, -20, 135, -5, 154, 85, 276, 110, -108, 53, -77, -71, 32, 145, 98, 49, 123, -79, 90, -51, 78, -140, 162, -65, -119, 195, -180, -66, -122, 337, 99, 50, -26, -200, 16, 72, 44, -129, 52, 173, -53, 158, 36, -11, 57, -159, -22, -37, 185, -128, 83, 164, 266, 8, -265, -237, 67, -83, -34, -179, -12, -24, 39, -233, -62, -135, 175, -91, -2, 142, 92, 141, 147, 65, -322, -29, 224, -186, 57, 270, -84, -6, 114, -26, -70, -69, 354, -60, -69, -29, 88, -12, 112, 29, -7, 80, -205, 12, -107, 110, -9, 152, 9]
5987Ij45L2K11j0k58J17O6%J95l02J67j70k09K34j90L13j2p0m9J6R3l34J85J5
6011i6n3J78K12j61j11j17Q9J03j46jL30J1j95K61l92L23j32n7j63m3J99j07j9
6034h7R3r5j43J20N6kK39k18m2n5L77l30J03K52m29K58j35k6k8oR6J9p7N0k74
6059b84J20L68k30l7K10k67J63j19J56p8k11l3K19J3k05L12r7J2K71m03J89j19
6081e0Q1J10k22Q5j59RJ34K71k29Q0L5k6k29L5K14r1J00l15L49k50n3K80k13J24
6105G0J50l32r4K93k58L28j14ol4j36K23j42J54j18L7j2O4q0n1J56j40N3j32Q6
6129c5k15K58J28j30q3J44L7m3p4J77j51J11Mm9J45l42O9L27k19M6L6j17p0Q8
6153D2k16J80j5j40k3L22j65J57k30J01N4j2q4Q3K39l39K20j32k34M20j76q4L54
$$ y = [9, -136, -104, 107, 97, -161, -44, 22, 22, 217, -85, 82, -88, -297, -63, -253, 60, 48, -22, -71, -55, 38, -296, -111, -96, -149, 29, 241, 80, -31, -148, -59, 44, -102, -103, 227, 238, 43, 304, -88, 235, 103, 46, -117, -160, 39, -68, -87, 6, -89, -232, -112, -56, -58, 181, -37, -79, -134, 243, -87, 16, 268, -161, 97, -38, -64, -92, -98, -2, 17, -60, -10, -284, -164, 204, -26, -63, 147, -120, 43, -76, 80, 2, -209, -242, -23, -10, -215, 97, 0, 12, 283, -120, 69, -50, 31, 141, -81, 4, -155, -146, -12, 259, 30, 110, 145, 119, -110, -75, 139, 48, 148, -167, 182, -68, -121, 159, -54, 70, 220, -112, -206, 87, -171, 157, 43, 37, 3, -133, 90, -52, 102, -16, 21, 9, 73, -7, -58, 98, -42, 11, -121, -35, -250, 8, 136, 6, -77, 67, 104, 61, -13, 164, 13, 124, 128, 79, 224, -118, -49, 278, 59, 105, 141, 24, -46, 42, -174, 6, -9, -149, -172, 150, -15, 142, -88, 13, 67, 55, -29, 54, 293, -46, 174, 42, -192, 228, 52, -32, 322]
6176C22m36K41L2k55j97L48j06Q3q0J02q3Q0N9j05k29K68l6j90P7jO4R7n6q3J26
6201D2K1P4m2k91J99L2Q0k91J81O0j25p0J47p0J12q5J32J52l36K21P9J05l01m2
6225a6K40k34K55l93K00k92L02R1j18r2P0j60J09O9m0J9J44j05M4J46k24J74N
6248A94l23K24j95L3J85M6j33m7j51J50n5j35K79j97L41j26n9J76k27m6N1j18
6270a33J98m8N1ok57L33j52j23m0J28mK51l6k66M2n9o7J88J65k11K5j61J54O2
6294C4j9K2k6Pk01N3J99k18J10n4jJ73o7j84j19Q0K63j05J72J8o6j31J69j22O3
6319E0J39k99K81m19L4L30J35r5k55K22k47K50q3m5O1j53J79o9j23J28J51k78
6341a06k38K85R1k25O9Q9J82k24J45k19M07k79Q0l02K76k17K64j94o5K45k6ok25
$$ y = [322, -114, 127, 159, -96, -293, 55, -51, 32, -48, 54, -29, 51, 110, 5, -224, 44, 8, -182, -105, -106, -42, 55, -1, -84, 42, 63, 137, 95, -196, 3, 35, 115, -176, 5, 65, -60, -130, 17, -53, 59, -26, 106, 258, -78, 143, 222, 327, 26, -16, 224, -10, 245, -148, 52, -240, 62, 153, 35, -57, 13, -147, -38, 31, -9, 10, 154, 49, 93, 239, 15, 189, 194, -129, 95, -100, -67, 118, 164, 31, -16, -167, -17, -72, -207, 72, -125, 216, 90, 31, 207, -20, -66, -15, -133, 65, 17, 68, 62, -195, 138, -14, -137, -177, -49, -53, 198, 162, -104, -62, -121, -188, 0, 165, -46, -21, -182, -28, 34, 15, 37, 11, 18, -183, -130, 69, -149, -39, -93, -94, 79, 12, -172, -291, -211, 52, -53, 119, 137, 71, -60, 109, -13, 50, 189, -110, 171, -248, -214, 116, 251, 156, -99, 123, -124, 126, 43, -2, 59, -94, 85, 16, -107, 21, 172, -106, -344, -59, 32, -193, -124, -35, 147, -77, 68, -151, 256, -23, 57, -245, 31, -186, 78, -116, -181, 64, 38, 32, -193]
6364a93K44k1M3j21J96j21j95J23N7M8P2l3Q7r9j08l8N9j51J14R1r9M8l6j11J32
6389a2j8L37m34j71L86r3Lm0k38K34L2o7J15kN1Mk66K75j1r5k5J23j75j04K98
6414A07k42o6L74j25K48l63k15K85K4p2K03j24q8l5K47l9l11N5J89K41k22j02
6436c1N9j38R8k16M32k21J02o4LJ58j47k17K26N3n7j19K5P1n9Q8O2N3k05M2K2
6461B0j19M75j72l6k61R3J14l19K49k3M9j00J74l17K02j90K35pq3m1L1L2J77m5
6485A38j21j56K45o2j88L18j67R2p3j55J92j66k3o4J23J25O0k94R6J26j66L03
6507A83k73K93n14L20j1j52P8j52J72m3J50k11J01J11L7JL8k96KJ16m7J44L1k40
6531a62j69rJ09J25J44j71J8P0k6M9j05R1m7j6n1J82J46j45q2L5j57J97n6K68
$$ y = [-193, 51, 30, 73, -48, 148, 27, -168, -45, 12, 60, 132, 99, 186, 87, -21, -59, 0, -151, -37, 54, -45, 3, -33, -144, -12, -30, 307, -127, -298, 88, -5, -2, -42, -280, -46, -14, -81, 34, 32, 83, 87, -179, 96, 85, -10, -35, 88, -87, -191, 107, -135, -201, 173, 48, 296, -67, -282, 3, 27, -45, 158, 34, -54, -89, 158, 119, -192, -137, 52, 293, 71, -31, 28, -110, -12, -228, 204, -17, 85, 21, 24, 182, 35, -182, 44, 97, 40, -79, -54, 17, -42, 46, 108, 161, -44, -2, 20, -99, 376, 204, 168, -93, 0, 114, -205, 44, 21, 70, -30, 144, -173, 29, -161, 74, 67, -16, -57, -26, 6, 183, 138, 17, -139, 106, 44, -144, 174, 7, 99, 26, -129, 63, -103, -126, -190, -67, 58, 118, -176, -80, 46, -120, 183, -90, 203, -311, 9, -2, -154, -76, -228, -56, -99, 51, -160, -59, 52, 89, 90, 128, -168, -166, -50, -97, 47, 78, -162, -331, -340, -231, -106, 38, -133, -115, -45, -71, -22, -127, -36, -83, -99, -150, 32, 178, 33, -49, -14, -171, 26, -30, 238]
6555B38j19q5j85J38J36r4m2j51K06K4O9j14K20k76N8N7k8P5j21L2k9P4j75J05
6579A3j46J75j56O6j90m2L12q5J6n0J27K5Q6k50o4L07K9j45J14l70R8Kj8K29Q3
6604A66j68K1k43K53N9p6j68J01j22Q8j03P4L26k01K5p7k15L50j04K3q5O6R3k5
6628E8j6k99M12j80J76j69j20K21n8j0NK5j13P0J23k85J66J74o5k75J86M8j36
6651f2J73p8r6k4J5j95K02q4K06j32J93P0m16K52o8Kj5J30o2r0K4O8k3J92k03
6676b1J3qj90L58k08K2J93O6k06J76j00J29k98r7J69K14j81M8M3k29J29j24J56
6699E4o0n7r2L51l61P0L8oL7K89k88r5o2K34O3j28p6L91k30r5N8r8J02M7J2J34
6725B32o8j74N8n5p7N8l4R4P6m2j37j64K35Qn2n4J92j6K06l47Q9jj43K1P8J34
$$ y = [238, 119, 34, -151, -13, 123, 29, -13, -164, 42, 66, 135, 21, 241, -35, 23, 80, 52, 127, 6, 38, 9, 83, -92, 13, -133, 42, -114, -48, -238, -280, 32, -53, -37, -87, 40, 65, 151, -99, -163, 144, 173, 28, 142, -228, -130, -128, -146, 83, 166, -2, 19, -224, 29, 88, 12, -156, -55, -177, -89, -192, -118, 208, 7, 32, -45, -260, 90, -14, 9, -76, -10, 83, 58, 42, -257, 155, -25, 151, -18, -138, 83, 25, 15, 20, 45, -68, 2, 125, -160, 6, 180, 115, -160, 26, 74, -62, 111, 33, -63, -87, -72, -267, -65, -149, 57, -75, 118, 188, -228, 24, -44, -42, -57, 73, 11, -79, -55, 13, -10, 182, -21, -8, -16, -206, 152, -56, -34, 159, 225, 19, 195, 95, 224, -74, -171, -2, 212, 31, 79, 122, -107, 22, -102, 54, -6, -63, -155, 196, -165, -95, -57, -63, -26, 263, -25, -120, -182, 52, 115, -13, -89, 302, 72, -23, 35, -63, 39, 86, 98, 232, 164, -10, 48, -7, -84, -26, -60, 34, 110, 68, -69, -233, 2, 10, -42, -96, 96, 80, 286, -61, 28, 27, -116, -95, -17, 117]
6751A17k88J45O4q0Q2j32K66j30M9j15K73m31K93o5P9k34j3k6K03ok54L96j74
6774A9J37k52L4Po2OK2m0m8K17p8J22k83L19l5p1J69m04N63l92QQJ39O1r0k13
6800a37P9q1K1Ol1K03l6r9L1q1J7J67J09j53J44k58j36M67j46J0k11k2J74J42
6824A79k15k06K64J1k4m0L32l34RJ26j57o2J9J61j63K4K9p4J25LR1k36K52j23
6848iL21m07J06Oj82K38J3l28J36J55r6J60j64K29j60j84J22q9P0K30k92P1n0
6871a04J06j59J84K0j2j42R8K07l13K86Qk91J94m5r4n4KJ88k45j7J67O6qo6J33
6896A09N4q0Q3l66O1J43j38P6J09j25J91j12q2L11j78O2J16l03nJ20pj43J60m07
6920c51J76K92j02N9j88K25J4K6n6o8k15P6J80R2Rk05k6J82k8o6q4J46J54j87
$$ y = [117, -171, -26, 38, -42, 40, -92, 174, 44, 93, -22, 251, -180, 113, 48, 127, -107, -120, -146, 57, 51, -203, 193, 19, 156, -96, -62, -55, -117, -111, -89, -129, -177, 40, -38, 84, -199, 120, 85, 14, 183, -221, 342, -50, -42, -34, 105, 166, 76, -137, -58, -139, -118, -112, -143, 60, 24, -75, -44, -125, -108, 59, 168, 15, 159, -99, -235, 232, 86, 96, -115, -137, 37, 179, -36, -242, 22, 33, 9, -31, 301, -33, -24, 102, -55, -117, -98, 63, -100, -76, -47, -121, 4, 7, 98, -138, 114, -9, 312, -95, 11, 17, -165, 73, 86, -242, -106, 49, -47, 113, -51, 178, 18, -166, -44, -133, -63, 167, -125, -54, -104, 2, -157, 27, 47, 35, -107, -9, 198, -115, 171, 179, -112, 82, 37, -57, -111, -109, 79, -166, -183, -16, 50, 42, -24, 109, 163, 83, 166, -200, -139, 4, -134, -58, 51, -74, 117, 5, -77, 234, 56, 118, 234, -69, -74, 46, 39, -104, 56, -351, -175, 117, 15, 74, -114, 111, 125, 151, 95, 27, -188, -112, 68, 160, 169, -36, -62, 120, 92, 26, -58, 88, 242, 55]
6944E5O2j92K8J70j49N6Q3M9j40J70q4k72J60n5R8j46J96l76J52Q2n4NO7r8L01
6969A68j22j31J65j07Q3j13J7L4O4k03M65j27k07k3q1L28l40k7K00o9o9N7m8J32
6993D6J41o6l2K39m78K26k4J87p9j51m8j0M4P5j54N9m3r7R1l4n8J66R3k56l2P6
7019a19L4l1P9J40j56L6Qj2r9R0J07Mq5k9p6J6J09p1j00J28J91k22j40J01P4L83
7045C60l78J11J85j01m2l52L06m0j74j00J81J63k45J69j7J29j18r7L58l66K62
7066A94l54L13k17Q9j45l3J19k7k04L59kr4J1R7k00j26o6M03n7L4J76m48P8L6
7090f4m7Q4n3K2J03j32L18l66M2j22K62O7j21K87l24O3K25k18o6J23j75J78J30
7113B16k92J87p9l2ok8j08J10L55k96n2K0j99K77k41J6r4J69J38J80k28m3N0Q0
$$ y = [55, 117, -75, -47, 123, -26, 30, 113, 162, 22, 192, 108, -164, -4, -59, 39, -107, 89, -287, -135, -53, -107, -102, -35, -133, 168, 46, -85, 80, -27, 56, -57, -40, -6, 58, -145, 320, 193, -14, -37, -118, 210, -130, -157, 43, -26, -95, -38, -86, 46, 187, 121, 89, 328, -150, 76, 52, 239, 160, 9, -39, -49, -5, 70, -84, -25, -68, -165, -74, -108, -166, 0, 93, -163, -195, -119, -85, -116, -37, 103, -53, -17, -9, -21, -120, -30, 77, 81, -4, -33, -109, -93, 16, -55, -155, -27, 164, -58, -198, -97, -23, 360, -18, 93, 278, 177, 135, -217, 89, 49, -125, -225, -44, 119, -126, 43, 26, 155, 37, -60, 298, -68, 194, -160, 153, -64, 25, -120, -153, -34, -61, -265, 94, 92, -2, 9, 106, -94, -220, -286, 117, 60, 94, 270, -178, -100, -64, -111, -27, -80, -58, 45, -87, 231, -135, -93, -215, 47, 114, -7, 280, -44, 19, 244, 26, -40, 83, -92, 86, 216, -76, 111, 32, 0, -6, -34, -142, -32, 323, 27, -25, -5, -204, 73, -168, -152, -246, -77, 61, 241, 13, -30, 20, 100]
7137A00l3m1o9M9R8j31J07J31k01m8M5o3m5J55P4l54J64J06j18J4L58k89o3L38
7161B84j23J0l62k8R5K08n2K2n0l0J2k37J17o7%K97oLj61J10J51k13j80K53L3
7186H6l49J39j4J90k76P2J44r1J48O6k14N3L22j66j28O2j10KQ9m0l3L96r5n3k64
7211f4J82k08L23m68K97k4r1J19rJ79l00K60j09o1l0J2J10j54p5J35Q2N1k55J16
7235A8R5K8p2Qq6M4o2j02J0M6J25P8O7o4j97j92J59J19K6M6k1K6r9r8J87r2R8
7262I5PL4l29J52J74k39m2J89M3j25P1J79k23J96j96J33m8m2qK4l0M1j36J67p6
7287A1r7Nj0L3R4k0OR2M6k37O9K73l17j04J2R6j13O0Q1m6j10J09J73L5L3m08K21
7314a3j19L28j51J3k34P0J35mJ17k59p0M04j13N7k62J03K4l95L86lL4q7j31K70
$$ y = [100, 67, 26, -43, 6, 104, -27, 80, 211, 10, -38, 7, -56, -101, 54, 128, -226, -62, 44, -74, -60, 298, 9, -54, 284, 161, 171, -191, -219, -124, 84, 32, 54, 4, -26, -14, -251, -134, -201, -201, 96, 90, 93, -68, 42, 193, -20, -200, 53, 86, -263, -124, -138, 52, -224, -152, -8, -99, 49, 115, -99, -46, 276, 110, -18, 44, -66, -64, 25, -15, -48, 348, 253, 200, -64, 118, -90, 233, -235, 62, 38, -53, 66, 57, 236, -64, 196, 87, 26, -4, 8, 118, -36, -111, 24, 106, 157, -98, 18, 113, 141, 69, 77, -9, 35, -27, -129, -119, -73, 52, 130, 197, 133, -64, -256, -97, 22, 48, 94, 73, 99, 0, -98, 89, -3, 95, 102, 136, -193, -41, 133, -106, -148, 41, 84, -41, 30, 209, -14, 182, -14, 119, 71, 29, 21, 45, 15, 56, -80, 87, 11, -86, -81, -91, -58, 36, 16, 22, 114, 160, -77, -8, 265, -52, -156, -144, -48, -161, -101, -20, -66, -176, -67, 106, 141, 174, -234, -13, -132, 196, 45, 58, -176, -106, 29, 25, 142, -117, -187, 217, 104, 161, -101, 2, 26, -369, 17, 14, 48, -39, -170, 100]
7338A00O5j48k15K92q9l6J10j91J1j74J89MN3j99J32M0J47j57J64K5k44J66mo6
7362b5l8R4Q8q0m7mM3jJ46j53k59K6M29k04KQ4j29o6J23K06m34Q9K22n16N52M9
7388A97j68J13K0Mj75KJ0j1J13j02K1j20J60r0O2K16j52p0J62k16J22k81J06J95
7412A18j52M4L7k9o1P9l05P7L28j59j99J06L0J00j37K90k91J07j05J49K3q4Rj31
7436a56J83j77J43q0j2J02L2Q8j77J07l9L0q5O8R3j41k6m9J63j08m2p3Kp6K09
7461b1q1M7k10L88k40j46K20Q1O0n9j13J45o6J40j66k17L40m6L7k64K32q8L8j28
7485a17J1K44j57O6o0L4J4j55J29J16n6n5K1J84o2j03o5k33R0J83O6n46J83R0
7509a78L58j49k59K30L8L3L6j14n6R2p5J11Qk60J03K5M0O8r1J47k05l8K38k9p9
$$ y = [100, 165, 17, -198, 94, 5, -31, 79, -112, -101, -275, -86, -82, -29, -228, -96, -56, 91, -66, 98, 123, -121, 45, 41, -25, -63, 31, 119, 39, -8, -12, 31, 30, 176, 23, -236, -210, 219, 15, 17, 101, -28, -94, 29, 235, -199, -110, 112, -404, 148, 197, 29, 142, 162, 166, -9, -7, 3, -8, 105, 3, 24, -96, 64, -26, 36, 252, 100, 30, 192, -24, 98, -183, -77, 118, -34, 10, 47, 18, -43, 36, -269, -192, 136, -23, -222, -116, -86, 14, -123, 167, -124, -17, -122, 27, 50, -34, -25, -156, 27, -150, -7, -87, -99, 3, 35, 123, -54, 53, 14, 44, -41, 27, 120, -21, -47, -96, 67, -41, -83, -156, -154, -230, -21, -102, -55, -265, 123, -117, -263, -43, 38, 98, 39, -74, 71, 5, 145, -21, -238, 102, 56, 93, -171, 61, -27, 11, -117, -106, 138, -19, 47, -13, 21, 35, -120, 9, 125, 69, 14, 35, 219, 157, 54, -11, -244, -154, 29, 95, -451, -268, -178, 180, 31, -228, 2, 40, 73, 109, -5, -61, 31, -44, 67, 75, -185, -82, -57, -17, 51, -40, 107, -98, -136, 102, 73, -6]
7534fK43p6k1j63Q1j71J33r2O9N0R1l19J27P4Q5l64L15k08J57j23jj18R6Q9K5
7559b7N4k3L18k72j10J6R3j5l6o0j01Q6J26Jj65J97k85J49M8Q6l87J8L47j57R5
7584dJ0L4k2j1p6o0o3J04Pk6K32Q4j82J34j49P9j52j03K1OJ22lj58K53K47j49
7610A75j06r4K5J65j16J40l78R1rm8M18l78n6J39PQ6J8q7J68m56J74K1j21j95
7634d17M95r5Q2j5P4J6k03j5J60L8j65o4J54J61j64J54k09K2l7J18m8m2K4K52
7658B76m74L32j12j75L6k54L81j69J48k06m9L50K64l57J26l25L70n14L92q0Q6
7679D6j3j19J7j5j18L30l23k0L39M1k2j68L0l33L04q2L09k84K52k21q9O2j2j54
7703b43J75j02L3J21p5k8J04p1J03K55j07k37JJ25Op0J10J59j17k81K01J9k7J09
$$ y = [-6, 237, 161, 140, -23, 58, -113, 20, -72, -3, 47, 138, -181, -54, 20, 105, -259, 56, -152, 5, -118, -119, -237, -141, -52, -27, 27, 4, 322, 50, -60, -44, 49, 34, -2, -62, -163, -77, 49, 50, -115, 82, -203, -54, -6, 80, -307, -289, 58, -99, -4, 6, 40, 18, 7, -69, -129, -192, -88, -81, -107, 125, 209, 27, 161, 12, 91, -61, -164, -143, -137, -15, -18, -176, 77, 324, 175, 69, -25, 0, 165, 49, 189, -189, -98, -107, -155, 263, -115, -171, -32, -25, 61, 79, -8, 160, -296, -122, -101, -222, -417, 78, -17, 65, 50, 124, 140, -63, -78, 82, 120, -45, -109, 45, 206, 42, 196, -13, 9, -28, 90, 42, 0, 24, 276, -198, 134, 22, -153, -117, -371, 10, -159, -11, -217, -266, 84, 348, -9, 117, -208, 162, -352, 40, -40, 46, 33, -86, -69, -84, -202, 128, -195, -215, 124, 165, 143, -25, 5, -328, -24, -106, 203, -81, 171, -50, -139, -77, -89, -243, -68, -170, -137, -16, -91, -119, -15, -86, 17, 272, 165, -72, -71, 54, 60, -10, 100, 259, 142, -139, 62, 81, 54, 163]
7727A63L3j13k11J39J26O7l60K9QJ66r7J77j59p8N2o9J40J66K9k01M2r5NJ06j99
7752a34K73l06M7J86M8o4J86p8qk65Q3j1k97L24j96L55q6k55J87L2O3l3R3j38
7776Fn4K46k26j6j29R6O7l9p8J98O3j16j75J58J78j6l22J23l0J03q3j13J46r8
7800a11j6N2m1L8k1j2q3J50K91j77j43o8K35j38K14j49N6K24j97k49J07K00l53
7823a91j1K87j98P2N8J09k37pL47K41n86K43j31q6J02Ko6mj9O7q4O6k49L64r1
7848bp4j10j4L53j5l30J33J23k40K20L6k23L5L04ll99K27l4P3j69K24k8k06J59
7872D0%k82L49k1j25m5L61l87J03k1k2J35l01M68k17j33JJ64kK02m47K06j78J81
7896B9j13P0j36m2J25K18L1j54rJ4k51J07K4J51l21L59k98J36J46j74K04k22J04
$$ y = [163, 196, 83, -128, 11, 137, 204, -156, -127, -119, 47, -50, 127, -32, -110, -58, -127, 13, 179, 208, 7, 49, -46, -41, 65, -134, 139, -167, -120, 66, 114, 50, 236, 158, 150, -115, -32, -43, -340, -16, -212, 143, 57, -198, -11, 21, 84, 51, 144, 6, -48, 198, -28, -44, -173, -77, -10, -49, -127, 71, 134, 18, -157, 1, 179, 163, -159, -36, -66, 37, -46, -159, -13, -111, -127, -75, -116, -78, -99, -111, -194, -44, 247, 70, -73, -141, 94, -44, 170, 21, 77, 301, 104, -145, -38, 162, -191, -202, 85, -113, -41, 17, 126, -111, -118, 229, 470, -116, 127, -4, -90, 12, 14, -52, -56, -75, -8, -92, -26, -275, 89, -2, -76, -186, -200, 153, 138, -192, -59, 64, -176, 44, 80, -143, -108, 196, 193, -206, 21, -13, 60, -109, 115, 87, -119, 40, 40, -242, 107, 86, -39, -84, 277, -110, -7, -28, -50, 85, -216, 252, 35, -98, -97, 67, 65, 267, -180, 26, -152, 29, -84, -14, -150, -192, -67, 151, 182, 28, 19, 33, -218, -111, -87, 64, -257, 102, -196, -60, 86, -88, 116, -106, -2]
7919bj5q0N0K2j99K56R4l3J22l28j13K43K7k98P8Q7K75K5k17k9j06J85j15N9N5
7944D3p9M5%J26j39k2o0m6R1n4j30K61J43j49j29J38j4k95K86r1L85j44j3j20
7968C3r8j39K55j48J46J38k07J12p2R7j84J50j12N4j5J16j39q0J96k2j11j09K03
7991F4l09J91K20k49J50K8j33L5MK0j43pK50k62K39k14k3n3R4J53K7k42o5J38
8015h7L46l88K21j03Q4P4J5j75j4K86m23K59j40K18j07j73J95j14q4r0L6J68j7
8038a3P5k1j28L0Lq3K72l37L82j95J57j85l3m0J31J91l72K58Q5j66J16O2l25L25
8062A89m0j4L1j83o7J81O8k35j20J24K7K65k01R7j11n4M0P7j6J8k37Rj12L08k3
8087B1O7j12J09n5m7J19j77j17N2L41k38N9k31L26j52J9q5J64Ok41L32O1n9k18
$$ y = [-2, -17, -97, -47, -25, -224, 32, 126, 93, 215, -113, -226, 17, 44, -254, -176, -89, 186, 211, -6, -35, -141, 44, -71, -12, 43, -36, 9, 9, 135, -4, -26, -86, -132, -41, -95, -225, 36, 179, 30, -99, 39, 25, -270, 16, -75, 310, 166, 153, 33, -65, -204, 51, -97, 49, 187, -20, 92, 20, 117, -67, 83, -29, 25, 10, 126, -13, -93, 103, 81, -30, -139, 64, -245, -54, 166, -83, 67, 95, -38, -3, 1, 21, -122, -129, 121, -141, 98, -116, -139, -192, -98, 55, 82, -160, -225, -87, 259, -129, 92, -11, 73, 147, 162, -13, -27, 259, -164, 95, -45, 173, 66, -107, 88, -26, -110, -200, -164, 4, -13, 62, 41, -87, -57, -54, -137, 135, -202, 180, -15, 142, -43, -76, -116, 15, 206, -166, 92, 177, 11, 127, 189, -136, 189, 149, 135, 166, -17, -84, 97, 165, -70, -190, -66, -39, 226, 25, 122, 11, -43, -3, 74, 58, 76, -161, -152, -264, 44, 21, 88, -24, 85, 30, -17, 102, -75, -192, -140, 201, -37, 22, -209, 117, -35, -16, -101, 63, 69, -172, 160, 221, 162, -56]
8111e6K02j47j36J95N3J45j21l32K52j54K29j26J06j32J31q4ro1J61j35J43r1
8133C3K24j28k07K1Q5j18L15k27o3M0P0q7Q4j09J57J0k14kK31q2n2J2M2jj33k1
8159a20Q9k0L09n78M51O9n23L50K9M9o3R2l45L57j15j51J08KJ50rj33k33N53l36
8183a8JJ17j89L11k65O9K8k82
$$ y = [-56, 146, -1, -137, 58, 111, 256, 135, -197, 55, -99, 130, 4, 110, -22, 109, 25, 16, -45, 116, -19, 124, 33, 257, 129, -78, -57, 28, -90, 225, -2, -65, -25, 45, -42, 42, -67, 90, 100, -114, -116, 115, 33, -19, -7, 35, 34, -99, -120, -31, -51, 258, -320, 131, 200, -323, 27, 56, 105, 42, 134, -211, 146, 31, -120, -12, -10, 140, 131, -2, -235, 318, -18, -17, 100, -89, 222, -43, 26, 54, -228]
8191b28
$$ Imaginary data points
##PAGE= N=2
##DATA TABLE= (X++(I..I)), XYDATA
0@%%%%%%%%%%%%lJ1j6J6j6K1k9L2m0M8n6P0p8Q8j04J21j44J67j90K16k44K77l14
35a67L54l97M45m99N57o19O89p66Q48r37J036j143J261j388J527j683J854k043
53a071K252k485K749l045L385l782M243m791N458o290P355q774J0779j3842J9153
68A1294l0938J04762n083j25981R8246l671n914r48m480k6393N3878n8850K6325
81C2247M8357p1714l1477P3815J9673q3954L4008O19r471J7125j4738R14p056
94H348r420q908P0027o0874m0688N3270J5458k8335j7172K6163k4536J9073j0123
107g717J1868l724l2524J8824K2251J1495o6288K5786L5108k2136j3951K2082
119A074o634k2636L4047j7214K1400k6064j3579L7007P792k7299j4503M5235k9774
$$ y = [0, 0, 0, 0, 0, 0, 0, 0, 0, 0, 0, 0, 0, -3, 8, -8, 8, -8, 13, -16, 16, -24, 24, -32, 38, -40, 48, -56, 65, -79, 88, -102, 114, -130, 147, -167, 187, -210, 235, -264, 293, -326, 363, -403, 445, -492, 544, -599, 662, -726, 801, -882, 972, -1071, 1181, -1304, 1445, -1600, 1785, -1997, 2246, -2545, 2913, -3377, 3978, -4796, 5983, -7859, 11294, -19644, 85118, 80035, -45946, 52300, 48629, 42715, 41767, 37287, 10894, 64772, 5922, 32247, 80604, 8890, -22587, 51228, 70901, -13053, 20955, 21574, 12103, 29228, 14490, 15404, 8348, -1072, -9980, 60047, -827, -41515, 11755, 27213, -1122, -18294, 7869, -16667, 2406, -7717, 4151, 427, -32097, -13273, 8978, 20473, -45815, -20029, 15079, -7057, -21008, 1074, -5560, -28196, 5851, -11363, 10037, -16027, -29606, 7401, 15193, -12106, -26609, 18626, -11148]
132a1148M635J4037l210j8288O133K2859j2838Q004l5232L3737J4889l1294J78
145g538K4335q317k8221M1654j2089o540j2858J0814K1299j5061j6637J320L7259
158B9420l5029K87J5646M59k1427L745L1043k8915J795q662K1414q65j9354J31
172a0312J6619o74l0676L6158j0084j3599k352J8937R32k3041J0229j351J6921
185G707k4155M001J2352j515j8743Q565K8844l8223O948Q275R848j2107o206Q737
199e672N059M87k2499L1523r691j2527M783J7001o390k0678K1873l257M695j5654
213a0947J2051L812n100n780M671K0584l2968J0729J1437R79j5698M280J2207
226A0257q935K491j0066K1592j5395l987O720Q733o709j8067K5074n902m196q213
$$ y = [-11148, -6513, 7524, 4314, -13974, -7841, 15018, 2180, 10184, -25048, 8689, 23578, -7716, -7538, 16797, 8480, -19741, 21913, 9824, 3284, -9574, 1240, 22539, 7478, -9159, -7839, 29420, -5609, -5322, 10324, 10783, -10644, -6899, 24144, -4771, -2976, -11638, 9776, 8911, -10443, -10312, 6307, 5633, -25043, 11115, 1031, -12568, -14920, 4017, 4949, -18092, -7863, -9214, 7707, -16448, -12447, -95, -1610, -20353, -11788, 17056, -21167, -14219, -5944, 3904, -8203, -14409, -5672, -613, -126, -22625, 8898, -793, -13320, -8537, 8464, 2074, -18604, 3269, 12, 4707, -10947, 1104, 4916, -184, -5964, -1293, 19291, -13677, -2948, 8489, 9468, -6230, -1950, 10257, 1322, 3813, -6253, 15339, -56, -4043, 2677, 11410, 4701, -13366, 11708, 5806, 1610, -6603]
240f603J5717n358o950M733j302J2554k4609J2304O590k923j2425O800J0805j5467
254f134P226m595J1706j5346M264O074j699k566j0411K0874j0171k802j811J2276
268F885r291m524J1969p910O710j4131J4557j493m654l360O178N935j5376J1846
282C341l897M919j1901J0106L083r242M206m167J3240j3664L636P32O260r302
296b650o96J3803j3779N190n229J2691r256l060N281J585K65j1428J4967o616
310A068R79p116J1527o53j2889J0610j971N019j3217R399r0l38n892J995J1530
325I961j6443O902q91P855j2019J254Q354m221j240n776J4629j1282J977k118
339c058Q151l690j0313J3877m236O89r064J2018l155l150r46L175O395j6119J1663
$$ y = [-6603, 9114, 3756, -3194, 1539, 237, 12791, -11818, 486, 7076, 4153, -8272, -1472, 9333, -6134, 1092, -3503, 8203, -7143, -2879, 3195, 1496, -1070, -11481, 9393, -778, -3580, -5391, 6885, -2406, -6930, 5039, -2871, 3839, -10292, 4265, 2772, -1882, -5242, 936, 6871, -8505, 3341, -556, 4363, -7538, 2568, 5651, -3591, 615, -3552, 9688, -3976, -340, 392, 6652, -2650, -3346, 10457, -3322, 1868, -3361, 9330, 74, -2986, 2295, 3880, 4145, -7283, 7684, 1068, 2047, -5069, 6458, 5805, -7084, 3526, 1555, 6574, -6643, 2756, 2666, 2328, -3564, -1569, 9961, -6482, 420, -471, 7384, -4635, -3381, 4973, 752, -488, -6264, 8365, -2917, -940, -3058, 5093, 1403, -8910, 4967, 731, 1420, -7644, 4374, 1219, -1931, -2877, 298, 6693, -9426, 2237]
354B237j589K676r719M763P817q966O82r10J0953j3900N238J170K395m201n239
369f593J4213q633K59m331J1988p036l522M668M69K142j1725J3777m424n98m815
384d161O807L095j0392M998J72O262j3357Q662J432k633j801j575J1284j1872
398c079K680r4P658r481j20P023l640N20p419J3972q960j282Q70M932j151r273
414f844R497j916J765j0149J0678j537n565K389P0O568j3050O910Q59J982q298
429f641L268O940q530K207k691J0180j0718P84M660R50l719m730J1291n561m9
444b359n074J0930m393o000P056k90J671r761J0507j193j713m595O358M235j0925
459e546N962r2O290j2168N486N846m347k863m56J0569r836J122k67Q518q037l966
$$ y = [2237, 648, 3324, -6395, -1632, 6185, -2781, -2099, -3009, 7944, -5956, -718, 452, 2847, -1354, -6593, 7620, -1013, -754, -5085, 6903, -133, -3655, 1013, 1482, 3624, -8101, 5676, 1252, 654, -4161, 2646, 5741, -4651, 347, 519, 6781, -6576, 2086, 3518, 885, -916, -2491, 8793, -3079, -399, -493, 7165, -2316, -2436, 4587, 947, 1467, -5952, 8020, -940, -2222, -1352, 3580, 2429, -6844, 2653, 737, 2502, -7647, 3031, 1494, -4071, -1682, -1612, 4956, -8094, -1184, -325, 1657, -6641, -3373, 3567, -4963, -2756, -5447, 4733, -5985, -5201, -541, 409, -3310, -8040, 3251, -2310, -2359, -7433, 3497, -896, -6896, 160, -130, 1541, -8220, 2287, 1094, -619, -5214, 1144, 5379, -5546, 416, 324, 6614, -5554, -68, 5778, 1431, -1432, -1888, 8681, -1155, -33, -300, 8218, 181, -3785]
475c785J0646l481o52p115J2356m469l764o33N893Q80j1145Q894k96J670r784
490d785P032M006o880p45J242Q148j2106M172J082L270p199m59R948p356p11k936
506d277J1084p704k936L436L667k485p854J1529m204M6n835P864J963q952K953
521a705K496M340j1007O761P65K01m622J435P497q858K272m14P869q655l45N565
537C595n87j548m469R796o515R99j522N778k272o322O929o4N22q149R243j363
553D051l082p14K416M326j0021N333J260K251q370L084N093l377j594k379R461
568G738r177J959J390J963l500l416P855l727Qn050Q839l706l078K004J528J082
584B712q289R130k130q52m699N106K656o071J461k18N780r151M371J846j246k899
$$ y = [-3785, 6861, 3380, 2728, -4387, 7969, 3500, -264, -897, 4996, 5876, -5269, 3625, 3329, 4999, -4785, 2247, 6253, -627, -1372, -130, 8018, -4088, 84, 1166, 4436, -2763, -3222, 6726, -630, -1341, -4277, 6807, -897, -3833, -397, 3270, 785, -7069, 4460, 256, 302, -5533, 2331, 4294, -4658, -1705, 791, 5131, -5876, 885, 1650, 1851, -2771, -1336, 6161, -2697, -425, -839, 7030, -1625, -1970, 3595, 3008, 1460, -3009, 6787, 272, 1271, -251, 5527, 3255, -3067, 3862, 3798, 4320, -3829, 5414, 4051, 969, 255, 2671, 6997, -3024, 2309, 3569, 5820, -2550, 534, 5627, 2250, 656, -1723, 7738, -1439, 520, 1910, 3873, 373, -3043, 4812, 1085, 1093, -3957, 4882, 1176, -1902, 102, 1630, 2712, -5577, 3553, 1423, 571, -4128, 978, 3634, -2437, -976, -1194, 4586, -4565, -194, 1652, 406, -2493]
600b493M6P279o982P42j699P583n698k297M358n40K73n611Q952m032j430j214
616b763M690K00o506M756j158L739p886O058N28l785PJ422M883q828L927L51L730
633C365o642L46N570l490K40l121Q175o022j158J836L381k272n114P301k469J044
649I70n117N918j10m428J996J279K428q103O008J63P46m901K096M721n528J836
665b6j434N379o121J023K562Q46l107k389P815n206Q27k267N414k437l663M154
681A370m43J069o262O603j090r55k842K921K763o220L719j485L585n440K280K139
697A712j853j040r54O142o824K369p48K879k680j592M627k766Q92l583O544m126
713a001n20M20J970N58n433N867k209J067l608L997L94l640J796K0L735o981M342
$$ y = [-2493, -2447, 4832, -2150, -1408, -3107, 4476, -1222, -3519, 839, 299, 572, -5039, 3913, -119, -1549, -2763, 1927, 2127, -4379, 377, -781, 2958, -4928, 1130, 1658, -2127, -2120, -698, 4185, -4643, -716, -365, 3365, -3277, -2931, 2639, -851, -611, -3732, 4443, -1579, -2737, -901, 2480, 208, -4906, 2395, -74, 970, -4147, 1771, 1661, -2767, -771, 508, 2936, -5167, 841, 1004, 1750, -3151, -1055, 3666, -1862, -26, -1460, 3919, -2202, -1179, 1383, 2229, -878, -3267, 4548, -658, 169, -2098, 3316, 879, -2784, 1370, 927, 1996, -4266, 2337, 1247, 292, -2550, 371, 3134, -3086, 633, -852, 2733, -2707, -427, 1712, -141, -1181, -2135, 4007, -2817, -448, -1196, 1683, -997, -2589, 2038, -728, 164, -3419, 3125, -1001, -1521, -1101, 869, 1427, -4006, 1861, -348, 719, -2889, 1108, 1502, -2138, -342, -322, 3413, -3568, 774]
730G74R1N49k516j02M940n278J822j325M708n022K86K425j68k09m024O777l824
747i6j79j276M547j723l912M165q90J807o317N587l85j607j214J446L748o941
763c240L348r9K688n633J803K998k395m10j733O166n519M72O88K575k673k674
779c638N223j818J99m208O136j855k517J056J355J645n784M689l31P48m377L537
795F0K394m441J014k03M360n795J773J555Q69k794j208N740l830M16k102N556
811C364l089k346L157R3M52m880N884j681l22k520L387J203n037L188l60K645
827C138n806L172J256j430j371N7M555n200J264n28L800m036j007L725j575m0
843b6k876N634l250n23n09K882p70m224M681j250J218m513M403N8k580N55N29
$$ y = [774, 865, 1414, -1102, -1204, 3736, -1542, 280, -1045, 3663, -1359, -1073, 1352, 1184, 975, -3049, 3728, -96, -275, -1551, 2996, 1273, -2639, 1526, 636, 2443, -3874, 1713, 1328, -279, -1493, -47, 3701, -3240, 108, 9, 2697, -2936, -1133, 1865, -530, -940, -2673, 3493, -2026, -1554, -866, 1709, -964, -3638, 1585, -233, -34, -4242, 1894, 39, -2478, -1422, -67, 1578, -4206, 483, 152, 900, -3477, 60, 2454, -1987, -973, -1176, 3184, -2611, -838, 717, 1586, -1208, -2416, 3324, -506, -90, -2192, 3364, 275, -2071, 1086, 1179, 1631, -3249, 2635, 954, 632, -1888, 1499, 2702, -2335, 853, 493, 3138, -2668, 504, 1760, 330, -1041, -984, 3571, -1629, -365, -893, 2907, -1129, -2136, 1589, 14, -26, -2902, 2732, -518, -1041, -1550, 1332, 562, -3662, 1019, -231, 987, -3526, 877, 935, -1645, -1090, -561]
860e61L088n827L494l57J470l213O84L898l459M38j137N002m647N42J474Q08j183
877E14k653N620l103O42k394M496j501k444K221K2J291m844M822q79k08k004J871
894A469K216m649K073j85K702m942J956J773j038j299r56M947m731R37n53K933
910B653k406k088L689q34j68l905N388j644j579m79K159R84m994L583n14J302
926A147m240K817J511k381j57m12M356m995J163Q09J741k574j257M065k194K15
942c86k255M965k989r63J070J391K91m136M209q05K62k775L406O57l087J167J24
959A46K880m801K252M49M29j700j72L500l261R41j299L687l299k41J826l15P0
976A092l020M465k473M99j703K502N4l062K542p14J618m239L219j6o48j041M62
$$ y = [-561, 2527, -3300, 194, -163, 1307, -1906, -1222, 2676, -783, -345, -1482, 3520, -1127, -585, 889, 1697, 514, -2139, 3481, 378, 1020, -1374, 3122, 1621, -823, 1398, 1420, 2711, -2133, 2689, 1810, 1602, -402, 1469, 3685, -964, 1109, 924, 3626, -1316, 640, 2413, 1375, 76, -880, 4067, -664, 273, -280, 2653, 247, -1841, 1848, 1014, 846, -3059, 2329, 685, -894, -1373, 786, 1770, -3224, 359, -155, 1147, -3093, -276, 1235, -1146, -1303, -1715, 2641, -2354, -1191, -382, 1359, -1215, -2472, 1593, -601, -386, -2641, 2324, -665, -1628, -558, 833, 1124, -3012, 1197, 392, 654, -2121, 1285, 1942, -1145, 22, 146, 3026, -1775, 477, 926, 1355, -345, -517, 2983, -278, 663, -636, 3051, -248, -489, 1337, 1022, 1092, -1928, 2537, 64, 563, -1140, 1362, 1416, -1646, 896, 182, 1800, -2439, 780, 764, 116, -925, -463]
993d63K093l518J905j219K365k972N98J905j635L35j555L696l222Q87n47J318
1009b9n19j965L266k172J206k419L424j249o58L63q0J506k951K920j516J327j907
1026a453J252J277k409J493j086K967l541J679K55K24p79o88L073l005J338j403
1042h06K882k152o87J880m35M54k597L705k078N25j222J575O42k805K067p14J249
1059A483k966J925L48n68k55l44K369l598K071r11J841k257n9K218j664N62j676
1076a481L032k246K64l8J129k74k552K982j545J477k632K463l97q74K86j22J891
1093A363l493K570q80J030j782O38J805k103R30j378K799k709J077M93J23q6j502
1110a105K641j942J052j464J586m99p75J293j099J341k335K785j192J10l52J22
$$ y = [-463, 1630, -1888, 17, -1202, 1163, -1809, -1211, 694, -941, -606, -2161, 1535, -1687, -800, -1347, -29, -548, -2513, 753, -1419, -213, -2632, 792, -457, -1115, -752, -832, 674, -2277, 643, -873, 454, -1453, -201, 1076, -1333, 160, -926, 2041, -1500, 179, 434, 658, -121, -809, 2264, -741, 597, -806, 2076, -76, -763, 1117, 682, 1136, -1461, 2244, 166, 691, -531, 1044, 1686, -1119, 948, 234, 1483, -1483, 442, 790, 222, -33, -377, 1992, -1606, 465, -446, 1395, -862, -921, 1297, -367, 195, -1481, 1551, -695, -431, -469, 660, 386, -2166, 816, -729, 748, -1884, 579, 182, -692, -406, -528, 1363, -2130, 440, -440, 590, -1192, -554, 1251, -852, 78, -1300, 1499, -1210, -133, 360, 483, 397, -1105, 1536, -406, 646, -818, 768, 269, -506, 787, -312, 1029, -1306, 1479, 287, 397, 45, 167]
1126A67J510k414J611j124J694k464J759m1q27N14o19K002k788J917j247J078
1142G28o30m81J354j511P47j259K380j784j58O46NJ41j519K174j676J202j730
1159a371J838m86j069R21n06J528k936K415n39K36q70J95J659k256J297r91K036
1176A101k194M29J056n53N4j067K177j798J078r45J388o74r56J756r65J014k209
1193a308K708j119k74k63Q24Q22k681J890n65J479k413J156Q76j255J08m50K375
1210A910k857J123r7O87j121l90K045j594N93j782K908j548p66P31L18M95k331
1227a676K437j268O71j336J483N81j983Q30l79J549k732J624L18j95j063M67K181
1244A509k655N48n70K058j505n47J335j32J40j813K667j377K41q58J604o24j327
$$ y = [167, 1677, -737, 874, -250, 1444, -1020, 739, 698, -129, 385, -234, 1768, -1020, 897, -350, 728, 98, -383, 971, -540, 207, -1052, 1328, -456, -614, 32, 37, 178, -1341, 833, -843, 359, -1371, 467, -19, -1088, -167, -673, 855, -2081, 334, -205, 31, -839, -644, 1015, -1241, 56, -935, 1101, -1093, -664, 392, -161, -107, -1174, 1003, -795, 283, -662, 726, 52, -904, 852, -113, 901, -1308, 1400, 281, 7, -256, 568, 1390, -1291, 599, 34, 1513, -900, 256, 1132, -123, -15, -465, 1910, -947, 176, 79, 766, -355, -745, 1300, -294, 299, -1483, 1425, -123, -889, -158, 160, 655, -1676, 761, -507, 164, -1172, 311, 892, -1091, -261, -640, 909, -1823, -199, 119, -76, -1139, -672, 1509, -1146, -598, -1168, 890, -615, -1162, 173, 41, 181, -1632, 1035, -342, -101, -959, 645, 21, -1306]
1261a306J456k86J073k292K005J79p45n26K13J799k470J074l36J512j991K96J398
1278A053r32j27r94K629j873K87J4J007r42j034K094q81K84j667K219n82j186
1295f31P46M7J171l019J977n9J39j307Q07J029j581M51n20J919k212M63O99q2
1313C7o46q32K424j622K83r06K189j373p53J200Q7L30k169K396o00k81q39J519
1331D44N37k383J460l93J255k026J151O02o83n01K07J835k342Q01k38J590j493
1348a77m68J681p80R9j272K674j545l43j7J186l11j852J839k77K11j534J739J51
1366A004j188Q6J61J443k643J062K86Q97j928K45J857j477o5o97K378k040n3O76
1384DN54m78j444K083r72L14j058J791k91j250P12J46N02k128J817j8P6j266N48
$$ y = [-1306, 150, -136, 937, -1355, 650, 829, 84, -442, -229, 1570, -900, 174, -162, 1350, -641, -345, 1053, 121, -6, -1000, 1629, -244, 43, 57, 1064, 122, -912, 1182, 301, 585, -1082, 1137, 555, -631, 115, 162, 1333, -1686, 291, 232, 371, -936, -129, 900, -681, -230, -750, 1169, -1043, -580, 119, 37, -609, -1441, 983, -639, -356, -1262, 927, -446, -1199, 1, 88, 418, -1751, 645, 45, -236, -1075, 444, 981, -1402, 58, -335, 920, -1106, 45, 647, -36, -537, -330, 1505, -837, -36, -274, 1316, -177, -645, 1036, 256, 355, -917, 1757, 212, -131, -148, 1038, 727, -1125, 714, 437, 648, -886, 853, 1004, -184, -98, 63, 1506, -1137, -75, 211, 1108, -820, -575, 1282, -195, -260, -957, 1421, -619, -672, 4, 558, 80, -1364, 719, -253, 61, -997, 794, 503, -747, -35, 111, 613, -1515, 302, 284, 360, -906, -358]
1403c58J707k100Q57l10J283j852O97P93m50l65r99K452j205J0q15J580n34j238
1421h47J518m11N06j728K283r75m55k08O62R79j945J173l90R22j958J178P66r96
1439G4J90l56J269j514L11J89O04q30n97J681r78J85r46J677j247p8L31L64J77
1458E06j655J662l59K38j288J284R4j263O32k70J141j701R43J77m4j37o21J417
1476G56j241L92m50J334j234PP67j74k86r31J928j235L28n14J172k78j190J079
1494B30r1M84j604J507j96k80m34M10P77j489Q87m27O68j048L29Q38p07N7m76
1513e65J415j278L61o2M17l99p68J370r03L62q84J639o07o68K93O0O71j431J075
1532I8k71L72p20L75N23r43N09n45J174j372O70J58K26o92k14J155r61N39p00
$$ y = [-358, 1349, -751, 106, -204, 1079, -773, -76, 717, 267, -98, -1097, 1355, 150, 160, -655, 925, 391, -847, 671, 260, 766, -962, 1321, 346, -109, -317, 345, 1324, -621, 552, 162, 1084, -874, 304, 1070, 74, 264, -92, 1177, -337, -26, 163, 767, -63, -660, 1021, 43, 228, -718, 959, -288, -366, -35, 329, 506, -1149, 513, 154, 392, -896, 388, 482, -781, -149, -419, 722, -979, -36, 141, 97, -40, -661, 756, -485, -93, -543, 791, -443, -436, 331, 157, -129, -1060, 868, -367, -39, -553, 619, 341, -849, 230, 139, 623, -981, 526, 330, 50, -384, 26, 803, -686, 201, -226, 442, -606, -277, 561, -146, -89, -565, 850, -428, -67, -129, 288, -111, -879, 491, -412, -50, -934, 705, 98, -570, -277, -217, 454, -977, 98, -173, 199, -521, -146, 377, -566, -57, -602, 572, -800, -130, 28, 254, -438, -652, 503, -458, 81, -619]
1551f19J277q35l43P11k86K01r84J605q58L74q80R33M76j429R32n44Q01j229J218
1570E21j30l49j45j05J099j446O56l74R13r22M4O35m68J11m59J362j132J45j42
1589a86M31L9r47J357r17O88j071R04k01m58M00K23K37j345J423o70L54q24M53
1608a10O62q98L42o63J358j439N27L40m2k54m18J265j053O19o95J079o70j91L43
1627A02j95L13j193J600p25n6oL25J51j094J000l86O99j236Q80K15p69J04j05
1646c76J239j374M75K00L86p06N7O38o95L25o03J308q39k37K06K13K12j330J543
1665F42o74J09n78P93Q1j028M64l2R34j392P52q6Q1o99J81J076j315P92p52J121
1685D70p18k71P25m2j64p80J289p93K65m33O70l0p79O29J44K54j261J185j79k66
$$ y = [-619, 658, -177, -520, 191, -95, 106, -878, 727, -131, 243, -637, 296, 772, -657, 275, -269, 532, -697, 521, 391, 42, -103, -208, 891, -555, 101, -273, 640, -282, -238, 397, -71, 40, -419, 943, -189, -44, -186, 245, 284, -663, 694, -223, 465, -606, 298, 97, -361, 39, 262, 499, -846, 577, -93, 261, -563, -110, 552, -346, -4, -667, 691, -748, -221, 119, 77, -177, -595, 670, -383, 236, -459, 620, -50, -241, 102, -93, 220, -973, 627, -98, -154, -160, 165, 316, -778, 222, -164, 535, -701, 179, 394, -375, -271, -376, 863, -511, -36, 164, 550, -156, -99, 539, -156, 169, -434, 874, 35, -202, 4, 217, 429, -901, 642, -32, 77, -501, 292, 373, -655, -191, -223, 711, -681, 71, -15, 66, -633, -452, 624, -691, 101, -651, 470, -248, -519, 206, 164, 0, -780, 509, -284, -19, -452, 218, 188, -591, 38, 182, 436, -825, 360, 181, -85]
1705h5k21K00P63q84K22J56K55q55M52N03n34K07n83J118p96o0J17M08m89l52
1725d58R18l68K02o51R59m15m88N75lK08j108Q88k03L96p79M48N94j074O71l84
1745g2P49j124M92O4J88m93k8Q88q13J36m18J016q81j61N14j17J66q02J205m85
1765B4j06k42L13N08j230Q46m8L14r65P04J2K12p96M03P36j063M67k30P18o98
1785a21k60R42n58R0n07J246q77Q8k58Q39l25j065J263n26M37r45Q97p1n76J78
1805a09j63P21j213Q38p2N38r77K16P08q28N21n73J161j148K29J90K1Pp07J047
1825D07m51J54p65J113m88l26L16M1K89j048J008j56M0n88O15K98r31P50k09N17
1845E86j037L21L15j19j03j81J037j013O8j40R29o64j56O48n28K60p98J025n64
$$ y = [-85, -306, -106, 657, -227, -5, 151, 406, -449, 3, 506, -28, 179, -404, 714, -82, -142, -25, 383, -106, -458, 460, 92, 294, -357, 602, 187, -301, 274, 271, 479, -629, 259, 56, 452, -327, 121, 715, -359, 312, -72, 677, -447, 45, 109, 297, -196, -224, 664, -149, -13, -431, 585, -296, -457, 57, -60, 106, -696, 509, 24, -82, -324, -11, 497, -733, 113, 65, 379, -586, 118, 130, 342, -454, -51, 685, -378, 89, -141, 577, -121, -381, 561, 3, 93, -414, 832, -45, 43, -215, 624, 299, -766, 497, -29, 408, -537, 360, 289, -287, -109, -272, 449, -764, 74, 2, 540, -437, -221, 487, -341, 180, -393, 768, -380, -151, 39, 60, 67, -640, 407, -44, 110, -655, 458, -30, -356, -40, 1, 290, -758, 250, 94, 134, -454, 161, 459, -472, 278, 69, 586, -451, -130, 185, 66, -37, -218, 819, -194, -126, -266, 663, -1, -157, 491, -37, 223, -575, 450, -114]
1864a14L8m5L40L60j003J007m94L89q48N12J44m22r2J18O78j028P28k04L14o19
1884b41L5M62o11M41l61P32p74lL32K77k32p41J079n35J67l01N01r2m81L46k32
1905b32L86p05P58m38K65n42L40N49q89O37n19Q46q81L60K51m00N4l82J195j099
1925d46M53j82N98n98k93Q12l58J49n86Q15k21k23K08q3O73j018N52k65M08q27
1945d32N38L37l33j98J69L70q71N19q2K34l52j38M51k50K7l05P06m45l67M93q6
1966a5J95o27P88l25k4m08O46J26q09L52M2M73q69K88j2K24k99%N73p93O44n18
1988c48O20n25J56M12l32J2m99R20o02M49l54K01q7k06M31l00L07p33P29j69j5
2009F7j59j5N32q43R49m38J30m26M72K16m47J0j8M73o06K57P4j18N0l27N96n28
$$ y = [-114, -76, -121, 219, 579, -424, 583, 89, 478, -370, 142, 286, -136, -228, -110, 568, -460, 268, 64, 378, -241, -206, 256, -355, 86, -275, 457, -317, -320, 12, 289, 57, -684, 395, -140, 27, -274, 227, 135, -346, 0, -232, 154, -551, 207, -231, 34, -508, -168, 381, -508, 129, -390, 456, -425, -65, 186, -214, -160, -542, 653, -446, 7, -175, 423, -175, -468, 344, -14, 135, -451, 364, 143, -80, 128, 45, 718, -300, 252, -13, 395, -432, 106, 443, 110, -88, 81, 451, -420, 99, 17, 251, -101, -239, 212, -38, -11, -316, 390, -55, -422, 71, -15, 180, -447, 341, 16, -8, -416, 230, 356, -453, -101, -59, 414, -455, -167, -179, 45, -254, -254, 319, -474, 170, -348, 272, -253, -97, 315, -17, -5, -504, 416, -186, 263, -91, 110, 23, -183, 248, -52, 255, -478, 251, 82, 67, -92, -107, 425, -418, 531, 93, 223, -203, 269, 485, 38, 48, 30, 503, -103, 154, 228, 110, 160, -167, 429, -99]
2031i9L08l18M67l09j27L17l38M12q78R98m21Kk75K59K36m33M14m55N02n75M15
2052A02j92j4j08j46Q72r97J97LN88m42k24M48p8K04m82O25n07K03m29M98J27
2073B48o31P55l78J68m55O08l00k98L36qL04p29M63%J46l64J29M42m41J4k56Q61
2095F14q38j7L23J65j37m61O24m85K49k92N60j12k21j24L73K67j012M73J14K6
2115H9j27q6K48k06Q2m0L67m75k9K78K6l49J5O34o18J21k97M18m4l99O14k75J95
2138A42o60Q26j21j34l37J09J38j95J15Q6j9j84K89K57l34q0l5P03o99K61j92
2159f4R8k17j44N06k43J56j14N47p92MJ72K39Rm64N65l05M08n54K75J91o30L86
2181B9j97N08p52L51K88Q6l03l77N55o31M58PL19o37J38k4P0J13m47Q94o80L36
$$ y = [-99, 209, -109, 358, 49, -78, 239, -99, 313, -565, 433, 12, 14, -261, -2, 234, -199, 215, -240, 262, -313, 102, -90, -104, -212, -358, 514, -483, -286, -283, 305, -137, -361, 87, 9, 213, -269, 356, -151, 52, -377, 121, 248, -383, 372, -6, 162, -293, 315, 15, -283, 53, 45, 349, -380, 83, 83, 229, -135, -6, 436, -5, 9, -247, 614, -224, -241, 82, 247, 110, -351, 273, -212, 37, -255, 305, 193, -28, -152, 221, 488, -524, -51, 63, 89, -38, -124, 124, -82, 0, -40, 327, -148, -177, 101, 127, -222, -207, 427, -191, -70, -367, 51, 7, -392, 222, -53, 142, -518, 308, 187, 53, -284, -175, -37, -232, -117, -31, -50, -234, 55, 312, -22, -102, -137, 566, -133, 128, -64, 34, -183, -327, 179, -64, 92, -22, 525, -267, -263, -91, 148, 157, -307, 258, -47, 361, -193, 82, 273, -357, 29, -168, 340, -412, -61, 227, 313, 10, -367, 188, -443, 15, 22, 341, -296, -158, -182, -112, 1, -446, 448, -232, 104]
2203A04l66M27j91n16N22j27L64l91M76k62k78M50k28L79n16J19L9J37k13j47
2223b18M85k86j2k30P58o03l2J52L85k63l74P24l47j8n48O69k64Om5K35J33p51
2245d44P67k35M18o46L43o7k15J73n9J33n75K29M46k25J0k00K98j34K30o12N53
2266A88j95k11M83m92j17K17M41l71K23r1m1J90k04p8N9J01l79K43j24J34l3J33
2288G6j6k65M46j80M0m2j31J11j40J18j76L62m05J18%K36j00l34O23n57M16m08
2310b08M74j73M8N9j13J22n13N37k93L56m31J72J40l38M13l89M05m31K87Mk3j45
2332d0k21M63k98L13n34K95O6k02L97l05J6k53O36m65R8r7L55J6o30O19l79L37
2354A87l67J15J6j12J69qO3k83L31l22L16l54K76j09l6K7j73N27l05k6j38J73
$$ y = [104, -262, 165, -26, -542, -20, -147, 217, -174, 302, 40, -238, 212, -16, 363, -153, -34, 5, 142, -71, -218, 267, -19, -31, -261, 497, -106, -138, 14, 399, 136, -238, 486, 139, 121, -427, 242, -22, -16, -61, 174, 307, -444, 323, 88, 506, -140, 203, 136, -79, 94, 35, 168, -407, -178, 268, 43, 53, -147, 151, 17, 247, -365, 188, -7, -218, 265, -227, -344, -127, 314, -57, 166, 75, 34, 224, 20, -58, 1, 102, -277, -34, -158, -24, -57, 76, 60, -205, 241, 61, 101, 59, -72, 39, -101, 17, -159, 203, -202, -84, -84, 152, 52, -282, 341, -216, 200, -208, 266, 93, 141, 200, 87, 209, -304, 233, -60, 296, -135, 37, 177, -161, 252, -137, 268, -163, 124, 128, 105, -40, -261, 202, -96, 217, -317, -22, 44, -158, 239, -66, -50, -303, 333, -132, -34, -131, 224, 240, -390, 229, -150, 187, -180, -65, -49, -161, 8, 0, 63, -220, 111, -211, 105, -249, 27, -82, -118, -91, -264, 263, -42, -68, -206, -33]
2376c3K29n95N14j79K04k43J27K19j64N4K1O7k97L25o2k00k35K86R4l00K80k21
2398a09M92l82M8J8j55K10l83M63k91J65k23L81j73p4J74j93J68n71N78l27J80
2419dj18P1Qj02J16K63j5l87L88j32l28R7K4M70n43K18m2m6K39l66M61l80J55
2442D7l10M20n8mm3nL5l55L82k71L25k36J08J77k31J15r1O9l81M31j86L41l25
2465d6j44L28l20J42j18N04n44Q5K56O6j58k55M79n94M13j87K82j21k68K03O5
2486F8j1j93L65j01j80p6N3K58m02R0K22J66l70L3N7k85L96k05M10m79l2N26j11
2509A99l93K05rP9q4j44K92l17L37n4p4l7n06P75l26K70l53L04P1k00N5l51M05
2532A44k38j1J15J12k94k19O32j76M4j56M26n02R1J40n7K30n06M55l70J84K0P3
$$ y = [-33, 196, -399, 115, -64, 140, -103, 24, 243, 79, 133, 154, 221, -76, 249, 187, -13, -248, 38, 132, -168, 112, -109, 383, 1, 49, 67, -88, 122, -261, 202, -89, 76, -147, 234, 61, -13, 161, -32, 136, -435, 143, -184, -4, -122, -51, -43, -145, -29, 234, 219, -168, 220, 88, -240, -143, -119, 351, -192, 26, -16, -62, 177, -189, 272, -108, 47, -263, 157, 99, 95, 52, 47, 82, -273, 109, -162, 163, -73, 35, 212, -19, 96, 5, 74, -307, 124, -62, 279, -46, -190, 138, -182, -40, -158, 346, -198, -113, 143, 209, 51, -204, 275, -319, 94, -93, 189, 68, -200, 3, 68, 57, -136, 229, 128, -52, -128, -75, 183, -219, -129, 93, 259, -111, -78, -21, -306, 90, -115, 295, -184, -216, 310, 199, -194, 11, 2, 81, -3, -147, 145, -172, 165, 111, 37, 0, -506, 269, -57, 213, -140, 164, 235, 35, 90, -261, 144, -94, -105, 10, 122, -172, -391, 241, 65, 109, -47, 379, -123, -32, 108, 51, 281, -225, 230, -140, 44, 64, 137]
2554A37j1l6P7o7K43n76L34j56Q5k47M30ok45K0j99K71m8o6k9K64k99k05O70k23
2578A18p1j64J96On12N55l78J52p4J50N0j44J94n1Q6j54J96L8k39M0j79R5J82
2601I2J84l30J93j30NJ14l5k57O3J16j58L20m06L11m1r9o1K01N2k09J86l9P8r8
2625E2mL47o34L95l31N23n85M27j41k11J39q0L50k79n6K18P3p4m48N06J51j59
2647A79k00L33j87r4n2K2K46n97L59j53K71l02J84M2l2l32N67k81m37M79j34K29
2669A10k03N0K21k6j68p7K50r2j74K08m3J85k75J04j43J88k05K57j64j6j04R9
2691a8L59o80K58K37k72J78M7J03k49j6O6j93J25R1j19K66l73Q2K47lL0j49L57
2714C74k93k28R8M3lp0K32j87K3p0l8J62j85L06n31L74j84J88K36m29L97k53J22
$$ y = [137, 126, 90, 167, 100, 343, -233, 101, -55, 30, -217, 213, 207, -38, -18, -217, 54, 6, -60, -89, 175, -124, -329, 341, 118, 47, -117, 79, 85, -427, 128, -250, -98, -172, -22, 28, -116, 78, 27, 113, -41, 155, 193, -46, -6, -185, -90, 92, 276, -54, 139, 9, 14, 128, 93, -164, -101, 15, -143, 177, -229, 82, 41, -58, -119, 82, 134, -75, 111, 72, 150, 52, 48, 395, -239, 156, -175, 348, -237, 190, 49, -162, -23, -103, 247, -32, -88, 130, 203, 129, -319, 187, 338, 179, -21, 312, 125, 31, -21, 1, 247, -350, 9, -144, 127, -175, 9, 51, 19, -313, 254, -27, -464, 15, -119, 110, -93, -43, 178, 152, -16, -93, 157, 65, -109, 99, 56, 241, -34, 70, -73, 115, -90, 167, 3, -13, -117, -18, 341, -339, -81, 156, -116, 62, 109, 212, -37, -53, 13, -180, -55, 36, -83, 183, -190, -108, 139, 136, 166, 17, 374, 81, -147, -49, -6, -9, -79, 153, -34, -11, -81, -119, 43, -142, 164, -367, 7, -177, 11, 247, -182, 215, -38, 84]
2737H4l68K96l87N23p2k85N03p0Lk87M4l1J4K7k7J83k99K09L3nq9J02J10l36L15
2762A90j98J46l73K85Q5l25L30j26L93n40K76k05L13l73k0K02k95M51n6k24j13
2783a77L04K2l38L95j63k4R7L12n64L09j08j96L6J56k03k4O7J2K79j75j23L6q3
2806a53J69l46M29m54L22J44j09o4K59O6k57L5o8P3j57M4N2J24j27m6J89k50J74
2829D9j60JK62k55N8O4J90j54m8r3J98q8k8k5j68L38j19l0k4RJ82j20M6j48l1
2854i4J85k47J90J22k7r7Rj83K49N2k58j61N37l44J75l9k40P2k8K48l38J26l5
2877a26K00N1l23K33L5K07j00j11Q3j85J20k72K65k08O5K43j07N8j59J95l08K41
2899I7jM6k30JJ79k10J38O7M9k66K63j28q0N1j55J75j31L22qj01k05L5O8j0L1
$$ y = [84, -284, 12, -375, 148, 76, -209, 294, 224, 227, -60, -16, -47, -33, -6, -33, 150, -149, 60, 93, 88, -1, 101, 211, -125, 190, -8, 138, -235, 50, 135, -190, 140, 14, 407, -133, 143, -62, 251, -122, -142, 60, -235, 216, 160, -64, -177, 127, 149, -189, 206, 43, 19, 116, 428, -136, 173, 65, -131, -95, 61, -142, -166, -99, -87, 192, 17, -106, -70, -153, 16, -330, 99, -355, -33, 111, 2, -62, 197, 263, 6, 41, -27, 46, -111, -67, -15, 109, -18, -64, 125, -125, 49, -111, -110, 152, -103, -45, 19, 209, 55, 7, -86, 112, 24, -4, -29, -197, 141, 22, -8, -32, -23, 159, 39, 85, -63, -94, 91, -156, 34, 156, 129, 32, 41, -142, 107, 159, -99, -260, 277, -67, 108, 69, -171, -99, -127, 121, -217, -91, -126, 74, 125, -198, 35, 70, 277, 177, 66, 149, -36, 84, -188, 77, -131, -66, 177, 70, 128, -31, 164, -144, 97, 96, 142, -88, -87, 92, -118, 20, 87, 136, -130, 133, 5, -75, -24, -179, -4, -135, 187, 179, 78, -127, -92, -24, -34, -3]
2924cM5J8j37O6k24N2O3K29j13J05r3j30J12J3l5L8j9rM7R3j20O1J11k1p8k52
2950a81J54j50N5J49k20K72k47L7K74o6j10J91j96k6K61j33p9k7J35p6n6J36j2
2973H5j54Q6J40q2k65N7K49j20j99M98m58M31l23QJ77j90L8L07k60L5j63Q2J72
2996A51k20R0q4O0k28L05l1Pj04M5L8k83j10K67j14n5L19lnK26k43J20k26K42
3020A64J50m8k58j89J54O9lo5Q2l72K76j83J74j42q3M23j48k6N0K90k85j7rj8
3044a4N7j29k28L61O2k55M7J72j03k0M4J92k58J3L66j58k49L0K95l30K68j98J80
3067A45j60L8k86K82J61o1J11r4k61J5P1MQ2j7Q3k46J94J7P6l72K84o7J00Qk98
3092a91M87k10j60L22k17l91K81K06j4q8Q7m1k0j69J27J30oJ60j65j42O4J13k06
$$ y = [-3, 42, 60, -77, -11, -235, -183, -120, 109, -4, 101, 8, -122, -10, 3, -32, 6, -13, -22, 25, 118, -2, 59, 170, 149, 71, -181, -27, -177, -122, 27, -193, 79, -168, -131, 143, 77, -33, 158, -38, -64, 197, 64, -15, -42, 93, 17, -39, 97, 85, -69, 17, 157, 75, -190, -133, 116, -4, -203, 295, -163, 268, -55, -47, 130, -60, -22, 285, 25, 60, -103, -21, 151, -69, 21, -63, -3, -231, 74, 43, 50, -54, -9, 29, -254, -364, -97, -211, -266, 53, 50, 45, 271, 28, 148, -78, 164, 314, 266, 8, -181, -27, 42, 39, -26, 56, -316, -40, -223, -49, -191, -274, 149, 1, -25, 25, 315, 30, 13, 4, -14, 43, -86, -314, 47, 109, -146, -99, 73, -30, -50, -6, 186, -72, -59, 307, 149, -100, -70, 225, -105, 163, -35, 145, -15, 23, -263, 19, 180, 119, 230, 136, -125, -110, -39, -35, 47, 30, 113, -133, 61, 78, 154, -218, 66, -1, 99, 107, -191, 296, 86, -74, 248, 31, -360, -79, 127, 113, 25, 112, 71, 51, -118, 9, 139, 133, 293, 128, -14, 50, 163, -43]
3115d3r3K51j80o9J77k52K20k20rJ49j34R7L2K09l60O8K10M1j84K07j54N8J07
3138A28k64K45l23L85k68O7K2L1R4J52k28j36P5K2r2K34J01l36o2k2J02O4k04
3161b13J48N8j65K90j78J32k79K92n3J41k45oJ1K15J28j95Jj33J06j6q1J17o2
3184A3J60k65Q1K1n1j26J31n2L92j91k91Q3Q6J38j27J21o1J08m0l00K86j95J35
3207E6j07Km1Q4J84k13J32L6j3L9k13J88j63l3J26n2J2RPL1o2k18O8R7l11L07
3233d8m6m3jn7K66j33R6q4J70j71j69L02j91J38O9j03p3J12j21J22O5j6k31K84
3257A37k89K67PL52l58k10K51k71J41k21J08L60l90J37j9J43j47k41M98J14m42
3278g3K35j70K0k6N8j78J9N3K03J35l73L8J64l30J61P7m4J8l6J19j87K63l39L53
$$ y = [-43, -136, 115, -65, -134, 43, -209, 11, -209, -218, -69, -203, -106, -74, 135, -225, -157, 53, 94, -90, 117, -37, 21, 128, -136, 109, -214, 171, -97, -30, -8, 23, 117, 269, 41, -95, -20, 2, -90, 144, 245, -91, -153, -175, -73, -9, -213, -65, -7, -172, 118, -60, 72, -207, 85, 32, 173, -72, -78, -67, 148, 276, 81, 82, -51, 55, 39, -42, 75, 13, 173, -92, -11, 10, -41, -167, -36, -88, 304, 113, -178, -95, -9, 129, 2, 123, 62, 170, 130, -170, 116, -79, 56, -51, -49, -90, -6, 178, -35, 97, 133, 120, 159, -54, 134, -29, -62, 64, 12, 24, 33, 40, 71, 9, -209, -141, -44, -355, -48, -94, -137, -138, -195, 71, -62, 34, -50, 120, -51, -220, 82, -109, 29, 98, -5, -78, 34, -87, 35, 100, 84, -147, 137, -152, 115, 122, 474, 116, -94, 157, -114, 27, -194, -86, 274, -116, 21, 2, 145, -2, -243, 255, 369, -73, 162, -8, 12, -14, 44, -134, -115, -62, 141, 276, -97, -59, 105, -225, -64, 13, -31, -13, -49, 70, -117, 146, -193, 160]
3302A60j60J47j12oK01j00l9J20l53J15j14J17n1K11l21K24j93J07J7J8K6j23
3324a09Q9k3J88j19J13q3o2j05J35K7N3k14Qj5K32j22n3J94j33L7N9j47R2k33
3348a91L93k7k33J9j65L51k17R4j05J13j9k04K76P7P9k82l0L1K9M4K44j22l80
3371b25Q8J72J32k12J3O8L02l21mj6N9p2J69k1j95K7O3J3r0r9M9k0JK04k48K24
3397F1m3k2j12J47J89k63n3l2J02j36L41j63N4K4K5l32L62j16j87K05k64L98j63
3420B2J58k59M4j12L42j69j5Jq3k0J1J00j74R5K15m0p7o9O2o1j1J6R3j03jJM6
3447A2J31j35O5k8l1o7L85n04J59Oj36n6L98l35K03J8j26J57j5R2j53k6j88Q8
3471h6L9N5J42l37L08J0n4K3l09L59k6M1O3j49j76j9K78k32J71j33J63j20r0M0
$$ y = [160, 0, 147, 35, 29, 230, 130, 91, 211, -142, -27, -141, -24, -75, 136, -185, 39, -154, -47, -30, -12, 14, -109, -20, -43, 145, 26, 139, 56, -6, -111, 24, 51, 104, -110, -102, -117, 115, -7, -60, 134, 1, 38, 97, -50, 42, -191, 202, 175, -58, -39, -204, 147, -70, 24, -81, 32, 13, -191, 85, 162, 241, -41, -71, -40, -11, 33, 277, 155, -225, -137, 35, 167, -45, -32, 36, 338, 17, 13, -3, 56, -16, 153, 132, -63, -36, 27, 40, -50, -149, -100, -120, -119, 85, -163, 61, 18, -4, -116, 31, 220, -43, -96, -128, -26, -162, 179, 16, 70, 94, 119, -213, 149, 33, -154, 51, -213, 185, 22, 180, -79, -35, -147, 195, 26, 11, 12, -71, -91, -80, 20, -154, -59, 156, 116, 39, -30, 32, -29, -40, -24, 69, -34, -35, -34, 12, 143, 8, 73, 45, 14, -53, 332, -172, -13, -7, -143, -199, 199, -136, 67, 85, -41, 116, 101, 193, 40, 14, -174, -86, -47, 8, 150, -187, 121, 131, 77, 100, -209, 150, 124, 165, 228, 79, -97, -116, 162, -70, 101, -32, 131, 11, -79, -39]
3495c9J91k43L08k20J32k59o8J83O6q7lN0l2j15O5J00J05j25L63m18NnK98p84
3519e32L48K6j8K20K18j47j11p0L40n27j25M93N02l84L3r5o1l0m10L46k22J30
3541g6j18P29q76j9J48l44N31N85o74j73N38m86L44n90K46M19m32n9j12M36m73
3562d56N06j75J07L68k13l78O92p61L11L89l89P0m6L8P9p0kl2k27oK09J5j57L70
3586B42k93K9L1J94k58j84K54k0J79o0m4k49P8L7LP9k42L62q1p2o1J73j61J29
3610F5j11K39j71J51l96O0J32k5Q0j78L01q1Q6k32J33k99L18r5K1j69K37p8o4
3633g6J74N6j05r8QM5jnj64K67k0o9l5l4J12p4J04p0m6j1R8l6R1R8k20k29K08
$$ y = [-39, 152, -91, 217, -3, 129, -130, -198, -15, 51, -36, -39, 11, -21, -136, -71, 29, 134, 9, 372, -46, -41, -46, 252, -532, -184, -158, -176, 44, 262, 115, 4, -66, 274, -253, -378, 115, 617, 233, 266, 171, 110, 80, -330, 16, -206, -76, -194, 535, -341, -360, -212, -556, -25, 560, -114, -287, 251, -235, 109, -481, -235, 184, -248, -307, -419, 17, -456, 50, -125, -18, 350, 137, -241, 451, -310, 1, 390, 1, 71, 25, 63, 142, 72, 70, 38, -189, -195, 14, 29, -128, 242, -51, -22, 9, 203, -55, -239, 15, -5, 174, 114, 70, -179, -101, -64, -61, 18, -224, 138, 57, -15, -76, 97, -64, 65, -46, 193, 22, 173, -223, -163, -31, -56, 24, -154, 147, 66, 152, -80, 53, -246, 72, -23, -2, -171, 66, -12, -76, 98, 154, 49, -49, -41, 4, 3, -2, -166, 101, 81, 12, -23, -57, 55, -19, 85, 15, -31, -42, 56, 20, 111, 209, -11, -240, -32]
$$ [...]
8191b1
##END NTUPLES=NMR FID
##END=
