##TITLE=1H_EC-3230(21)
 DMSO, 8 sc, 
 10.7.2020
##JCAMPDX= 6.0         $$ Bruker NMR JCAMP-DX V2.0
##DATA TYPE= NMR FID
##DATA CLASS= NTUPLES
##ORIGIN= UXNMR, Bruker Analytische Messtechnik GmbH
##OWNER= root
$$ XWIN-NMR		Version 3.5
$$ Fri Jul 10 11:18:36 2020 Russian Standard Time (UT+4h)  she@DPX200
##.OBSERVE FREQUENCY= 200.1315
##.OBSERVE NUCLEUS= ^1H
##.DELAY= (6, 6)
##.ACQUISITION MODE= SIMULTANEOUS
##.ACQUISITION SCHEME= undefined
##.AVERAGES= 8
##.DIGITISER RES= 18
##SPECTROMETER/DATA SYSTEM= spect
##.PULSE SEQUENCE= zg30
##.SOLVENT NAME= DMSO
##.SHIFT REFERENCE= (INTERNAL, DMSO, 0, 15.7039)
##AUDIT TRAIL= $$ (NUMBER, WHEN, WHO, WHERE, WHAT)
$$ ##TITLE= Audit trail, XWIN-NMR		Version 3.5
$$ ##JCAMPDX= 5.01
$$ ##ORIGIN= Bruker BioSpin GmbH
$$ ##OWNER= she
$$ F:/spectra/data/she/nmr/H-F/1/audita.txt
$$ ##AUDIT TRAIL=  $$ (NUMBER, WHEN, WHO, WHERE, WHAT)
(   1,<2020-07-10 11:17:12.75 +0400>,<she>,<DPX200>,
      <created by zg, POWCHK disabled, PULCHK disabled
       configuration hash MD5:
       00 E9 B6 7A A2 85 ED C7 34 08 36 98 17 FE 4E 26
       data hash MD5: 16K
       93 43 E4 F1 0A 7C 7A 96 A5 AD E0 98 56 34 DF B6>)
$$ ##END=
$$ 
$$ hash MD5
$$ 64 0B 78 56 10 56 87 2E A8 35 35 5F 63 AB 7F 94
##$RELAX= 
##$RELAX= 
##$RELAX= 
##$RELAX= 
##$RELAX= 
##$RELAX= 
$$ Bruker specific parameters
$$ --------------------------
##$DU= <F:/spectra>
##$EXPNO= 1
##$NAME= <H-F>
##$PROCNO= 1
##$TYPE= <nmr>
##$USER= <she>
##$AMP= (0..31)
100 100 100 100 100 100 100 100 100 100 100 100 100 100 100 100 100 100 
100 100 100 100 100 100 100 100 100 100 100 100 100 100 
##$AQSEQ= 0
##$AQ_mod= 1
##$AUNM= <au_zg>
##$AUTOPOS= <>
##$BF1= 200.13
##$BF2= 200.13
##$BF3= 200.13
##$BF4= 200.13
##$BF5= 200.13
##$BF6= 200.13
##$BF7= 200.13
##$BF8= 200.13
##$BYTORDA= 1
##$CFDGTYP= 0
##$CFRGTYP= 5
##$CHEMSTR= <none>
##$CNST= (0..31)
1 1 145 1 1 1 1 1 1 1 1 1 1 1 1 1 1 1 1 1 1 1 1 1 1 1 1 1 1 1 1 1 
##$CPDPRG= <>
##$CPDPRG1= <>
##$CPDPRG2= <>
##$CPDPRG3= <>
##$CPDPRG4= <mlev>
##$CPDPRG5= <mlev>
##$CPDPRG6= <mlev>
##$CPDPRG7= <mlev>
##$CPDPRG8= <mlev>
##$CPDPRGB= <>
##$CPDPRGT= <>
##$D= (0..31)
0 1.2 0 0 0 0 0 0 0 0.06 0 0.03 0 0 0 0 0.0002 0 0 0 0 0 0 0 0 0 0 0 0 
0 0 0 
##$DATE= 1594365431
##$DBL= (0..7)
120 120 120 120 120 120 120 120 
##$DBP= (0..7)
150 150 150 150 150 150 150 150 
##$DBP07= 0
##$DBPNAM0= <>
##$DBPNAM1= <>
##$DBPNAM2= <>
##$DBPNAM3= <>
##$DBPNAM4= <>
##$DBPNAM5= <>
##$DBPNAM6= <>
##$DBPNAM7= <>
##$DBPOAL= (0..7)
0.5 0.5 0.5 0.5 0.5 0.5 0.5 0.5 
##$DBPOFFS= (0..7)
0 0 0 0 0 0 0 0 
##$DE= 6
##$DECBNUC= <off>
##$DECIM= 24
##$DECNUC= <off>
##$DECSTAT= 4
##$DIGMOD= 1
##$DIGTYP= 9
##$DL= (0..7)
0 120 120 120 120 120 120 120 
##$DP= (0..7)
150 150 150 150 150 150 150 150 
##$DP07= 0
##$DPNAME0= <>
##$DPNAME1= <>
##$DPNAME2= <>
##$DPNAME3= <>
##$DPNAME4= <>
##$DPNAME5= <>
##$DPNAME6= <>
##$DPNAME7= <>
##$DPOAL= (0..7)
0.5 0.5 0.5 0.5 0.5 0.5 0.5 0.5 
##$DPOFFS= (0..7)
0 0 0 0 0 0 0 0 
##$DQDMODE= 0
##$DR= 18
##$DS= 0
##$DSLIST= <SSSSSSSSSSSSSSS>
$$ [...]
##$SUBNAM2= <"">
##$SUBNAM3= <"">
##$SUBNAM4= <"">
##$SUBNAM5= <"">
##$SUBNAM6= <"">
##$SUBNAM7= <"">
##$SUBNAM8= <"">
##$SUBNAM9= <"">
##$SW= 24.9337058887773
##$SWIBOX= (0..15)
0 0 2 0 0 0 0 0 0 0 0 0 0 0 0 0 
##$SW_h= 4990.01996007984
##$TD= 16384
##$TD0= 1
##$TE= 0
##$TE2= 300
##$TE3= 300
##$TEG= 300
##$TL= (0..7)
0 120 120 120 120 120 120 120 
##$TP= (0..7)
150 150 150 150 150 150 150 150 
##$TP07= 0
##$TPNAME0= <>
##$TPNAME1= <>
##$TPNAME2= <>
##$TPNAME3= <>
##$TPNAME4= <>
##$TPNAME5= <>
##$TPNAME6= <>
##$TPNAME7= <>
##$TPOAL= (0..7)
0.5 0.5 0.5 0.5 0.5 0.5 0.5 0.5 
##$TPOFFS= (0..7)
0 0 0 0 0 0 0 0 
##$TUNHIN= 0
##$TUNHOUT= 0
##$TUNXOUT= 0
##$USERA1= <user>
##$USERA2= <user>
##$USERA3= <user>
##$USERA4= <user>
##$USERA5= <user>
##$V9= 5
##$VALIST= <valist>
##$VCLIST= <CCCCCCCCCCCCCCC>
##$VD= 0
##$VDLIST= <DDDDDDDDDDDDDDD>
##$VPLIST= <PPPPPPPPPPPPPPP>
##$VTLIST= <TTTTTTTTTTTTTTT>
##$WBST= 1024
##$WBSW= 4
##$XGAIN= (0..3)
0 0 0 0 
##$XL= 0
##$YL= 0
##$YMAX_a= 374898
##$YMIN_a= -216080
##$ZGOPTNS= <>
##$ZL1= 120
##$ZL2= 120
##$ZL3= 120
##$ZL4= 120
##$ABSF1= 10
##$ABSF2= 0
##$ABSG= 5
##$ABSL= 3
##$ALPHA= 0
##$AQORDER= 0
##$ASSFAC= 0
##$ASSFACI= 0
##$ASSFACX= 0
##$ASSWID= 0
##$AUNMP= <proc_1d>
##$AZFE= 0.1
##$AZFW= 0.1
##$BCFW= 1
##$BC_mod= 2
##$BYTORDP= 1
##$COROFFS= 0
##$CY= 11.3945322036743
##$DATMOD= 1
##$DC= 2
##$DFILT= <>
##$DTYPP= 0
##$F1P= 16.9975609425685
##$F2P= -3.02152046262296
##$FCOR= 0.5
##$FTSIZE= 0
##$FT_mod= 4
##$GAMMA= 1
##$GB= 0.15
##$INTBC= 1
##$INTSCL= 1
##$ISEN= 128
##$LB= 0.24
##$LEV0= 0
##$LPBIN= 0
##$MAXI= 10000
##$MC2= 0
##$MEAN= 0
##$ME_mod= 0
##$MI= 1.114404
##$NCOEF= 0
##$NC_proc= 0
##$NLEV= 6
##$NOISF1= 3.799351
##$NOISF2= 2.8
##$NSP= 1
##$NTH_PI= 0
##$NZP= 0
##$OFFSET= 15.70392
##$PC= 1
##$PHC0= -9792.278
##$PHC1= 8.400923
##$PH_mod= 1
##$PKNL= yes
##$PPARMOD= 0
##$PSCAL= 0
##$PSIGN= 0
##$REVERSE= no
##$SF= 200.130013532006
##$SI= 16384
##$SIGF1= 3
##$SIGF2= 2
##$SINO= 400
##$SIOLD= 16384
##$SREGLST= <1H.CDCl3>
##$SSB= 0
##$STSI= 0
##$STSR= 0
##$SW_p= 3612.71676300578
##$SYMM= 0
##$S_DEV= 0
##$TDeff= 0
##$TDoff= 0
##$TI= <>
##$TILT= no
##$TM1= 0
##$TM2= 0
##$TOPLEV= 0
##$USERP1= <user>
##$USERP2= <user>
##$USERP3= <user>
##$USERP4= <user>
##$USERP5= <user>
##$WDW= 1
##$XDIM= 8192
##$YMAX_p= 0
##$YMIN_p= 0
$$ End of Bruker specific parameters
$$ ---------------------------------
##NTUPLES= NMR FID
##VAR_NAME=  TIME,          FID/REAL,        FID/IMAG
##SYMBOL=    X,             R,               I
##VAR_TYPE=  INDEPENDENT,   DEPENDENT,       DEPENDENT
##VAR_FORM=  AFFN,          ASDF,            ASDF
##VAR_DIM=   8192,          8192,            8192
##UNITS=     SECONDS,       ARBITRARY UNITS, ARBITRARY UNITS
##FACTOR=    0.0002004,     1,               1
##FIRST=     0,             0,               0
##LAST=      1.6414764,     0,               0
##MIN=       0,             -216080,         0
##MAX=       1.6414764,     374898,          0
$$ Real data points
##PAGE= N=1
##DATA TABLE= (X++(R..R)), XYDATA
0@%%%%%%%Qj6J6j6J6k4L2l6M4n6O5p3Q8j05J22j43J67j92K21k54K88l27L72m18
31b21M73n32N94o64P40q24R18j021J130j252J388j535J700j884K088k317K575
48A356k869L208l604M071m635N331o212P377q995J1410j5461K3935p3288J52752
62I4376J39241k18249k06290k5158J35242Q5157J3204l6664l7687m6314N870O4955
74c2317N5230n3952r1891N949J19153P4361n6851j05802k5131N0659M9956K4518
86A3882L1552P727o8166r4983P297J19544R2456l5293r1169k9278L6141J9736
98I446j2147J5843N2782O980p2058n7650M3118Q7095J0301p6318n5608L8737Q0302
111G0823K1271n7586p1123k3728M0865Q3625O0243m3201j30672q0432P2049J49166
$$ y = [0, 0, 0, 0, 0, 0, 0, 0, 8, -8, 8, -8, 8, -16, 16, -20, 24, -32, 33, -40, 48, -57, 65, -78, 89, -103, 118, -136, 152, -175, 197, -221, 252, -280, 314, -350, 390, -434, 484, -537, 593, -659, 729, -806, 894, -990, 1098, -1219, 1356, -1513, 1695, -1909, 2162, -2473, 2858, -3354, 4023, -4972, 6438, -9023, 14912, -58376, 94376, 233617, 15368, -190922, -216080, -80838, 4319, 17523, -19141, -56828, -103142, -97272, -32317, 22913, -31039, -122930, -116981, 2172, 76533, 19682, -86120, -111251, -60592, -10636, 13882, 45434, 53161, -15005, -109988, -102691, 16853, 109309, 74016, -17153, -46431, -10290, 9446, -2701, 13142, 65924, 72904, 846, -56804, -13686, 73409, 83710, 7392, -48216, -9479, 70823, 92094, 34508, -36615, -60343, -19478, 64147, 124390, 81189, -49483, -129915, -57866, 91300]
123I1300N3152r9306j27952j1058R4076O9454k1022n4768k3963L264J4077L0498
135A7752L0149k0112p1101l8791O0435R7308J1390r2301q0409J9786P7738M5627
147E7471j4420m0393l3098p592K2805L7254J5481k7736l6780N740L8664J0148
159B7544l2812j9543K5599K7247j7538l2798J0826M5678Q228n5526m5538L3435
171b5198P5003K3382n2245o3634j2058M1733N2142J9359k6745m9964l0742K1489
183b7478N7062L0816l3916n8891j1572M5178M3849m920m2227l4328K242L4672
195D87L9485J2517l6353o2941k5026N2600P9507J3663p0843p1963O424O7553M4641
208D9751k3571n0796j4302K6009K4426j289j7780j4071J304J5860J4343o20j5623
$$ y = [91300, 144452, 45146, -82806, -93864, 212, 69666, 48644, -6124, -30087, -26823, -12746, 17752, 47901, 27789, -43312, -82103, -21668, 75640, 87030, -5271, -85680, -65894, 11844, 57471, 43051, 2658, -30440, -38032, -15227, 22027, 37508, 9772, -27008, -21268, 17396, 27544, -5268, -24811, 788, 28035, 10497, -22301, -11475, 34203, 42431, -13095, -58633, -25198, 49805, 73187, 20942, -42692, -54750, -13017, 39125, 58484, 31739, -18225, -48967, -27478, 29584, 60400, 26484, -32407, -43979, 1199, 45048, 40128, -2099, -36427, -34185, 487, 39972, 52489, 16136, -46805, -71831, -19231, 60276, 73939, 3096, -68867, -62443, 5110, 49751, 26180, -24616, -38918, -12909, 11517, 10228, -7552, -21623, -20319, -4459, 9884, 9264, -6359]
221f359j4103K495J3122O956k862K808R022n790k5492j3087K3339L8437R657l0903
235G240l5511j691K7631K2999J265j0033j2680j2439p90J7969K1576l384k8620
248f468k0357J6239L7353J2438l1440m0973l828L7386M0722L643m1150m7574m262
261d8271M5345M8329q47n0109m3963J1051M9945K6211k4945l7918n801K5571K1334
274A5932m022j8803j0967L957J0058R063N549n031j4674r431O915J6252Q905l526
288A0177j0715p858l07N506Q152O061q12q845o531J056M999L547L279K078m707
303E080j0787m222J1663J7410n6k3551j9969J2875L3763J3155k6746l5812m324
316c1521L3629L3104l640l5762k7796Q111L2088K3278r312l2347j9206J3848K9299
$$ y = [-6359, -20462, -17967, -4845, 2111, -751, 2057, 11079, 5289, -20203, -33290, -9951, 28486, 38143, 7240, -28271, -29962, -2331, 20668, 21933, 11900, -780, -13219, -14009, 3960, 25536, 22152, -6468, -26825, -10586, 26767, 39205, 7765, -33208, -37036, 350, 41072, 44715, 3565, -44009, -48271, -2926, 45403, 44556, -5553, -49516, -38465, 11480, 37691, 12746, -25172, -30973, -5402, 15932, 11910, -6893, -17860, -13903, -3845, 5218, 10767, 5736, -8938, -18369, -11454, 4798, 13703, 10177, -538, -8396, -8703, -3197, 4955, 11016, 10204, 1359, -5172, -4116, 883, 4430, 7709, 9787, 5080, -5707, -9929, 1734, 19144, 19088, -4463, -24432, -11557, 22206, 35361, 8615, -27197, -31521, 2108, 35212, 31572, -4190, -31986, -23875, 8213, 31491, 22179, -10168, -29374, -15526, 13773]
329A3773J1579j6678k4772n409J6643J8393J805j2532j3075m449P095J3951Q999
342A5323o199j6271r513P736J7065Q095j0300j5524q02J1510P811m156p986j038
356d249N451M024l423n478J285O545K377n758p804j84J1694J0354o184j8319q972
371a8641J4152K2140M253j9898k2588J994K3315J7479o663k0673j2348P485J7305
384G312R718p488j5405p460O244J3664Q643n456j5883r248P247J6413R882p479
398A0704j7699j0128Q503J8988R062j0044j8443p111J2252J8171J884j5530j3035
411a2426M379J4531O352q141j1463l17R601N250m478o517P8M846L078m083n489
426d799O90Q074M206n850r658k626Q106J0725J041j1116j0868J188J1112Q775
$$ y = [13773, 25352, 8674, -16098, -21507, -4864, 13529, 15334, 2802, -10273, -14722, -7627, 6324, 15323, 9124, -7147, -16660, -8924, 8141, 16236, 5936, -9588, -10390, 1120, 8931, 4775, -3211, -4249, 1202, 5226, 1803, -3675, -2390, 4155, 6532, 774, -7030, -7214, 4480, 14834, 8650, -9669, -18641, -4489, 17651, 21904, 2006, -20582, -18588, 4727, 22206, 15543, -5130, -17478, -9993, 7312, 17030, 9542, -5863, -13323, -7079, 6585, 15228, 9772, -6111, -15359, -8112, 8301, 18183, 10704, -6995, -17123, -8620, 10368, 19430, 9386, -9057, -16168, -3916, 14255, 16139, 609, -12426, -8047, 6484, 12836, 4695, -6768, -7085, 2516, 7766, 3288, -3229, -3151, 1695, 4773, 690, -4799, -4109, 3965, 8171, 2321, -7337, -9963, -1857, 8868, 9909, -1207, -12075, -10887, 225, 9000]
440I000j907j0575q237J797J0036P702j871r564r367J076J2569J1096m047j5478
454g770j0224O861J7289R474r622j7923o431J2471J7014L425j3308j4772O27J4434
468A545J0672m116j2636o227O028J0775K719p177p501P88O237K784j867k922m11
483a309J751P3j708q29K354J392m95k624k004K38K739K758n94l026l253q44K485
500b896M970J270m260n919j500M738P970J614q055r969J237J1291R284k766j3252
515f243r127O630J5425O590r509j4393l031J1206J3279O24j1937r714K364J1049
529C213P137k886r664n651M275R151K722l779o342k288L438M936J809l370l265
544e64j367J733K848J936k566l055M02K493J325j680j939K41K484J944k894m232
$$ y = [9000, 7093, -3482, -11719, -9922, 114, 7816, 5945, -3619, -12986, -11910, 659, 11755, 7708, -7770, -17994, -11133, 6156, 15630, 6008, -11915, -18346, -5875, 11139, 14564, 1256, -13516, -12889, 1545, 12217, 8101, -4535, -10762, -4734, 6041, 8760, 1583, -5918, -5130, 1107, 3891, 2024, -898, -1309, 442, 515, -1193, -2022, 332, 1724, 1229, -1395, -3399, -3161, -422, 2336, 1742, -1284, -4537, -5381, -2896, 2074, 3344, -916, -6835, -8335, -3597, 4373, 5987, -2068, -12037, -10800, 491, 9775, 7009, -6243, -15370, -8740, 6685, 13275, 3766, -10627, -13658, -2452, 10827, 11451, -486, -10200, -7836, 3213, 10350, 7464, -2200, -7851, -3576, 5575, 8297, 4518, -1824, -4112, -674, 4262, 6071, 2701, -564, -1931, -198, 2650, 4586, 2020, -1035, -633, 1860, 3185, 1505, -434, -193, 2291, 4235, 1341, -2891]
560b891R99M526L120k752o294k471N272P725K92q186p329J696R592P107l901j1283
576d778n585P075J0848K567p952r698j280Q716P963q72q048n972J176P135N370
591F665j965p186m905J794O704M725k562o561l894K407O176L020l063n378k407
606f430L116N346P77l986l499M94L669K375k055l801j22L357K083j768l113k65
622c822L273K190j750m449q12M112M086r59n081m257J976O018L538k893o502k538
638g870L502O076K408m469o016j096M965M590J066m386n518l80N070N556n2n150
654a704n431J77O240O020j148o959m261K483O847L671l164o099j847M361N064
669D250O49l783l465N03M086K527j340m061j079K285K460L66k487j851J398J819
$$ y = [-2891, -1892, 2634, 5754, 3002, -3292, -5763, -491, 7234, 7526, -660, -7989, -6293, 3299, 10406, 6505, -4778, -10363, -3288, 7560, 10127, 2175, -7523, -8803, -87, 7876, 7004, -1044, -7016, -5840, 1295, 6665, 4700, -2486, -7391, -5597, 1107, 5832, 3270, -3291, -7185, -4778, 1398, 4418, 1355, -4023, -6430, -3314, 2032, 2809, -1177, -4676, -4182, -513, 1862, -193, -3994, -4116, -759, 1324, -444, -3557, -3822, -549, 1641, -109, -4558, -5370, -1258, 2828, 1869, -3212, -7469, -5493, 525, 4063, 1170, -5332, -7870, -4368, 1708, 4116, -353, -6369, -7465, -2500, 2090, 3156, -1230, -6748, -7128, -2058, 3498, 3446, -1704, -7135, -6958, -718, 5302, 4154, -2805, -7066, -4583, 2264, 5935, 2771, -3328, -5175, -814, 4250, 4899, 1116, -2349, -1846, 2240, 4767, 3427, -634, -1713, 572, 3032, 3398, 911, -940, 458, 2277]
685B277p12j817j092J357J751M35k271k542M66K208K334p22k677l212R22M033
701G38K363j690m608k099K233N168J796l838n419o11M494N166N22n452n235Q70
717e602O399M739j732o183l717L084O358K708m500m802o98M351L879l36l734k766
733b552R09L594J980j373k487j524O08K690O40j532j683L26P70p1R5j305j42J315
751B58K44j144q84j42R13P45L35j359j780K56J879J518p86k812j705J806L640
768I82N80k717l470m99L096L821L4l879l556Q63M128L055p28m293k565J570M358
785G80J745k048m169q59K911L987M0k766k879j46L099K705J43k778k969Q82K764
802D42J828p82k413j027J397J854l6j372o61L51J229R97j378j337J70J517Q68
$$ y = [2277, 1565, -252, -1344, 13, 1764, 2199, -72, -2614, -2148, 60, 2394, 1672, -1005, -4217, -3295, 738, 3101, 1411, -3197, -5296, -3063, 2105, 3901, 63, -5356, -5967, -1473, 3693, 4215, -1237, -6472, -5602, 797, 5536, 3804, -2379, -6096, -3012, 3346, 6054, 1554, -3248, -3946, 405, 4284, 3948, 214, -2552, -1643, 1951, 3931, 2558, 71, -1453, -845, 1845, 2485, 953, -730, -404, 366, 295, 390, -915, -1057, 258, 502, -642, -1526, -1668, -755, -10, 325, -1034, -2814, -2558, -679, 839, 53, -2759, -4464, -2658, 982, 1562, -1155, -4625, -5124, -2028, 1793, 1827, -2052, -5608, -4745, -617, 2438, 1710, -2583, -5148, -3578, 780, 2525, 477, -3692, -4551, -1640, 2347, 2387, -379, -3258, -3404, -305, 2400, 2543, -235, -3204, -2322, 442, 2270, 1488, -925, -1952, -555, 1299, 1263, -109, -770, -419, 810, 1807, 429, -908, -738, 779, 1647]
819A647q73j026n22J300J462l35k031j253J470K584Q03j948l298l53L112K736
835C475q50k907k018P75K845J707j074k920j552J765K924R36j799k798n62K286
851B33K562m8k116k542n8K443K405o36j852j865L42J844J629o6k308j133J028
868a38J445K42r54r62k01J188O36j11j158K47M13R8J06k85q5J52M38n5r46j77
888a07K69R18M94j055j640j09J751Q34l82j213j177P8J624J232n55j777j296O04
906a507K193J023q54k642o26J711K064P07j746k433m50K370J783k01j299j786
922a693N6K190J268q44j820r26J119J461Q21j074j648k4J060J276k20q29r57L71
940d13O64L87n54l28j09M19M74o46p09q3J095M83p09j011L4M62J115k4j067q54
$$ y = [1647, 774, -252, -774, 526, 1988, 1653, -378, -1631, -161, 2423, 3226, 1278, -2020, -2373, 739, 3475, 2625, -282, -2300, -1525, 1320, 3027, 1953, -967, -2519, -754, 2170, 3106, 1307, -1491, -2053, 233, 2795, 2747, 631, -1911, -1969, 474, 2879, 2243, 391, -1474, -1132, 712, 2341, 2275, -33, -1166, -138, 1307, 1549, 595, -367, -568, 620, 1256, 1145, -13, 234, 647, 745, 851, 566, 481, 633, 1071, 1016, 70, -107, 162, 1080, 1574, 519, -1121, -1230, 521, 1355, 973, -240, -1417, -1339, 285, 1517, 962, -815, -2111, -1507, 686, 1709, 855, -1787, -2413, -702, 1362, 2069, 323, -2110, -2560, -190, 1593, 1392, 93, -1693, -1637, 553, 1821, 977, -843, -1769, -650, 811, 1632, 558, -1090, -1114, -54, 1222, 1002, 173, -784, -413, 251, 638, 84, -244, -353, 66, 540, -106, -815, -898, 197, 680, -29, -1040, -1006, -544, 571, 547, -520, -1374]
960a374K29J149J027n70j498q76Q72J780N44j038k000n98J854K209j74j660j795
977a919K76J671J548n67j442j441J033J578O39p64j486m73R59J399M24j318j336
994a219J3J146Q86j18p30p25K06O00L79o7n52m4O18p8m26n12J31O80M33m32m64
1015b75p06P35P23L2p99p00K72J156N72p58j255k92J180R82K67r73j128l75J616
1034B74J041j85j273j043R9J371Q89n32j138n29L56J294P71j158j186l45J141
1051a53P97L53q30j326q0J304J030l68p39j016N74Q25K92k19r90n5L95L83L12
1070D89o27k27j07O25j4k08n52O23N08r1m43n21m8R31Q88p47q62k99L83J014N42
1091A257j217p23k7J034P56J72r90j334M52J828L52p37r07q62N44J683L29j390
$$ y = [-1374, -1145, 4, 1031, 461, -1037, -1913, -1041, 739, 1283, 245, -1755, -2353, -499, 1710, 1536, -124, -1919, -1643, 28, 1576, 1009, -433, -1874, -841, 737, 1376, 612, -874, -1347, -388, 1011, 1435, 117, -1219, -1206, -60, 826, 708, -22, -747, -541, 59, 438, 371, -181, -225, 393, 315, -111, -623, -492, 188, 621, 189, -275, -981, -246, 477, 509, -290, -990, -718, 438, 1010, 252, -1003, -1295, -115, 867, 1134, 161, -967, -1342, 274, 1315, 1130, -143, -1186, -1087, 284, 1173, 641, -497, -1026, -670, 624, 1395, 237, -949, -1294, -153, 644, 997, 167, -1159, -1239, 65, 1095, 727, -12, -1028, -454, 371, 663, 444, -546, -601, -206, 177, 489, -138, -365, -472, 153, 139, -69, -621, 2, 510, 419, -24, -545, -593, 338, 1226, 479, -383, -682, -299, 715, 1257, 40, -683, -710, 324, 1080, 1252, 262, -1072, -620, 1208, 1560, 823, -84, -946, -402, 1281, 1610, 220]
1109B20q21j5O63J165j62q04r37K04J223M42l66o95p83M00R21On49l64n1P7M65
1130B39J86l04p93J27O21l51N0k62K62K32M20n27n54K25J74N57k38p99O2O21K88
1151B36J85p72k23K26L38P95j36q34q97M33J190M77o99q73m88N20J186J59k62
1170E61j163k82O23Q79L98j051r90N70O52J009l65j060r14Q25Q19N76m56j178
1188e47l98O17Q30N9o20p14K34K13P49k04o14l11P95L74Qo21R1m91Q48j74o51
1209e27m2P6O73K95k72o75o7N77N15j52l93o30L26M33R60o95o50n80N69R72J2
1230G25j82j420j76J083R21j91n21p98l20J345Q00l15j114p13N36J063M56q73
1248C06j187L72M77O92k16l74o80J38P26L42j37q16J73L05k17M87l00pm65M35
$$ y = [220, -601, -616, 47, 1212, 1050, 246, -691, -487, 736, 1178, 812, 117, -666, -266, 655, 661, 112, -252, -303, -226, 239, 425, 121, -672, -545, 76, -275, -225, -487, -225, 7, 427, -100, -654, -429, -255, 302, 64, -735, -673, -52, 236, 421, -351, -574, -348, -10, 785, 649, -185, -1082, -649, 541, 1018, 319, -554, -1042, -522, 664, 823, 561, -602, -884, -261, 618, 1016, -35, -1025, -455, 197, 1206, 841, -219, -1133, -308, 511, 1087, 631, -547, -945, -328, 502, 561, -59, -773, -539, -326, 423, 219, -395, -706, 89, 463, 471, -150, -59, -550, 298, 124, -527, -569, -493, 180, 475, 203, -472, -539, 38, 553, 401, 8, -622, -296, 137, 1097, 402, -248, -828, -259, 713, 725, 543, -877, -1053, 30, 951, 760, 239, -559, -879, 466, 1266, 951, -163, -876, -340, 723, 1179, 306, -881, -509, -32, 660, 444, 70, -610, -472, 254, 596, 459, -357, -184, 121, -96, 391, 91, 84, -381, 54]
1268E4K17k92P4k87M63J82r0m71J26j5K32J41o05Q2k34J083j34j14m38m84K40
1289b70Q73N31j054o48J15M50J064k38n16n27J04P58NK78q00l98J19O23O29n02
1309E96j008J57M07R09k54l90n43j79N53M90m50j33n54P8O47J03m68l23K56J74
1329F8M23k03n71M0L4J19j89J10M2l77N98q9l46k86K95j39M90K12p80j58L41M18
1351E2L95m45k18J8M36J78Q1o68m11M77K87L07J29p75n93N80O17L32m34m61n32
1372f48K09J054j40k85o22L36J25P69l67m25n48N26M39q0j28o85J36M3N97j05
1392B01m39o9J29M39m4k78l00q9R5N37j14k61k02J15O6K23j20o05P25jL74n83
1414b01j51m7M18L48k91j13l42J72L82J16J03p19j81J00Q38J30k64m88k32L08
$$ y = [54, 271, -21, 53, -234, 229, 411, 321, -150, -24, -39, 193, 334, -271, -189, -423, 660, 526, 412, -26, -510, -270, 603, 1134, 80, -568, -453, -3, 1061, 823, 307, -220, -116, 642, 647, 925, 125, -273, -154, 469, 1098, 596, -412, -255, 152, 1061, 807, 417, -126, -305, 248, 738, 288, 155, -399, -321, 326, 429, -39, -362, -106, 68, 491, 288, -283, -243, -209, -90, -279, -169, -127, -504, 94, 5, -341, -627, -332, -471, 19, 231, -549, -707, -366, 52, 447, 2, -216, -198, 238, 416, 497, -171, -582, -105, 182, 489, 618, -157, -750, -170, 447, 779, 345, -116, -648, -439, 615, 475, 190, -432, -96, 29, 798, 431, 6, -542, -16, 423, 343, 215, -470, -334, -291, 306, 201, -238, -307, -178, 261, 217, -61, -361, -450, -355, 182, 68, -193, -395, -280, -214, 9, -111, -716, 9, 8, 382, -201, -352, -399, 19, 367, 76, -37, -379, -207, 175, 291, 394, -325, -506, -406, 432, 562, 298, -190, -422, -114]
1434a14L65L79l71n33K03L98N16k44p88j33J69P88N0j61l20o7J8Q8L48m95k85
1455a89k06M07N57l13j9j83j63N01k02j39P3j63P6M30j54l65l8M9J79J27o31J48
1477b18J87J31K56l87n08l64R91L03Q7q51J56m21Q06K85l98k92j68K78M34L38
1497F45q15k76K46M11K91l13n23k37N17J5N07n57o2j85L17M68m8l40k44L11M8
1518A76J82l78Pn00M70L15k07p0l11M39l09J12J2j94l0L27m9L43m70r9K56J42
1540A64m5l17K4J45P3Q7p7l03nk6J84L08j13k57m33L38M91L18n72n22K46J17N03
1563C28Nn28l01P5P89NQ0q44M97n51P94J18n88J04m62N77K45P8o18Kk02M43J7
1586F3N1l83N7K53J72q4j85l10K43J48J43k5n32J43K30N65m69j28j49R5L33k50
$$ y = [-114, 251, 630, 259, -274, -71, 327, 843, 599, -189, -322, -153, 635, 685, 524, 204, 137, 155, 243, 591, 96, -189, -395, 12, 569, 256, 237, 54, -109, 392, 190, 51, 124, -39, 37, 467, 313, -52, -90, -41, 138, 265, -366, -218, -31, 100, 356, -31, -539, -903, 88, 391, 478, -373, -217, -638, 168, 453, 55, -237, -405, -127, 307, 645, -170, -446, -200, 211, 502, 189, -334, -571, -54, -39, 468, -89, -151, -336, -19, 449, 401, 61, -183, 128, 176, 358, -20, -13, -513, -43, 272, 65, -5, -316, 123, -186, -74, -62, -256, -286, 41, -8, 335, -135, -234, 22, 164, 119, -198, -174, -29, 44, 131, 54, -249, -254, -280, -96, 212, 99, -158, -591, -253, 238, 556, -16, -538, -292, -175, 328, 333, -195, -496, -421, 368, 373, 453, -391, 106, -445, 349, 467, -121, -17, -479, 98, 343, 421, -197, -195, -397, 46, 63, 114, -269, -212, 41, 213, 129, -56, -366, -123, 25, 168, 143, -389, -246, -16, 549, 80, -48, -197, -102, 231, -19]
1608a9p6k13k0O38R9j17l90o1J61L90K0l62l75J85K88L73l03n80j45O05P1K67
1630D36l46m82qLN12J99l68l85J82K92J81J43l00m83L40R1K97j99k33j02M7L50
1652A67J07j97k01j82O96j70k10j17k66J96M90k72j47j06L97O4j0j85n4j95J98
1673CM15j91l93R7j59L90J54j08o80K97OO81k73l47j11l11O27K74k4n40j23J89
1695a27K31M8qj94m16M43j6L13m20l14N60Q3K0J4m42m3J99q0L52j99j16k41M51
1718I8k0j47j29K1L5K73J27k73j38j42J16N71m90j7l52O03k6J70k04n40M0N11
1740H7J66J19p21J88N4K80J06n16j04Q1J18M14j64l58N9K53K00mo4j05j55K5K11
1763A70o5k51J59k61M23n5J29k60l89N00k3j0Lk73j48M04l6K36Ol38j20l1R6P3
$$ y = [-19, -95, -308, -328, 310, 409, 292, -98, -159, 2, 392, 412, 50, -325, -140, 148, 521, 218, -362, -507, 98, 169, 436, 90, -392, -400, -397, 115, 314, -54, -439, -257, 35, 216, 359, 59, -424, -84, 7, 304, 105, -128, -230, -183, 167, 274, 77, -124, -306, 390, 220, 10, -107, -373, -177, 313, 41, -106, -212, 185, 249, 239, 54, 0, -195, 3, 418, 227, -166, -69, -228, 162, 316, 208, -472, -175, -169, 512, 239, -108, -219, -530, 97, 371, 347, -193, -316, -127, 104, 152, 144, -50, -466, -23, -39, 274, -146, -460, 100, 183, 203, 217, -225, -268, -69, -149, 203, 4, -112, -353, 98, 78, -69, -198, -177, -142, 131, 258, -15, -153, -295, -179, 392, -98, -115, -467, 136, 110, 280, 76, -464, -424, 87, 253, 372, -349, -161, -107, 173, 279, -237, -341, -260, -142, 272, 108, -250, -191, 62, 262, 258, 194, 89, -66, -41, 170, 105, -146, 13, -248, 175, 120, 249, -11, -400, 100, 77, 67, 70, -203, -351, 53, 17, 253, 259, -79, -199, -230, -134, -61]
1787f1q9m4L85j80K70k77l12K42M13j43p6l10O1J47L75m43J1k39M05R1M0r7j22
1810D7m25M11L31k90m17K30j81K71J84j30j37j31K55l4J67K0m27m7L32M7K66l22
1832B0j25m20N75M12m19j51p4K37K51j32o7k22l53N10L37j93l90m8K39J33j30
1853a0m5j75k1M29mk21l13KJ44K84Q8Pk61J24N8O7j6L3p21L91M35l76j62o9J2
1878c20K33J64L8Q9m15K36J92j04j12km24N08J54m9l21j90J72J84K99r9l02l95
1900d64L56K67l0j60l90L27L3L48r6l75r1J6L16L41k79Q2l19J90P2j4n90M63k27
1923b24M20L8j34j89m01N12m3K14j87J3j3J67l47L81l01n8O1L51l41j46k5L17
1945F5K09l88K33l52j9J84j5L63k34m5j17L28j35L54o96m6J24O39q3l16l18J18
$$ y = [-61, -150, -194, 191, 11, 281, 4, -308, -66, 347, 204, 128, -182, -121, 26, 401, -42, -31, -270, 135, 226, 266, 169, 47, -378, 33, 364, 74, -343, -113, -294, -23, 161, 31, -106, -237, 18, -16, 151, 171, -256, -303, 29, 76, 342, 20, -105, -525, 50, 462, 43, -108, -182, 55, 306, 174, 107, -115, -468, 42, 379, 186, -204, -252, -13, 120, -10, -55, -230, -251, 178, 174, -47, -360, -358, -214, 70, 158, 165, -96, 28, 86, 153, 137, 170, -551, -160, 275, -101, -263, -332, -320, -87, 77, 115, 204, -211, 25, 217, 113, 1, -1, -425, 83, 237, 188, -133, -323, -151, 33, 332, 233, -69, -464, -108, 159, 129, -31, -421, -94, -61, 287, 191, -184, -275, -259, 57, 398, 119, 201, -118, 72, 144, 130, -460, 3, -224, 196, 234, 100, -89, -490, 22, -21, 193, 6, 19, 6, 173, -174, 207, -94, -152, -91, 260, -81, -227, -252, 65, 274, -114, 119, -233, -252, -68, -83, 280, 46, 1, -116, 212, 77, 431, -265, -311, -187, 452, 369, 53, -265, -147]
1967a47L12J34N0m58k22K18J51L12m51j12o6J89M1L41j66k65N48j91J91l76j04
1988g1j74m7N83k46Nm60J77K29R4J00l17J21r8m3K59j69k18j38K72L17k27j12
2010a63J27J53j13jJ29l33M38o9j15k1J78n98K18M48O9k63m0m34J47L87q2J89
2032B51n87K53K85M79o26m8l21Q1N08k03j01o7j46J44O4N4m3r7J54j96K31n8k62
2055b51l4J24J16K59l88L69r5K2K30l12l91M76k1Q4j94m8l16L06M17j78l40Q6
2077g9K4NN28o66P8K5K4L33M8q2k99o5r6L19q4N0l20Q7K02K41l55J79K7l66O26
2102C84k43N3k68q9J52j51K59l8k63J53P7K45j30j93j01J66J7j13J30j39K23l60
2124b29M38k72J17q6L07k03p8J11n33K30J88J4K69k72R3L9k77O01m75l9m81O17
$$ y = [-147, 165, 299, 349, -109, -331, -113, 38, 350, -101, -213, -279, -90, -49, 292, 126, -139, 409, 218, 409, 33, -71, -245, -292, 291, 45, 50, -410, -233, -4, 90, 190, -127, -6, -104, -147, 112, -57, -275, -413, -141, 176, -51, -163, -36, 117, 4, 3, 132, -201, 237, 168, 53, 32, 210, -388, -170, 278, 347, 84, 44, -390, -243, 144, 62, 251, -336, -83, 202, 681, 55, 7, -314, -233, 275, 72, -29, -96, -242, -98, -34, 20, -23, -120, 34, -162, 69, 11, -251, -285, -161, -45, 214, -174, 195, 100, 122, 352, 40, -351, 125, 104, 188, -6, -54, -370, -64, 353, 175, -165, -79, -55, -50, 478, -188, -110, -85, -61, 272, 320, 238, -61, -126, -222, 97, 13, 63, -257, -170, 32, 273, -82, 97, 124, -242, 384, 141, 194, -74, -163, -11, -162, 97, 59, -204, -51, 26, 271, 141, -52, -153, 13, 30, -83, 47, -92, 131, -229, 209, -63, 54, -32, 275, 72, -6, 105, -428, -198, -10, 4, 273, 1, 94, 133, -144, 457, -18, -57, -538, 79]
2146G9K91k43l41j08L69J34k30L45m69r4M75k6O5j14p8l53N25k49J54j65k90N51
2168B28k63J64M4o24M71K35l55j01J58j25l57L41K20n5J22J7j68K8L42j80k12
2189g0J47j1m31K09L9K17K51j38j72j14j73K48K2J97m00J95j41J65K6p6l88Q3
2211c15M84j8n3Q8k48j94K91Q5K27m79L50o73M26M8L0j32m6J04j0J1J4m18J79
2234b49N42j74j08J22p7O9o7lj75m7J77j18K87k45l2j2m4K90R1j22J8j56m4J5
2258f2k15J82K88k05K49j7m41L2R2J17K20j77k69K6K57J15O9l84j53K25N1J01
2280A01m2J74n78N6K05J28k35mj3M12J1q5J7k31o7k5L08j9p7k08K64ml08J75j00
2305a45k01M70j65K55j30j02k0l8P3R5q4l04M22k13R6p2K38l53K61M2M9j66qj32
$$ y = [79, 370, 127, -214, -322, 47, 181, -49, 296, -173, -267, 208, 182, 247, 133, 55, -298, 227, -22, 132, -33, -323, 228, -35, 129, 173, -451, 20, 255, -100, -201, -43, -168, -525, -184, 36, -19, 103, 120, -48, -20, 322, 142, -70, 77, 66, -365, -156, -117, 100, 351, 213, 41, -73, -246, 2, 24, 221, -179, 16, -125, 40, 66, -10, -398, -315, 169, 151, 98, 186, -62, -256, 35, 120, 347, -132, 218, -455, -29, 19, 49, -83, -129, -25, -35, -24, -10, -428, -249, 293, 119, 11, 133, 56, 125, 58, 55, -120, -167, 10, -108, 179, -66, -98, -110, -154, 136, 227, 105, 123, -33, -77, -62, -277, -95, 193, -12, 237, 220, -221, -189, -97, 20, 240, 63, -206, -180, 77, 192, 261, -123, -276, -51, 0, 101, 59, 233, -345, -289, -84, 44, -191, -195, -208, 204, 215, 130, 147, -84, -151, -176, 132, 113, 36, -172, 92, 88, -220, -45, -145, -346, 124, -41, 214, 84, -18, -38, -76, -3, 92, 8, -296, 126, -87, 9, -63, 175, -178, 83, 125, 174, 8, 0, -132]
2329a32K02j47K01j38o4O8J69r5kk33J29Q4K4j31N1j96L84J55m22K5j38j57L71
2352HK36mk18j55Q2j29L48l67Q8Q7m1J70K85m65q3K85k33J93J55k31o03N21K89
2375B18l44J74k02K07kq8KO6j05Q7R5j3j39l0J39l4K4j06J12J95l47L91l6j51
2399A13J75o60K43L7J65K5J2k64L42k60J73j69Q7N9K14j95l19K17l05L48J41k17
2421c8j47j00R7L66j2j01k28mK99j30J16k44k39M88n42M62j00j8J69j5r2k60L9
2444b34K77k23N31m01j83L34l17J62J45kRj83R9P3j29L47k27k96K19L78o51J15
2466a57Q6R5k22L11j05k00N5K95l43J17l9L50k85J12L69l58k60L03q0J48j90q7
2488h5K06n16N11j86L18k71J46k32L40j27p9K9k40L79l72M41k19oj45L8J95Mk00
$$ y = [-132, 70, -77, 124, -14, -78, -10, 159, 64, 62, -171, -42, 42, 66, -65, -14, -210, 174, 329, -93, -68, -206, -363, 8, 244, 240, 22, -133, -51, -180, 168, -199, -111, -24, -65, 105, 390, -75, -158, 127, -106, 87, 242, 11, -592, -71, 218, -126, 48, -154, 53, 51, -37, -35, 31, -74, 13, 108, 95, -44, -74, 65, 31, 55, -51, 61, 256, -91, 300, 264, 113, 288, -372, -129, -92, 73, 98, 110, -154, 188, -72, 101, -68, 19, 78, 292, 97, -222, -5, -310, 38, 179, -38, -185, -285, -188, 178, 166, 65, -163, -167, 132, 2, 118, -126, -365, 123, -419, 43, -57, -75, 94, 79, -13, -273, -234, 43, -180, 351, -50, -233, 101, -216, -54, 91, 89, 98, -85, 14, 87, -42, 305, 78, -218, 1, 379, -272, -157, -71, 24, -198, 113, 8, -192, -137, 158, -185, -68, -107, 243, -42, 70, 439, 81, -179, 124, 44, 192, 2, -85, 121, -395, 116, -70, 248, -23, 123, -109, 231, 104, 25, 54, -186, 193, -179, 262, 43, 37, -108, -70, 125, 129, -71]
2511g1n0J38L08k96K3m16K67K54m1j8j81j76K88n3J87k50J19L0p2O3j00J19k26
2534a54J25K87j05o3j9j20J43k42K52K8L60m55P9k00J12o4J02p1m3J69O9j45j63
2557a18N6L73j99J89k78R1J10k57m1J96l19j33O22m13J71k57L77pk38j3l01R8
2579b91L55j00K3l77L33j53K91j82L8K65n7l16L21k90r1K12q8J99j76J16NJ86
2601B23k85K41k27j16J51K05j34j77L25m4l88n9L43K36l31rj93L08n0J64m60K40
2623c7R5m5R0j59k67K67Q3K4P6k40L08n52L73L5L0l44K04J55o0l45M2j28L17J24
2647D6J24j06l22M31n36K80J4j35L99k69J92J8J41m71K95j71K22j36j5j93J74
2668a8K15J66n67L55j6j27m8L50n69J63K54p2R6j12k15j13RM5P35o09j03K31Q2
$$ y = [-71, -121, 17, 325, 29, 52, -364, -97, 157, 116, 98, -83, -259, 29, -24, 163, -87, 32, 62, -10, 53, -47, 72, -154, -29, 258, 153, 90, 71, -49, 94, -148, 104, 132, 492, 37, 116, -84, 28, -36, 66, -5, -48, 121, 190, 45, -118, -62, 311, 112, 301, 23, 114, 224, -33, -74, 122, -197, -330, 292, -121, 50, -207, 170, 163, -75, -88, -389, -291, 64, -36, -13, -390, -57, -210, 81, -101, -63, 202, 145, -171, 150, -140, -231, -19, -107, 92, -84, 32, 37, 223, -62, 179, -48, -164, -13, 192, 58, -119, 206, 162, -226, -285, 58, 294, -37, -46, -239, 69, 19, 183, -277, -37, 58, 13, 103, -56, -323, -56, 27, 51, 127, -113, 195, -357, 16, 51, 81, -263, -59, 96, 36, -309, -267, -395, -78, 46, 170, 64, -258, 173, -363, -83, -69, -204, 195, -74, 118, 136, 277, -194, 101, -70, 152, 16, 1, -192, -18, 197, 363, -204, 151, 135, 8, -40, 310, -259, -96, 158, 86, 182, 70, -145, -258, -249, -204, 531, -78, -181, 50, 132]
2691A32N5j48K14k35O3l40J07K31o8k31K55q8K9j46K70j4k11K23k36J81J14j07
2713E0L6o6Q9j26j21j1J9K87J09k13j07Q1L14j04j27j47J62k70J95j71M8K71k91
2736i3J05j43OJ14L8j70K05J42m79K00m8N3K05m29K63oL04l26J84n3Qp4j05K50
2760A51R8l22o3R8J60r6M8p2J04J35l66K24j90R8j75J18K27k45K3K67k61N3L1
2783D5k15J70J58j98j33j32M52l17J90J9j42oL52r8k58K61m35J49K38l77L16J53
2805A92p8m85L46J7J69m9o1n4MJ15O5L2o60J1P39k76M2j33L6q1P6J3L79o99N57
2830B17j22K8j73J66k02l9L17l28%r4J04K71p0l2j12K72j07K2j88Jj78L78J11
2853B42k80J07j55R3J92m06J05Q7j99K82j77K85k39j0j50L13j02L88l16m45L38
$$ y = [132, 187, 39, 253, 18, 81, -259, -152, 79, 11, -220, 35, -53, -24, -170, 100, 86, -125, 98, -138, 43, 157, 50, 86, 20, 109, -17, -138, -149, -130, 157, 266, 53, -54, 27, 341, 237, 110, -37, 125, -145, 50, -121, -73, 198, -93, 12, -131, -125, -11, 27, -143, 62, 204, -275, -75, -123, -70, 135, -294, -31, -37, 267, -59, 125, 72, 80, 6, -99, 151, 249, -73, -136, -38, 122, 26, 74, 2, 106, 241, -125, 99, -91, 7, -168, -50, 177, -68, -45, 222, -39, 14, 45, -170, 0, 158, -40, -173, -305, 147, -170, 20, 39, -103, -109, 243, 145, -113, 148, -287, -138, 100, -277, 39, 192, 114, -371, -25, -8, 161, 112, 51, -3, 1, 116, 181, 213, -447, -436, 303, 27, 69, -64, -28, -109, -33, -20, 359, -340, 217, 95, 123, -50, 116, -86, -125, 192, -136, -136, -230, -126, 145, 75, 43, -69, 203, 96, 118, -70, -69, -247, 131, 242, -38, 69, -86, 7, 199, -207, -102, -15, -214, 68, -109, 176, -63, -73, -223, 90, -12, 376, 60, -385, -47]
2874d7L21k40K90m65k26L56K02R5j93k63L2J95K76l17j03m0K67l1l63K08J7m10
2896d39K94N2j6k5l0Q2K96j46k41N0LJ56K20l27p6j28K09J15j59K44l9l20K94
2919F9Pj66J83l49J95k49L76l5K47k79k28J79J67k06j09J02J61j24p0M0L8J78
2941A27o8K3k19J96k73K28p8j09j74L45L55n62K33R5j21QN6j01K77J6k19k78L9
2964b04L11M4n2O5k20k1J95j4K55l15J71m8M2k22k5K16J98j92Q8k56j00K14j40
2987a0J65J73n14o3m7J06K21j71J49N5j40J9j5m0L15m29K97k29L98j94J55P3j85
3010H9j75J34J30j77J28K71n73J15j18l00N34r7l08L71K84P9r0j64l30K54p6K43
3032B24j3n45L25L31k41R3j88K46j54q0Nj92J82j29q1L14q8J18k85K2K92K4n22
$$ y = [-47, 274, 34, 324, -141, -367, -11, 191, 286, 93, -170, -138, 57, 333, 16, -87, -127, 140, 109, -254, -46, -29, -439, -145, -93, -109, -134, -164, -82, 214, 68, -173, -123, -120, 36, 256, -71, -147, -275, -66, 49, -110, 134, 95, -225, 69, 76, -90, 93, -256, -61, -310, 66, 31, 278, -1, -229, -50, 117, -89, -198, -96, 65, -59, -129, -89, -51, 127, 59, 82, -137, 59, -214, 14, -64, -173, -347, -2, 353, -209, 24, 119, -2, 6, 62, -39, 238, 254, 35, -243, -204, 107, 151, 99, 164, -56, -77, 118, 104, 359, 44, 215, 167, 209, -13, -38, 178, 376, 184, 272, 16, -84, 130, -10, 155, 328, -186, -249, -296, -190, 31, -140, 9, 64, -76, -57, -72, -112, 203, -226, 71, -158, 240, 46, 201, 274, 89, -86, 48, 178, 1, 129, 400, -173, -58, -176, -476, 58, -39, -347, 24, 308, 387, 297, 133, -197, 57, -19, 224, 211, -334, -9, 322, 81, 174, -14, 232, 78, -2, 3, -189, -7, -136, -217, 97, 9, 127, -158, -136, 156, 180, -342]
3055c42L30J13P2j84j80K78k76L84j5J39k93J51p4k08p6p4J28j34M78q5K19l86
3077c5r9J84J22j7l80J49l2L1J83r9K57m02oL21m53P9J6M02j28j32J44k08K97
3100A94j96l9J75J22k07k09L27l92K65r9J4P3o5j73L42P5j8j50k05K34m3K31l34
3123g8Q1j4M0om6rM5M7k63L32k32J94J2p9o2j5o1J4J1J61k23K90k80J30K59l48
3149a00K34qp6M4L18l15k22K17J16m6k6r1n5M14m06q3L8m57L61J37L16p4j95j32
3173i1Q8J64q8K21l94L01j51j13K37k60m7mj02K24L7j52m2J19M69l21k21R8J56
3196A28N0l40K73K4k78K28j63j6m9K82jl53K55j43K03j25n5K34k97Q2k1J2r0o2
3220b22K40P6k48K93j15o1j09J62k73R5J15J54m6m05M33p2n2J4m0j56N96l19J45
$$ y = [-342, -12, 101, 173, -11, -191, 87, -189, 195, 180, 319, 26, 177, 103, -105, -181, -255, -127, -261, 217, 132, 351, -35, -134, 50, 172, 155, -225, -76, -108, -77, 106, 7, 264, -138, -144, 177, -276, -197, -181, 221, 93, -39, 105, -103, 194, -2, -41, 134, 256, 49, -160, 167, -225, 40, -59, -45, 28, -37, -210, 132, 207, 189, 39, -166, 68, 25, 256, -78, 3, -11, 29, 23, -23, -32, 13, 60, -203, 129, -103, 91, 103, 24, -38, -53, -114, -100, -89, 72, -151, 139, -141, -11, 248, -100, 134, 126, 50, 94, 412, 97, -125, 92, 208, 162, 136, 45, -10, 404, -2, -85, -47, -504, -143, -6, 310, 236, 41, -91, -3, 161, 73, 294, -100, 201, 50, -63, 174, -86, -133, -137, -239, -15, 22, -130, -172, -53, 416, 95, -126, -28, 128, 178, -162, 111, 135, -143, 85, -78, -94, -143, 139, 138, -215, 40, -103, 100, -25, -80, 154, -143, -61, -82, -70, -160, -222, 18, 94, -154, 139, 24, -37, -146, 16, -257, -162, -47, 107, 61, -344, 89, 17, -35, -21, -61, -217, 379, 60, 205]
3243B05k5j92j00J71O2k25mJ47j73K26j29M9N6n6R7k37J56K64k84J72m92M01P
3266I6j33l6j8K95k39N9K2r9J0j3L86k10k63O9J55Q3j58j35J68J09k37J89j98
3289i8o1K97j23K1l17lL30j5j36l01O48j67j40K84l00j53J27R1J20k7j57K9J21
3312G0k45K27n6K57j05n12L46J7J36J14k32Nl73N62k07J35m04M08m1q2lP9l87
3335b91N56m13M11o57K18M04l25N0K13Q2j3j21l47L74m96M42l01J51O1N0j08P4
3357A4m98O75L07p08J60K26J27m32L16l62r8L38l74K29L4l8L0L47l58K89P5m38
3379a39l9K16j25P7O4k42K79l72M63k39r3K54k51L45l27K26K3m31N39M7k26j39
3401i0m5j59M27j37P4o3K52l91K05m57K32m2L79o6oNj05l08L50N4j94L29m44O08
$$ y = [205, 180, -12, -112, 59, 121, -104, -108, 39, -134, 92, -37, 12, 68, 12, 109, -128, 28, 292, 8, 180, -312, 89, 96, -37, -73, -91, 204, -35, 24, 46, -53, -43, -56, 330, 120, -143, -74, 81, 164, 6, -129, 39, 148, -89, 100, -98, -159, 138, 15, 36, -281, -284, 46, 31, -105, -406, 242, 75, -65, 219, -81, -234, -107, -16, 104, 77, -80, -51, 70, -175, 52, -4, 253, 148, -364, -18, -1, 135, 249, 17, 22, -351, 211, 4, 139, -265, 143, 102, 20, 17, 96, -291, 265, -148, 263, -394, -176, 228, -97, -47, 166, 248, 235, 114, -233, 141, -355, 87, -214, -63, -2, 48, -60, 14, -484, 191, 498, -210, -50, 176, 303, -129, 187, -175, -273, 65, -309, -80, -46, -84, -54, 293, -65, 224, 299, -139, -178, 38, -87, -10, 54, -188, 91, -281, 182, -57, -150, 104, -147, 198, -129, 97, 120, -311, 228, 275, 49, -90, -135, -294, 133, -4, 70, 7, 259, -132, 73, -384, -152, -194, 185, 119, 113, 118, 13, -295, 55, 109, -85, 244, -200, 408]
3425D08n86J24O6K25k67J3RM43l79J65p6J80m33K8R1j13J00j01%L2J02r1M9j05
3449a16J70J58m15K56j26L10Oj14Q5m42p4J76K25j77j25j4J57j69M76m39J43j97
3471b46M71k21j24L5J21k41Q8P5L6M8J29Q6j42K4J47l03k05L06j05j16K4J71J64
3494B22k49k65K72P7L2k94J68p2j14N20m12J4J09n9J29j93Q8J89l2j24j56J94
3516D4q1O3k21J11Q6J05k09L24l60j86K92M30n28Q3O1l4R7L09m52J33or0K46k75
3540e8p6O7K4r0J50j22k21N99l88K29m2K1k33L78n12M8j84L65J71k55K10J1j55
3563f3J10J07m35J65N8o3k08L62J58r2j14j69j44K46J20j65J68J89k54j66kK47
3585E5O6K3K18l34j4J84j53r9j72K59J20k45k38J94P7mK12j57j0NR7J31j36j12
$$ y = [408, -178, -54, 12, 237, -30, -17, -8, 435, 56, 221, 145, 325, -108, -80, 11, -102, -2, -103, -103, -71, 31, -60, -11, -116, 54, 212, -203, 53, -73, 237, 243, 129, 214, -228, -302, -126, 99, -78, -203, -217, -60, -229, 247, -192, -49, -246, 225, 4, -120, -85, 36, -205, -117, -42, -6, 42, 171, 257, 115, 139, 286, -17, -222, 84, -21, -137, -113, 58, 222, -27, -292, -20, 57, 89, -205, -37, -109, -223, 297, -115, -101, 8, -51, 78, -115, -27, 162, 130, 6, -150, 44, -37, 26, -195, -84, 2, 107, -102, 222, -138, -324, -32, 398, -130, -47, 14, -20, 77, 386, -66, 67, 61, -29, 217, -58, -134, -67, -43, -133, 17, -105, -326, 273, -115, 114, 72, 93, -140, 238, -274, -226, -410, -45, 126, -129, 81, 92, -63, 47, 154, -281, -116, -58, -121, -329, 33, 191, 99, -15, -184, -328, -82, 38, -127, 41, 230, -24, -190, -192, 55, 121, 144, 362, 28, 14, 198, 45, -54, -226, 33, 153, -92, -330, -136, -59, -63, 149, -8, -18, -13, 84, 215, 79, -33]
3609c3M0J51m64k2K88L01p8j3l50K47j60L24k66J10k65K07L39n11J66m2l9K58
3631A88L9k20j10N4qpM75n92Q4K01o0J8l90L68j58J45O9j5l79M84J37l78n8N21
3655D08m33k20L32L2k38J75M1l0Q9l9l57K35K01m19L88j28L6j57K76l41JJ74j52
3678a26J9J27K90k19J20j40Ol1q2n3J5M8N1j65K8J83k23N2OJ82m2K38k40p1L7
3703A0K60nk84K02k33K01J01j04m32P0M29m70K71n6k43R3K89j9j5k30L81m64k6
3726b74J05L01k10L43k9l01j31j18K21Q8j2j74K56k20J79j3o1J00j99O1J15n9
3748c2K0r2J98k49J5K5J25j92J13L4L50j77l37l04N06j57M26n51L57l6N7j62m
3771f7k47nML23J06j77J97k46L47l38KJ04J9k52L82o9k71M21j9n6M8l32O2J76
$$ y = [-33, 7, 158, -306, -328, -40, 261, 183, 170, -180, 67, -93, 231, -35, 75, -190, 17, 356, -155, 11, -31, -70, 188, 227, 7, -103, -49, -57, -64, 411, -181, -97, 104, 44, 62, -328, 40, -118, 27, 96, 81, -298, 186, 323, -55, -113, 408, -25, -245, 87, 119, -119, 56, 97, 67, 156, 117, -240, -5, 196, -223, 165, 37, 73, -84, 192, -149, -148, 26, -126, -107, 20, 310, 91, 211, 71, 77, 46, -36, -89, -74, -26, 25, -140, -112, 71, -152, -100, -94, 88, 46, 284, 44, -27, 10, 270, 265, -19, 183, -50, 151, 252, 148, -284, -214, 215, -255, 16, -40, -283, -190, 99, 80, 65, -165, 216, -248, -274, -169, 132, -78, 265, 236, -65, -196, -314, -93, -5, -17, -191, 65, -155, 24, 11, -50, 50, -149, -88, 27, -32, -12, -104, 94, -155, -140, -115, 10, -182, -69, -35, 315, 138, -199, -503, 3, -154, 272, -279, 78, 42, 99, -63, -67, -314, -319, -315, 8, 114, -63, 134, -112, 235, -103, -101, 3, 22, -230, 152, 83, -188, 233, 214, 158, 206, -126, -64, 112]
3795A12k43L10m82J55K06q8K13j11l05L52Q0m22L65k47N6Q1k44M90n55j3K13L5
3817d2RJ34K00k51lK24j49k14K27n30N19j90J83k92L09r2N7k75L07Mn03K55J58
3840D5r4k39M53p0l08K13J44j83M52k74O5j37K11L9m88O6N6j56J14K34j06r6M75
3863D16k42J80k56k93J0K48j57K72k52q5J40Q6l31o2L95M8l6l2M4j28j3J26J46
3886B24k98J72R9k03Q8j12j09K46k39J22K10j49j33J11r2J8j12K28r6N4l22L66
3908G3J8l9M0R2NR7j41l19o9L89k96L05R4l00k08K70o8j76J80o9j39K26Q7Pm86
3933d27N01Rj42L52k26J84j45k19K6p0J07J46M6p2j24M89m18j93K22p0M9J89k37
3956b3j32q2K72k21K16J36j89J07%k92J88N3l85L26l8k27L38k12L69l29M1j22
$$ y = [112, -131, 179, -303, -148, 58, -30, 183, 72, -233, 119, 199, -223, 142, -105, -49, 32, -212, 278, -277, -290, -77, -42, -33, 101, 301, 50, 47, 271, 122, -92, 135, -395, 124, -66, 117, -175, 134, 42, 99, -176, 131, 135, -368, -113, 45, -49, -288, 165, 95, -213, 0, 144, -39, 413, 139, 204, 67, 278, 317, -171, -105, -49, -205, -91, 143, 37, -59, 416, 174, 354, 98, -195, -185, 63, -94, 178, -74, -159, -19, 67, -264, -326, 69, 117, 81, 49, 93, -35, -48, 78, 224, -74, 98, 197, -6, 82, -30, -139, 107, -132, -10, 200, 51, -82, 29, -63, -45, -157, 71, -25, 29, -293, 73, 91, 52, 92, 184, 189, 286, 145, -174, -243, 146, -150, 155, 249, -51, -259, 11, -57, -233, -53, -122, -261, -35, 52, 59, -427, 74, 83, -59, 293, 67, 251, 106, -113, -87, -157, -50, 96, 142, 70, -54, 435, 17, -176, 46, -24, 25, 214, -23, -155, -237, 35, -186, 30, 166, -23, 84, 84, -208, -20, 33, -352, -26, -64, -291, 47, -165, 204, -125, -84, -206]
3978b06KJ24M8rJ13k10J81r3m0K62k35M03j08k69J70k10r6J02nm5J90l34L8RJ34
4003h4k19N00j88N5k03j4J24j46J49M01n55J54M8l5p2M16n16N8P0j42r2K70K05
4026A84l20R4p9Q3L01k35j30K52l96K40k38M99k39j36J39o2P6m88P22l54L6K46
4048A95k70K8K04r2k47J72k81N57l98K07k38J47q1j46j41K18J37l3j30J54J37
4069I9P4n8p7j22M8k00J18l7L07k91J83M3p2J39k2k80J7L75j58RJ4m1o7JK6p1
4095d3J16n2K36j96n09K72j1r9J51p3J48J25K0q9m18K42M61k06k72K50k56L68
4117A65J05j20k56J04q0K3N4M0q8L02k03l03Q1J33K97k91K48l6j68J23m1M9k97
4140a59L51m37L41n5j58L69l88Q3N4J50j71j58J88J17o1K38k93O4p4M5p6J81l07
$$ y = [-206, -204, -80, -32, -41, 72, -138, 43, -50, -90, 172, -63, 340, 232, -37, 133, -77, -173, -71, -76, -121, 69, -265, -227, -218, -84, -303, 197, 9, 64, -139, -153, -29, -175, -26, 375, -180, -26, 22, -13, -85, 331, -185, -127, -57, -199, -291, -21, 184, -136, -42, -121, -38, 263, 28, -102, 150, -246, -6, -244, 255, 16, -120, 19, -43, 33, -455, 267, -87, -51, 195, -75, -47, 157, 65, -182, -10, -291, 266, -132, 75, -163, -16, -97, -243, -384, -166, -29, -62, -192, -38, 99, 173, 115, 38, -84, -36, -236, -118, -155, 152, -139, 44, 87, 15, 154, 132, -148, -131, 244, 86, 95, 109, 68, 1, 2, 28, -43, 73, 21, 257, 61, -448, -176, -187, -286, -135, -208, -60, 65, 85, -4, -422, -180, 281, 75, -197, 53, -203, 165, 270, 150, -106, -2, -82, -59, -5, 35, -53, 249, 46, -257, -176, -43, 254, -37, 211, 175, 7, 130, 89, 138, -159, 192, -245, 96, 41, -117, 252, -136, -53, 1, 151, -20, -178, 10, 127, 66, 304, 11, 75, 1, 46, -30, 151, -156]
4163a56J05r2L57r8r8PN4k30R8K58k70K58m48M04l38N2J84o4j24np6L14j21k11
4187b40J74L06l4Rl89N14m59J26j13M16l69K53l89KM69m18K02O8K1r0j41R7j53
4210a38M4n8K25J80j74m3J86k04j40L42Nn12Q5M60j57J80k41J04k98J41m0j88
4232b41L99k02o8PK43k4j47R6k78K83M0j57j37p4j88J38N96k90J24o80N77O7k88
4255b04p5K40L9J48k34N11n75K40K5k19r4J99J7kJ46j35J57l44k1K23J1k5M3K5
4279I6p9o0m8Q0K54j88R3m80J41K68N4k3om58M04J41k82L2K58j62l2j29K34j77
4303f9N1j7J92j94kj40J79O3K3k13q4L76K50m18l5J14l46M02k87Q9J04l81J50
4326a93J34k5nK23l22K64j31l2L09m44J87J66k9k3j37j69L07p7J95N6k97j84n6
$$ y = [-156, -51, -143, 214, 116, 18, 25, 79, -151, -53, 205, -65, 193, -255, 149, -189, -137, 47, -17, -141, -146, -222, 92, -29, -240, -66, 240, 206, 215, -174, 340, -119, 7, -106, 310, -59, 194, -195, -193, 276, -142, 60, 128, 149, 59, -82, 15, -138, -94, -152, 73, 253, 79, 36, 222, 18, -122, 220, 225, -287, -202, 258, 101, 281, 40, 144, -154, -13, -53, -241, 158, -44, -112, -105, 138, 114, -33, 63, -215, 68, 108, -49, -186, -260, -448, -310, 286, -4, 120, -560, 17, 84, -204, -279, -39, 0, 148, -86, 425, -150, 90, 115, -104, -198, 1, 18, 16, 162, 27, 184, -160, -181, 42, 53, 28, 71, 96, 17, -43, -91, -11, 243, 55, 148, -332, -191, 77, 131, 108, 102, -356, 48, 189, -93, -61, 197, 35, 3, -126, 108, -69, -18, -35, 157, -37, -39, -179, 0, 63, 86, -127, -211, 165, 415, -3, -38, 76, -270, 132, -155, -66, 38, -343, -193, -59, -84, -89, 134, -188, 76, -55, -87, 222, -222, -35, 131, 102, 79, -58, -227, 80, 3, 198, 254, -43, -227, -283]
4349b83N3L51k24l5K52K14k91K18j00m93Q5P6M30j71k32n6J87j15q6K86K14m54
4371a74JM96l40J1j30N7K97k33k10J84m1K35O1j90j01j1J41J13q8j03k38M91k90
4394f2O7L7m2K27l04l39N71j90J85k46J01ql2J53r1Lj76L40l84N5J84K35k10j6
4418E8j04M94m00k6j57L06j93j17j13J73oJ55K33n61L93L3k13n0Q4J04k01q4K82
4441I0J46l79J56j26j51K51MN8OP0j02j30j87M62m1k6l00Q5J9rO4K04k3j92J80
4466A29k39L87k57J3j1l08M89J27j59l10J77K96m33L85m17L62k33L3rj15L05l41
4488a29RJ6Rk4J72J41j81K32k56N7J83m85L33K2j4j97R7j11l8L52j95J89j48J93
4512B27k75j60K40n8K43j05J58l55j42J18K90l03J53j46Q9J01l16O2L07l1o4q4
$$ y = [-283, -230, 121, -103, -138, 114, 328, 37, 255, 155, -338, -253, -177, 253, 82, -150, -206, -19, -134, -220, 66, 280, -174, -173, 323, -17, -6, -136, -79, 218, -15, -225, -41, -82, 153, 214, 24, -77, -88, 53, 166, 78, -25, -263, 228, -62, 5, 42, 0, 227, -77, -416, 155, -35, 150, -96, 5, -3, -35, 118, 27, 30, -146, 194, -190, -135, 49, 284, 74, 58, -46, 448, 48, 22, -135, 171, -22, -139, -252, -79, -85, 70, 303, -258, 135, 168, -45, -95, -11, 93, -108, -192, 90, 236, -143, 13, -113, -264, -13, -9, 49, 55, 125, 23, -107, -294, 168, 127, 101, -199, -114, -95, -104, -40, 164, 141, -51, 129, -110, 277, 20, 33, 22, -286, 203, 330, 171, -139, 38, 334, -99, 286, -131, 231, -2, 31, 22, -93, 212, -129, -120, -104, -95, -119, 53, 194, 13, 245, -11, 46, 229, -256, 77, 99, 85, -112, -15, -126, -164, 188, -7, 182, 34, 227, -48, -208, 32, -26, 217, 112, 270, -85, -227, -109, 181, -122, 31, -115, -26, 75, -241, -179, 128, 97, 33, -51]
4534e1K1o8J71q8k82J79j8K67J78l94J67J47m81N35j53n06M00r2J87k98M86j39
4556A68j47NN7j76l4J58k23M26l87K04k13K42k6j86K51j58l5K30m12K5K16k0O7
4579C2m54N23k94J40J08j52O9k06L2N9J12J51r4jM8q7j57J70j76j6Ro4K22J10
4603H4J88n65P0K60K64n81K96k43R7K28k32L01N5l91J09k0J58k3K8l77J90l5R2
4626d7K9J72jj44K43m73M86l07j35K68J18j33J38k09M72m67j79K62j32q1l1J76
4648B5r5L47k93j93K66j78K17l48J83M40k48k08J20m5Q5J50k43p3J56r3J0J2L23
4671C17p8p1J4j34q7P6Ok5j27K70K4j32L7j41j5K1K32k02k35K36K06j00j98L4
4695g2KJ50P2l37K69l24J69k12L30K90o07N67l81j60K23O3k89L78J65m44K90j15
$$ y = [-51, -30, -98, 73, -15, -297, -118, -136, 131, 309, -85, 82, 229, -252, 283, 130, -376, 24, -68, 119, -179, 307, 168, 21, 26, 83, -93, -127, 31, -192, 234, -153, 51, -162, 80, 54, -132, 119, -39, -74, 156, -256, -231, -15, -35, 32, -422, 101, -193, -53, 55, -97, -28, -234, -202, -143, -31, 120, 26, 25, 73, -14, -171, -1, -177, -193, -184, -248, -26, 84, 272, -293, -223, 37, 301, -280, 16, -227, -130, 98, -134, 167, 222, -169, -60, -80, 78, 55, 83, -294, -104, -139, -47, -18, 154, 153, 9, 252, -221, 265, -42, -177, 91, 209, 76, 214, 5, 477, 10, -169, 93, -39, -120, -151, 25, -70, 277, -16, -209, 57, -121, 96, -252, -69, 371, 123, -85, 35, -10, 75, 225, -18, -91, 65, -28, -18, -6, 317, 239, 168, 182, 48, -39, 37, 43, 18, -109, 161, 185, 53, 90, -51, -66, -45, 187, -15, -250, -14, 192, 92, -106, -72, -70, 80, 152, -185, 84, -240, -71, -283, 47, 337, -270, 297, -84, -244, -21, 42, -247, 131, 296, -148, 142, 27]
4717B7K5J05j11L8j34K25j59M6j48K42k12M25m66n9K4L32j78l05K12J70K40n22
4739a83K97o8K99o4n14L5J33J39k12J80j45J60k41K33N1p0r8P8k44M07k57j39
4761b23L23k40R7N7K92j75m55L19P5j86oJ35nL7o5q1L89m09j25J15K88k82J59
4784C4Jj2l8j48K0L06k32L39l16J7k36K47m7K06k21K74k86J72J16l82K23j70k59
4807c92k1R3K02N9J65L4j84o3J92j10J20k7J84k63J16j49j75M43k5l62L42M2n26
4830c05L30j48O4N6M3J8j76j56K85k64J03K90k54K17k41J87q8r0J29n4lJ80J7
4853A40l61K70J44j71K11j95J27k70k3J15L00k27k8K18j08k72K80m69K56j93L63
4874A07j64k8j29R2l84M68j38L29l33K91P9J5l41kK88j69j50K39j37J5K34J04
$$ y = [27, 52, 157, 46, 84, -50, 175, 16, 62, -86, 156, -56, 369, -97, -156, -132, 200, 22, -283, -71, 99, 339, -183, 114, 46, 345, 281, -233, -198, -65, 74, -138, 42, -103, 57, -184, 49, 100, 30, -68, 10, -234, 173, -84, -223, 100, -140, -43, 14, 306, 131, -324, -5, 70, -116, -122, 13, 8, 45, -20, -101, 288, -121, -246, -131, 157, -125, 34, 35, 23, -15, -163, -143, 163, -69, 270, -46, -29, -265, -18, -65, 141, -80, 194, -92, 80, 196, -186, 37, -133, -392, -413, -320, -118, -59, 106, 140, -44, -107, 85, -25, 95, 68, 252, -11, 105, -44, -219, 224, 199, -163, 179, 221, -305, 25, -123, -59, -3, 40, 58, -118, -274, 11, -253, -150, 140, -114, 103, -138, 49, -39, -129, 0, -54, -57, 123, 140, -221, 49, 193, 22, 233, 38, 165, -105, -128, -13, 287, 60, 32, 250, 142, -130, 150, -319, -63, -256, 107, -57, -85, -214, -122, -506, -38, -176, 153, -180, 111, 190, 205, -136, -138, 150, -19, -169, 70, -67, -52, 182, 286]
4896B86j64k56L33k59J2N9k4L43k72n8K56r8j35k8P8j17k34J7M21r5J13m30L01
4919D9j30J45j95M57j64p4k60N24n67N42l75J21n3k7J03j83J95K74n47o7K51J02
4941A21k44k4K33j96p5M54l16J86n9j78j8J73J41m42K93L5l1N7%k07L05k08j75
4964a75k17L23J14K90m52R8K4q5J58j91k33J97L56l54j7J31k44N13l65K72k2n95
4986d74M66O6l83L87l61K18n9J99J03l84M41k16k04K74J82k70J60j20Q2Q2l20
5007a31K70l29J01Q6K65l64j59K89o7KJ96J81l16J80r7r0k86J69J3j40J35J02
5029A0O9j91l5K78j13m5k62K00L40k82J41j02j58L69k6k19K68j90N3q1M5j45Q4
5052Hk4j08j29L60j78J48J99k32O3k59L59m78L74l22N22k72n2k37L12K81l42n5
$$ y = [286, 122, -134, 199, -60, -48, 11, -13, 330, 58, 0, 256, 158, 23, -5, 73, -44, -278, -261, 160, 65, 178, -252, 49, -81, 64, -131, 326, 162, 88, -172, 352, -215, 327, -48, 73, 20, -7, 96, -87, 108, 382, -165, -232, 19, 121, -123, -147, 86, -110, -185, 269, -47, 139, 80, -98, -116, 57, 198, -244, 49, 84, 53, 110, 110, -97, 208, 0, -175, -392, -69, 45, 335, -117, -19, 5, -80, 78, -113, -346, -149, 207, -147, -164, -33, -277, 236, -129, 143, 121, -474, -8, 58, -325, 62, -299, -81, -140, 59, 162, -222, 219, 3, -201, 73, 255, -15, 145, 25, 107, 189, -131, 139, -190, -89, -3, 262, -102, -261, 28, -39, -37, 159, 340, 24, 204, 107, 17, -269, -100, -87, -227, -92, 10, 79, -112, -147, 131, 18, -27, -289, -89, 251, -31, 110, 8, -150, 219, 193, -26, 242, 52, 105, 24, 69, -76, 8, -16, -124, -253, 107, -71, 77, 276, 44, 107, -152, 207, -271, 103, -219, 303, 31, -21, -258, 54, 335, -7, -62]
5074f2q1j47J81K60j08L3p8p5N8m9L5M0j01K76j71lK29k02j29K93k24O3j70M05
5098B73l12p0J08j71m6M02J09l55j24J86j34K5r0K34m5k40j6K66N0J6m5k52K62
5121C1k3j54p8L46k9j94J71R6n9k34L29j84r5mM55k82j81J13j36j02J26M6Q9m6
5145Ak01J56K00P5m84K38L16l97m4n3J41j00nj31L37N4r8N0l15M81l02M6R8Q0
5169A43K4kL4j34j08K07j18l61K64J48K43p8l68l2r7M19m46L06J35k73L62j17
5191A51Q1l03J2J09N4k40J07m1K02L5j27l88N04n0p3J3l14O3L37r6N7j86J7K58
5215A82k07j12L80l66j9K24l4l1N8k40J16J5j76JK55J6m89L44R9l30N03p7j67
5238e5J21j15l67M88j23j71j4K33j63J25O4r1N3K18M9m14K06N7J77m57M93m72
$$ y = [-62, -143, -290, -109, 151, 43, 76, -2, -77, -19, -68, -33, 7, -94, 182, 11, 8, 237, 35, -94, 199, -25, 38, -132, 273, -39, -109, -1, -172, -218, 184, 293, -62, -186, 0, -134, -109, -199, 35, -10, -250, -266, 0, 50, 66, 21, -231, 31, 8, -146, -224, 122, 93, -101, 70, 166, 107, -127, 202, 18, -77, -81, 374, 92, -89, 24, -112, -214, -88, -42, 47, 1, -200, -44, 156, 231, -253, -15, 301, -96, -140, -193, -52, -152, -157, -288, 49, 103, 5, 55, -260, 221, -81, -35, 63, 143, 167, 165, 199, 65, -43, 164, 46, -315, -51, 97, 340, 262, -106, -138, -235, 184, -262, 44, 179, -94, 268, 151, 232, -71, -59, 50, 104, -136, -29, -70, 132, 167, 40, -348, 156, 106, 33, 46, -268, -205, 132, 36, 93, -93, -76, 182, -25, -137, 243, -123, -142, 82, 48, 17, 75, -165, -49, -34, -210, -209, 46, 62, -427, -83, 16, -314, 189, 112, -55, 66, -49, -416, 72, -51, -222, -236, -3, -166, -41, 23, -68, -15, 203, 252, -162, 44, 101, 278, -179, 314, -158]
5260a58M7j4M9K01k38Q5j62R3k34M00R6q9j16j94K49K0j11k14K69N6m1j1J21r0
5284A4m8j19J66J88j19k36K85j32L8K4Q2K5J00j82l42J37K50M7k77J08j76L5P6
5307e6J26L0J59k92l4p3M07j98M6k09K48m9k10M43k60k06j5q9J39K18n9q0j49
5330a63K07QN8J10j65j87r0J65J06R2R2k74M73m23m07N41j05Q7l05L24k62L2P0
5353a6R8r5j35L00j34N6J27j39J15l78J92j10J02M92n75L42m78K02J02rj12k67
5375c20J60j90M72k30K65p6j59j37L25r0K81o44L43k00J70Pj04K35k38K26j44
5396d8J74m80K73O4oJ57j58QK03j18J49l49m3K56k56j19K88J4M7J7k02L1J32k75
5420b41J26LJ31j10r5PK47K1k07p2K72J48l4l81K8J35q3K90l16L80j54l49J10
$$ y = [-158, -111, -125, -76, 125, -113, -28, -190, -97, -331, 69, 165, 76, -40, -234, 15, 35, -76, -290, -21, 35, -6, -17, 104, 14, -34, -153, 13, 201, 82, -154, 131, -1, 37, 61, 143, 168, 268, 86, -256, -119, 131, 178, -99, 9, -167, -132, -56, 70, 100, 259, -33, -67, -140, 267, 69, 115, -94, 154, 105, -105, 338, 78, -128, -143, -232, -93, 125, 66, -14, -163, 44, 52, 110, 220, 55, -132, -222, -57, 49, 141, 233, -41, 432, 9, -398, 143, 38, 125, -180, 144, -118, -86, -16, 82, -13, -148, 152, 18, 74, 201, 62, 177, -201, -9, -119, -17, 475, -100, 242, -236, -34, 68, 59, -53, -320, -160, -350, 122, -108, 157, 81, -78, -215, 110, 20, 301, -343, 0, -200, -30, -23, -127, 108, -130, 96, -48, 126, -354, -81, -17, -23, 134, -24, -16, 187, 69, 218, -131, -174, 82, -174, -293, -5, 9, 56, 73, -129, -98, 34, -241, -115, -112, 19, -91, -186, -179, 68, 89, -118, -190, 82, 230, 196, -185, -157, -22, -105, 185, -131, 249, 95, -254, -144]
5443a44J08L3J07m6N8j80QJ53o7J77k25k14K9Q3P6r7J89P6j35j95M19m00J46j28
5467a69L74L3O9j17m1j1%k41L69m66K55l26J84K9j23J89J62k36K84m34J55J93
5489A32l41L69k44NJ40k26N1P7P3j46K06j54J35j36j1J71l2P5l4j2j87J79k27
5512a37K44l29K65m3K30j71j24jj11K78q4o3P8k08k0O5K52m6L51m88k3PJ8o4J95
5537G1K86l19n7NQ0k78K57q9j1J03j84L02M4k11J56l18L55l29M10k29P8j87R3
5560B8M1j37L57k21O2J08k68J72r4o8J33k46j37K07j50L72q0l6J34J78n28J72
5582aJ87J3j66k16J61j68J04M5j60N78m94K26Q8J01k28M7N5l86O04l91k29L80
5604A50k89K15r3K0P7p5Mj81J96k23L44j34k09M24n4j23l0L3J88m4m50lj57M54
$$ y = [-144, -36, -3, 104, 58, 116, -64, -56, 97, 30, 207, -18, -232, -203, -120, -44, -141, 48, 124, -11, -206, 213, -187, -41, -169, 205, 238, 307, 190, 149, 138, 138, -103, 266, -200, 55, -271, -87, -58, -181, 8, 170, -66, 218, -216, -61, 132, -209, 160, -84, -79, 61, -165, -114, -37, 36, -110, 96, -58, 77, -59, -70, 101, 69, 144, 110, 98, -89, 90, -137, 107, -222, 43, 0, 230, 59, -65, -66, -177, 101, 17, -46, 32, -176, -196, -131, 121, 75, 426, -62, -85, -78, -60, -124, 71, 357, 38, -19, -14, 66, -212, 45, -44, -55, 48, -136, 166, 210, -1, 155, -163, 192, -137, 273, 44, 122, -65, 28, 69, -68, 289, 68, 130, 238, -30, 142, 48, -20, 113, -133, -270, -63, -213, 159, 79, 43, 177, 355, -173, -1, 186, 199, 33, -183, -22, -190, -86, -41, -201, 377, -117, 109, 197, 298, 70, 117, 172, -214, 390, -1, -230, 150, -139, 76, -17, 3, 80, 5, 9, -172, 24, -199, 145, 11, -198, 226, 172, 49, 19, 52, 240, 196, -254, -257, -414, 40]
5628D0K17m44J47L7K04M6l93N0K7L44m12L5k09K67j75K74k44r0J79L73j61k79
5650a67K94l86J48J36J08q3J76k97j22K09J17n6k01L80k57K10m9j99j48J09J58
5671H0l49L88j69l3K32N9j60O0k05N9j77O4J55j81K80k92K88j0j81O1J38o1l74
5694c28L20q5J01k0M9j54r0R5L07l88N9L20q5j97P2j73J89r8k03L97j44j13J2
5717a57L9K2L9J95k96j50K58r3J97k18N6K77l9Pj7N9l46K08J42m21k9J36L1J54
5741E4j36k37N28m00K10l13K91J34j35J18k71O8Q6N9jq5k6m7j35L60k30J89rp
5765F5N7l69K53P2N5J3k4j91J93k26Lk20K70L01j03j76Rl92O44L23o81KJ78l2
5789B4J06j91j5N7k99J09K44P6k43M82j18l90K52k77o5L66j18k37L71k81M0L8
$$ y = [40, 257, -187, -40, -3, 201, 247, -146, -96, -69, 275, -137, -102, -311, -44, -219, 55, -189, -279, -100, 273, 112, -167, 127, -259, -111, 25, 133, 50, 226, -71, -193, 16, 133, 77, -124, 256, -1, 209, 160, -39, -187, -78, 80, -269, 119, -50, -83, 149, 208, 48, 108, -97, -38, -215, -151, 4, -177, 103, -189, 99, 89, -92, -31, 107, 46, -328, -8, -93, 8, -12, 37, -117, -207, -112, 195, -193, -134, 186, 101, -96, -24, -197, -8, -106, -309, 88, -56, -169, -157, -118, -96, -57, 138, -158, -308, -50, -143, 54, -164, -108, 169, 130, 137, 120, 179, -167, 41, 183, -238, -267, -131, -100, 54, -82, -319, 209, -191, 19, -294, -3, 131, -4, 114, -157, -89, -3, 56, 55, -30, -56, -103, -238, 122, -108, 81, 72, 65, 122, -247, 6, 78, 133, 146, 122, -69, 124, -102, -99, -319, -49, 252, 149, -27, -18, -410, 234, 557, -124, -122, 56, 24, 130, -61, -76, -19, -318, -209, 35, 111, -132, 350, 232, -158, 94, -183, -248, 118, 0, -237, 134, -147, -107, -69]
5811f9K87j13Jk66o3L46o1l36J60J22j43M12m15J90J2k49K82l7J41j6o2l36N6
5834a57k20K47L41k62j03L21j75R1N9n08M72J32k80j0L48n8J23m87J2J75j05J08
5856F4K28n65K61j20J93k28M5J76n3q0L20o5n21N86k64J31O3j79j59l7J86P1j8
5879C5o3j85l2K59j1J29k25J85j93L12l36K08l55J38P6n7J76j84R4K00m1j96R9
5902C3k57J32q8J55j16K21kj04n0j7Q0lr4Lr4L13K3N1o41N88O8L6k64J39n4k03
5928a45L1J63j86mK65k43K19m10K76O3J13m10O74k19k66N92o59J35k64L01j37
5949a11j70L94J31l55J8p6O4j72L03p2J25K08k15j89J18K92k46j60O4K90l41p5
5971a75L43l6l09K69j9J68l40J61J02P1m22L31l94K13r3J75k16J32K67k00p2k11
$$ y = [-69, 218, 105, 106, -160, -223, 123, 62, -274, -114, 8, -135, 277, -138, 52, 64, -185, 97, 60, 201, 185, 123, -213, -157, -377, -130, 211, -51, -154, 167, -8, 83, 142, -366, 106, 238, -42, -52, 296, 238, 361, -126, -114, 61, -44, 64, 292, -273, -12, -132, 61, -167, -122, 54, 1, -79, 241, 176, -345, 241, -23, 108, 171, -8, -167, -204, -18, 53, 35, -28, -213, -245, 14, 3, 132, -93, 92, -101, 211, -125, 83, -272, -134, -58, -115, 61, -123, -29, 171, 130, -66, 33, -224, -92, -180, -25, -141, 80, 78, -26, -76, -93, -13, -16, -110, -107, -201, 112, 135, 186, -455, 133, 201, 237, -27, 112, 58, -145, -114, 49, -137, -141, 124, -119, 100, -310, -34, 29, 142, -268, 406, 187, -79, 513, -146, -11, -275, 26, -111, -281, 113, 244, -111, -93, -169, -105, -277, 26, -46, 79, 287, 72, -117, 1, 293, 47, -113, -49, 241, -100, -175, 168, 132, -177, 92, 73, 241, -99, 62, 164, 235, -187, 144, -250, -37, -130, 45, -171, -39, 228, 28, -44, -255]
5993b55L76k73M2K66j29j37L49m42P3L80p2N4m35j23N29k06N9m8q1q9j8J15kK70
6017B03l03j30J4L43k81K00j89L43j23k19J94J82m75Q90m69l90K04k99M35p24
6037e94N29J25k8j2j27P1L1l07K05J28j51L03M1j70KJ92k11j21J99l63N91k34
6059I9q8p0O6P2l6J90l1j69M4k25M50l00k7J07l79O3K08L29j18m21J95M65k13
6082B11l10J24k02R6K49j00J0Q0k38L46k01k37J5j02m1J40J17p0M2j8J18L46k87
6105H8j09j35kK41O3P7l2j33j49j67J09L3O2j28K20J22l01J7K65l9k66j95K51
6128a08J9L63m17K41j76o0J07K26o7Q3j72j8K72l90m6J24N4k05J1n6M39j87r0
6151e3K36k27j02L4J33M1O9m86K54K27m84K59L54j29p5k83K73k64J81k75N33j26
$$ y = [-255, 121, -152, -110, 156, 27, -110, 239, -203, -130, 250, 178, 232, -203, -326, 203, -3, 56, 8, -73, -162, -180, -65, -67, 203, -100, -230, -216, 127, -154, 46, -143, 200, 77, -142, 52, 234, -241, 649, 180, -210, -6, -305, 130, -594, -65, 60, 32, 20, -107, -36, -5, -312, -107, 21, -130, 173, 214, 44, 46, 238, 27, -94, 105, -258, 333, 99, 11, -59, 7, 79, 43, 233, 202, 33, 77, -148, 302, 2, -25, 82, -297, -234, -26, 303, 185, -236, -41, 424, 211, -99, 25, -177, -81, 168, 68, 78, 158, -80, 266, 65, -172, -157, -259, -300, -160, -43, -113, -71, -89, 29, 375, 88, -21, -156, -158, 83, 146, 223, 191, 58, -91, -258, -149, -116, -54, -182, 38, 160, -141, -124, 141, 102, -164, -359, -108, -89, 274, -143, 98, -78, -138, -31, 195, 128, 211, 39, 21, 293, -97, -143, -19, 35, -170, -159, -215, 224, 37, -53, 183, -44, -146, -112, 21, 62, 131, -355, -101, 126, -358, -99, 255, 126, 51, -232, 41, -223, -42, -317, 216, 90]
6173I0k57N57l57n7K89n01R0N9%J4J34j41J32l02K10l58N51l16L79j01r7O8J1
6196I7j91O1k6J71j15j40J01R1l31L20k9O9j92K06J00r7J07k80L6k93M53k75L97
6219B40j18J1Ll36K02N5j23k23L59K2j18rk20M20l46L53l48j56M26j70J00m05
6241c81O84k30J34L39m62j85J88m1q6k41L19L2J37k09k35J38J60l5j42K88k0m09
6263b57K34J46o0r5K86j49J06K4qj42m73L33m9J87n9k86J26J3K04m2j66K2J07
6286Bkj11K99l68J93J53K2m36M84j28J43l56k21K98j09P5j09J92L8m4K91k61k78
6309b33J38r6L45n2N5q4Lk10O2kL69k31N0j73J89l32P9J46j08o8J9M07J31n39
6333a35K82k31L03k40K01m33M62l04K71l73K22p2J26j25k47L08J17l69J98L07
$$ y = [90, -167, 390, 33, -24, 265, -236, -146, -87, -87, -73, 61, -80, 52, -250, -40, -398, 153, -163, 216, 115, 18, 86, 97, -94, -33, -59, 112, -3, -143, -42, 49, -282, 38, 9, 78, -114, 92, 192, 95, 202, -78, -42, -335, 118, -157, 240, 122, 133, 136, -200, 2, 57, -66, -289, 70, 92, -26, -35, -255, 165, -181, 172, -176, -332, 94, -76, 24, -381, 303, 73, 207, 546, 84, -101, 87, 46, -40, -281, 38, 70, 207, -2, -237, -99, 61, 26, -116, 172, 152, -257, -23, 123, 63, -32, 254, 105, 211, 235, 227, 85, -388, -55, -104, 83, 24, -262, -136, -123, 81, 39, -127, -105, 2, 0, -111, 188, -180, 13, 166, 188, -248, 236, 108, 251, -105, -326, -28, -137, -62, -171, 21, 59, 15, 306, 45, -233, -95, -191, 154, 102, 157, 73, 76, -134, -72, -74, 295, 64, 114, -59, 130, -202, -123, 23, -85, -153, -134, 273, 404, -135, 147, -84, 219, -21, 180, -253, 209, -95, 176, -197, 25, -47, 79, -46, -293, 15, 132, -237, -39, 268]
6353B68r5j84M11k40m67R5J58M52q89M70K80q6k88L04m55L79Lk0j41J14l7j83
6375a51o0N6R1J09j29J56Ql7Q1l64K52P3q7j16L8K05k12j9L52l81K4L3k72M70
6399A20j77M73l47j73N8j42K06l24J76M02j56O6k93K54j72nJ60l59L70J71j89
6420A19j02l4K21k44L02r4j90L53m28L4J13j91N80m88j44K52R4n3q6Q9J67l82
6442a12M01j51k06J40KJ39l28L43pM1j12R6M1l63J81L1P2m25K00M48j38j77k50
6465a34J6P1Q2k27L8L75m6j06l99Q58m95k34M39m09M0lk41O11n9k50J79l71K40
6488b5J84j59k0N1P1J6J74n95m1L16L7l1J18j86M64j63m34L10k19mn3L70j44j14
6512g7m3m1K63k09L65l38K76j39r5k12P7J37K2J31j02M17n24M50m80L07j52p5
$$ y = [268, 173, -11, 400, 160, -307, -212, -54, 398, -491, -21, 259, 173, -115, 189, -266, 113, 116, 96, -45, 69, 32, -151, -211, -155, -64, 45, -84, 72, 80, 43, 124, -240, 12, 85, -2, -118, -80, 125, -87, -106, 246, -135, -111, -78, -350, 120, -57, 416, 69, -104, -46, -188, 18, -306, -130, 272, 116, 182, -111, 143, -29, -34, 126, -233, 137, 308, 119, 17, -17, 204, -40, 262, 168, -22, 331, -97, -63, 50, -141, 439, -49, -193, 59, 153, 100, 14, 103, 270, -112, 289, 138, -68, 72, 74, 213, -115, 228, 221, 262, 150, 246, 287, -76, 105, 136, 208, -217, -17, 431, 293, 116, -134, -118, -47, 35, -192, -154, 221, 175, 69, -330, 528, 33, -201, 238, -171, -131, -134, -375, 236, 177, -73, 106, -265, -25, 159, 0, -20, 31, 102, 118, 292, -303, -344, -28, 9, -22, 96, -90, 374, 211, -223, 87, -132, -136, -189, 181, 37, -77, -120, -161, 102, -107, 258, -80, 196, 57, -38, -250, -173, -36, -14, 117, 15, 432, -92, 358, -122, 185, 33, -42]
6534d2l6j86M21j83m4N2J28J3o4OpJ10k21J10m4J25O3j63N7O9Lj6l57K02j73O8
6560a09K08k5l24o4L3K92J04m2k41K5K5M30l58J32K35l51J34m9j81K23m67M91
6582A21j62J3M1R4k10K85l28K41L4k63L09J27k29j70l05M42q2K99j72k55J08n3
6604a15N8N0j7K55k78j05J01LK70k98J14k18K3M02k60k44L65l10M2K03K6m93L53
6627g3J65k76M02J33m44j53K3P7O8k50L71j15M09Q5n14J18k12L13k21L44j24n3
6649G3o3Jj28j0K87j57M3k7J17M8k52n2K08p9o8PK06j36k83M59P6k72m5J03K19
6674B75k08m6j47q2R4j23O2L42M6l63Or0M33j62J2R9l9M7j91j7K67k80K54j10
6698G9J04k46k4J24j01k73J01Q5L07m7j32M3L7l8O8k68P5p6Q5J36n5PJ43l11J52
$$ y = [-42, -78, -264, 157, -26, -70, -18, 110, 123, 59, 65, 58, 168, -53, 57, 13, 138, 201, 38, 95, 164, 167, 151, -206, -4, -177, -109, 99, 74, -250, -314, -281, 11, 115, 73, -168, -143, -118, 312, -46, 86, 321, -30, 104, 55, -126, 97, -370, 121, -41, -28, 13, 107, -103, 182, -146, 95, 129, -134, 175, 302, 73, -97, -402, 40, -42, 257, 85, -170, -62, -115, -57, -7, -24, 231, -47, -152, -51, -48, 222, -76, 38, -180, -157, 245, -15, -259, 106, -204, -162, 41, 67, -426, -73, 92, -184, 218, 351, -93, -246, -223, -146, -78, -328, 43, -72, 337, 422, -92, 26, -186, 127, -94, 250, 126, 73, 10, 11, -117, -127, 160, 3, 46, 19, 136, 184, -68, -120, 88, 9, -59, -52, 154, 18, -265, 194, 270, -2, -47, 56, 275, 67, 21, -126, -208, -114, -237, -175, 167, 213, -150, -144, -234, 199, 37, 49, 148, 109, 156, -35, -52, 215, -65, 189, 79, 183, -63, -87, 37, -64, -337, -236, -151, 156, 109, -23, 20, 57, 19, 87, -181, -106, -182, -97, 39, -16, -9, 134, -177, -25]
6723b5J17o3P3J50j80J87l90J35j37j81K21M1N9J23n7K6j8k40K55o9J5J33j88
6746a3P2j12q2K90j19J44r0o9J64j43j3k49L03q4k04K13m5j24L82m22R1J59n8
6769iK77l99K7l9K25j73M1L42k82MM44l96o1k74M50O2p0j25j05K3P1J42k14j25
6793a64k6K86m81M73p3j25j96K51Q2J31j87O1j69P2M8O4J81n53J05J18j26K82
6815E4k4j91p3L3L06l13L22k42K23k12K09l08K74N4K3k49J85J32m53M50m61M84
6837B23l32J76j0q3K4J35k38K26l22O8J95M0O6m58j0K82l7P9j46K54o8p9j45K86
6861A26O0l89K36J07k1j71M5p3J24n29L89M74k81p8j30J13j32R6q0J46P5k19M37
6884C25l33N9j13l1%K41p7J95l09J07K13l76K32l31K45j46K26J0j05J1k04J81
$$ y = [-25, 92, 29, 102, 252, 72, 259, -131, 4, -133, -314, -93, -52, 7, 130, 73, 99, 81, -159, 96, 27, 42, 175, -13, 59, -53, -135, 155, 36, 180, 90, 21, 185, 42, 29, -220, 83, -1, -205, 8, -37, -161, 221, -201, -110, 49, -9, 268, -131, -104, -143, 82, -91, -50, 292, 10, 14, 458, 62, 1, -273, 177, 239, 169, 44, -61, -38, 33, 175, -39, -164, -190, 96, -385, 88, 15, -110, -306, -55, 27, 158, -29, 32, -137, -65, -17, 47, 228, -325, -220, -102, -228, 54, 30, -161, -234, -201, 105, -208, 114, -128, 95, -117, 92, -216, 58, 112, 135, -114, 71, 203, -250, 200, -261, 223, -109, 67, 57, -26, -2, 133, -105, 121, -201, -133, 62, 102, 168, -290, -300, -18, -55, 24, -122, 132, 64, -15, -160, 126, 186, -203, 33, 140, 119, -52, -7, -80, 44, -485, -96, 378, 97, 19, -111, 2, -130, -34, -114, 32, 107, -112, 325, -8, 51, -62, -93, -93, 148, 71, 266, -43, 64, 277, -99, 133, -198, 47, -99, 127, 137, 32, 43, -161, 20]
6906B0j75J82R2n02PL92k8J39J09j31k78Pj58L84j56m9o0m8N99l23k10L80k33
6929d0J20j72K94k39r7J0J06J4J14k14J53p3k2J16j80J77L25k21j35J98j00j92
6951e8j15K22m4j60K68j94M6J67J6l49J31J14k06J5K01n75M14K41k96l1J80K49
6973B36k03k88J29j56J39J1o5L98k18j4K40k04n6L6k3k76K99lP1L1J24j96p6K8
6997c6Q8o1oj67J34J95%l43J41j78M82KP0j84j71L33k58k97L36O2P3m50K75J8
7021E8k75M62m74K14k1K1K12j14j28kj7m3K51K17l08ok0J95j15j85l3J96k71J10
7045g6l0J74j65K74l56R9K76k20j88J62J92j28K44m23M4m8K30j12n4K33j1j17
7067@k78L40l19K87k0j59K04o2J76k31P3K05k0k92J75m6O3j12J45k74K43j85J69
$$ y = [20, -155, 27, 119, -383, -376, 16, -12, 127, 236, 105, -173, -166, -324, 60, -96, -145, -205, -253, 346, 23, -187, 193, -40, 80, -92, 202, -37, -134, -124, -18, -4, 110, -104, 49, -24, -46, 70, -110, 67, 392, 171, 36, 234, 134, -58, -173, 49, 5, -155, 113, -81, -35, 132, 148, -201, -70, 44, -162, -147, 54, -521, -107, 134, -162, -193, -13, 236, 33, -255, -126, -282, -143, -132, -197, 201, -17, -31, 209, 5, -51, -15, -38, -314, -15, -18, 53, 84, 208, 12, -64, -36, 52, -9, -15, -182, -48, 147, 147, -196, -55, -233, 249, 251, 321, 137, -34, 299, 41, -256, 80, 142, 215, -235, 40, 58, -217, 245, -229, -15, -36, -15, 197, 83, -45, -47, -64, -107, 144, 361, 53, 47, 27, 222, 107, -78, -111, 85, -186, -76, -106, 68, -97, 177, -179, -80, 196, -24, -212, -50, 142, 14, 258, -165, -121, -169, 61, -51, -105, 128, 117, 0, -278, 62, -257, 30, 10, -149, 55, -7, 169, -62, 11, 216, 196, -96, 79, 33, 96, -16, 129, -145, 98, -87, 82]
7090H2j18M02n05N63l14j56K29k88K53r3k37J54J32M1j80jj47M32j48R6j36l0
7112C1j79K36J25qK4j28j18P6L1j22K0k28K98j46L08m08N38m78J22m3o4m1J18
7135c6P3J0k68n8L65j77k4P9PL5K23m65K69l11N84p18M05P0j00j07J85K44Qj93
7159A00j53L1n1J30k63J49J90k96K36k6n4m1L13k95r4K95k23L1J90j49k1k45M81
7182B35k52P7J47j85n1J53L21m78K03m8l90K64m4J59j84k84M03j32K10N3k41P6
7204A2j07N7j36nJ45M9k11M8J18L94l93k00K25jJ77k36JL0K68qj49j59J52M6n03
7229c86L08k7J05j69J83Jl0M7o4J55j17L02o44K26K22j01r6J82j13j24K13J64
7251B37k80J77k30P2O9j05J50j51j09L42k94M65l11J38l66K03O9j36J46J73o59
$$ y = [82, -36, 366, -139, 424, 110, -46, 183, -105, 148, 55, -182, -28, 104, 145, -35, -36, -183, 249, 101, 197, 61, 31, -148, 88, 213, 205, 229, 101, -17, 59, 90, -32, -12, -240, 58, -88, 220, -188, 350, -128, -6, -49, -113, -154, -36, 37, 47, -221, -279, 86, -91, -115, -36, -29, 6, 229, -236, 33, -278, 306, -412, -7, 63, -37, -144, 41, 285, 293, 100, -53, -22, -73, 57, -206, -57, 133, -163, 73, 47, -7, -48, 265, -30, -124, 171, -52, -21, 169, 20, -1, -246, 235, -17, 60, 207, 22, -29, 124, 445, -33, 170, 122, -268, -4, -48, 111, -73, -357, 46, -86, 124, 177, -64, 12, -95, -38, -174, -179, -34, 15, -196, -148, -30, 364, -29, -229, -4, -5, 172, -64, -63, -33, 235, 227, 78, -81, 71, 117, -386, -78, -105, 0, -169, 14, 15, -15, 32, -32, 123, 6, 308, -336, -110, 112, 11, -85, 97, -16, -140, 73, 237, -43, 134, -96, -24, 45, -60, 90, -61, -170, 172, -122, 343, 32, 170, -196, 7, 76, -60, 86, 259, -400]
7272d00O82k18p4j88M16O8m33J78pK17j50j95K01K11l69P9K6J05m17M09j99m4
7294a02P6Q0o6J33j21k42K81q4R7q3K19l22m6K0L42K5n93J06K07K01j94j34K16
7317A6o7l63N88j17J24l21j08K36J54k68J76Q0j90M76l02l13L73o6j65R2J97k72
7339d0j72P1M20l22J9L35o02K68J13j93J62K0k17K50j80J93q8j35L58l33J45j81
7361a09K35m18M25m42J63R5O4Q1J3J72l20P6M7j82N2L8k08J13k5K01J19k77M1
7384d6p6q0Q8J90k02O6K68r5j34K03o2k14L32n4k30K4k33J46L2J0O0k16K08J23
7408A08k14J48j57P4R8m18J67K19l90L98k6M15k76j11m2n1N5k9q1K72l7l1R9m17
7432b27J60R9J00k31K58Ql07j1P6j7p8j0J69j87K33r6O3j28K88j3j30L2n3N9N6
$$ y = [-400, 282, 64, -10, -198, 218, 286, -147, 31, 24, 241, 91, -104, 97, 308, -61, 18, 44, 149, -268, 141, -58, -102, -26, 54, -12, 121, 0, -242, 39, -45, 52, -31, 188, -134, -180, -160, 182, 207, -386, -280, -73, 128, -66, -200, 16, -51, -414, 174, 57, 181, -140, -248, -12, 142, -126, 50, 130, -60, 416, 114, -199, 174, 108, -57, 35, 232, -40, -212, -141, 279, -43, -24, 311, -291, -23, 90, -103, 59, 79, -138, 112, -68, 125, 37, -98, 260, -73, 72, -109, 126, -292, 133, -309, -146, -51, 13, 94, 107, 279, -41, 35, 82, -100, -48, -10, -218, -105, -130, 71, 190, -87, -46, -122, -202, -114, 76, -126, -60, 208, 113, -21, 182, 120, -94, 238, 184, -46, -22, -255, -109, -77, -67, -7, -223, -15, 108, -106, 42, -115, -41, 57, -361, -194, 25, -365, 33, 7, 422, 146, 35, -7, -58, -3, -32, -113, 159, 122, 91, 190, -227, -67, 32, 132, -99, 159, 167, -140, -151, -75, -92, -170, -180, -11, -198, 35, -61, 2, -126, 162, 149, 19, 51, -2, 57, 113]
7457A13k11J0M38k53K26j53Op1j17J0K91j52j3m15L30k7j51J38r7Q0l59L03K45
7480A71q5j32K91r6j26m7k40L18J42l93J86O7l68K05M43m23K78L8q9j03n0Q5k28
7503a56J03L76k03j13Q1K31k47j40L30m68o8J53L70j21q2K2j16J33Q9k40M7L3
7525A4j99K71L3l77M5L59o8m6J46j71j05j53L64o3j86J11N6l4Q5k91R5k8K98o0
7549I6K45n12N40k65J43K12m91o1O7J74j90n2J74N3j45j71J16j37M71Nl59P5L36
7572C24l26J72k67r7K99K58l25N8J64j49k34K50k14k6J71k13K6M75j54k31L35
7593B96k36mJ90k31j09J41m9Q4k83L90L12m04Lk21J36RJ54Kj66k40J82L53k42
7616F7j51M33o05J32J19l05K48jP7k73L53k97J40m7J80M0q0Q7J2l11J37K25m55
$$ y = [113, -98, -88, 350, 97, 323, 170, 176, 105, -12, -2, 289, 137, 124, -291, 39, 12, -139, -1, -98, -18, -377, -74, 171, 86, -46, 245, 149, 23, -24, -264, 54, 196, -197, -11, 56, -312, -107, 336, -87, 191, 229, 140, 37, -13, 72, -156, -53, 323, 120, 7, 88, 319, 72, -68, 262, -206, -274, -121, 249, 128, 46, 68, -48, 85, 174, -66, -19, 14, -185, 86, 119, -258, -213, 146, 78, 32, 178, 7, -98, -251, 113, 50, -136, -25, 31, -3, 82, -209, -114, -142, 156, 96, 341, -171, 369, 104, 247, 459, -32, -93, -26, 148, -42, -94, 80, 133, -12, -183, -67, -204, 267, 272, -87, -12, 324, -2, 170, -97, -194, 105, 363, 38, 96, 260, 111, -123, 127, -87, -113, 58, -155, -129, 346, 192, -39, 296, 60, 56, 246, 15, -94, 47, -2, 82, -201, 189, 501, 97, 100, -121, 15, 24, 178, 180, 14, -226, -44, 309, 67, -84, 349, -256, -124, -5, -310, -62, -63, 14, -259, 94, -203, -63, -110, 70, 110, 30, 117, 129, -182, -45, 180, -275]
7639b75J94j17K76q4L6j07J33J25q8K02l84J46J66j74k02J58k52L32K77p95M24
7660iQ3j0m5j04K50J7K1l32J86J89l56m0L82k40J55j43pJ80k64M3J6K31o23K34
7684a86L34Pj68L3j15P5K89m60N09j17l29m8J38k3R2M9j35J64Q8M8n82L40O9j35
7708f3K11k74K49J9j16K52l6m42L33N6j45m8j08j03J44J65j79J0J4L13l97L65
7730B20l08K53j90m8J48k31K44K56k46L8o8j76N2m9L8M57n70J63k38K31j97O54
7752D33k60l83K61K43k74j09r6R6K40m25M38j1m13P6M1J77k43J61K07j42J39k44
7774h8m6K17l1j41J20J9K1l16J43m7J41J23j54Q6J2K8q6p6k18L75j4N9J3j82Q6
7799D4J07K8l03k13M12k29L57k83M12l58RJ48k15J59k6j22J62J81j68j94o0K37
$$ y = [-275, -81, -198, 78, -6, 30, -77, 56, 181, 93, 295, -89, 57, 223, 49, -153, 5, -247, 85, 362, -433, -9, 74, 64, 19, -85, 165, 182, 203, -129, 57, 246, -110, -150, 232, -8, 147, 4, -3, 177, -87, -44, -28, 203, -420, -186, 148, 155, -13, 20, -95, -20, 269, -191, 318, 201, -128, -176, -38, -61, 31, 80, -55, 109, 197, 245, -337, 3, 72, -63, 148, -126, 123, 142, 26, 278, 242, -200, 133, 189, 44, -4, -112, -215, -71, 94, -85, -75, -61, 252, -145, 220, -88, 165, -25, -73, 75, -156, 88, 344, 98, 136, 68, -108, -56, -105, -67, 390, -180, -17, -255, -24, -221, 433, 173, -210, 51, 294, 20, -89, -185, -89, 151, -274, 164, 153, -260, -184, -143, 34, -209, -48, 159, 17, 156, -88, -134, 83, 52, -89, 31, 50, 71, -245, -102, -149, -8, 115, -39, 47, 59, 87, 1, -75, -293, 82, 68, 127, 140, -42, 44, 151, 179, -124, -337, 75, -154, 203, -80, 332, -26, -17, 131, -84, 75, 49, -73, 89, 270, 102, -92, -152, 85]
7821H5k78M56n0k87K10l6j08JL38o36M86n07K43J07L6j69N3K33m17K52K4r3m1
7844i8j41L65k01n7K63k16o3M60j64J0k94O0P2k37J03K79l88K18j57l5J90k32
7866b63L48l8j44k18L42j19J50k24J15K2j31j14N79o45M09M6K3j27j40N5j49j01
7888c24J24J51K52j54j07L19j87k68j68K65K7k15J12L10j74p9L94q9j62l2k37
7909b42O0L96k46J8M6K66m70J87K5j7R1q8j13j0K85k66K05j92K25j75j8n7K7r7
7933a60K32q3O2q0L61m72J57J70k9k62J18J37m86J82M8K03r0j01L7J6K86k42k72
7956b68K31r1O9Q8j47n5J14J52k4k41L64k27J5J44m26P12l56j62J23j58K40K47
7978C44n51q0RJ94j41L47j26j78Q2R1J04J2j29Rn5L9N7l11M16k40K08m16K74m67
$$ y = [85, -193, 263, 213, -74, 136, 100, -8, -7, 331, -305, 181, -326, -83, 24, 60, -109, -56, 177, -240, 12, 36, -57, -98, -239, 126, -75, -132, 131, -85, -148, 312, 148, 158, -136, -76, -4, -241, -138, 141, -247, -29, -186, -221, -31, -263, 85, 47, -97, -315, 27, -92, 58, -166, -51, -29, -160, -274, 305, -340, 69, 115, 138, 11, -129, -74, -223, -324, -200, -49, 203, 49, -58, 261, 74, -194, -362, -97, -70, -285, -173, 137, -37, -116, 278, 189, 27, -5, -242, -182, 214, -32, -14, 32, 298, -172, 15, 40, 23, 114, 26, -87, -97, 188, -78, 127, -65, 160, -15, -33, -90, -63, -160, 72, -11, 51, -29, 332, -140, 17, 187, 158, -104, 14, 151, -335, -153, -105, 98, 8, -93, -56, -40, 246, 4, -268, -37, -128, -59, 29, -118, -173, -59, 93, 69, -172, 192, -35, -20, 124, -302, 410, 54, -108, 15, -143, 97, 344, -207, -287, -278, -84, -225, 122, -4, -182, -100, -9, 95, 107, -22, -13, -68, -29, 28, -283, 133, -107, 101, -315, -41, -508]
8002e08L48K88k7R0j84L69j91k27J40j96K48J03k13j87J35j61K90p5j28q0J74
8023Hmp0j62M28m72M06k10J6o2J56l7J40l68K35K88m82l71L32M17l14J28J08n3
8046E7k55J08K13K4J21j59k1k83M31m96M07j74r3K32j82K79k35J27L8J79k58k00
8068a40RP0n8M9j0J10n6J37l4k37P0l9j20Q5p2J25L84k70J4Jk0m84L88J49JJ13
8094A65l38K48j05j02L35Pl1l62J34P9M9J06kk64l1K55q8J61j01J21o8k74j32
8117b38L15j4j9J06k25K68j17L7j7l1l85L43L57m6n16q7L19J48l95Q3J6L01k61
8140e8q9K41k70L38nK7l51K6J59J43k8j77K63r4l19K88j86L8L22j31o5kk12J48
8164Fj06K19r1j77O31m41k23K26m2M0k47q7K08L03l20j20K26J7R6%p9q3L08m07
$$ y = [-508, -160, 128, 101, 191, 7, 376, 185, -42, 98, -98, 150, 253, 40, -147, -12, -173, 117, 42, -86, -166, 8, 4, -66, -228, 200, -272, 134, -76, -60, -122, 34, -3, 137, -231, 4, 292, -190, -561, -229, 188, -126, 2, 110, 57, -198, -90, 123, 147, 268, 109, 88, -195, 236, -260, 147, -27, -120, 112, -70, 209, -26, 101, 139, 318, 60, -140, -131, -61, -119, -70, -80, 30, -26, 111, 77, -160, -90, -129, -249, -164, -236, -111, 273, 3, 17, 18, -2, -486, -98, 51, 52, 165, -173, 75, -30, -132, 203, 210, 179, -183, -49, 30, 79, 185, 183, -81, -112, 143, 55, 216, 115, 236, 168, -106, -238, 77, 63, 44, 150, -75, 193, 76, 113, 96, 65, -320, 23, 380, 334, -182, -269, 50, 198, -197, -114, -98, 203, -58, -147, 94, -176, 162, 157, 184, -167, -141, 18, 161, 133, -44, 219, 125, -194, 94, -92, -54, 268, 137, 72, 70, -142, 6, -100, 119, 28, -149, 482, 41, -182, 44, 2, 42, -205, -292, -84, 219, -101, -221, 5, 22, 118, 118, 39, -44, 264, -143]
8188a43J92J79m22
$$ y = [-143, 49, 228, -194]
8191a94
$$ Imaginary data points
##PAGE= N=2
##DATA TABLE= (X++(I..I)), XYDATA
0@%%%%QqQj6J6k4L2m0M8n6P2q8J04j26J50j76K08k42K83l27L76m33M95n61O35
29C38p21Q14r14J022j145J282j429J590j768J963k175K410k669K954l272L626
45A906m019M462m966N545o214O996p932R073j0497J2340j4826J8383k3947L3953
59B0257n7575K14379J97837l40866j62836N9940K05740N7785m4428q6029l4289
70B9915k2523K9327N1483K7510p2045p3709K7170J12882K6723r7793j06963J3621
82e4402Q3146N1434r390j5234k6358o2097n4059M9448J20980M8993q5661j04602
94e7802o567O5084L2923j4156J885K9752j1572o7851l1756O4037P8133j5883q5023
107a8796l3926O1728P1930j0822p6022n1763K1397O7930O2158N648p8835j08907
$$ y = [0, 0, 0, 0, 0, 8, 0, 8, -8, 8, -16, 16, -24, 24, -32, 40, -48, 56, -70, 80, -96, 112, -130, 153, -174, 202, -231, 264, -297, 338, -383, 431, -483, 539, -606, 676, -753, 837, -931, 1032, -1143, 1267, -1402, 1552, -1720, 1906, -2113, 2349, -2617, 2928, -3286, 3710, -4222, 4851, -5646, 6694, -8132, 10251, -13696, 20257, -37318, 177061, 374898, 34032, -128804, -68864, 136876, 194661, 150233, 64204, 29915, 7392, 36719, 88202, 115712, 43667, -30042, -2872, 110010, 136733, 38940, -68023, -54402, 28744, 80178, 70788, 55554, 29196, -32901, -86960, -37512, 83468, 132461, 46800, -57802, -64369, 715, 33638, 19482, 21367, 51119, 39547, -28304, -60060, 3977, 82110, 66227, -18796, -52722, 9006, 80936, 70114, -5908, -57671, -36274, 31656, 93814, 99462, 20627, -88280]
119h8280j6383J15891J28026j0652j39490j05048M2459J21030M8937n9183p1122
130c3815r176K8627K3801J6767M219l3107n5634n310P3290P2155l0807j06296
142e5286n1969O0311Q9602J8880m9769n2151j6516J7953L4102K8126l989l6753
154a7459k8663J6485L9276L362l5837j4889L0078K4226k1225k9480J5664L8736
166B0274l154n2123k4272N0380O5862o860p0175m8571K2766O1910M0554j1039
178D5552m5841m1082j433M2811N1530O342m9751m8763J2290N8137L2017k6451
190C5358m7541j6507K6787M1740K2110j4887m5466m1470J0124O7872N7808k3362
202G2566q4453m8265M1262P7215K3649m7633n3750J044L9074K2032j3202k3852
$$ y = [-88280, -104663, 11228, 139254, 128602, -10888, -115936, -73477, 47553, 96490, 37307, -33815, -42991, -14364, 9437, 26204, 30423, -2684, -58318, -63628, 9662, 81817, 51010, -55286, -107255, -46944, 42658, 61538, 11769, -40382, -56898, -38945, -4843, 23283, 19294, -17459, -46122, -29637, 9639, 13001, -22836, -37725, -7647, 16579, -4646, -34126, -18462, 20274, 17120, -35003, -59275, -8895, 56967, 50107, -20068, -68639, -45873, 16037, 56591, 45552, -289, -41371, -42804, 7, 51537, 57879, 8128, -40635, -28345, 29792, 61809, 35358, -12183, -28690, -1903, 39837, 61947, 47060, 1594, -39876, -29752, 38120, 95928, 72566, -11887, -60152, -18890, 58325, 81974, 34341, -19409, -18365, 20709, 42741, 29539, 5687]
214E687q123R429J6226O828j0307j8395q568R489J5096M168q072m015K554o929
228E068j7863j006K8266K7894r523l9938k5051J5211L6100J6062j3176k0115j0313
241h384j779Q266J8708J1835j2957k6830q245K5195L0816l460l8532k8145J6826
254a6686M4368K5103k0636m7855k8414K1521N2985L0102k6877n5989k5330L3092
266a4616N1517R403m0287l6812P956L3298J5582j5990k2624n703J1758J1706L988
279I176l714r926j2035k387J2548J4656J360j1202j2282l746O134Q911O063N86
293D142n809r057l138N628P429K393o18j197n304o805J741J3008J1381p400k2236
308a5842q942K1049K8753r93l3175k6190J3008L9006K0962k0496l9203j3747K4633
$$ y = [5687, -2436, 6993, 23219, 30047, 19740, 1345, -7223, 2266, 17362, 21530, 13458, 9443, 11997, 5068, -12795, -13801, 14465, 42359, 32836, -7102, -32153, -16942, 19158, 35220, 22044, 1929, -8384, -10163, -1897, 16811, 28646, 15689, -11141, -19386, 5809, 36625, 33165, -5367, -33512, -16686, 27682, 52785, 32149, -15706, -44120, -22599, 30386, 60488, 33611, -22378, -47708, -14616, 36901, 46304, 6017, -30795, -22839, 10459, 26041, 10051, -12573, -18276, -6518, 5188, 9176, 5462, -4464, -16499, -18886, -6338, 8318, 9678, -1524, -13806, -17552, -11418, -2507, 3556, 4142, -1667, -10724, -13862, -8234, -805, 1588, 970, -227, -5531, -12336, -10595, 2413, 13794, 6394, -15842, -24784, -3735, 25018, 24025, -9150, -35340, -22332, 16674, 37636, 17140, -22063, -35810, -11177]
321a1177L4366R559k3505l1652o254K5538K7326p52k5276k0722N332K2683J4116
334A9582p947j7838r592L939J2426J0884O80j1632j4725k086J3336J5570M37j5460
348b426j2836M431J4546N451p890p900Q80O706L165m732m667K536O233J65o336
363b674n193L616J0399M795r653j5756m52J8609J6302o071k3469j4531J2324K5445
377A3691R002j6529k1406l464J5605J6784K193j3921j4419k76J1775J2569J383
390A2987j1084j4109j907J3224J5027Q43j3453j5788j503J5079J6607M29j6301
403E1j5466J179J7274J4260n370j8175q062J0278J4889J802j2104r649L906J1102
417E915L827o950o622K017N632J947m192m433K605P304J379q028p191K298J0048
$$ y = [-11177, 23189, 32748, 9243, -22409, -28663, -3125, 24201, 23449, -1827, -22549, -17217, 5466, 19582, 11635, -6203, -15795, -11856, 570, 11454, 12134, 502, -14223, -16309, -2973, 12597, 13034, -2426, -15262, -10831, 3715, 9166, 1276, -6624, -5744, 962, 4127, -605, -5272, -2736, 3497, 3662, -2674, -7867, -4251, 6148, 10943, 1290, -14466, -14918, 3691, 19993, 13922, -9547, -24078, -11754, 13691, 22693, 6164, -15242, -18706, -3101, 13683, 15876, 1955, -12464, -12740, -965, 11604, 12987, 1903, -12206, -14113, -889, 14138, 14981, 1528, -14260, -15763, -684, 15923, 16352, 51, -15415, -14236, 3038, 17298, 11928, -6247, -14309, -4031, 10858, 12660, 556, -9093, -5187, 5915, 9742, 2792, -3830, -1813, 3819, 5766, 1574, -2859, -254, 7050, 8429, 401, -6790, -4492, 5556]
432E556P377m018j2501o643O684J2721M103p255j1102m358P515R971K854o545
446D359r705m820O314J2170N093r988j4683l238J1965J5454J557j5750j5758J927
460a5103J7412J2962n117j6648r948P280J6015O358r938j3160j309J0182R774
473H760j389r603n841M288P313J996l729l678J53K449R86j276k44K215Q27j371
489A856k683k51J274K761J828j942l636j703J496L621K839j118n373m266J919
504c378N741N230k538r121n911M745J1482M601q670j2498l226J0713J3495j83
518A0482j4301j1421L590J4163R171n745j3930o141P766J2006L248p845r567j309
532i833P738Q130n54o879n205P79N430M531r96l977l447J034K965K768j75l058
$$ y = [5556, 12933, 8915, -3586, -10229, -3545, 9176, 13279, 6024, -5078, -9436, -1921, 8050, 10904, 4359, -5346, -10166, -3852, 8318, 13411, 3423, -11260, -14498, -2533, 12921, 14478, -1272, -17030, -15103, 2309, 15271, 10154, -6494, -16442, -9162, 6853, 13211, 3273, -9887, -11196, -1014, 8760, 7371, -2232, -8073, -3785, 3528, 5524, 1795, -1883, -1730, 719, 1705, 429, 185, 2400, 3227, 1856, -827, -1078, 196, 2957, 4785, 2843, -793, -2496, -1000, 2621, 5460, 4342, -1031, -5297, -3378, 2363, 7593, 5055, -4066, -9977, -5232, 6250, 10851, 2181, -10317, -13543, -2830, 10665, 10482, -3819, -15240, -11650, 2513, 11684, 5939, -7991, -14132, -6366, 5640, 8888, 1043, -8524, -9833, -2095, 6035, 5481, -1398, -6603, -5824, -394, 4137, 3141, -836, -4283, -3249, -284, 2484, 2309, -749]
548g49k401J217K708Q39j737j752P79K625P36l106k686J749N152R33m237n111
564e041P57O483N003k875q828m033N863R471K894p558j0136r90J0118R066k088
579H106j0222o992L346J0440N178n130q974k837N444P460K571m945p378j864N344
594d53O504J615n144n936j365N150O145K60n227m647RM309M741j243n009k211
610b502K339L736J085l055l343J209L632J213k607k613J040L065J287k459l632
625a605N29M628K715k789m755j732L538N498Q57n186n229J57N503M427k90o373
641a07m508J994N817L352k301n878k833K349N356L315l060o354k830L477O238
656D027L307m767p318j542M955O531O70n575n503L15N851L865j878m606k378K613
$$ y = [-749, -3150, -1933, 775, 1614, -123, -1875, -1096, 1529, 2265, -841, -3527, -1778, 3374, 4307, 70, -5041, -4284, 2199, 7202, 4327, -4501, -8534, -2671, 6800, 9694, 2136, -8000, -8990, 1128, 10194, 8106, -2116, -9108, -5762, 4678, 9856, 4726, -4248, -7085, -1641, 5819, 8390, 3445, -3933, -5797, -453, 6051, 7666, 2522, -3414, -4779, 371, 6516, 6776, 1549, -3098, -3089, 1220, 5961, 4718, -291, -2502, -163, 3573, 4658, 1603, -1740, -531, 3101, 4314, 1707, -906, 134, 3199, 4486, 2027, -1605, -1076, 3552, 6267, 3478, -1277, -3009, 529, 6027, 6884, 1698, -3531, -3374, 2129, 6556, 6266, -107, -4615, -2621, 3196, 6548, 4247, -1631, -4464, -2115, 3241, 6556, 3496, -2858, -5688, -2211, 4027, 7334, 2567, -4751, -6293, -1338, 5193, 5863, 288, -5215, -4900, 951, 4816, 2938, -1668, -4046, -1433]
672a433L951J577k878l381K86L121K157q50k350r05J935J851o92k019qJ700J313
689C375o65k010j270J159K625Q97j317l611j236K595L187J118l684l648o53M302
705A164L642p73m942m075J483N710K932k544n842l435L548O384K047m561n879
720e141j090M670N747r8n739m080K000M922K781j930m487j740L129M035L58j997
736A340k609n7K038K596J4j727j311N67J736L41p54o36K63R48M90j346q46O95
754A742J233L28lj711j082Q07K168M52j591k246p16K763K755p40l559k488J178
771g10L959K334k132m188k286K691M032J797l091m012j276L556L966j76l902l137
787b575Q04L449L127j711l507j821J706L331J255j548l162j612K370K870N06j660
$$ y = [-1433, 2518, 4095, 1217, -2164, -1878, 1243, 3400, 2550, 200, -705, 1230, 3081, 2389, 370, 362, 2062, 3375, 2710, 700, -570, 589, 3214, 4111, 2794, -817, -2053, 542, 3729, 4847, 1163, -2485, -3138, 1164, 4806, 4033, -909, -4984, -3501, 2209, 5141, 2597, -3245, -6680, -3132, 3252, 5299, 738, -5141, -6231, -1561, 4186, 4088, -1651, -5731, -3731, 1191, 3972, 2042, -2445, -4185, -1056, 2979, 3337, 1340, -1269, -1326, 712, 3308, 3322, 1595, 284, 851, 2587, 2928, 2174, 1538, 1801, 2749, 3239, 1893, 1047, 1742, 2975, 3303, 3300, 1589, 507, 1314, 3482, 3934, 2343, 97, -619, 2144, 4899, 4159, 600, -1888, -710, 3249, 5583, 3451, -737, -3023, -332, 3700, 5497, 2406, -1606, -2882, 674, 4640, 4464, 562, -2575, -1771, 1678, 4805, 3094, -413, -2234, -528, 2803, 4058, 2510, -652, -2264, 106, 2976, 3482, 1822]
803A822k183p19K018J872p74j557j087J398J358k71j094r35K44J696K5q03j367
820c57K21J776P96m92k561j99K105K025r82k137k235J206L415J539j893l577p48
837b098K038L262N79k292l064l01K548K731p05k327k576P39K702K116j359k842
853h49j688J541K460J454j377k996o79J254K302O64j600j763j09J585J144j60
869A183j287j012M88J274J81m35p05m6N51L43N1n43oK55K59j71o93k38J077N78
889A104l5q91j003K85J770O28r79j365r65J136J775N32j430j873m05J710J787
906A781P4j990j913M86K162J420l91k332j667Q64K849P49j048k059r10R01K136
923A112R15j697j664l75J761J548l64j302j323N95J365O34n26r54j99J93J012
$$ y = [1822, -361, -1080, 938, 2810, 2036, 479, -608, 790, 2148, 1877, 783, -152, 92, 1788, 1813, 1010, -357, -136, 1640, 2436, 1944, -617, -816, 1289, 3314, 2332, 195, -2040, -834, 2581, 4120, 2227, -1350, -2098, -60, 3202, 3781, 1489, -1575, -1876, 672, 3403, 2698, 371, -2205, -1466, 1236, 3352, 1993, -849, -2537, -996, 1464, 2918, 1541, -1455, -2134, -880, 1422, 2086, 486, -1277, -1386, 199, 1343, 1183, -104, -1116, -628, 646, 827, 392, -313, -359, 192, 535, 586, 43, 37, 292, 551, 380, -313, -551, 526, 1104, 1069, 178, -825, -540, 1230, 1858, 879, -486, -1451, -315, 1460, 1992, 562, -1311, -1716, -6, 1781, 1855, -135, -2048, -1562, 600, 2020, 1629, -703, -2370, -1506, 1343, 2092, 1044, -1015, -1925, -1024, 1112, 2027, 330, -1334, -1709, 52, 1600, 1236, -66, -1389, -794, 571, 1205, 679, -275, -474, -281, 731]
940G31j4p80K5M02Q7L77n26r1m7R86Pq96o81L10P17N90k90j209m80R36J240k23
962A171r58j161J19O41J977l03j860j291L92J791J464o49k022j521J567J844K26
979A427p88j599n58J334J265K95j331j572L61J504J349n86j823p21P86J013P54
996A110p06j158l63R63N06L47r78j15J11N25K78m00o47M45M19J03l78m59P7O56
1016C36K86n51m00q79J223R07l88n97r65J89R38J108n46j034j053K86J760P68
1034A388p12j561m55R58J361M05j167j352M8J188Q77L59j463j021J57J395Q31
1051A236l55j416q61R20R45O01n77j180q6Q74N41J69m86q36j39R08L44l27j99
1070G6k42K37K22p4o63N5L07M29k96k68l02L79M73J68o09n93l01J124N67O7j303
$$ y = [731, 717, -63, -38, 364, 451, 828, 302, 211, 164, 1150, 1157, 261, -420, -110, 607, 1197, 907, -302, -782, 154, 1394, 1171, 213, -948, -829, -188, 1789, 1486, -374, -1665, -1273, 518, 1982, 1333, -689, -2210, -643, 1201, 1427, 639, -960, -1518, -184, 1081, 1376, 45, -1527, -1166, 338, 1687, 1101, -722, -1443, -657, 356, 1110, 404, -754, -1117, -154, 352, 699, -279, -394, -283, 242, 520, 120, -527, -82, 337, 440, 62, -397, -320, 336, 622, 71, -329, -1208, 15, 922, 534, -63, -1028, -839, 99, 1207, 661, -373, -1426, -1140, 620, 1388, 676, -885, -1340, -382, 979, 1384, 217, -1135, -1087, 101, 978, 1337, -126, -1147, -990, 405, 1236, 881, -535, -1396, -476, 469, 1070, 493, -687, -773, 101, 642, 811, 325, -511, -650, 258, 602, 275, 76, -166, 71, 293, 219, -444, -389, -82, 347, 51, -217, -519, -140, 333, 501, -108, -701, -1002, 122, 689, 756, -547]
1091e47q26M29J590M7P9j610n48R88J336M41j306j390K80J522O79m4j348p71N80
1110d19J208M59l70j216m46N45J548K18j155o95n5P67O02K63j160m87L74N23L70
1129H74j78o45P7J46J63N63n82k62N6K99n69J42l46K60O19r3n05n44N10J8P71
1150G74m00r54n19Q15N88L16m54r44j76P42P85k29l19j261M46N17Q95J06j205
1169d77r34M25Q25Q58k9j313k79M39Q33L03j75j301k71O34J249p7p49p33o2Q86
1189E2M14k0q88l06M01N32M88p02l81k50N17L65n28j46k92M61K97j55k88k08M36
1210b01J11K58m74l56k43R20K73j78p19o35O78R75K51q94q07N8N20J173J18j280
1230d52m28r4J560M3j29j359k05Q42N59N76p07r14J7O85R68k96n88o78K38J019
$$ y = [-547, -1373, -944, 646, 693, 772, -838, -1386, -398, 938, 1379, 73, -1317, -1037, 485, 1164, 1120, -228, -999, -419, 789, 1248, 878, -338, -784, -239, 1309, 1527, 372, -323, -378, 389, 991, 1254, 94, -393, -19, 504, 874, 696, 51, 128, 274, 437, 1000, 418, 156, 212, 511, -58, 84, -262, -2, 617, 524, 19, -525, -15, 3, 774, 374, -580, -1099, -284, 304, 620, 166, -778, -954, -212, 573, 344, 25, -1236, -790, -273, 622, 728, -477, -1411, -986, -161, 697, 668, -645, -924, -485, 348, 651, 476, -825, -1096, -462, 787, 710, -39, -772, -834, 52, 466, 446, -442, -748, -347, 185, 673, -29, -410, -660, -143, 222, -306, -452, -744, -283, 14, -141, -429, -637, -201, -90, 168, -306, -662, -905, 15, 288, 110, -609, -1244, -566, 409, 660, -234, -1041, -983, -463, 710, 828, -452, -880, -974, 586, 629, 500, -859, -1064, -222, 337, 913, 206, -708, -691, -6, 962, 666, 78, -600, -362, 657]
1250F57J37k28p13l21N64O18o2j28p44K55J27K98J94l12j86n9O37l02Qm49K83
1271B74P4Q5r6n30L57L47J91j11n11l14J51O40K6K03j169J02L10O62J71q18l62
1292c18o5R98K90k35q91o36P48O75J96o56n66J78L63M92L19j021K0j04O14L58
1312G59po71m77L65N79L4k27j25o31N06O92J2r83j1k7N18J76J3n09l19J47N44
1334C58l98m1o7j71N26j12n41j58K14J43O50p58k99j80O7O26K70o05n43L07L85
1355c27K80j15p07m29M40P06j5l10l43j07L58N62M91p73o37J19O58K39K07m74
1375a77o95N26N71N17o55n27l27O41R32k18p79J89k49N00O8J67p13j02K83O90
1395F42j7l51l82L35J58j52k62J17k6L45n3K1l41l64N81J31o2k81k42J15L28J35
$$ y = [657, 794, 566, -147, -468, 96, 714, 652, 524, -220, 35, 162, 460, 654, 342, 156, 97, 734, 432, 440, -9, 274, 348, 433, 337, -193, 164, 511, 702, 591, 80, -234, -83, 557, 583, 786, -383, -281, 29, 691, 862, 44, -318, -383, 615, 905, 670, -221, -857, -109, 566, 762, 106, -460, -282, 81, 573, 892, -129, -109, -213, 401, 759, 752, 81, -396, -31, 548, 582, 355, 230, -401, 105, 797, 809, -174, -185, -212, 306, 482, 495, -14, -333, -186, 358, -40, -81, -148, -319, 207, 95, -446, -604, -390, -247, 403, -355, -654, -834, -767, -141, 129, -476, -1019, -712, -327, -47, -162, -869, -1298, -858, -152, -167, -477, -820, -927, -569, -7, 484, -289, -926, -807, -149, 90, 297, -177, -872, -346, 225, 742, 87, -440, -767, -126, 806, 588, -191, -2, -251, 249, 317, 484, -229, -331, -48, 642, 625, 274, -108, 227, 385, 233, -29, 88, 62, 407, 354, 375, 34, -330, 251, 382, 320, 39, -203, -88, 240, 375]
1417C75M2n25l19L02J96M61l75k27j46J65O05r8k31p12NO28L63p8n65l97K34M77
1439A80P2l61k58J22K83M37J80j86o49P2K82N34l33o2m12K31K09L81k36m83L0
1460C3J37K8L53k42m74M31k2p8p1j12j56L08O9L2p15L22K18N10m48j98k74l2P11
1483C30N2k37m67p6K64N06J40m52p17o7N57N62m50m99r1K32N31M50o51m43l08
1504h34R48K19L0l49m44N8L11M62m88Lk65k2M98L31m43k31j65J53Q76m67m2m70
1526c31O12k70L33j19l51L40J36j67j95j0p0n0L66l5k33k71M2M79J72j29n64P9
1548b36K9O78k63j93l27j5O21R2k54m18l20N00L78j9r5m13k37L06J47J3j96%j01
1571c23O65k52p6n0k34J88J20M27k52k29k31K80J88j48k86K33j74L51l46M57n27
$$ y = [375, 417, -108, -427, -125, 71, 532, 157, -70, -216, -51, 554, 456, 225, -487, -482, 146, 509, 431, -134, -531, -297, 180, 252, -109, -367, -245, 38, 475, 655, 469, -180, -108, 174, 708, 375, 313, -99, 132, 341, 722, 486, 3, 33, 170, 198, 551, 309, -165, 266, 244, 166, 95, -17, -173, 135, 204, 236, -479, -157, 61, 571, 123, -75, -349, -381, 330, 382, 145, -322, -398, -134, 372, 512, 60, -657, -724, -167, 395, -55, -554, -645, -413, 118, 568, -83, -526, -834, 114, 333, 363, 14, -430, -372, -61, 401, -87, -84, -349, -371, 127, 458, 15, -216, -381, -228, 648, 181, 139, -331, 281, 11, 344, 225, -126, 214, 350, 183, -12, -22, -92, -142, 224, 189, -44, -315, -273, 206, 378, 249, -315, -236, -207, 471, 208, 15, -312, -327, 294, 386, 132, -286, -606, -106, 272, 253, 158, -255, -492, -186, -39, -26, -222, -222, -323, 342, 90, 14, -36, -270, -82, 38, 465, 213, -16, -247, 33, 221, 73, -213, 20, -154, 197, -149, 308, -219]
1592b19k0L86j66M81o25J38q5K06k0J52n58L46M40k32J80o63J10k00M02J79j24
1613A08l88j79L62K92O0n41O8l50R02J48n34m11m2L18M72O3k11n35J30L67L08
1634D07j67k94k78J27q3M01n9j93j50K38K39k42J17m88M34p3J31J2m03n5J74K67
1656F2L6K39n39J85J04N5j70l48M44K2L4J26l20o4kK85L1j3l77J84k5L38J5l88
1680h6R1m19N32L06k60l83J67k3N14Jm63k85L49r4K85M00q16j2k9P36l57j93j90
1703b29k01M66m7L45k78K0m04J34N63m54L8j1m6L33K07l87k44J43k35N37j29R
1725A30l47N1J82K02l13k3k48M51j25K97l89k42N08K33l01k48q5L7K90J33q7J15
1747B21p00L43K91J84k68l66Q7J73L09j26k47j61L5L73l12M72l85l8r7O40k59
$$ y = [-219, -239, 147, -19, 462, -163, -25, -110, 96, 76, 228, -330, 16, 456, 224, 404, -259, -149, -349, 53, 232, 108, -280, -459, -97, 195, 255, -286, -218, -568, 334, 482, -52, -463, -505, -187, 285, 348, 137, -398, -268, 99, 407, 240, -54, -332, -205, -288, 113, 54, -139, -289, -51, 188, -54, 63, -425, 9, -64, 67, 79, -324, -379, -205, 62, 98, 337, -202, -17, 87, 142, -28, -376, 68, 90, 124, 250, -70, -134, -136, 149, 180, 167, -210, -26, -51, 287, 302, -86, 5, -414, 118, 424, 164, -219, -52, -75, 439, 440, -23, -308, 41, -53, 232, 632, -184, -196, -225, 511, 154, -39, -229, -430, 36, -11, 334, 56, 76, -328, -194, 369, -85, -47, -58, -104, 229, 436, 49, -195, -52, -287, 250, 121, 130, -217, -166, 16, 218, -95, -118, -366, 85, -40, 257, -132, -374, 134, 367, 66, -182, -267, -230, 60, 193, 106, 221, -479, -136, 155, 339, 71, -295, -208, -35, 274, 148, -99, -260, -225, 148, -164, 308, -77, -115, -212, 428, 169]
1768A69k01j41OJ6M44k67Q0k78J17J58K04l03k95L22J43N1k97J3l30J85l4M71
1790B33l07j15m3L4L03J55k66k88K13L08K3j72j39j59L02p1jj88j42K91M17m6
1812C42k35j25l10M09L63J6l57m75K21K55K09j45j87j27m5J04L16p8m01J37R6
1833a7K19r4k06n4L27nJ55l15k94K85P7K22Q6m34K8l11N85P1j56k44k06L68L2
1856A19p9j53K41q8L6N8P3k59j56M69J19k82l31K67j37j9L66K37q71K23q4M18
1878A67k81j19k54L69J55P2r6j67r8L64J33J99m74N6Ol34L74Q2k29k23P2K52K09
1901B35J00l22m1j82J98O43n20m9k29M6J08J55N3K3n1l88J98J57k16j79K7L33
1923I9j57R7k0j3K27L2l30L9j88J69j17K00J80j36k89K33K79n65J77J21j26M93
$$ y = [169, -32, -173, -167, -151, 293, 26, 106, -172, -55, 103, 307, 4, -291, 31, 174, 225, -72, -59, -389, -204, -238, 233, -74, -189, -232, -198, 105, 260, -6, -294, -81, 227, 250, 78, -61, -220, 82, 11, 10, -178, -320, -29, 388, 342, 107, -18, -328, 81, 444, 460, 103, -372, -151, 104, 313, 168, -19, -146, -191, -87, 229, 151, -250, -113, -17, 202, 108, -98, -152, 175, 170, 325, 10, -284, 1, 78, 300, 386, -48, -20, -331, 254, 325, 169, -75, -281, 87, 119, 40, -113, 128, 40, 76, 134, 207, -52, -208, 261, 380, 98, -233, 34, -103, -122, 244, 481, -390, -167, -251, 167, -114, -233, -487, -118, 37, 109, 13, -154, -252, 112, 245, 444, -30, 26, 32, -302, 72, 154, -75, -298, -226, 26, 235, 335, 13, -28, -210, -12, 631, 111, 62, -167, -121, -13, 142, 195, 218, 167, -221, -23, 134, -82, -261, -234, 99, -58, 39, 19, 6, 233, 265, -65, -26, -214, -45, -162, 38, 218, 82, -207, 26, 305, -260, -83, 38, -88, 405]
1945D05L6l87m03K17J11J54l35J36l17L49J1L68N6o17J74l29Q43k62k65l31L55
1966c1M7J06L62o55q8O3L64k5k45k06N86k64J76K9k63j0MN6K81l13k9k2J11J68
1990B02N6j87j35r4K39o8j15j8J57J9O2k1r8N1k57K21J13J1l88J14K41J20k50
2013b5J22n84N13K13j14l2n36J00K85R4J25k37o1J7J15K06o3j34M0l36N63n0m06
2036a85K81j58J87K14k16m46J66j03M79j28l4j09L8L7L43j71k40k25k6L58L23
2057C85k27l58m8L21K59j60j99j05L9M5J49j16k56K15K5R3J0j50k3L6M33j44r7
2080A27o6k3R8p9q1j51Q7J28j43K49k96K99l37r1M45o9J97k89k78L08K43j49m78
2103c49J26K34J93P7k00R5l42K13J78r2k29J56j92J90j00kj12J53k63L33J66j36
$$ y = [405, 441, 54, -349, -132, -21, 133, -202, -66, -383, -34, -23, 345, 401, -216, -42, -371, 472, 210, -55, -386, -31, 16, 122, 484, -171, -259, -196, 168, 143, -102, -308, 278, 14, 190, 219, -44, -54, -50, 6, 287, -26, -55, -77, 34, 202, 258, 71, -64, -158, 81, 13, -102, -120, 37, 56, 118, 97, -1, 50, -207, 14, 127, 138, -250, -136, 105, 225, -25, 97, -487, 26, 239, 125, 93, -443, -343, -58, 36, 161, -76, -137, -120, -5, 201, 138, 4, 44, -292, 271, 221, -185, 96, -62, 125, 339, 123, -323, -157, -260, 219, 91, 57, -52, -14, 23, 366, 195, -45, -270, -296, 62, 385, 158, -200, -248, 73, 332, 172, -27, -132, -93, -48, 101, -15, -271, -56, -31, 62, 72, -78, -101, -65, 368, 224, 127, 61, 38, 136, 57, -24, -175, -88, 40, -103, 146, -150, 149, -188, -279, 166, 97, 294, 5, -273, 35, 278, 129, -349, -223, 11, 204, 281, 81, 176, -166, 47, 225, 133, -96, 60, -132, 58, -42, -44, -156, -3, -266, 67, 233, 97]
2125I7r2J73l34J51M1J6k15K55J39j60j02K63k51J37OL7r7J35j23j00M11l59l65
2148c37K43k9rK99j87k22K68J5L25l91k36n0J93M27k92k04n9o1J95L15j61p7j67
2171b02J52J77n1j33k64J57M17J02m76J0K3K12k03K12L3L2j39J04l8K40l09n2
2193Dk28L52K0n4k16J47J50j29J61k16j37J41j75K20j47P1j00Q4L85l22k70j25
2215c84K20J10K4J86n22K1M12k59J44K1k41M43j71L2J8o6J41o04N79j35J44j48
2237c5j64J71Q8k28q4R3j03K92j13J54j38mR8J49J31k67o2k40J54K92p9j92L5
2260e2l8J19M04n07o8k34M74L42j41l0r9l87K97Nj61M0P3JK50k40k20N5R2K64
2284B39N6k67k13J69J51j10M59m88j20J31L6J61n34K14J25j9O0J03j16p1J68Q4
$$ y = [97, 5, 178, -156, -5, 36, 52, -163, 92, 231, 71, -31, 232, -19, 118, 124, 161, 64, 199, 76, -24, 387, 28, -337, -94, -123, -132, 167, -20, -242, 26, 41, 366, -25, -261, -311, -118, 309, 17, -187, -246, -307, -112, 203, 42, -35, -202, -50, 127, 76, -57, -321, -164, 253, 355, -121, -111, -88, 124, -79, 133, 166, 198, 59, 163, 125, 365, 56, 4, -224, 128, 148, 94, -122, 25, 175, 46, 207, -9, -146, -5, -180, 40, -107, -36, -136, -52, 333, 11, -259, -384, -164, -54, -30, 156, -366, -345, 67, -192, -48, -27, -268, 175, 4, 36, 54, -12, 129, -475, 104, -31, 113, -35, -199, -28, 60, -168, -252, -159, -262, 30, -83, 71, -67, -71, 27, 176, 307, 40, -22, -262, -108, 184, 105, -87, -52, -90, 29, 433, -74, -142, -376, 98, 440, 299, 269, 170, -217, 80, 85, -76, -36, 37, 38, 288, 48, -172, -117, -25, 239, 295, 28, -185, -16, 135, 25, 484, -4, -124, 7, 43, 204, -330, -116, 9, -10, 50, 153, 37, -34, 134, 218]
2306B18k78J44j69j79L9L7M7j49M43j62J55j45N0k61J12Q6K37j44L3o23P92j23
2328A60j51Q0n3j08J57k16L12j33j62K06L4R3r7j49J01j77L8q3K28J63k39M8l8
2351A4J48J37l14j21K73j08L3k17j64K58J95k50K07k98j06J46L0M23l71M4J42
2372A01k22J18R5l85K74R4p1J42J27m87k3K39K09j81j53j34L48N2l01K97j47L69
2394C61l84k03K37J2K44m00L93k02j70R3j37J27k2j5ok34N0L54K81k72k54J23
2416b4L44k95J61m07R1l2K44k78J73J21p6J38l92L74j00o3OR9k00K89jl30R1j68
2440b35L90j13J8K96m06M25m55N3n49N48KM36o05J47J2K21J26k93k04r8L59J55
2462B30p4k23p5j5K4l4K10Q6k94K17J22k65Mj71K73M4L1J34k07L0j00l70N93l0
$$ y = [218, -60, 84, -85, -264, -225, -188, -141, -290, 153, -9, 146, 1, 51, -210, -98, -12, 225, 81, 114, -509, 283, 160, 9, 89, 36, -72, 85, -131, 181, 48, -114, 92, 126, 219, 122, -27, 74, -103, -65, -148, 80, 243, 4, 52, 14, 162, 299, -15, -136, 137, 29, 62, -155, -319, -61, 134, -116, 91, -207, -313, -167, -137, 286, -85, -41, 101, -121, -3, 92, -293, -19, 75, 4, 146, 273, -214, -237, 2, 211, 30, -123, -257, 91, 143, -158, 139, -8, 361, -23, -226, 11, 23, 267, -133, 260, 58, -112, -19, -156, -29, -51, -66, -72, -306, -256, 98, 379, 107, -147, -24, 320, 25, 186, -221, -130, -162, 82, -196, -23, 98, 22, 160, -232, 142, 42, -21, -15, 84, -116, 173, 172, -158, -67, -235, 155, 42, 60, 356, -50, 375, -80, -27, -576, -28, -26, 410, -195, -48, -36, 185, 311, 18, -186, -284, 75, 230, 156, -67, -142, -157, -133, -167, 43, 129, -165, 52, 174, -91, -87, -258, 15, 59, 90, 224, 17, 47, -53, -423, 170, 140]
2486A40k19j37J16O0J72PR8l34q6K31n8L8J44m3J38l11k51N28j29l26J70p4J7
2509a09m8M64j98J56k49j04N6p9L87l16J75l33J08Q1L2k9j7Q4J67K40m60K5k85
2532b52L32Rj49K36o3m02J96J89m0J03l01J38j3N7K56k58r1P5L04k13N2l09j20
2555b64J15L25q0p6j36NK39j06N0K0k19J2K52R8k72k33L59L88l58O9J31n00J69
2578a2j64M24j00l04L04P8j96p1K08k43J85j25j86J34n0k80L81Q2l3N0l78r3L93
2601Dj32K07l07K15K5N5m42J19L45o6K29j79j39qr8l48O52j69L55l77L48j71J76
2624B94l68k15K11O9J87n00K79j72K13j68J58j36L39j20Qj79K85j53J63k65K15
2645A45k4K0l22J43rPQ9J55j98J39k10J80K12l11J01k17K46N2k16j90K54L9J61
$$ y = [140, -79, -216, -100, -40, 132, 139, 237, -97, -183, 48, -10, 28, 172, 129, 267, -44, -295, 233, 104, -222, -52, -126, -109, -157, 307, 109, 265, 16, -88, -32, -111, 276, -40, 135, -198, -90, -9, 23, -6, -23, 61, 228, 468, 8, 33, -252, 80, 89, -60, 176, 113, -289, -93, 96, 56, 159, -142, -4, -17, 40, 296, 38, -53, 22, 326, 113, 165, -144, -264, -149, 176, 96, 20, -116, -111, 128, 22, 72, 92, -127, -115, 137, 235, -37, -270, 89, 477, 119, 188, 319, -181, -12, -176, 248, 148, -156, 148, 226, 30, -41, 167, -76, 109, -16, -202, -68, -118, -398, -17, 65, 32, 82, -296, -389, 4, -128, 79, -228, -13, 12, 67, -375, -256, 89, 23, 252, 73, -66, -74, -172, -520, 132, -37, 318, -59, 289, 118, 294, -74, -289, -78, -9, 178, -322, -43, -215, -2, -170, -12, -148, 191, 71, 79, -100, 185, 32, 195, -70, 145, 121, 141, -181, -38, -47, -40, 49, 204, 6, 145, -65, 115, 327, 16, 117, -100, 146, 198, -18, -208, 46, 85, 246]
2668B46j20n6j96J47k43J85m6M2M5j30L66m3j50n2q8J00J55l32N0K96n5j88M10
2691C43m27J01n1nJ05j30J44j43O2j08K24K91l36J14R7l19R7K86o87N45k92q6
2713a75K73R0l08kK07j40J82k77n9M39q2J7k19j51k1J90L14j08l13J53o7J62k58
2736a53J22k97M13K00k48Q6L7P6j07j01j37Nj33J29R2K56j50J08j18r8K8K52j92
2759G0J35j76k64L28n7M9J45l04K48k45Q7q7j3n5K18J93k62j48O7K27p8p1o9j45
2783b07j3K01O6J96m33K97q2K8Pj11j42K29J96j04j91o8J13K84l27l01L11j66
2805b17J93K82O6l94k12M31j33K01j15n5k33j91M17r2M27l31k95K64rm1J34j80
2827h3J76j42P1O7j77P2M1L47l27n32P61m63L14j18J78k29o3k1J50N4j65K51j81
$$ y = [246, 126, 70, -126, 21, -222, -37, -83, -41, 4, -126, 240, 197, 47, -5, -93, 7, 162, -170, -120, 176, 121, -67, 343, -84, 17, -34, -39, 66, -64, 80, -63, -1, -109, 115, 406, 70, 184, 281, -38, 59, 345, -342, 203, -89, -175, 98, 188, -120, -122, 85, -55, 127, -150, -209, 230, 148, 165, -54, -205, -226, -36, 278, 170, -143, 10, -57, 105, -153, -31, -328, 85, 285, 37, 123, 160, 236, 129, 28, -109, -104, -237, -108, -16, 240, 90, 198, 80, -18, 10, 262, 70, 205, 29, -235, 93, 36, 85, 230, -74, 174, -71, 16, -71, -84, -139, 79, 272, 10, -138, -71, 156, 78, 7, -62, -207, -220, -19, 47, 243, -190, 107, 25, 53, 60, -51, -193, 36, 232, 128, -63, -131, -18, 266, -61, -362, -51, -217, -24, 258, 324, -70, -282, 149, 16, 217, 102, 47, -186, -377, 40, -52, 375, 44, -251, 13, 4, -37, 97, -83, 93, -49, 22, 89, -88, -16, 25, 372, 45, -487, 274, -189, 125, 7, 185, -44, -107, -128, 22, 76, -89, 162, -19]
2850a9r9L04j09l52K30J82r3R5J11n09L85j06K04m83J90k20j0L08j56K71J1k33
2872i8j5N1J30l41L05M0J87J43k34J9m72O09k03k20L69o60J73J94N2K28l7k51
2894c1l80N14m27M58r0k01P0J71j09N4j36J43J99l14K40n6J09l81K76k4k24K58
2916A19k16O3k22K32J6k71J91J62j16K59n01K05K40j42L03p73M52L2n3J45k86
2937a61p8J56j03J97k1o0J60J03k61rnm9K5m32N65L92m59J00O4M9k64L39l42q
2961a02mQ5K8L4j68j18J87k32P0K54Pk02M50l78l0K30m4Lj37L83m33Q1j16L97
2985B45k31R1j82J65Jq6j4j18L79p1j91j94L82l30L52L6j85J16k98L17j28j5j14
3008g3L49j96k08K20J8j55l3R2j7mJ40m5j16K50m78k2L92K17m68J28P9j40O4J46
$$ y = [-19, -118, 186, 77, -275, -45, 137, 44, 139, 250, -259, 126, 20, 224, -259, -69, -289, -299, 9, -147, 124, 135, -98, -113, -62, 68, -273, 32, 72, 259, 402, 168, 187, -285, 324, 121, -99, 270, -390, -217, -23, 29, 257, 220, -31, -411, 103, -324, 134, 44, -157, -87, 84, -25, 29, -107, 36, 235, -79, 161, 105, 214, -167, 109, 85, -139, 119, -97, -34, -256, -24, -8, -279, -88, 74, -42, 217, -284, -79, 161, 19, 322, -451, 1, 33, -20, 125, -161, -239, -83, -186, 11, -10, -70, 90, 193, -68, -77, -82, -131, -106, -538, 27, 419, -40, 60, 124, 173, -91, 248, -94, -102, -106, -21, 7, 41, -127, -245, -58, -290, -220, 34, 41, -161, 289, -89, -119, 111, 67, 70, -67, 316, -117, -36, -152, 245, 14, 105, -77, 88, 89, 3, -11, -129, 250, 179, -12, -206, 176, -154, 198, 234, 49, 165, -133, 184, 56, 41, -73, 276, 80, -128, 92, 110, -45, -78, 14, -3, -7, 133, 88, -28, 222, -256, -278, 114, 331, -137, -9, 70, -70, -6, 140]
3032A40k35J38j63j1K94k25k64L03K97n49L09r3K57J23q0J6j75P9J55k80R3m27
3054b98o1L73k05J8J70Rk39P7J72k8j5j17r9M50j23l25K84l12K05j90L30r8O6
3077D4k27M05k24M2K78m30j42M43j9k82J12j51l4J17j64K27O%j16O1j68N8J78
3100A4K51l14J41r6k29L38K8M9q8k01PK92k38K32m1j66k82N00p3j13J87l86J47
3123d1J01J30l27m1%J00p8J27oNK44k33qJ64J69p09L13P3J6j47J01L2J85q2K48
3148C36mo68L42j23K70j2k8j05j61M44m06m14O82j15j05K22q2j31l1J12K76m39
3170a40K0J72N8R2j96R2q8J41l79R3R4J29L0k46j84N1Q8j26M56JJ62k73k14R5
3194g2J60k07K56o0l65K02K12p1n4O2j77j15J81l3J18j82r7J57K12p8k69L62j07
$$ y = [140, -95, 43, -120, -131, 163, -62, -326, -23, 274, -275, 34, -59, 198, 321, 241, 257, 82, 161, 316, 36, 129, -298, -359, 14, -191, -173, -3, 6, -233, -156, 16, -12, -27, -144, -243, 207, 84, -241, 43, -269, -64, -254, 76, -22, 44, -183, 222, -2, 40, 318, -112, -254, 189, 170, -112, 0, -151, -185, -68, -232, -5, 1, 1, -115, -54, -222, -164, 14, 265, -49, 92, -4, -233, 105, 133, 182, 94, -107, -100, 192, -46, 186, 145, -21, -303, 197, 124, 11, 198, -188, -41, 60, 190, -137, -178, -178, -78, -156, -29, -35, -30, 214, -19, -27, 137, 306, -403, -90, -17, -1, -148, -47, -15, 170, 88, 336, 332, -336, 6, -117, 153, 141, 113, 8, -153, 291, -115, -529, 153, 38, -67, 155, 73, -58, -89, 23, 299, -140, -120, 52, 110, 202, 6, 98, 10, 151, -228, -135, -41, 88, 118, -128, -312, -261, -173, -299, 157, 158, 320, 47, -167, -72, 88, -119, 137, 77, -288, -86, 126, 55, 1, 63, -114, -229, -48, -81, 37, -145, -242, -85, 127, 49, -220, 142, 35]
3217C5j4K11j33j55P1N5k46J31K19l4k13k73L59k9n1J03M3m2l2j09J7K77m10K47
3241B7K09k7l47L07k42k0J96l8O0k3j33N9J5k39O5J03L5p1j4J22R3l99J98J85
3265A21k45K53O4j09j35O6M4m6k4m2L00l48Q2O2J7M7J0J6j78L4j04J15j24m7K21
3290E0Pk09K57r0J87n9k36L72m39r5M7Q8j25K57k24J58j5o8K93r7P1J39p3j81
3314A5p4M0L14l72P7K27k36J67p4r4J5j74M3q1K91m05K46L1k5j55N60n87L37j72
3338h6o3k3J81j17o3p9M28l68k07M02Q9J1j99K5j98J19J99j53L4L02k17l7Q3l06
3362b43K08P4R3l5J4j48o4M1P6K06k48J4Q5J97o01M75n17M15l26K0O6J54R6R4
3386A46j05j7o8K94j49m0j16K37j18j83Q2pK3K07l59K24K9n02M08J85l63K75K5
$$ y = [35, 21, 232, 99, -56, 15, 70, -176, -45, 174, 140, -73, -346, 13, -16, -67, 36, 79, 37, 5, -104, -87, 190, -220, 27, 236, 209, -138, 169, -73, -93, 103, 65, 125, 102, -31, 28, 43, -196, -131, -28, 7, -64, -78, 44, 137, -262, -64, 121, -124, 129, 193, 84, -51, 15, 59, 13, -11, -53, 247, -101, -19, 43, 60, 107, 117, 133, -45, -11, -115, 0, -124, -171, 50, 57, -152, 105, 15, 202, 143, -93, 279, -160, -255, -208, -120, -245, 12, -212, -54, -69, -137, 156, 59, 130, 269, 196, 15, -59, -19, 295, -77, 0, 227, -9, 158, 84, -10, 5, -169, -126, -207, 84, -321, -75, -44, -69, -224, 336, -251, 86, -86, -149, -172, 9, -108, -171, -250, 178, -190, -397, 5, 94, 105, -94, -69, -267, -148, 51, -102, -68, 234, 17, -20, 63, -243, -35, 39, 132, 97, 111, -37, -101, -60, 16, 222, -26, -12, 73, 270, -331, 144, -373, 42, -284, -264, -198, -44, 52, 146, 41, 24, -44, 250, 101, 61, -55, 182, 64, -119, -37, -44, -21, 186, -173, 51, 80, -422, -14, 171, -192, 83, 108]
3409A08l06o3K53KO2R7k67lr5K4J97K19k23J27l95L61j76k2qJ97l60L3M48Q6k24
3434G2J56K4k68n9K61k66K05n2J7P2r7j50L52l49M2J55k28J01K42r5J27l9p9p5
3458F9j70K82k65j14K70r0R1k04K93r2k6M0j23K01j24j49L75l39j40J11J58J95
3480B49k61K6j32J9M4L77k83J69j20j13k2j56N5K36k84M12m1k41R0K53k49R7O
$$ y = [108, -198, -261, -8, -6, 56, 153, -114, -117, -212, -188, 9, 228, 5, 132, -263, 98, -78, -100, -108, 89, -271, -238, 210, 296, 72, 228, 252, -16, -75, 186, -80, 125, 73, 90, 162, 65, -85, 267, -82, -40, 115, -113, -12, 230, 135, 262, 223, 144, 69, -101, 181, -84, -198, 72, -18, 73, -131, 162, 70, 44, 84, -39, 162, 38, -111, 264, -75, -215, -104, 54, 249, -12, 14, -118, -99, -55, 322, 39, 208, 88, -25, -47, -203, -148, 88, -196, 216, 175, -66, 24, 277, 28, 125, 131]
$$ [...]
8191g1
##END NTUPLES=NMR FID
##END=
