##TITLE=1H_EC-3230(2)
 DMSO, 8 sc, 
 9.7.2020
##JCAMPDX= 6.0         $$ Bruker NMR JCAMP-DX V2.0
##DATA TYPE= NMR FID
##DATA CLASS= NTUPLES
##ORIGIN= UXNMR, Bruker Analytische Messtechnik GmbH
##OWNER= root
$$ XWIN-NMR		Version 3.5
$$ Thu Jul  9 10:48:42 2020 Russian Standard Time (UT+4h)  she@DPX200
##.OBSERVE FREQUENCY= 200.1315
##.OBSERVE NUCLEUS= ^1H
##.DELAY= (6, 6)
##.ACQUISITION MODE= SIMULTANEOUS
##.ACQUISITION SCHEME= undefined
##.AVERAGES= 8
##.DIGITISER RES= 18
##SPECTROMETER/DATA SYSTEM= spect
##.PULSE SEQUENCE= zg30
##.SOLVENT NAME= DMSO
##.SHIFT REFERENCE= (INTERNAL, DMSO, 0, 15.7039)
##AUDIT TRAIL= $$ (NUMBER, WHEN, WHO, WHERE, WHAT)
$$ ##TITLE= Audit trail, XWIN-NMR		Version 3.5
$$ ##JCAMPDX= 5.01
$$ ##ORIGIN= Bruker BioSpin GmbH
$$ ##OWNER= she
$$ F:/spectra/data/she/nmr/H-F/1/audita.txt
$$ ##AUDIT TRAIL=  $$ (NUMBER, WHEN, WHO, WHERE, WHAT)
(   1,<2020-07-09 10:46:54.32 +0400>,<she>,<DPX200>,
      <created by zg, POWCHK disabled, PULCHK disabled
       configuration hash MD5:
       00 E9 B6 7A A2 85 ED C7 34 08 36 98 17 FE 4E 26
       data hash MD5: 16K
       27 17 A6 8B C3 B1 60 EB 19 C2 EB F9 5B 57 4D 32>)
$$ ##END=
$$ 
$$ hash MD5
$$ 8F 7C 2E C4 0E 4D ED BB 5F 93 24 F0 73 01 BD 34
##$RELAX= 
##$RELAX= 
##$RELAX= 
##$RELAX= 
##$RELAX= 
##$RELAX= 
$$ Bruker specific parameters
$$ --------------------------
##$DU= <F:/spectra>
##$EXPNO= 1
##$NAME= <H-F>
##$PROCNO= 1
##$TYPE= <nmr>
##$USER= <she>
##$AMP= (0..31)
100 100 100 100 100 100 100 100 100 100 100 100 100 100 100 100 100 100 
100 100 100 100 100 100 100 100 100 100 100 100 100 100 
##$AQSEQ= 0
##$AQ_mod= 1
##$AUNM= <au_zg>
##$AUTOPOS= <>
##$BF1= 200.13
##$BF2= 200.13
##$BF3= 200.13
##$BF4= 200.13
##$BF5= 200.13
##$BF6= 200.13
##$BF7= 200.13
##$BF8= 200.13
##$BYTORDA= 1
##$CFDGTYP= 0
##$CFRGTYP= 5
##$CHEMSTR= <none>
##$CNST= (0..31)
1 1 145 1 1 1 1 1 1 1 1 1 1 1 1 1 1 1 1 1 1 1 1 1 1 1 1 1 1 1 1 1 
##$CPDPRG= <>
##$CPDPRG1= <>
##$CPDPRG2= <>
##$CPDPRG3= <>
##$CPDPRG4= <mlev>
##$CPDPRG5= <mlev>
##$CPDPRG6= <mlev>
##$CPDPRG7= <mlev>
##$CPDPRG8= <mlev>
##$CPDPRGB= <>
##$CPDPRGT= <>
##$D= (0..31)
0 1.2 0 0 0 0 0 0 0 0.06 0 0.03 0 0 0 0 0.0002 0 0 0 0 0 0 0 0 0 0 0 0 
0 0 0 
##$DATE= 1594277213
##$DBL= (0..7)
120 120 120 120 120 120 120 120 
##$DBP= (0..7)
150 150 150 150 150 150 150 150 
##$DBP07= 0
##$DBPNAM0= <>
##$DBPNAM1= <>
##$DBPNAM2= <>
##$DBPNAM3= <>
##$DBPNAM4= <>
##$DBPNAM5= <>
##$DBPNAM6= <>
##$DBPNAM7= <>
##$DBPOAL= (0..7)
0.5 0.5 0.5 0.5 0.5 0.5 0.5 0.5 
##$DBPOFFS= (0..7)
0 0 0 0 0 0 0 0 
##$DE= 6
##$DECBNUC= <off>
##$DECIM= 24
##$DECNUC= <off>
##$DECSTAT= 4
##$DIGMOD= 1
##$DIGTYP= 9
##$DL= (0..7)
0 120 120 120 120 120 120 120 
##$DP= (0..7)
150 150 150 150 150 150 150 150 
##$DP07= 0
##$DPNAME0= <>
##$DPNAME1= <>
##$DPNAME2= <>
##$DPNAME3= <>
##$DPNAME4= <>
##$DPNAME5= <>
##$DPNAME6= <>
##$DPNAME7= <>
##$DPOAL= (0..7)
0.5 0.5 0.5 0.5 0.5 0.5 0.5 0.5 
##$DPOFFS= (0..7)
0 0 0 0 0 0 0 0 
##$DQDMODE= 0
##$DR= 18
##$DS= 0
##$DSLIST= <SSSSSSSSSSSSSSS>
$$ [...]
##$SUBNAM2= <"">
##$SUBNAM3= <"">
##$SUBNAM4= <"">
##$SUBNAM5= <"">
##$SUBNAM6= <"">
##$SUBNAM7= <"">
##$SUBNAM8= <"">
##$SUBNAM9= <"">
##$SW= 24.9337058887773
##$SWIBOX= (0..15)
0 0 2 0 0 0 0 0 0 0 0 0 0 0 0 0 
##$SW_h= 4990.01996007984
##$TD= 16384
##$TD0= 1
##$TE= 0
##$TE2= 300
##$TE3= 300
##$TEG= 300
##$TL= (0..7)
0 120 120 120 120 120 120 120 
##$TP= (0..7)
150 150 150 150 150 150 150 150 
##$TP07= 0
##$TPNAME0= <>
##$TPNAME1= <>
##$TPNAME2= <>
##$TPNAME3= <>
##$TPNAME4= <>
##$TPNAME5= <>
##$TPNAME6= <>
##$TPNAME7= <>
##$TPOAL= (0..7)
0.5 0.5 0.5 0.5 0.5 0.5 0.5 0.5 
##$TPOFFS= (0..7)
0 0 0 0 0 0 0 0 
##$TUNHIN= 0
##$TUNHOUT= 0
##$TUNXOUT= 0
##$USERA1= <user>
##$USERA2= <user>
##$USERA3= <user>
##$USERA4= <user>
##$USERA5= <user>
##$V9= 5
##$VALIST= <valist>
##$VCLIST= <CCCCCCCCCCCCCCC>
##$VD= 0
##$VDLIST= <DDDDDDDDDDDDDDD>
##$VPLIST= <PPPPPPPPPPPPPPP>
##$VTLIST= <TTTTTTTTTTTTTTT>
##$WBST= 1024
##$WBSW= 4
##$XGAIN= (0..3)
0 0 0 0 
##$XL= 0
##$YL= 0
##$YMAX_a= 326448
##$YMIN_a= -202747
##$ZGOPTNS= <>
##$ZL1= 120
##$ZL2= 120
##$ZL3= 120
##$ZL4= 120
##$ABSF1= 10
##$ABSF2= 0
##$ABSG= 5
##$ABSL= 3
##$ALPHA= 0
##$AQORDER= 0
##$ASSFAC= 0
##$ASSFACI= 0
##$ASSFACX= 0
##$ASSWID= 0
##$AUNMP= <proc_1d>
##$AZFE= 0.1
##$AZFW= 0.1
##$BCFW= 1
##$BC_mod= 2
##$BYTORDP= 1
##$COROFFS= 0
##$CY= 11.3945322036743
##$DATMOD= 1
##$DC= 2
##$DFILT= <>
##$DTYPP= 0
##$F1P= 16.9975609425685
##$F2P= -3.02152046262296
##$FCOR= 0.5
##$FTSIZE= 0
##$FT_mod= 4
##$GAMMA= 1
##$GB= 0.15
##$INTBC= 1
##$INTSCL= 1
##$ISEN= 128
##$LB= 0.24
##$LEV0= 0
##$LPBIN= 0
##$MAXI= 10000
##$MC2= 0
##$MEAN= 0
##$ME_mod= 0
##$MI= 1.114404
##$NCOEF= 0
##$NC_proc= 0
##$NLEV= 6
##$NOISF1= 3.799351
##$NOISF2= 2.8
##$NSP= 1
##$NTH_PI= 0
##$NZP= 0
##$OFFSET= 15.70392
##$PC= 1
##$PHC0= -9794.06
##$PHC1= 15.40092
##$PH_mod= 1
##$PKNL= yes
##$PPARMOD= 0
##$PSCAL= 0
##$PSIGN= 0
##$REVERSE= no
##$SF= 200.130013532006
##$SI= 16384
##$SIGF1= 3
##$SIGF2= 2
##$SINO= 400
##$SIOLD= 16384
##$SREGLST= <1H.CDCl3>
##$SSB= 0
##$STSI= 0
##$STSR= 0
##$SW_p= 3612.71676300578
##$SYMM= 0
##$S_DEV= 0
##$TDeff= 0
##$TDoff= 0
##$TI= <>
##$TILT= no
##$TM1= 0
##$TM2= 0
##$TOPLEV= 0
##$USERP1= <user>
##$USERP2= <user>
##$USERP3= <user>
##$USERP4= <user>
##$USERP5= <user>
##$WDW= 1
##$XDIM= 8192
##$YMAX_p= 0
##$YMIN_p= 0
$$ End of Bruker specific parameters
$$ ---------------------------------
##NTUPLES= NMR FID
##VAR_NAME=  TIME,          FID/REAL,        FID/IMAG
##SYMBOL=    X,             R,               I
##VAR_TYPE=  INDEPENDENT,   DEPENDENT,       DEPENDENT
##VAR_FORM=  AFFN,          ASDF,            ASDF
##VAR_DIM=   8192,          8192,            8192
##UNITS=     SECONDS,       ARBITRARY UNITS, ARBITRARY UNITS
##FACTOR=    0.0002004,     1,               1
##FIRST=     0,             0,               0
##LAST=      1.6414764,     0,               0
##MIN=       0,             -202747,         0
##MAX=       1.6414764,     326448,          0
$$ Real data points
##PAGE= N=1
##DATA TABLE= (X++(R..R)), XYDATA
0@%%%%%%%Lj1J6j6J6j9K7l2M0m9N7p1Q5j00J15j32J52j76K02k30K63l00L40l82
$$ 0 0 0 0 0 0 0 0 3 -8 8 -8 8 -11 16 -16 24 -25 32 -39 46 -54 61 -71 81 -95 107 -123 140 -160 180 -202
31b02M31m85N41o06O78p53Q37r30J031j142J264j402J555j721J906k114K350k620
$$ -202 229 -256 285 -321 357 -396 441 -489 542 -600 664 -738 817 -904 1002 -1112 1238 -1382
49a382K929l288L717m234M869n679O750q237J0465j4215K2117o8919J31751J33234
$$ -1382 1547 -1741 1976 -2258 2611 -3068 3682 -4555 5910 -8305 13812 -55107 76644 209878
63B09878j87934j92352l2339J25895Q9905J3194m3467m1373l9813J2181O3799
$$ 209878 21944 -170408 -202747 -76852 13053 26247 -17220 -58593 -98406 -86225 -22426
74b2426N0064n0777q7035j24J03208P0236l7892q7723l2353K8596M3580L6541
$$ -22426 27638 -23139 -110174 -110298 -7090 63146 25254 -62469 -94822 -66226 -22646 13895
86A3895L9922M320p2696r2231J0381J16828Q7264l5108r0219l1117L6787K7961
$$ 13895 53817 58137 -14559 -106790 -96409 20419 107683 72575 -17644 -48761 -11974 15987
98A5987o325P148L6357M491n8360m4994M0251P5694N946p1946n3308L4784Q0009
$$ 15987 9662 16810 53167 57658 -702 -45696 -5445 70249 76195 4249 -49059 -14275 65734
111F5734K8936n3499p9149l1190M5007R1853N9000m8957j30706p5176P5142J47141
$$ 65734 94670 41171 -37978 -69168 -24161 67692 126692 77735 -52971 -128147 -53005 94136
123I4136M9462j01007j27081r615R7267P2589j9945n9472l1116J829K1464L7919
$$ 94136 143598 42591 -84490 -94105 3162 75751 55806 -3666 -34782 -32953 -11489 26430
135B6430K8769k5900p3501l8331N8476R9244J7178q8968q6164J0748P8236N5749
$$ 26430 55199 29299 -44202 -82533 -24057 75187 92365 3397 -82767 -72019 6217 61966
147F1966p170m6708m4280r962L1574M6480J3886l5018m2963N388M2841J6573k9378
$$ 61966 54796 8088 -36192 -46154 -14580 31900 45786 10768 -32195 -26807 16034 32607 3229
160C229k2968J7371K1121j5201k2556J6821M1741j641n9686m2559M0883Q0706
$$ 3229 -19739 -2368 18753 3552 -19004 -2183 39558 37917 -21769 -64328 -23445 57261
172E7261K1829o1297p0836r160N3370N9335J3770l9844n5367k1615L3989N8508
$$ 57261 79090 17793 -53043 -62203 -8833 50502 64272 24428 -30939 -52554 -18565 39943
184C9943K1474m3451n8880m996N1182M5094p894m6261l9336J479L9518M6002J4100
$$ 39943 61417 17966 -40914 -45910 5272 50366 42472 -3789 -43125 -41646 -2128 43874 57974
197E7974m1188p0777k8339N8232Q8543J7290p7779q3079L957P7881N6512k3602
$$ 57974 16786 -53991 -82330 -24098 64445 81735 3956 -79123 -75166 2715 59227 35625
209C5625o3100k5643K8945L7419P923k0797k5888o519J8973K3910N570j6992k0488
$$ 35625 -27475 -53118 -24173 13246 21169 372 -25516 -32035 -13062 10848 16418 -574 -21062
222b1062n188J2057J2818N411N168L517j4411k8854q185L3255M1941L276m0456
$$ -21062 -26250 -14193 -1375 4036 9204 12721 -1690 -30544 -38729 -5474 36467 39743 -713
235g13l8762N161L7766K5509n828j9245j4835n795P128K1219J6376j0909l1743
$$ -713 -39475 -34314 3452 28961 23133 3888 -10947 -16742 -9614 11605 27981 17072 -14671
248a4671j8072K3473M3810J2041m0724n0963k997M8916N2412J944n4524n9199
$$ -14671 -32743 -9270 34540 46581 5857 -45106 -48103 813 53225 55169 645 -58554
260e8554j974O0928N9615n804o5970n2874J8203O5754L2902l3776n1693r867L4677
$$ -58554 -60528 400 60015 54211 -11759 -64633 -46430 19324 52226 18450 -33243 -43110 -8433
273h433L2631k044k5787j8832K269J3960J5185R113n237k0130j6512N518K2545
$$ -8433 24198 22154 -3633 -22465 -20196 -6236 8949 18062 12825 -7305 -23817 -18299 4246
286D246J8099j248j8270j7916k045J4418J7673O985r745j7418p146J0285J3984
$$ 4246 22345 21097 2827 -15089 -17134 -2716 14957 21942 12197 -5221 -12367 -2082 11902
299A1902J849m843m879m082m047J313J2141J3123o240k6845j7763K0751M0388
$$ 11902 13751 8908 4029 -53 -4100 -2787 9354 22477 16237 -10608 -28371 -7620 32768
312C2768J0418l7052m4683p72M5910M2788r079n0632l6187J5271M7227K9481j8232
$$ 32768 43186 6134 -38549 -39321 6589 49377 40298 -10334 -46521 -31250 15977 45458 27226
325B7226m5414k4505K2911M2013J4801k5467l5442q378K3837K8839M372j8915
$$ 27226 -18188 -42693 -19782 22231 37032 11565 -23877 -32255 -8418 20421 24793 5878
337E878k1885p810J0608K2863J5266r346k6307j6835J1176K8533J4847j5300k6285
$$ 5878 -16007 -23817 -13209 9654 24920 15574 -10733 -27568 -16392 12141 26988 11688 -14597
350a4597o917J7724J8291k95j3971r336L351Q609K586l619j142K834l41o311m988
$$ -14597 -21514 -3790 14501 14206 235 -9101 -5750 2859 5445 1826 684 3518 3177 -3134 -8122
365h122M136J4443Q243j2902k4248n744K4090K8452m56l2247k8730Q377L7356
$$ -8122 -3986 10457 18700 5798 -18450 -24194 -104 28348 27892 -4355 -33085 -24708 12648
378A2648K2645j6476l4206j4465J7646K9240J0768j7603k5370q011J5598K2891
$$ 12648 35293 18817 -15389 -29854 -12208 17032 27800 10197 -15173 -23184 -7586 15305
390A5305R140j2938k4126j1578J3914K5011J2616j3035k7153j4156J4259K8588
$$ 15305 24445 11507 -12619 -24197 -10283 14728 27344 14309 -12844 -27000 -12741 15847
402A5847J3531j6092k8751j1600J9098K9408M709k3666k3154L580K3001J4230
$$ 15847 29378 13286 -15465 -27065 -7967 21441 26150 2484 -20670 -17090 5911 20141
414B0141q991j7970o244J0207J0805j084o209j927J659M89l976k613N550R896
$$ 20141 11150 -6820 -13064 -2857 7948 6864 655 -1272 387 876 -3100 -5713 -163 9733
428I733M0j2679j2379L037J6080J2776n859j9913j2575R476J9711Q764r610j8365
$$ 9733 9773 -2906 -15285 -12248 3832 16608 10749 -9164 -21739 -12263 7448 16212 6602 -11763
442a1763p902R432J7021O970q469j5664r789O788J9675J3505r526k3986j2969
$$ -11763 -19665 -10233 6788 13758 5289 -10375 -20164 -13376 6299 19804 10278 -13708 -26677
455b6677J2417K7367J3345j6985k9079r501K1448K7683M979k2245k5198l60K5000
$$ -26677 -14260 13107 26452 9467 -19612 -29113 -7665 20018 24997 2752 -22446 -22806 2194
468B194K0347o029k2440j3098Q381J8557Q367r796j4020k719P751P290R23k776
$$ 2194 22541 16512 -5928 -19026 -10645 7912 16279 6483 -7537 -10256 -2505 4785 5708 2932
482B932l501k278r04l1L331N273K58o004o199o57N593O173J318n738o642j534
$$ 2932 -569 -2847 -3751 -3782 -451 4822 5080 -924 -7123 -7780 -2187 3986 5304 -434 -7076 -8610
498h610L728O133L961k553q164o363K237R676R031j200j4105j2591N051J9545
$$ -8610 -4882 1251 5212 2659 -5505 -11868 -9631 45 9076 7876 -6229 -18820 -13769 5776
512E776J2898q914k2549j2076J3849K6234Q742j8995k4274l336K1581K2503n74
$$ 5776 18674 9760 -12789 -24865 -11016 15218 23960 4965 -19309 -22645 -1064 21439 20865
525B0865k2474j8516N962K1173J3374o959j8457j0240Q131J6370O265p444j2034
$$ 20865 -1609 -20125 -14163 7010 20384 13425 -5032 -15272 -7141 9229 15494 8050 -3984
538c984m615M905R123M840l739p563l937J322O114N184j639o268l333J691L721
$$ -3984 -8599 -3694 5429 10269 6530 -1033 -4970 -3648 2466 7650 6011 -257 -3590 -1899 1822
553A822J981j164k201j13J82r26j504K496N137J53o045o852L03R969R285l411
$$ 1822 3803 2639 438 325 507 -419 -1923 573 5710 5863 -182 -7034 -6731 3238 12523 9112
569I112j4528r310P689J6505P802j0135j9208n590J4335J8236J706j6020j5920
$$ 9112 -5416 -14726 -7037 9468 17270 7135 -12073 -17663 -3328 14908 16614 594 -15326
582a5326P06J6573J3826l879j6219j0344M384J3633R879m256j3862r356M657J2284
$$ -15326 -14620 1953 15779 11900 -4319 -14663 -10279 3354 13233 8977 -4885 -14241 -9584 2700
596B700Q384l401j2635q966M226J2029P083m287j0672o922M606J0668M449o341
$$ 2700 11084 7683 -4952 -13918 -9692 2337 9420 5133 -5539 -12461 -7855 2813 7262 921
610I21q641j756O188O642q59n990l154K731L521r82k579L57L146J105l393n429
$$ 921 -7720 -9476 -3288 3354 2495 -3495 -6649 -3918 -397 -1379 -3958 -3601 -455 650 -2743 -8172
626h172O77P810N629m369j0038m671O174J1411M148q718j2609k132R960J1819
$$ -8172 -7495 315 5944 1575 -8463 -13134 -6960 4451 8599 -119 -12728 -14860 -4900 6919
640F919P44j1147j1309J302J1611R713k129j0648q982K163J1382R866k783j1901
$$ 6919 7663 -3484 -14793 -13491 -1880 7833 5704 -4944 -13926 -11763 -381 9485 6702 -5199
654e199q941L499J2415R854l965j3025q166O112J2551O809n643j2319m310P847
$$ -5199 -14140 -10641 1774 11628 7663 -5362 -13528 -7416 5135 11944 6301 -6018 -10328 -2481
668b481J0374J800p025p502m12N949O825q43o390l056J426L069K054j276j694
$$ -2481 7893 9693 2668 -4834 -5246 703 7528 6685 295 -2761 -1335 1734 3788 2512 818
683H18j77L04j877j156J679L165O57l054l859j722L385N267L07m201n280j704
$$ 818 641 945 -932 -2088 -409 2756 3413 359 -3500 -5222 -1837 3430 3737 -464 -5744 -7448
699g448M432O410J719n962p607q93O650Q526J021q497r624K34J0544R422r37j1029
$$ -7448 -3016 3394 5113 -849 -8456 -9349 -2699 5827 6848 -1649 -11273 -11039 -495 8927 7990 -3039
715c039r984K740J3091R644m871j2766p027O370J3017N335p980j1836j839Q460
$$ -3039 -13023 -10283 2808 12452 7581 -5185 -12212 -5842 7175 12510 4530 -7306 -9145 -685
729f85R597Q07q439p767L20P910N542j388n602n063J158M553K839j264k772k148
$$ -685 8912 9719 1280 -6487 -6167 1743 7285 5897 295 -4768 -3610 943 3782 2518 -254 -2402
745b402k5J155O90M6m25lq63k027j00J453J455M06j552k572j562K435M243Q78
$$ -2402 -2427 -1272 -582 -536 -961 -964 -1827 -3854 -3954 -2501 -1046 -640 -2192 -4764 -6326 -3891 352 1230
763A230l732n365j346N790P137o7p953p054J684Q193P425j762r525p441L820R931
$$ 1230 -2502 -7867 -9213 -3423 3714 3647 -4306 -11360 -9676 -1483 5942 4180 -5345 -12786 -8966 965
779I65O299l940j0167n208N686J0353L086o810q529j936O861Q376J250p703o874
$$ 965 7264 3324 -6843 -12051 -6365 3988 7074 264 -8265 -10201 -3340 5036 6286 -1417 -8291
794h291J57O427O482M09n945o159O55N939M258q97m200l580J493L887J541j913
$$ -8291 -8134 -1707 4775 5184 -761 -6920 -6265 -326 3932 3035 -1165 -4745 -3252 635 2176 263
810B63j679k40R93O82K80j027L76J422o32j873k98J528K495P64k518m087l61N067
$$ 263 -1416 -1656 -663 19 299 -728 -352 1070 438 -1435 -1733 -205 2290 3054 536 -3551 -3912 1155
828A155M881r59o129m735J652P387N109l146q117l441L374P707L063m193p402
$$ 1155 6036 5077 -1052 -5787 -4135 3252 8361 5215 -2902 -6343 -2969 4738 7801 3608 -3794
843c794k420M962O755J619m884p161r06N887O656o7o134n067R8N453N220n75n010
$$ -3794 -6214 -1252 5503 7122 2238 -4923 -5829 58 6714 6647 513 -4554 -4456 997 6217 5642 632
860F32m302N83M336M091l89m629k998J153L765J992j390k845j239R51J905Q67
$$ 632 -3670 -3087 1249 5340 4951 322 -2676 -1523 2242 4234 2844 -1 -1240 -289 1616 2483
876B483n34j044o93o04P22R48K04N06o64j851j217P48K251J726o67l188k881J529
$$ 2483 1949 905 212 -392 330 1278 1482 1988 1324 -527 -1744 -996 1255 2981 2314 -874 -3755 -2226
894b226L451K965k303m508j945K130N284J671l485m795j709L557N205K153m421
$$ -2226 1225 4190 1887 -2621 -4566 -2436 2848 4519 1034 -3761 -5470 -1913 3292 5445 1024
909A024o074j138N518N527J10n030n493K93N511M521r93m851l883J245M795L514
$$ 1024 -5050 -6188 -670 4857 4967 -63 -5556 -5263 248 4769 3776 -1075 -4958 -3713 1082 4596
925D596j937m867j738J807L997K178k082l740j141K323K206O18r69j858r27L28
$$ 4596 2659 -2208 -3946 -2139 1858 4036 1954 -1786 -2927 -604 1602 2220 1251 -607 -1534 -1206
941a206J184M49J26Q2r41q34j47N25R80R65p77k219j024J260K139J145j432l005
$$ -1206 -22 427 553 635 -306 -1140 -1287 -762 218 1183 406 -1813 -2837 -1577 562 1707 275 -2730
959b730j295K606L420Q79k941l562o39L168M530L74m136m111k23L928M646M18
$$ -2730 -4025 -1419 2001 2880 -61 -3623 -4262 -1094 3436 3810 -326 -4437 -4660 -732 3914 4332
975D332m970m478J106M550L616q67m618l688J982M842K270k116m417k059K079
$$ 4332 -638 -5116 -4010 540 4156 3289 -1329 -5017 -3035 1807 4077 1961 -2456 -4515 -2436
990b436M854J997l461l838q99K726L318Q22k461k642K99J672R23K14j001o92J6
$$ -2436 2418 4415 954 -2884 -3783 -1057 2261 3083 622 -2020 -1721 -49 874 1088 87 -605 -589
1007e89P95l88k02K56R09n22r70q55N14J832J238q17l221r87K558K712N68k734
$$ -589 206 -182 -384 -128 781 259 -711 -1566 -1052 780 2018 1201 -2020 -3007 -449 2263 2831 97
1025I7l577%L792L151k37l986l257K99M642L632j233n037k551J525M449L054k531
$$ 97 -3480 -3480 312 3463 3226 -760 -4017 -3718 924 4556 3323 -1714 -4265 -2740 1709 4763 2232
1042B232m692j640K984L791J205k682m212r47L248L798j45k580l056j77K579K111
$$ 2232 -2460 -4100 -1116 2675 3880 1198 -3014 -3961 -713 3085 2940 360 -2696 -2873 -294 1817
1058A817K23k718j039K47J148J758M9j711q56P3J016K69K80m11r5j33K0q52P00
$$ 1817 2040 -678 -1717 -1470 -322 1436 1485 -226 -1082 -1009 7 276 556 145 50 -83 -63 -915 -215
1077b15J258M62j299j204k51J198K479k79k129k618P10K713K328o77k742k384
$$ -215 1043 1505 206 -998 -1249 -51 2428 2149 20 -2598 -1888 825 3153 2476 -266 -2650
1093b650P49L464J899j026l587k398K041L988K355k976l831j070K238M317Q77
$$ -2650 -1901 1563 3462 2436 -1151 -3549 -1508 2480 4835 1859 -1972 -3042 -804 3513 4390
1108D390l460l867k0L014K935Q0k813l262M31L370J643l58k919j594Q28K223J291
$$ 4390 930 -2937 -2957 57 2992 3072 259 -3003 -2572 798 2441 2083 -836 -2430 -1602 621 1912
1125A912j546j742k37M78Q26R50p99p02j33K66J77k96N44J36L9n37n52m52J266
$$ 1912 366 -1376 -1613 -1135 -309 641 -158 -860 -993 -727 -550 -846 -302 -166 -127 -664 -1216 -1668 -402
1144d02J524n60j483j155L06K010J665p03k393j213Q32K350J596r53k940j447
$$ -402 1122 562 -921 -2076 -1770 240 1905 1202 -1191 -2404 -1572 778 2374 1421 -1519 -2966
1160b966J833L196R68j779k997j110K528K998N70k400k869o20K617K807N67l091
$$ -2966 -1133 2063 3031 1252 -1745 -2855 -327 2671 3241 841 -2028 -2648 -31 2776 3343 252
1176B52k659L22K371L052o53l016k497J231L179J345j390k586j422J480K369O13
$$ 252 -2407 -2085 286 3338 2685 -331 -2828 -1597 1582 2927 1537 -1049 -2471 -991 1378 1991
1192A991j549j788k7Q22J463K1j204p66R09N78m16l91J66M61O91m13j219m21J564
$$ 1991 442 -1346 -1373 -551 912 933 -271 -1037 -128 450 34 -357 -191 270 961 548 -671 -1092 472
1211D72Q20j60j190j415N99J821J411q86k288j068J058K664J147j710k745j192
$$ 472 1292 1132 -58 -1473 -874 947 2358 1472 -816 -1884 -826 1838 2985 1275 -1470 -2662
1227b662K571K694L29k199k894j83K700K843n93k833k352Q03L155K240j584l116
$$ -2662 -91 2603 2932 733 -2161 -2344 356 3199 2606 -227 -2579 -1776 1379 3619 2035 -1081
1243a081j761J329L119J118j912k650l51J678K061K33j391j708l27J470J374K6
$$ -1081 -2842 -1513 1606 2724 812 -1838 -2189 -511 1550 1783 392 -1316 -1643 -173 1201 1227
1259A227j850o40N60Q62J41j04r55J49N86q4l95j05L05J40N16m69q48k00J089
$$ 1227 -623 -1263 -703 159 300 196 -759 -610 -24 -108 -503 -608 -303 -163 353 -116 -964 -1164 -75
1278g5J143l67j387r25P70K013J105j521k318q29J859K612O59k399l004N67K588
$$ -75 1068 701 -686 -1611 -841 1172 2277 756 -1562 -2391 -532 2080 2739 340 -2664 -2097 491
1295D91K266o03k318k453J014L312J920j585l189j440J808L088P86k198k445k96
$$ 491 2757 2154 -164 -2617 -1603 1709 3629 2044 -1145 -2585 -777 2311 3097 899 -1546 -1842
1311a842J695K147K19j888j919M69J807P86o21j351j038M88J342N32q31q84j43
$$ -1842 -147 2000 2219 331 -1588 -1119 688 1474 853 -498 -1536 -1048 294 826 -5 -889 -1032
1328a032J005P1k2o10l2L61L52m08m45L5M36Q07r1j172o93R20J587L36j002j967
$$ -1032 -27 44 22 -588 -620 -259 93 -315 -760 -725 -289 518 427 -745 -1438 -518 1069 1405 403 -1564
1348a564q3J543J924J32k061j510O42J896J409n35k105j253J253K336N61j135
$$ -1564 -1647 -104 1820 1952 -109 -1619 -977 919 2328 1793 -312 -1565 -312 2024 2585 1450
1364A450k093j088J502K455N77j293k435l68J371K104R8j646j871j37J915J363
$$ 1450 -643 -1731 -229 2226 2803 1510 -925 -1293 78 2182 2280 634 -1237 -1374 541 1904
1380A904m79j662j457P52J484J000r72j235j008J169R05L09j080q18L31O32O9
$$ 1904 1425 -237 -1694 -942 542 1542 570 -665 -1673 -504 401 710 -370 -1188 -857 -225 -156
1397a56n10m32M40M75M8o85n05M90N34O07n31j181l61J219J415q0j421j062M11
$$ -156 -666 -1098 -658 -183 -135 -820 -1325 -835 -301 306 -225 -1406 -1767 -548 867 787 -634 -1696 -1285
1416a285J494J348r21j952n12Q53J636J241j021k076m48J333J816K87j443j621
$$ -1285 209 1557 636 -1316 -1828 -975 661 1902 881 -1195 -1643 -310 1506 1793 350 -1271
1432a271k45J348K176n4j633j596J82J553J539l74j924j101R83J234Q25m68j788
$$ -1271 -1516 -168 2008 1954 321 -1275 -1093 460 1999 1625 -299 -1400 -417 817 1642 1174 -614
1449f14o10J067J127J70p89r08j49P71P32n59n99J09K87p1L60m37n13L93O82j70
$$ -614 -1224 -157 970 1140 351 -557 -706 65 797 238 -361 -252 35 -36 324 -113 -626 -233 449 279
1469B79o93n7J23O48J36m32j003J72N33J334l06n95j298j92J884J210r20j867
$$ 279 -414 -471 -348 300 436 4 -999 -827 -294 1040 734 139 -1159 -1351 533 1743 823 -1044
1487a044o51R53J893Q47j403k179o31K218J883J66k138j958L77K341J322q65j848
$$ -1044 -1695 -742 1151 1998 595 -1584 -2215 3 1886 2052 -86 -2044 -1667 674 1996 1131 -717
1504g17j006R07K142N03j384j796K33J188J189M6j008j384L26J299M30l64j024
$$ -717 -1723 -816 1326 1829 445 -1351 -1118 70 1259 1305 297 -1087 -761 538 968 604 -420
1521d20k65N06N44K43p68o50N14M22q4k21m32L1P58J61n32r92K86Q30P80k0j173
$$ -420 -685 -179 365 608 -160 -810 -296 126 42 -179 -611 -580 178 339 -193 -1185 -899 -69 711 691 -482
1542d82r45O28J459K10n13j349m51P93J603L80j129j376k27J134J760p3j662j645
$$ -482 -1427 -799 660 870 357 -992 -1443 -650 953 1333 204 -1172 -1399 -265 1495 1422 -240 -1885
1560a885P33J812Q44p59j369q66P03J935M11j240j213p78J532J478K06j812r10
$$ -1885 -1152 660 1504 745 -624 -1490 -787 1148 1559 319 -894 -1672 -140 1338 1544 -268 -1178
1577a178K46J309Q78o22j271k37Q58O99J04j053j36k18P34M36k74q04K06M95N14
$$ -1178 -932 377 1255 633 -638 -875 -17 682 786 -267 -403 -621 113 549 275 -529 -323 172 686
1596F86l47r77l9N33R13k72m92r06K51J096O70o64j158l09R21Q93N15j076j259
$$ 686 339 -638 -677 -144 769 497 5 -901 -650 446 1116 452 -706 -1015 -94 799 1314 238 -1021
1615a021k26J648J272m84j834n59Q6J989N01m44j545q94R89J616J52p68j333m19
$$ -1021 -1247 401 1673 1189 -645 -1204 -1118 871 1372 928 -617 -1511 -522 1094 1246 478 -855 -1274
1633a274R67J327O6j191j023l7J472Q07k74j436j90K55J009L08o76p19j87R32
$$ -1274 -307 1020 1086 -105 -1128 -1165 307 1114 840 -596 -786 -531 478 786 110 -609 -796 136
1651A36N74l31l93m44o0O20L70m32p37N51M44m2k04k73p78Q91J296n34r24o67
$$ 136 710 379 -14 -458 -518 102 472 40 -697 -146 298 256 52 -221 -999 -108 1188 654 -270 -937
1671i37O60Q13L82n38j200l82Q97J065K27j360q79J22J200J114m56j423p38P76
$$ -937 -277 536 918 380 -820 -1202 -305 760 987 -373 -1252 -1130 70 1184 728 -695 -1433 -657
1689f57J179P76p31j790l53J348J034P06j525j323m1J433J001m9j464j120J032
$$ -657 522 1298 567 -1223 -1576 -228 806 1512 -13 -1336 -1377 56 1057 1008 -456 -1576 -544
1706e44J292M12n76j582q2R84Q70O8o98j236P06P84K1j05p78o3M50L33L01p69
$$ -544 748 1160 584 -998 -1080 -96 774 842 144 -1092 -386 398 419 314 -464 -527 -77 256 557 -212
1726b12o20O79L62K78k30j066K91O92O65m49q15o20Q63J232p0o64j174k32J253
$$ -212 -832 -153 209 487 257 -809 -518 174 839 390 -425 -1045 -182 1050 980 316 -858 -1090 163
1745A63O47j0j192j066R61J132N31o08j380p90R51J721L40j034j775L63J229J192
$$ 163 810 800 -392 -1458 -497 635 1166 558 -822 -1612 -661 1060 1400 366 -1409 -1046 183 1375
1763A375n46r88j445N37K099J93o54j125r26J167J228n3q94j051K69J044Q53k23
$$ 1375 829 -159 -1604 -1067 1032 1225 571 -554 -1480 -313 915 862 -32 -1083 -814 230 1083 860
1781H60j240n12N77J020J33q00o57M8J121L15q90k68n34J115O59m90r58k95O37
$$ 860 -380 -892 -315 705 838 38 -619 -571 550 865 -25 -293 -827 288 947 457 -501 -796 -159
1800a59O58N19p75j101rJ020J001l96j202o50O07J212N80r30j200m02J044J231
$$ -159 499 1018 243 -858 -867 153 1154 758 -444 -1094 -487 725 1305 375 -825 -1227 -183 1048
1818A048N2j085j134J62J436R36p43j230n35L36J091P92q06q65q56J124J023R
$$ 1048 1100 15 -1119 -957 479 1415 672 -558 -1093 -757 334 1126 320 -545 -1401 -277 746 755
1836G55p26o85j51N81J113l25j129l36N66J85P42n23q46j41N51P46N0n71n06L07
$$ 755 29 -656 -807 -226 887 562 -567 -903 -337 -152 590 67 -779 -920 -369 377 427 -144 -650 -343
1856c43N93K11l70o42K65M99M10l22q28j42M33J019o8p73n65j75P28Q31l94r18
$$ -343 250 461 91 -551 -286 213 623 301 -527 -669 -236 783 715 -58 -623 -798 -70 761 367 -551
1876e51j17J44J191L24p40j204l6J216O29lj299o97N53Q99Q23n02j412j61O32
$$ -551 -668 -524 667 991 251 -953 -989 227 856 853 -446 -1143 -590 309 1132 630 -782 -943 -311
1895c11R15K48o00p41m7O18O28K24r74r90M95R04O47n10j059P4Q1Q94J25m66m37
$$ -311 604 852 252 -489 -536 82 710 934 -40 -1030 -535 369 1016 506 -553 -479 -398 496 621 155 -282
1916b82l57R56L10k67m40q0M64J29n5l12m40M07M25K20k80j242L27Q56L49k51
$$ -282 -639 317 627 360 -80 -160 304 433 378 66 -374 33 458 678 398 -844 -517 339 688 437
1936D37m13r03L77R35L68l37j180j15L65J141L83r85q47j66R50R22m50r46p45
$$ 437 24 -879 -502 433 801 464 -716 -831 -466 675 1058 73 -774 -940 10 932 482 -464 -1209
1955a209L86J607j34k35j075n77R04R68J39r80j232N54J326O54p67p62m40K06
$$ -1209 -823 784 650 415 -660 -1237 -333 635 774 -206 -1438 -884 442 1096 329 -433 -873 -667
1973f67J137J20p44l64m46J324J6K90n61j050Q08L44J5l89j14m12N13Q67n30o96
$$ -667 470 590 -154 -518 -964 360 376 666 105 -945 -137 207 222 -167 -281 -693 -180 687 157 -539
1993e39P2L36O66p7o92m05K4R01M05l44p61m88M50J026K29q04j108N54N29P20
$$ -539 -467 -131 535 458 -234 -639 -615 286 691 347 -414 -902 -452 574 803 -1 -1109 -555 -26 694
2013F94j68r85m21L40R12O61o85j028J16K42J122L5j000p48K23R01Q14n24q50
$$ 694 526 -459 -880 -540 372 1033 348 -680 -564 -322 800 835 -165 -913 -690 211 1025 501 -349
2032c49m59O18O30N99p08j113L18M39M52J99o49m75J71L63O15m90o35m29P04N63
$$ -349 -808 -190 440 1039 331 -782 -464 -25 427 626 -23 -498 -327 36 651 161 -474 -903 -199 364
2052C64k14q5o27J21O29P25o20q54J87O97K01J03n31q87M39J010L17p35j008j20
$$ 364 150 65 -562 -441 188 913 293 -561 -374 323 524 627 96 -791 -352 658 975 240 -768 -888
2072h88R60R57l81p52q58P31M22M57o55p57q1P65Q40n5q82n61L50N35P22m08r90
$$ -888 72 1029 648 -104 -962 -231 191 648 -7 -764 -845 -80 760 705 -177 -738 -388 147 869 461 -529
2093e29k6J95O87M97o42q02o5R33L17k6j53j201P0Q69O84n11q58J86O9P71l4n67
$$ -529 -555 -360 327 824 182 -620 -685 248 565 539 386 -815 -745 124 808 297 -561 -375 -306 465 431 -136
2115a36j5j85P45R6m35j32k86K61L46j86m74K5l8N65L65o14l47K79RM48j87j12
$$ -136 -151 -336 409 505 70 -62 -348 -87 259 73 -401 -376 -414 151 516 -98 -445 -166 -157 291 104 -8
2137hn92J15O24K90j92n63k28J05P38J07k25p11k74L69J027M8q72n50j2J048N73
$$ -8 -600 -485 139 429 237 -326 -554 -449 289 396 171 -540 -814 -445 582 630 -242 -792 -804 244 817
2158H17k20p66o68P46O79K08j093m29J39N62Q41m42q09k99O09O91J31l44p37J88
$$ 817 597 -169 -837 -91 588 796 -297 -726 -587 -25 816 374 -435 -734 -125 566 697 353 -384 -196
2178a96K18P66n40o38m31Q75L94l81n5k55m6N38J81l44l03rJ13L23K57k23p11
$$ -196 22 788 248 -390 -821 54 448 67 12 -243 -289 249 430 86 -217 -226 -113 210 467 244 -467
2199d67n6N37O25k10p36k97L61M88O95k85j071l9K07P64Nm70p59J32O98Q48k83
$$ -467 -523 14 639 429 -307 -604 -243 245 940 655 -416 -455 -248 516 521 51 -708 -576 122 970 687
2220F87j078l13P43N47J04q30k80j41L99N87n0o99l36N63N56K11l27m91l30M45
$$ 687 -391 -704 39 586 690 -140 -420 -561 -162 425 375 -324 -660 -97 459 670 343 -148 -478 -33
2240c3O98k97p42q0j46O89K97L50o36l98J32O42M2o97l00M6N50O14k76q58J0K52
$$ -33 665 368 -374 -454 -600 89 386 736 100 -298 -166 476 518 -179 -479 -433 117 731 455 -403 -393 -141
2262a41R05l06o27m87N68L71L46l94p28r6O06N84J71r40l25K08M23N33n87n57
$$ -141 764 458 -169 -656 -88 283 629 235 -493 -589 17 601 772 -168 -493 -285 138 671 84 -473
2282d73k96Q78L27p9k73n52n8N05N95K0o51j82O1Q8L64J14o78k0l8Q19m9k92q37
$$ -473 -769 109 436 357 84 -468 -526 -21 574 594 -57 -239 -178 -90 274 388 -290 -310 -348 471 422 130 -707
2305g07K14N00L72j73o55j51M42N04n9l34k81n9N76L21j23n24l22N58K97n5n81
$$ -707 -493 7 379 206 -449 -600 -158 346 287 -47 -328 -387 189 510 387 -137 -459 99 396 341 -240
2326b40j77o8P85K63l73o52L67N6N15p6l40n86l6N04K51J25k29k52k05M57M81
$$ -240 -417 -485 300 563 190 -462 -95 -39 476 400 60 -526 -562 -58 193 318 89 -163 -368 89 570
2347E70l77m47l84M12O33K19m57n50l28N48N70m5m96l69L49J51Q13m47q23m3L10
$$ 570 193 -254 -638 -226 407 626 169 -381 -709 -161 409 364 -132 -501 -152 -1 812 365 -458 -501 -191
2368a91Q48j18o57o37L47P97P3l83r0m08M84L64k29m20k94L84M33Q6p85K23Q9
$$ -191 657 539 -118 -755 -408 389 462 79 -11 -419 65 429 200 -220 -514 -130 303 389 -396 -173 -84
2389h4L09j46p8j16o0L06J03k22R7l10n4L16K40k31qk50k33L77O80m87m9m86k8
$$ -84 225 79 1 -115 -175 131 234 12 109 -201 -255 61 301 70 62 -188 -421 -44 636 149 100 -386 -414
2412d14O71M99n93n80rK87Q47j74o86q61O70O93L38n39n64l72N74O81Jp60L4r0
$$ -414 257 756 163 -417 -426 -139 708 534 -152 -1013 -343 350 688 149 -415 -787 -213 468 469 -291 -257 -347
2434c47M88K69l88k62j24M38K2K12k65m31L22P0K01j34j27n19L59J42N44j20n30
$$ -347 141 410 22 -240 -364 74 96 308 43 -388 -66 4 205 71 -56 -575 -216 -74 470 350 -180
2455a80M6J97L45j84l68k57K0O55J96k72r23L38L96K28J47n20p12O10R65k67l55
$$ -180 -134 63 408 224 -144 -401 -381 274 470 198 -725 -387 9 237 384 -136 -848 -238 727 460 105
2476A05n59j04N16N54l3p04k81J53P94J93p58k45n5N79p6J96m61j92q5L27J74
$$ 105 -454 -558 -42 512 479 -225 -506 -353 441 634 -124 -369 -424 155 79 275 -186 -378 -463 -136 38
2497C8mm78N34l41P8L82r4l54PK31K41J15p00Kk54O23M14J82r18k66K51O67j63
$$ 38 34 -444 90 -251 -173 209 115 -239 -232 -1 240 355 -345 -343 -597 26 440 622 -296 -562 -311 356 193
2520A93m66k87O29K54J94l02n34q6K22Q60n09k95o04P46M11J26p20j67j53N95
$$ 193 -273 -560 69 323 517 215 -319 -405 -183 677 168 -127 -731 15 426 552 -168 -335 -488 107
2540A07K95q5m36l69O96k16J52J18k90k06L66J03M3j62j69l48J99K40K88j92l75
$$ 107 402 317 -119 -488 208 -8 144 262 -28 -234 132 235 278 116 -53 -401 -202 38 326 134 -241
2561b41k76O03J65K2k31m69j3P61m3k01n78K15K51M36K01q96j6K02O56k63l39
$$ -241 -517 86 251 273 42 -427 -440 321 278 77 -501 -286 -35 401 602 -294 -310 -108 548 285 -54
2582e4m12L94M18p9k92j8j44R9O58m42j10%k5L46m89K54l34J67J29j20L81k28
$$ -54 -466 -72 346 267 -25 -43 -187 -88 570 128 18 18 -7 339 -150 104 -230 -63 66 -54 327 99
2604I9K8n92M22L31j63L0m06k7N21J36j51k01o86M37L00J69j78n85J52K93N28
$$ 99 127 -465 -43 288 125 155 -251 -278 243 379 228 27 -659 -222 78 247 69 -516 -364 -71 457
2625D57m32n73K82K51J07K92l00n34J93K36L10l53m39L4Q19m68K06l58J33Q7J62
$$ 457 25 -548 -266 -15 92 384 84 -450 -257 -21 289 -64 -503 -469 350 -118 88 -270 -137 -50 112
2646A12k31K17m69K14L95l91M06l74J40j78k93L66L08J03l03m89M12N85k96k22
$$ 112 -119 98 -371 -157 238 -153 253 -121 19 -159 -452 -86 222 325 22 -467 -55 530 234 12
2666A2m93L14K96L21l20n91K8N03L35p3o90k34M78L34K91l67o63K76O35k92j03
$$ 12 -481 -167 129 450 130 -461 -433 70 405 332 -358 -592 -114 220 511 144 -519 -243 392 100 -3
2687ck75p1J77N24j86k81j76j39Q0O18l7n75M4K91R9k48M54k04J55m37J67Q2J26
$$ -3 -278 -349 -172 352 166 -115 -291 -430 -350 268 231 -344 -300 -9 90 -158 296 92 247 -190 -23 59 185
2710A85l26n57P35J66L43m97j76j42K99M88n73l32R0J89N83j36p89L25k63P52
$$ 185 -141 -698 37 203 546 49 -127 -269 30 518 -55 -387 -297 -108 475 339 -450 -125 -388 364
2730C64M31p44m17K61N42j63k24j01o6O5K78p3m11K1K02M46l1j21l45r8j35K56
$$ 364 795 51 -366 -105 437 274 50 -51 -117 -52 226 153 -258 -237 -35 411 380 259 -86 -184 -319 -63
2752f3K81j76R4l21MJ58M81j78p73J63K69L32l41L43l09PN9j09K16n48l0K46P13
$$ -63 218 42 136 -185 -181 -23 458 280 -493 -330 -61 271 -70 273 -36 -29 30 -79 137 -411 -441 -195 518
2775E18j23o76Q7k3P1P27n59l70j38M70K60k48j90J02L40P8r9m93J00L06j96M15
$$ 518 395 -281 -194 -217 -146 581 22 -348 -486 -16 244 -4 -194 -92 248 326 227 -266 -166 140 -56 359
2797C59n44k55M39j46J35J45k20q1J56j55M87j90o1j02O4l0K33j02J31p08L93
$$ 359 -185 -440 -1 -147 -12 133 -87 -168 -12 -167 320 130 69 -33 31 1 234 132 263 -445 -52
2818e2J16Q3K20p02rM59L55m48j03k61K89K60J63j93o09K90L22k50L03n34K37
$$ -52 64 147 367 -335 -344 115 470 22 -81 -342 -53 207 370 177 -432 -142 180 -70 233 -301 -64
2839f4J83M5j02k84L01l53L90j7q5j10L3K44k67M4k5k0R4j67P8l9L75m82p1L75
$$ -64 119 164 62 -222 79 -274 116 99 14 -96 -63 181 -86 -42 -67 -87 7 -160 -82 -121 254 -228 -299 76
2863G6q6j74M25l96L79j42M24k38m55j76L46P8J01l08l29L16K04L08k75k60j10
$$ 76 -10 -184 241 -155 224 82 506 268 -187 -363 -17 61 162 -146 -475 -159 45 353 78 -182 -292
2884b92K45QR7r8j78L77m0J10N5l20r5M21p1m27K7Q6J55j99L71j56k23q4M82k33
$$ -292 -47 -39 58 -40 -218 159 119 229 284 -36 -131 290 219 -208 -181 -95 60 -139 232 76 -147 -231 251 18
2908A8j13j03J01M5Q9J94j67l7l24o7P83Jl15R4p08N52n6K55m05O9k85L99L31
$$ 18 -95 -198 -97 -52 37 231 64 27 -297 -364 419 420 105 199 -509 43 -13 242 -163 -94 -379 20 351
2931C51k40j22j47J37L0N40n49m62J62O43j68j79m9j75K89J68Rl05m4J59K5J04
$$ 351 111 -11 -158 -21 9 549 0 -462 -300 343 175 -4 -53 -228 61 229 238 -67 -111 48 73 177
2953A77j3k32k1m5J42J69J17n29K48j69O0N3k30J52O4J28q8O9k28L34k79O3L25
$$ 177 164 -68 -89 -134 8 177 294 -235 13 -156 -96 -43 -273 -121 -57 71 -17 52 -176 158 -121 -58 267
2976B67k44j77j3N96k41j14j44r9P9J84J48p19N4L62L26j22l88J09j29M42j35
$$ 267 23 -154 -167 429 188 74 -70 -169 -90 94 242 -477 -423 -61 265 143 -245 -136 -265 177 42
2997D2K95n85J90j49N5J44l83M64k10L37k67L1k46K80J02J92j65m47J84j65L27
$$ 42 337 -248 -58 -207 -152 -8 -391 73 -137 200 -67 -36 -282 -2 100 292 127 -320 -136 -301 26
3018B6m27O37k01j89J33l20L72K63l76M3j12L96k05p9J70J62k64K40k47k2L3K86
$$ 26 -401 236 35 -154 -21 -341 31 294 -82 -39 -151 245 40 -39 131 293 29 269 22 0 33 319
3040C19K51n06K02n53j18K52L64J36k24j05j91L4K10k58O7M6J31l46L39J82j03
$$ 319 570 64 266 -287 -405 -153 211 347 123 18 -173 -139 71 -187 -120 -74 57 -289 50 232 129
3061A29m55L59M3J20n83M45m06O23k92J71ol6j80R1L49l06k67j57N74k96L00k24
$$ 129 -326 33 76 196 -387 58 -348 275 -17 154 148 112 -68 23 372 66 -201 -358 216 -80 220 -4
3083dm00K85R2L34k64j49K09K94m80P3J1j93L31L0q7k5K32l14J01K20k08j21j38
$$ -4 -404 -119 -27 307 43 -106 103 397 -83 -10 1 -192 139 169 82 57 289 -25 76 296 88 -33 -171
3106a71J87J35k17J05j40K81k48j27N51m02L22n1m04O77m24j45Qj27M53m73K96
$$ -171 16 151 -66 39 -101 180 -68 -195 356 -46 276 225 -179 498 74 -71 -63 -190 263 -210 86
3127H6l80n4L93Q0k20J30m11n6K67L93m70J25j21P1L29j36k50N1Rl7L42m49J48
$$ 86 -294 -348 45 125 -95 35 -376 -432 -165 228 -242 -117 -238 -167 162 26 -224 -173 -164 -201 141 -308 -160
3150a60K45l50M71k68j3k42J44O4K91Q2l42L4p4O44o47N3NJ01q6p3L22M6l14p4
$$ -160 85 -265 206 -62 -75 -317 -173 -109 182 264 -78 -44 -118 526 -121 -68 -63 38 -48 -121 201 247 -67 -141
3174a41J59J70l96P4JL67J44n16J09j49K50j9q8j3J24K9j56K20j49j6J4R4J02
$$ -141 18 188 -208 -134 -133 234 378 -138 -29 -178 72 53 -35 -48 76 105 -51 169 20 4 18 112 214
3197B14j27j33j7J32Q3p6j93O2j87K79l8j71L16j02k6L4J31j94J1J44R7l94j47
$$ 214 87 -46 -63 69 152 76 -117 -55 -242 37 -1 -172 144 42 16 50 181 -13 -2 142 239 -155 -302
3220c02O85n43l5K19P0K14k63q3m68O51L30k50k15m81M02m7K93k66k72N29m46
$$ -302 383 -160 -195 24 94 308 45 -38 -506 145 475 225 10 -471 -69 -116 177 -89 -361 168 -278
3241b78M20K0n47K92J65P8j96J64r3l60J73J7O0n4KL20l4l94J24L2j63J27M5j14
$$ -278 142 162 -385 -93 72 150 -46 118 25 -335 -162 -145 -85 -139 -137 183 149 -245 -121 -89 -252 -125 -80 -194
3265a94K12J77k44K66k86K13k54L5j47L54L8J66j57k50J37j76j41J0o1L07N8J79
$$ -194 18 195 -49 217 -69 144 -110 -75 -222 132 170 336 179 -71 66 -110 -251 -241 -302 5 63 242
3287B42l56j6p0k9L19m42N57l31k00L81k55L21m13K58j4M0P2j33J09j32j17J76
$$ 242 -114 -130 -200 -229 90 -352 205 -126 -326 55 -200 121 -292 -34 -48 -8 64 -69 40 -92 -209 -33
3309c3O3k07N8K12o0j45L45n03J61m6K02K3j30N6m34P45o06K95k09L28k02L1o8
$$ -33 30 -177 -119 93 33 -112 233 -270 -109 -155 47 70 -60 -4 -438 307 -299 -4 -213 115 -87 -56 -124
3332a24J4j33R2K69p8o6j26K69Q7m69K75K02j20l21L32m3p8k44L00j58K21L0N5
$$ -124 -110 -243 -151 118 40 -26 -152 117 204 -265 10 212 92 -229 103 60 -18 -262 38 -120 101 131 186
3355A86l12L6R2J77j80J9j19p4N5p4N59m13K6j48N45k49k0l62L37j30j3r5o9L36
$$ 186 -126 -90 2 179 -1 18 -101 -175 -120 -194 365 -48 -22 -170 375 126 106 -256 81 -49 -62 -157 -226 110
3379A10o7L8lj04k58o7L19n3R6k76L58k60L74j76l3L48q6kj85j75k51K96O4K70
$$ 110 43 81 78 -26 -284 -351 -32 -85 11 -265 93 -167 207 31 -2 346 260 258 73 -102 -353 -57 7 277
3403B77k87k27P4J79K19m99J03J69J36j23R1J54p0j27j48J81K43l04M4rj69L13
$$ 277 -10 -237 -163 16 235 -264 -161 8 144 21 112 266 196 69 -79 102 345 41 85 76 -93 220
3425B20J14l90P2k18J61m9j23J20j31P1J59J60l34R7J12M9k67L24j6J34l51K02
$$ 220 334 -56 16 -202 -41 -90 -213 -93 -224 -153 6 166 -168 -71 41 90 -177 147 131 265 -86 116
3447A16l01L04p9n94O45k00j46K52j73j48L03m6R8j08r5L5K44O1k44j39L92l14
$$ 116 -185 119 40 -554 91 -109 -255 -3 -176 -324 -21 -67 31 -77 -172 -137 107 168 -76 -215 177 -137
3469a37J56j24J20K21k75K12p5k10QK34j77J26l3J74mk33J25p9j03r6j70N62l56
$$ -137 19 -105 15 236 -39 173 98 -112 -104 130 -47 79 46 220 216 -17 108 29 -74 -170 -340 222 -134
3492a34J51j93l6M65j05k34lk77K15J11K05j16j35P8J33l55M20k04ok1qJ93k73
$$ -134 17 -176 -212 253 148 -86 -89 -366 -151 -40 165 49 -86 -8 125 -230 190 -14 -20 -41 -49 144 -129
3515a29M59m92K56k62J65j01l2K90j39J67j23k5K2k98O15l19k86k5L42j55Q8j
$$ -129 330 -162 94 -168 -3 -104 -136 154 15 182 59 34 56 -242 373 54 -232 -257 85 -70 18 17
3537A7j01K9L03j86p2M03m81n7o2K53j90L52r0pO9j84p3O9r4k56M00Ml0J04jj95
$$ 17 -84 -55 248 62 -10 393 -88 -145 -207 46 -144 208 118 111 180 -4 -77 -8 -102 -358 42 46 16 120 119 -76
3563g6j22O40o12J69M4k1n00O03j44K41n8k24j27J92j9J31l5K95m82K43k29R0
$$ -76 -198 442 -170 -1 43 22 -478 125 -19 222 164 -60 -187 5 -14 117 82 377 -105 138 -91 -1
3585aj50K41N5j81R4J01O9j83J23j70k72K10m1M01k33j75K99m57L48J66j55l26
$$ -1 -151 90 145 -36 58 159 228 45 168 -2 -274 -64 -105 296 63 -112 187 -270 78 244 89 -237
3607b37K95k8j1J13j71j54L58P6j42p3K22k01J74j69p6K69j08l18J90j41L23k80
$$ -237 58 30 19 132 -39 -193 165 241 99 26 248 47 221 52 -24 245 137 -181 9 -132 191 -89
3629h9R8L6J48j60q0k02N54m27J38J46j27j49j84M85j33N3p2R6m2r9K40k30K61
$$ -89 9 45 193 33 -47 -249 305 -122 16 162 35 -114 -298 187 54 107 35 131 89 -10 230 0 261
3652B61j25km06j2K42j12L77j43J7k79J24J4j7P1P9Rj44J40j45R9l5j19L70l10
$$ 261 136 134 -272 -284 -42 -154 223 80 97 -182 -58 -44 -61 10 89 98 -46 94 -51 48 13 -106 264 -46
3676d6jJ64j1o5j41l0q0K35j51J48Q8l62K60K0r5K44l51L7J93m6j4r6j10J92p7
$$ -46 -47 117 106 41 -100 -130 -210 25 -126 22 110 -252 8 28 -67 177 -174 -137 56 10 -4 -100 -210 -18 -95
3701i5k09K72j14J21j52J56L91k99j72n9J17p3K68N7j31R6m48J80Q2j72J89N6
$$ -95 -304 -32 -146 -25 -177 -21 370 71 -101 -160 -43 -116 152 209 78 174 -274 -94 -12 -184 5 61
3723F1l37N04K8l79j16M33m17K1M17o51M40J90j27l3o1j98M17r5K08k25R1n4m23
$$ 61 -276 228 256 -123 -239 194 -223 -202 215 -436 4 194 67 34 -27 -225 192 97 305 80 171 117 -306
3746c06L11k55L27J95j56l74K49o2j23J91L28k03j88P3r4nj02K46J60q6Rq4L4
$$ -306 5 -250 77 272 116 -258 -9 -71 -194 -3 325 122 -66 7 -87 -92 -194 52 212 126 135 51 85
3769H5k25K24k27K8k56N68l8M5j12j15K12k41L55n02K20P2j38l67N52j44j90J51
$$ 85 -140 84 -143 -115 -371 197 159 204 92 -23 189 -52 303 -199 21 93 -45 -412 140 -4 -194 -43
3791d3j4M9j4m6K5R9l5R3m8j07K6J26oM6j53r1p7J66R4l01N14k8l22q1l5k6M04
$$ -43 -57 -8 -22 -68 -43 56 21 114 66 -41 -15 111 105 151 -2 -93 -170 -4 90 -211 303 275 -47 -128 -163 -189 215
3818B15k19r1K43l85K05K4k07L10O5k88p4N3k8J37J14j88L6k3M1MK42k37l0o1
$$ 215 -4 -95 148 -237 -32 -8 -215 95 160 -128 -202 -149 -177 -40 74 -114 -78 -101 -60 -56 186 -51 -81 -142
3842a42j04L35k12K93k26L87q2n46M79j18p4m8k43M56l82J60k18K47J78l40M06
$$ -142 -246 89 -123 170 -56 331 249 -297 182 64 -10 -58 -301 155 -227 -67 -285 -38 140 -200 206
3863B06l24J60J3k06M93j44j26J21j53j26K0O3O7l27J97j32J85O5j80N6O2j78
$$ 206 -118 42 55 -151 342 198 72 193 40 -86 -66 -3 64 -263 -66 -198 -13 52 -128 -72 -10 -188
3885a88N79n12L08j41J94j24j53R1j51J12j02J8K61k62K94m19P3L24k47M02o26
$$ -188 391 -121 187 46 240 116 -37 54 -97 15 -87 -69 192 -70 224 -195 -122 202 -45 357 -269
3906b69L90k61K56k02J39k10q4j12O07lj39k90K40J09k88r4nJ29K88L0k60O4j70
$$ -269 121 -140 116 -86 53 -157 -241 -353 254 251 112 -178 62 171 -117 -211 -216 -87 201 231 -29 35 -135
3929a35M15n41J25L13J63k89j42M1Q8k7J31r0k13J09L4L21m93L99k69L0j19N95
$$ -135 280 -261 -136 177 340 51 -91 -50 38 11 142 52 -161 -52 -18 303 -190 209 -60 -30 -149 446
3951D46m54l39L40l5K02j74L9K6q5J08k37L53L54n98R9mk23K94N5j97j97L26L5
$$ 446 -8 -347 -7 -42 160 -14 25 51 -34 74 -163 190 544 -54 45 41 -182 112 167 -30 -227 99 134
3974A34j00J67k37J61k42K15j08J96l18K50j6p3J72j88l7m9L55l18K06k81R8j95
$$ 134 34 201 -36 125 -117 98 -10 186 -132 118 102 29 201 13 -24 -73 282 -36 170 -111 -13 -208
3996b08J20K97j24J01k01K6J22l97L97K79k08l38k03M38k60l9J93J22l63J95j70
$$ -208 -88 209 85 186 -15 11 133 -264 133 412 204 -134 -337 101 -159 -198 -5 117 -246 -51 -221
4017b21l7L76j92L33q4k51J16r4N8Q8J72o18J48L38j26m7r9P0J21K20j84m30M66
$$ -221 -258 118 -74 259 175 -76 40 -54 4 92 264 -354 -206 132 6 -41 -140 -70 51 271 87 -343 123
4040A23j42J21j68K78J71l91j42l1L48l83K68J99l4k35K13l99J89k9N5m9o8l6
$$ 123 -19 102 -66 212 383 -8 -150 -181 167 -216 52 251 217 -18 195 -204 -15 -44 11 -38 -106 -142
4062a42K96j10J26l22J90p3j5K1J37j4j38N9r3K04K32n62K53j3rk37O0L00k29
$$ -142 154 44 170 -152 38 -35 -50 -29 108 94 -44 15 -78 126 358 -204 49 36 27 -210 -150 150 -79
4085g9K02m47K8L56K31l56K10o8k43J45K34j79j2l08L02o9N3n6J44R2l14K99j22
$$ -79 123 -324 -296 60 291 -65 145 77 -166 -21 213 34 22 -286 16 -53 0 -56 88 180 -134 165 43
4108D3K80j48k72n1J5O9N8j68L46j86J77j09k77L02M6m5k34L22k84n0M10j3n57
$$ 43 323 175 -97 -148 -133 -64 -6 -174 172 -14 163 54 -223 79 125 80 -154 168 -116 -166 244 231 -326
4131c26N63n18J4M67m65k2O60n06L30j40J72k36q9k88K21M19n50M81m23J19k0
$$ -326 237 -281 -267 200 -265 -287 373 -133 197 57 229 -7 -96 -384 -163 256 -294 187 -236 -117 -137
4152a37R2j33J03q3L32k01j61K63J36k42R7j61J62l13N16j71J7j07n8j9K0J11
$$ -137 -45 -178 -75 -158 174 -27 -188 75 211 -31 66 -95 67 -246 270 99 116 9 -49 -68 -48 63
4174F3k94L19M3m8n7K90j13k15J00p7p2K82k87k7O1O0j20K38o1M6p6Kj21M65k57
$$ 63 -231 88 131 83 26 316 203 -12 88 11 -61 221 -66 -93 -32 28 -92 146 85 131 55 57 -64 401 144
4199A44j2J11k72j76K59P3N8l23L19Rk73m7K74k31J04J17k61K90r0jP1M8k62L2
$$ 144 132 243 -29 -205 54 127 185 -138 181 190 -83 -130 144 -87 17 134 -127 163 73 72 143 191 -71 -39
4223c9l5r3K97j75J14j20R1L1LK16l93j18N56j56r2ql65M29L1m45K95R2o9M84
$$ -39 -74 -167 130 -45 69 -51 40 71 74 290 -103 -221 335 179 87 79 -286 143 174 -271 24 116 47 531
4247E31n04J30j70J78j29K53l91N8M42j72k41l89J79J76J54o9j66o9J85L09m78
$$ 531 27 157 -13 165 36 289 -102 -44 398 226 -15 -404 -225 -49 105 36 -130 -199 -14 295 -183
4268a83j8K80q0J7p4K52j49j50K32k48L34m85K50R9J3k0j95K57j64j90J85R8j72
$$ -183 -201 79 -1 16 -58 194 45 -105 127 -121 213 -272 -22 77 90 70 -125 132 -32 -222 -37 61 -111
4291a11L62m16J79k02K04K34m02K44k89M38ll76J05K17p0j99K93J0J52m19J00
$$ -111 251 -165 14 -188 16 250 -152 92 -197 241 238 -138 -33 184 114 -85 208 218 370 -49 51
4312E1J67n89N86k05j07PJ43k56K96j51k91M79k06J19m8J22j80o6k0K97j45r4
$$ 51 218 -371 215 10 -97 -90 53 -203 93 -58 -349 130 -76 43 -5 117 -63 -129 -149 148 3 -91
4334i1J58j83K51j31K33l95J72k9P4j31J28j04J24n6P3j46N9J1nO0j59R9J77k52
$$ -91 67 -116 135 4 237 -158 14 -15 59 -72 56 -48 76 20 93 -53 6 17 12 72 -87 12 189 -63
4358f3k36L20L1J35J7k57j53J46j22L07j98nK09o1j36k0J62q3Q3k31J92m23L00
$$ -63 -299 21 52 187 204 -53 -206 -60 -182 125 -73 -78 131 70 -66 -86 76 -7 76 -155 37 -386 -86
4381h6K38m0j11pM08l37j07J58m06L96m07N2J88j01K7k1Q2O6J54k7j81j64L78
$$ -86 152 112 1 -6 402 65 -42 116 -290 106 -301 -249 -61 -162 -135 -156 -74 -8 146 119 -62 -226 152
4404A52j96J49l18K53j14J94j97K44j65n10N31J40k45K48l1J34k62j65K20j1k52
$$ 152 -44 105 -213 40 -74 120 -77 167 2 -508 23 163 -82 166 135 269 7 -158 62 51 -201
4425b01K68J80m32N74o89J80k2o0L58j69J1K99m48K6m0N03l50P0j06J72j8j04
$$ -201 67 247 -185 389 -300 -120 -142 -202 156 -13 -2 297 -151 -125 -165 338 -12 58 -48 124 106 2
4447Bk5o1O8M0o5n8L48l11K78l19K47K94m48o9K68k38m2O3J57J96k61P2N2k48
$$ 2 -23 -84 -16 24 -41 -99 249 -62 216 -103 144 438 -10 -79 189 -49 -91 -28 129 325 64 136 188 -60
4471f0K34p9m10L20p8R5K72m92RJ07M30m92R5K05r4q0k21L84m74J75J74M19n49
$$ -60 174 95 -315 5 -73 22 294 -198 -189 -82 348 -144 -49 156 62 -18 -239 145 -329 -154 20 439 -110
4494a10K31Q1k41j21J28j10N98n72K60p3k18R1Jj7N96r01M44k29P6Kq5K3K7K33
$$ -110 121 202 -39 -160 -32 -142 456 -116 144 71 -147 -56 -55 -72 524 -377 67 -162 -86 -84 -169 -146 -119 114
4518A14j04L53k50k22K97m4m16J21QJ17j06R4O9QO5M6l37J46J02j53m0L74k98
$$ 114 10 363 113 -109 188 144 -272 -151 -143 -26 -132 -38 31 39 104 150 -187 -41 61 -92 -132 242 -56
4541e6m6J69m67L80j94L89j9r5O4J18m09J44J2mj05J41N1J36l49J52j04J93k55
$$ -56 -102 67 -400 -20 -214 175 156 61 125 243 -166 -22 -10 -14 -119 22 73 209 -140 12 -92 101 -154
4564a54J27J60j31l54L27o3J12m41M01N9m55L52j69L18k57J60K28P2m20M4K9J4
$$ -154 -27 133 2 -352 -25 -88 24 -417 -16 43 -412 -60 -229 89 -168 -8 220 292 -128 -84 -55 -41
4586d1oL63j57q9J64j01p3J9j32l7K64p3j76K0j18L03mk60J74K8l43L43l11j76
$$ -41 -47 316 159 70 234 133 60 79 -53 -90 174 101 -75 -55 -173 130 126 -134 40 68 -275 68 -243 -419
4610d19M58r0Q6L4M8k13J73k60J41l00M62l26L2M67m34L28j70L3k35K87q7k01
$$ -419 39 -51 35 69 117 -96 77 -183 -42 -342 120 -206 -174 293 -141 187 17 50 -185 102 15 -186
4632a86J22J48J54l51J48q8P5L36l26K9o4k25L68O6l51p4K13J86Ol83O3N05n28
$$ -186 -64 84 238 -113 35 -53 22 358 32 61 -3 -228 140 206 -145 -219 -6 180 186 -197 -134 371 -157
4655a57K03k25J60J05p2K21j22L0j40k77J12L27j44k63K73M0j71R6k02K72j89
$$ -157 46 -179 -19 86 14 235 113 143 3 -274 -162 165 21 -242 31 71 -100 -4 -206 66 -123
4676a23J89K6k84J57N5Qk61J79K48j13J71k96R0Ql19K27k6k71J41J51M51l94N4
$$ -123 66 92 -192 -35 20 28 -233 -54 194 81 252 -44 46 54 -265 -38 -64 -335 -194 -43 408 14 68
4699F8j47j80Q7M10k60m33L39r7L1mK49J37m77J98L15k60j87P7L64j02k09Q7K04
$$ 68 -79 -259 -172 238 -22 -455 -116 -213 -182 -186 63 200 -277 -79 236 -24 -211 -134 230 128 -81 6 210
4722B10l53rM9n7L89o2m18L59n28J37L38J0k98P4L60j08j34K02j82j68kK02J37
$$ 210 -143 -152 -103 -160 229 167 -251 108 -420 -283 55 65 -233 -159 201 93 -41 161 -21 -189 -191 11 148
4745A48m8k78O2K08n60M73R3n08M53r1J28l5J61l09J12J11J7N7l60J16n5L48l70
$$ 148 100 -178 -116 92 -468 5 98 -410 43 -48 80 45 206 -103 9 120 137 194 -166 -50 -105 243 -127
4768a27K98k50J12l96L94n1K3J91j95K3O8Q6j11j16m3J55r6j60j23N61p59P92
$$ -127 171 -79 33 -363 31 -20 3 194 -1 22 90 176 65 -51 -94 61 -35 -195 -318 243 -516 276
4790B76m28J67J26k42K48q9l0Q8k94O7R8L4k92R1K26K88k98r2J89q1j96J66j04
$$ 276 -152 15 141 -101 147 58 28 116 -178 -111 -13 21 -271 -180 46 334 36 -56 133 52 -144 22 -82
4813h2J69N5l6Nnk02K05m38K55J92l79L76j67M0J11Q8m04J84k55K34K18n87L40
$$ -82 87 142 106 111 106 -96 109 -329 -74 118 -261 115 -52 -12 99 187 -217 -33 -288 -54 164 -423 -83
4836h3n8L47m22L15m13J66m6J09M11n24K75k23K48m4k37L40j79k27K75j89L60
$$ -83 -141 206 -216 99 -314 -148 -194 -85 326 -198 77 -146 102 58 -179 161 -18 -245 30 -159 201
4857B01k16K06m43J81R2OJ54K87o01Pl55O07Q4o6J01j48K6J54j96J3j4k48J71
$$ 201 -15 191 -252 -71 21 27 181 468 -133 -126 -481 126 210 144 245 97 123 277 81 94 80 -168 3
4880CM8o2o5J80Q1q9n72N90L0J45n83L08K26j99rj24r1J06Q4kM1k7q8r3K05L5
$$ 3 51 -11 -76 104 185 96 -476 114 144 289 -294 14 240 41 32 -92 -183 -77 7 5 46 19 -69 -162 43 78
4906G8J31n45J95R7k81L98J42j09j9j41J24J2n5K4l4m05L42n3j06J15J09r0l7
$$ 78 209 -336 -141 -44 -325 73 215 106 87 -54 70 82 27 51 17 -388 -46 -99 -205 -90 19 -71 -108
4929a08K23k36J82j7J5J32m96L11j2K40k49J34j28K65j18j60j84P7k56M01K89
$$ -108 115 -121 61 44 59 191 -305 6 -6 234 -15 119 -9 256 138 -22 -206 -129 -385 16 305
4950C05k05l09j6M30K0l77N6N4o0K79L0j50k21K69J0k04K55J34m28M9j21J66j25
$$ 305 100 -209 -225 205 225 -152 -96 -42 -102 177 207 57 -164 105 115 -89 166 300 -128 -79 -200 -34 -159
4973a59J26Q9j8j65R9J89j65J44m42L99m4p0j10K74l71K02k42M07L9j70K46p1
$$ -159 -33 56 38 -127 -28 161 -4 140 -302 97 53 -17 -127 147 -224 -22 -264 143 182 12 258 187
4995A87J50m28N5R4j0m56J78K88l6N9k35kL02r1J3k70K76l7m0k89M81k16Q1j59
$$ 187 337 -91 -36 58 48 -408 -230 58 22 81 -154 -156 146 55 68 -202 74 37 -3 -292 189 -27 54 -105
5019a05J4J36L73k94m3K75m96K85j10M7k82M85k51k24J45oK57k71K65q5N0k26
$$ -105 -91 45 418 124 81 356 -140 145 35 82 -200 285 34 -190 -45 -51 206 -65 200 115 165 -61
5041f1J40O5P4l10K18j67M59j83n13N14l01J43j57N1J55K43m0o02O75m76k50K00
$$ -61 79 144 218 -92 126 -41 418 235 -278 236 -65 78 -79 -28 127 370 330 -272 403 -73 -323 -123
5063a23L92k80N2j53M33k34k60J49p5J72o8l00N67l00Q5n6o1K1p0J73j0l00K96
$$ -123 269 -11 41 -112 321 87 -173 -24 -99 73 5 -295 272 -28 57 1 -60 -39 -109 64 54 -246 50
5086E0n3J07Nqj94k26J07R2J75%j6K23n3j22q6p3j92M72l32N12o43K14l2K47k96
$$ 50 -3 104 109 101 -93 -319 -212 -120 55 55 39 262 209 87 1 -72 -264 208 -124 388 -255 -41 -73 174 -122
5111a22J31R2L5k13M5j80L99J41n00K51k77K37j74O3L0J10k21M54k79J76l82J77
$$ -122 9 101 136 -77 -32 -212 187 328 -172 79 -198 39 -135 -72 -42 68 -153 301 22 198 -184 -7
5133gk16R3L78k76J00j84J93j98J06J52j98J26j8K20m16M02m63K92j03j83P7P7
$$ -7 -223 -130 248 -28 72 -112 81 -117 -11 141 -57 69 51 271 -145 257 -206 86 -17 -200 -123 -46
5155d6L94n14J57qL46l96J77k5j4j74j35L94Ql45J73m66N57k11k48K31J68J82
$$ -46 348 -166 -9 -17 329 -67 110 85 71 -103 -238 156 164 -181 -8 -474 83 -128 -376 -145 23 205
5177B05k54J76j20N7j84k32O29n85O37o99P6K67j69M57m33M1K68K2kk27J08N4
$$ 205 -49 127 7 64 -120 -352 277 -308 329 -370 -294 -27 -196 261 -172 -131 137 159 157 -70 38 92
5199I2k25K91j25l0J27lj89L22m66J94P6K8N7j43j88j35K58L33l76N0K8j15N6
$$ 92 -133 158 33 3 130 127 -62 260 -206 -12 64 92 149 6 -182 -317 -59 274 -102 -52 -24 -139 -83
5222h3r5K59k1p4j06l3J08l33N15j04j46k31jL60q1J97j83k7m5O6L1R7j89K39
$$ -83 -178 81 60 -14 -120 -153 -45 -378 137 33 -113 -344 -345 15 -66 131 -52 -79 -124 -58 -27 70 -119 120
5246A20M5k77m6K22j69j8L07j79n2l6J20j62L21m72K83K84m21o9J9M32j68k46
$$ 120 165 -112 -158 64 -105 -123 184 5 -47 -83 37 -125 196 -276 7 291 -130 -199 -180 252 84 -162
5268a62K83k6m22L38k51K04K8lOj34J96O7J26l70k4K79j82JJ64j94L72m9l76p
$$ -162 121 95 -327 11 -240 -36 -8 -11 -5 -139 57 124 250 -120 -144 135 -47 -46 118 -76 296 247 -129 -136
5292a36n0J67J92l36Q1J9j45J25J83k19p9J18jj09M67l09j57K17j76J15K23m46
$$ -136 -186 -19 173 -163 -82 -63 -208 -83 100 -119 -198 -80 -81 -190 277 -32 -189 28 -148 -33 190 -256
5314b56M84j87j26R7q6J01J49j13J93k50j3K2o0Q1p2O1k70L80K4J53l62K9J12
$$ -256 228 41 -85 12 -74 27 176 63 256 6 -7 15 -45 36 -36 25 -245 135 159 312 -50 -21 91
5337I1M01l91l56K96k35M66l98L21l47j37L97j08K59k17r8O1J52l4l54K54N9j5
$$ 91 492 101 -255 41 -194 272 -126 195 -152 -289 108 0 259 42 -56 5 157 123 -231 23 82 67
5359F7J47k63q1J70J11m46J17L5J13K7l21K54K4kl35L46R2O9J02o06L16J62r3
$$ 67 214 -49 -130 40 151 -295 -178 -143 -30 -3 -324 -70 -46 -48 -383 -37 55 124 226 -380 -64 98 5
5382Ej32J59l99L36M5l9J45k29K69J63o08K91p4Rk7K14n2k07K12l92L25l15K57
$$ 5 -127 32 -367 -31 14 -25 120 -109 160 323 -285 6 -68 -59 -86 128 76 -131 81 -311 14 -301 -44
5405d4l2K17p0l5n8j10J16j86J76k5k14K29M9J15o6j2j52o8l3K41N0j02J81K6
$$ -44 -76 141 71 36 -22 -132 -16 -202 -26 -51 -265 -36 13 128 62 50 -102 -170 -203 38 88 -14 167 193
5429A93j45J60k17k24Q2M2P4J04m45L93M7J42k72K27l53L13Rl00m0k3J77%J84
$$ 193 48 208 -9 -233 -151 -109 -35 69 -376 17 64 206 -66 161 -192 121 130 -170 -210 -233 -56 -56 128
5452A28l15J18j94R9j96M47q9J21N1p9J04k88J61k71J34L16l49j50L37l7n4k52
$$ 128 -187 -69 -263 -164 -360 87 -2 119 170 91 195 -93 68 -203 -69 247 -102 -252 85 48 -6 -258
5474b58J58J67p6n8L71o07R9J51p9n9L67p9k99J56k3L30j32j44lo4K5n0JK38m40
$$ -258 -100 67 -9 -67 304 -303 -204 -53 -132 -191 176 97 -202 -46 -69 261 129 -15 -18 -82 -57 -107 -106 132 -308
5499c08%K48J60j8q3j3J36l28K06l9J33k01J23j06k36J63K04j50J68J46j56J60
$$ -308 -308 -60 100 82 -1 -14 122 -206 0 -39 94 -107 16 -90 -326 -163 41 -109 59 205 49 209
5521B09l86J32M8l8mJ2r7K61m14O38l52pJ9J58m4J48l12q1N1p5J70J68l5J23l40
$$ 209 -177 -45 3 -35 -39 -27 -124 137 -277 361 9 2 21 179 135 283 -29 -110 -59 -134 36 204 169 292 -48
5546d8P9j4J35j58m2J73l03K83k47J3L03k88J87M4k71K78j18k04L22k00J3O3j42
$$ -48 31 17 152 -6 -48 125 -178 105 -142 -129 174 -114 73 117 -154 124 6 -198 124 -76 -63 0 -142
5569a42L58k9l57j21M62k25m6r5L23j86q2K12k52K53l4k79L36j36J70q8J77k41
$$ -142 216 187 -170 -291 171 -54 -100 -195 128 -58 -140 72 -180 73 39 -240 96 -40 130 42 219 -22
5591b2k44P7J70m7M8J11j96j94J87K01k8K65j34k02lL88n82R8N2Qr9M03kjj76
$$ -22 -266 -189 -19 -66 -18 93 -103 -297 -110 91 63 328 194 -8 -11 377 -205 -107 -55 -47 -146 257 255 254 78
5616G8r7l1J4K89l26Q9L89n64R0m8J1k5j33K77m4j82J24J28J5j1J12p4J3j36Q9
$$ 78 -19 -50 -36 253 -73 16 405 -159 -69 -117 -106 -131 -264 13 -31 -213 -89 39 54 43 155 81 94 -42 47
5641D7j44p1p8J68J28j24J45n9Q6J31n44M19j01N4j79K67j07j44%J21J6j25K70
$$ 47 -97 -168 -246 -78 50 -74 71 12 98 229 -315 104 3 57 -122 145 38 -106 -106 15 31 -94 176
5664A76m92J09L29m50J72j6J49k8j29J83R7m78J14L05P6k74k50M14k1J19j03K16
$$ 176 -316 -207 122 -328 -156 -172 -23 -51 -180 3 100 -378 -264 41 117 -157 -407 7 -14 105 2 218
5686B18j31j7k30K59j17p5N2k81L91k92M62l29M13k6n84L61J1j16r0K98l18K57
$$ 218 87 70 -160 99 -18 -93 -41 -322 69 -223 239 -90 323 297 -287 74 85 -31 -121 177 -141 116
5708A16m3k7jn7J14j14m8j1j07L5K43n91K18L84k91K75q6P0J54k52Q7k45Q6q3
$$ 116 73 46 45 -12 102 -12 -60 -71 -178 -143 100 -491 -273 111 -180 95 9 79 233 -19 68 -177 -91 -174
5732a74K08lj14M59n10l8M6J62O7k1Q0k46J36K40l79J76j47J47Q8j90Q7j84K94
$$ -174 34 31 -83 376 -134 -172 -126 36 103 82 162 -84 52 292 -87 89 -58 89 177 -13 74 -110 184
5755A84j2R6j71k99J07j77N46j41l70M69j12K5J19k07Q4k62L93j45k01q7L00l19
$$ 184 172 268 97 -202 -95 -272 274 133 -237 232 120 145 264 57 141 -121 272 127 -74 -161 139 -180
5777a80L50j94r7Q3K23j18j93j1m6j25K83J40k36M01l38K88k87J37J7J27j78j56
$$ -180 170 -24 -121 -38 185 67 -126 -137 -183 -308 -25 115 -121 280 -58 230 -57 80 97 224 46 -110
5799a10K59l10K45o0J27r9M5k19l6J52K39o79K53m3J95qp2R6J2l35J40K86o9L3
$$ -110 149 -161 84 24 151 52 97 -122 -158 -6 233 -446 -193 -236 -41 -49 -121 -25 -13 -348 -208 78 9 42
5823D2m01M48k48K15l4R8k23J45k78L43R6l36QK29j42Q1J02l11K99j05j00K5K44
$$ 42 -359 89 -159 56 22 120 -103 42 -236 107 203 -133 -125 104 -38 43 145 -166 133 28 -72 -47 197
5846A97k62q9J47j85K87j31L70l25L4m0N6N1l37o1J18J97j68K87kN4j98l5l5J79
$$ 197 -65 -154 -7 -192 95 -36 334 9 43 3 59 110 -227 -288 -170 27 -141 146 144 198 0 -35 -70 109
5870A09K9n16K74r4K85J01l57N28j85k65k2R5J11k66K20m4Rn2j01L18j59P5l42
$$ 109 138 -378 -104 -198 87 188 -169 359 174 -91 -113 -18 93 -173 47 3 12 -40 -141 177 18 93 -249
5893b49M00k27k36J07J82J21k34O8j46K21J9M1k04J63n4p9K24j88J56L1p9N7j2
$$ -249 151 -76 -312 -205 -23 98 -136 -68 -214 7 26 67 -137 26 -28 -107 117 -71 85 116 37 94 82
5916H2j48L88l46P1o2O1l42N24k36M4R3L03m81r2j08M25k1r6J08l00J49k64L27
$$ 82 -66 322 -24 47 -15 46 -296 228 -8 36 129 432 -49 -141 -249 176 155 59 167 -133 16 -248 79
5939G9o5M7j33q3K66Jj31p5K15M7k09K00p8l26L89K2o1m1j19K78k18J74%P4m28
$$ 79 14 61 -72 -155 111 112 -19 -94 121 168 -41 159 81 -245 144 166 105 64 -55 223 5 179 179 253 -175
5964a75k9L64k31K83k12k39J62J57n2mR0J7K01k62k56M03n79N61l88M58l50L46
$$ -175 -204 160 -71 212 0 -239 -77 80 28 24 114 131 332 70 -186 217 -362 199 -189 269 -81 265
5986B65l57K43P3j17J42l51K03K09l66K42o0o4p3Q9q7K32m34L5L92k63K79J7q8
$$ 265 -92 151 224 107 249 -102 101 310 -56 186 126 62 -11 78 -9 223 -211 -176 216 -47 232 249 161
6009A61l10L06pj38K5j5J61nl18l6K57k43Q5K11K7P1l04L63m94J69K9p8N5j36
$$ 161 -149 157 150 12 37 22 183 178 -140 -176 81 -162 -77 134 161 232 -72 291 -203 -34 -5 -83 -28 -164
6033a64L29k02j6K3L08l39K27O1n7l62K38k72J46O6l13K53j18n2M33k56J65J17
$$ -164 165 -37 -53 -30 278 -61 166 227 170 -192 46 -226 -80 -14 -327 -74 -192 -244 189 -67 98 215
6055B15j90M3j12K72l1j04mO7l21L68n42M92j02J89k96K03l93K54R7k75j7L51
$$ 215 25 68 -44 228 197 93 89 156 -165 203 -339 153 51 240 -56 147 -246 8 105 -170 -187 164
6077A64k48K39j67j47O9K9J25j95m6j10j27K64J42j31J51N0K73l75J03rp2K7m9
$$ 164 -84 155 -12 -159 -90 -61 64 -131 -177 -287 -414 -150 -8 -139 12 62 335 -40 63 54 -18 9 -40
6100d0N9J53j81q5J87j20Q3l61N52r6O0k19r5O7j18j93M94J46k65N2q0N3l10K65
$$ -40 19 172 -9 -94 93 -27 56 -305 247 151 211 -8 -103 -36 -154 -347 147 293 28 80 0 53 -257 8
6124HkK92k07L34k15m8l87L96l3m62M22j36J79l43J14n9K95k25j90pK82j1j77
$$ 8 6 298 91 425 210 162 -225 171 138 -324 98 -38 141 -202 -88 -147 148 -77 -267 -274 8 -3 -180
6147a80M91j48p6k07j88K23J2N9j18L04p5m8k93M72k26j30Q0j45K31KR6m46J36
$$ -180 311 163 87 -120 -308 -85 -73 -14 -132 172 97 49 -244 228 2 -128 -48 -193 38 40 136 -310 -174
6170a74K3K88K15q77P45J5j11j32pJ60k09L7K3n2q3K35n9l1M8r0J09k70J28L74
$$ -174 -151 137 352 -525 220 235 124 -8 -15 145 -64 -27 -4 -56 -139 96 37 6 54 -36 73 -197 -69 305
6194C05o66L47k74Q8j55L66Q0k0k3J47J31M0l02J12J01n05o0J50J59J30K30n36
$$ 305 -361 -14 -288 -200 -355 11 91 71 48 195 326 366 64 176 277 -228 -288 -138 21 151 381 -155
6216a55J07K49j26l9k29K11j38L4J11oJ14l02M90j02k40M6J47k20l5M4Q8J0m0
$$ -155 -48 201 75 36 -193 18 -120 -86 25 19 133 -169 321 219 -21 25 172 -48 -83 -39 49 59 19
6239A9m4q7j01J66j23K45j87J33k9N4o5k91J23J00n6N2j58K41J19J50k08J39m8
$$ 19 -25 -112 -213 -47 -170 75 -112 21 -8 46 -19 -310 -187 -87 -143 -91 -249 -8 111 261 53 192 144
6262A44k96j46L75j47j84M11l99N3J61Q7o9K56j45j21j79J54q6L40l68q3L50K54
$$ 144 -152 -298 77 -70 -254 157 -242 -189 -28 59 -10 246 101 -20 -199 -45 -131 209 -159 -242 108 362
6284C62m03L6J04j14l1n8k43J99J32J02j36k64L21NM6l2r5k41K09k4n3K18K23
$$ 362 -41 -5 99 -15 -46 -104 -347 -148 -16 86 -50 -314 7 12 58 26 -69 -310 -101 -125 -178 40 263
6307B63m03j55M26j00J9J54M3n37N37j80j6k72K73m40L23o4J49j70M11k09j05
$$ 263 -140 -295 131 31 50 204 247 -290 247 67 51 -221 52 -388 -65 -129 20 -150 261 52 -53
6328e3j4j2J78Q5j89J05M27m41Mn7L8L97r96O51k73N5nj82J76oJ05Q2R1j50l9
$$ -53 -67 -79 99 184 -5 100 527 86 90 33 71 468 -528 123 -150 -95 -100 -282 -106 -112 -7 75 166 16 -23
6353b3N1j6r8n8L75j78J03K0k81N7Pj3K18l9L00n09L52j64k9j38L4Lj61K49L74
$$ -23 28 12 -86 -144 231 53 156 176 -105 -48 -41 -54 164 125 425 -84 268 104 75 -63 -29 -26 -187 62 436
6378D36j47r3j60j13m6q6K53l07K24n1K91k78j27J86l9p5J86j4J32o8N4k11K44
$$ 436 289 196 36 -77 -123 -209 44 -263 -39 -90 201 -77 -204 -18 -57 -132 54 40 172 104 158 -53 191
6401A91Q7j93j46J97k68L16j62k15J80J45J9m35J14K03l12K57M8k19N01m85J11
$$ 191 278 85 -61 136 -132 184 22 -193 -13 132 151 -284 -170 33 -279 -22 26 -193 308 -177 -66
6422f6L07j89q1Q0J82q1J44k53j7R2j73K23k98j82L78Jm80K21N7O0L33j23P3l10
$$ -66 241 52 -29 51 233 152 296 43 26 118 -55 168 -130 -312 66 67 -413 -192 -135 -75 258 135 208 -102
6446a02J12K79k44j29%j72L36Q3Nl16N7J26j02P7o6J91k07q9N3J1M98m33j00J06
$$ -102 10 289 45 -84 -84 -256 80 163 168 -148 -91 35 -67 10 -56 135 -72 -161 -108 -97 401 -32 -132 -26
6470b6%kk1pj22l4J59r0kq9N27l30J60k87L08o9K42q4l72K0q5K01N9l2k2K49q7
$$ -26 -26 -28 -49 -56 -178 -212 -53 -143 -145 -234 293 -37 123 -164 144 75 317 233 -139 -119 -204 -3 56 24 2 251 164
6497A64M1j21O9j2J28k30r9J09R6j02k44N54k87j36rJ92q2k04J78J89l14R6O1
$$ 164 205 84 153 141 269 39 -60 49 145 43 -201 353 66 -70 -79 113 31 -173 5 194 -120 -24 37
6520C7J21N5j25j3k65J11J87j58j87P2o1L80n5q1j89L29k7m6N0q0P2k32M9R2j60
$$ 37 158 213 88 75 -190 -79 108 -50 -237 -165 -226 154 99 18 -171 158 131 85 135 55 127 -105 -56 36 -124
6545a24K8j23M00m64M4J43m90Q50m61L07j05j7l65M63k38jJ96Nn57N46lk16r5
$$ -124 -96 -219 181 -283 -239 -96 -586 264 -197 110 5 -12 -377 86 -152 -153 43 48 -509 37 34 -182 -277
6568b77J76J21J81j69r2j25r2M4M36j75l0J45J5M1l65L6J69k10R2J65j6J85o9
$$ -277 -101 20 201 32 -60 -185 -277 -233 203 28 -2 143 158 199 -166 -130 39 -171 -79 86 70 255 186
6591A86j88j61J69Q9j36M5J09j84Q5K9J40J32n41O45n45K22J1O9k11qJ12Q3n8
$$ 186 -2 -163 6 95 -41 4 113 -71 14 43 183 315 -226 419 -126 96 107 176 -35 -43 69 152 94
6614I4j57J21j38M3j46P7J18K31o65N71n11L78J32J48l20J08k87k29O22k34n2
$$ 94 -63 58 -80 -37 -183 -106 12 243 -422 149 -362 16 148 296 -24 84 -203 -432 190 -44 -96
6635i6K59l04J45R5k42N5j24M40l65MK23r2J82k47M16j30j99J88k0l48M16k88
$$ -96 163 -141 4 99 -143 -88 -212 228 -137 -133 90 -2 180 -67 349 219 20 208 188 -160 256 -32
6657c2J54L9l79L21l14K46n9j3K6J49k95R1k30K36j23J60j8K54k75J68j47K04
$$ -32 122 161 -218 103 -211 35 -24 -37 -11 138 -157 -66 -296 -60 -183 -23 -41 213 -62 106 -41 163
6679A63l04K63j12J23m59K38J06m1R0Q4j80k36J31O00l82QJ46k62r4j67K25l8
$$ 163 -141 122 10 133 -326 -88 18 -23 67 151 -29 -265 -134 466 84 92 238 -24 -118 -285 -60 -98
6701i8m8J41j75J81K5k26K02j15K03Rj38l92M50j35J70k3N0j25J85j55JJ31j82
$$ -98 -146 -5 -180 1 26 -200 2 -113 90 99 -39 -431 19 -116 54 31 81 -44 141 -14 -13 118 -64
6724f4q1J16j42J08m8J91M9m39L06m21L59K6J02k94K47K5j27j05L6J91q0L6J50
$$ -64 -145 -29 -171 -63 -111 80 129 -310 -4 -425 -66 -40 62 -232 15 40 -87 -192 -156 35 -45 -9 141
6747A41k62K14Q4j27N2l26J5K69k07K61j56j10K03k1r2P6J1J40k98K93k32rJ13
$$ 141 -121 93 177 50 102 -224 -209 60 -147 114 -42 -152 51 30 -62 14 25 165 -133 160 -72 -81 32
6770C2o8n3J11Qk10J85J26l54N29m66Q7K66L4l05l5nJ19l8l31M32m35M32no5Q4
$$ 32 -36 -89 22 30 -180 5 131 -223 306 -160 -73 193 227 -78 -113 -118 1 -37 -368 64 -371 61 56 -9 75
6795G5K13k57M7J34l71K74o8j54J39N4J37j36k38L07j86K34j01j69j32L63j87
$$ 75 288 31 78 212 -159 115 47 -107 32 86 223 87 -151 156 -30 204 103 -66 -198 165 -22
6816b2J19j3J71j72k53Q5J00j1L7j56k90M70j21L01j6j52j9r2o9M6Q9k13P4L25
$$ -22 97 84 255 83 -170 -85 15 4 41 -115 -405 65 -56 245 229 77 58 -34 -103 -57 32 -181 -107 218
6840B18k64po3P6M4K15k19R4j44L1o0K80o39L01J79J4l54K63K6J90j35j29j76
$$ 218 -46 -53 -116 -40 4 219 0 94 -50 -19 -79 201 -438 -137 42 56 -298 -35 -9 181 46 -83 -259
6863b59J84J13q4J60j47Q0K23m18K3o2k1L4K95m1L17n39P6J76j69K6K74N3j54
$$ -259 -75 38 -46 114 -33 47 270 -148 -125 -187 -208 -174 121 80 397 -142 -66 110 -59 -33 241 294 140
6886A40J22m3j48J52l19J68k20M30m19K72m16J4L79J05k06M4q4O2R9l68L31m58
$$ 140 262 219 71 223 -96 72 -148 282 -137 135 -281 -267 112 217 11 55 -29 33 132 -236 95 -363
6908c63K26J54M0P2K43o42L38m1K16k9j46j01n7k8j20M00j55o1O2j5O8l47L43
$$ -363 -137 17 57 129 372 -270 68 27 243 214 68 -33 -90 -118 -238 162 7 -54 8 -7 61 -286 57
6931E7j20l10L68p9K49k58J7L31l82j4J60j18K87k31J7l4o1J37o8K65l2O5k01
$$ 57 -63 -373 -5 -84 165 -93 -76 255 -127 -141 19 -99 188 -43 -26 -60 -121 16 -52 213 181 246 45
6954D5N8J76p5k45k15M24j59q9J93j45J95m85r9J33K58R1M7J4o6j01l40L06L55
$$ 45 103 279 204 -41 -256 168 9 -80 113 -32 163 -322 -421 -288 -30 61 108 122 56 -45 -385 -79 276
6977B76k78j99J66J10k64M5Q3K32r1l89R4L40MK6q9L9m1l13L82k53j8J86l50L36
$$ 276 -2 -201 -35 75 -189 -144 -61 171 80 -309 -215 125 129 155 66 105 64 -249 133 -120 -138 48 -302 34
7001C4Q2k02J40J98Mm45n9L43j34j7J35j48P7pQ5k95M65j00k39J13N8j49l18J13
$$ 34 116 -86 54 252 256 -189 -248 95 -39 -56 79 -69 8 1 86 -209 256 156 -83 30 88 -61 -379 -266
7025b66J93j46M11l16K85r7k73J84o3j5o6M23Q2n06J57m3p5J6J8m2J30m2q7Q4
$$ -266 -73 -219 192 -124 161 64 -209 -25 -88 -103 -169 254 336 -170 -13 -56 -131 -115 -97 -139 -9 -51 -138 -54
7049e4J80o6o5J22r6J05l14nL47k40K67l84q9M91j65j53K34j79LJJ15j89K79m0
$$ -54 126 60 -5 117 21 126 -188 -193 154 -86 181 -203 -292 199 34 -119 115 -64 -61 -60 55 -134 145 105
7073A05k3k00j25K76q3m0J28r1Q8L17m3l28j24M13j83o8L87l20j47r9J22k03L28
$$ 105 82 -118 -243 33 -50 -90 38 -53 35 352 309 -19 -143 270 87 19 406 86 -61 -160 -38 -241 87
7096H7j29J76j00K82l71P9k0j60J41J03k79N06j77n3j06k95M16JQ5m63J20K79
$$ 87 -42 134 34 316 -55 24 4 -156 -15 88 -191 315 138 85 -21 -316 100 101 186 -277 -157 122
7118A22l30K77k2J9M9l20M70k87j2k7J22r8j16J55n5k03J18p2J44KJ0J87n53M05
$$ 122 -208 69 47 66 115 -205 265 -22 -34 -61 61 -37 -153 2 -53 -256 -138 -210 -66 -64 -54 133 -420 -15
7142a5m4R6k04N30k29o1K88j53m04L07J90m09O1Lk34J71J00K1J60p6l20J1K83
$$ -15 -59 37 -167 363 134 73 361 208 -196 111 301 -108 -47 -44 -278 -107 -7 14 174 98 -222 -211 72
7165G2j98J59J63k07p3R7j54MJ71O1N5m8k38M1q7M71l72J93q4J94j97J21j11l36
$$ 72 -126 33 196 -11 -84 13 -141 -137 34 95 150 102 -136 -95 -182 289 -83 110 26 220 23 144 33 -303
7189c03L09J33k53O6K35M8l46k29N98m5l71J86Kk74k0J97L1q1j36J74j67M79O5
$$ -303 6 139 -114 -48 187 235 -111 -340 258 213 -158 28 30 -244 -264 -67 -36 -117 -253 -79 -246 233 298
7212B98k19K32m84P0OL6Q5q6M9M4k4J22j87j96J79q0J40j7J43j56PK60m1j62k72
$$ 298 79 311 -173 -103 -97 -61 24 -62 -13 31 7 129 -58 -254 -75 -155 -15 -32 111 -45 -38 222 181 19 -253
7237b53J79L16k15P4j04k82M37k21r4J31p2K38k4O6k16j22J6J1K44j34l12J22
$$ -253 -74 242 27 101 -3 -285 152 -69 -163 -32 -104 134 110 176 -40 -162 -146 -135 109 -25 -337 -215
7259b15r5L30p6j40K97j4r6M8K37k64j8J02K0o72N14J14k3J25m1R0j55p7NK4k0
$$ -215 -310 20 -56 -196 101 87 -9 39 276 12 -6 96 116 -556 -42 72 49 174 133 223 68 -9 -4 20 0
7284@l31L78j82J52k48L13l73L53M2k12j72L33j22J48j59j02L01k35J00N9pJ19
$$ 0 -331 47 -135 17 -231 82 -291 62 104 -108 -280 53 -69 79 -80 -182 119 -116 -16 43 36 155
7306A55J16m20J29j01R2j12L8K43p8J86k49k49J34N6L21l59J49N9j50K0J55j88
$$ 155 271 -149 -20 -121 -29 -141 -103 140 62 248 -1 -250 -116 -60 261 -98 51 110 -40 -20 135 -53
7328e3J30j11j8q0J93k27M1n4O7J50J63k83K6K37m13n9jO3K21J21j37J09J11j40
$$ -53 77 -34 -52 -132 61 -166 -125 -179 -112 38 201 -82 -56 181 -232 -291 -292 -229 -8 113 -24 85 196 56
7352E6K55j57j36n5o5n3n0R3L75m24KK83j32j2N1J39r5k75J49J65j05nn12L15
$$ 56 311 154 18 -37 -102 -155 -205 -112 263 -161 -159 124 -8 -20 31 170 75 -200 -51 114 9 4 -508 -193
7376a93K19q7qp3K29J22l9j97L52l49q5P2M5M8lJ06m7k35j96J77m6R6R3K68j23
$$ -193 26 -61 -69 -142 87 209 170 -27 325 -24 -109 -37 8 56 53 159 112 -123 -319 -142 -188 -92 1 269 146
7401A46o0k00K05K22k72j33J22k07J18J11m26L85m31K73L09nl05L84Q9j68j31
$$ 146 86 -114 91 313 41 -92 30 -177 -59 52 -374 11 -420 -147 162 157 -148 236 325 157 26
7422B6J06r8M5K79l33j33r9m2L05K49k44j76P5J65l23L33n33M55j06M26m19j91
$$ 26 132 34 79 358 25 -108 -207 -249 56 305 61 -115 -40 125 -198 135 -398 57 -49 377 -42 -233
7444b33L26q6J7k56m5K54K10K84m89L1J26j21L8j70K08j30L2j72J48J18k80L45
$$ -233 93 7 24 -232 -277 -23 187 471 -18 13 139 18 56 -114 94 -36 -4 -176 -28 90 -190 155
7466A55J06n03M08l26J59J04k43J80J12j0l84J5J86K1O3k14K35o5k12K95J0l00
$$ 155 261 -242 166 -160 -1 103 -140 40 152 142 -242 -227 -41 -20 43 -171 64 -1 -213 82 92 -208
7488b08J62M89k26r4J27k44n4k6Q0L4k92L09K66k90n9J76Mj59j54K42o0J61j38
$$ -208 -46 443 217 123 250 6 -48 -74 6 40 -252 57 323 33 -26 150 154 -5 -159 83 23 184 46
7511D6p4K04k33R3j95K69r5n5N4j12L1J77k06K21L8J29j92p0N0k61l6M78j08J41
$$ 46 -28 176 -57 36 -159 110 15 -40 14 -98 -67 110 -96 125 163 292 100 30 80 -181 -217 261 153 294
7535B94k0k54r4J47n4j22Q9L7k85N31m58J46R1J6l6J89l44J90J03l31m1L85j39
$$ 294 274 20 -74 73 19 -103 -14 23 -262 269 -189 -43 48 64 28 217 -127 63 166 -165 -206 179 40
7558D0k7J36%j10j99J89J00M5j5k42p6M5K79k50K08k1r0j36J74L5j3l2j24j4K70
$$ 40 13 149 149 39 -160 29 129 174 159 -83 -159 -114 165 -85 123 102 12 -124 50 85 72 40 -84 -98 172
7583A72p6k36K03J76j98M5l26K24k41J33J14rP1j68R7Q3j16q0J21k7n0K22n5k2
$$ 172 96 -140 63 239 41 86 -240 -16 -257 -124 -10 -19 52 -116 -19 64 -52 -132 -11 -38 -88 134 79 57
7607E7l73K10J3j09J26K07M8n8L08m14J09j06j9j86J3J72l22J60j86L48N07n80
$$ 57 -316 -106 -93 -202 -76 131 179 121 429 15 124 18 -1 -187 -174 -2 -324 -164 -350 -2 505 -75
7629g5K24j10j27k35K22R0j88J50k42M68J75m76J18o6P4K3j59J65J84k65J77k66
$$ -75 149 39 -88 -323 -101 -11 -199 -49 -291 177 352 -124 -6 -72 2 25 -134 31 215 -50 127 -139
7651a39J89K84k64j34K25j4M4l42LJ53J51j58r8rL26K8k75k75M49m7j65r2M03
$$ -139 50 334 70 -64 161 147 191 -151 -148 5 156 -2 -100 -109 217 245 -30 -305 144 97 -68 -160 243
7674B43J16l06j57k7J88l10K66O6J61m36N3K1J16j09K43k5n0j61J52L1k52K9K97
$$ 243 359 53 -104 -131 57 -253 13 79 240 -196 -143 -122 -6 -115 128 103 53 -108 44 75 -177 -148 149
7697A49j8j68jj86K50j49l5K85k24J09r1m3k26J52J29J32K66l92J67J25k63o5
$$ 149 131 -37 -38 -224 26 -123 -158 127 -97 12 -79 -122 -348 -196 -67 65 331 -61 106 231 -32 -97
7719i7l8L28k01K94k08J78k10J01n08K85k17K06M61j20k87J24k00J57j77L01j22
$$ -97 -135 193 -8 286 78 256 46 147 -361 -76 -293 -87 374 254 -33 91 -109 48 -129 172 50
7740E0R1r3p4J78l26k05L46l9J62J15N1q4l41K96l14J60Kk59L73O1k53j99N55
$$ 50 141 48 -26 152 -174 -379 -33 -72 90 205 256 172 -169 127 -187 -27 -25 -284 89 150 -103 -302 253
7763B53q9m75J91k94N18J51j08j3k37j5n7J26q6L96j39j70qP9r2m9K75j08j82
$$ 253 164 -311 -120 -414 104 255 147 134 -103 -118 -175 -49 -135 261 122 -48 -56 23 -69 -118 157 49 -133
7786a33j78N48l40L50j77K2N1M1l53K07l00K08J60j55K91n92K61M4q3j15J55j6
$$ -133 -311 237 -103 247 70 92 143 184 -169 38 -262 -54 106 -49 242 -350 -89 -45 -128 -243 -88 -104
7808a04J70J03l11J01o1p2K49j57j5K91J30l60j63M9O4L68p0m7m34J78O6l27M19
$$ -104 66 169 -142 -41 -102 -174 75 -82 -97 194 324 -36 -199 -150 -86 282 212 165 -269 -91 -25 -352 67
7831F7m2k3m0n5Q7k24M31l73J95K52l3n47K26J52K13l14l2K05j71J40k59pJ59
$$ 67 25 2 -38 -93 -6 -230 201 -172 23 275 242 -305 -79 73 286 -28 -60 145 -26 114 -145 -152 7
7854GL38k78K6k28J94J25R1k86k57M26j45K05J23n93L61k20O8q6J44j41Q8L12
$$ 7 345 67 93 -135 59 184 275 -11 -268 158 13 218 341 -252 109 -111 -43 -129 15 -126 -38 274
7876B74j14n1J81k00n9l04J54k56K84L9n9j42Q3L14j55j51J64j58k9J21K77m9
$$ 274 160 109 290 90 31 -273 -119 -375 -91 -52 -111 -253 -170 144 -11 -162 2 -156 -185 -64 213 164
7898A64k40K32l51M30j01r9K9MO7j67j3N3K35k49l55J39N26l34J34J23j47K73
$$ 164 -76 156 -195 235 134 35 64 68 135 -32 -45 8 243 -6 -361 -222 304 -30 104 227 80 353
7920C53l88J44k11j46J21L1p8J79Q9P8j51P4o8k5j53N80o96J85j2n5Q2l83N11
$$ 353 -35 109 -102 -248 -127 -96 -174 5 94 172 21 95 27 2 -151 429 -267 -82 -94 -149 -67 -450 61
7943F1k62L50k08j19K8O5J25J22o6m9J08J74k2J78n74m0J10M02l72J61m7j13J37
$$ 61 -201 149 -59 -178 -150 -85 40 162 96 47 155 329 307 485 -89 -129 -19 383 11 172 125 12 149
7966A49l36K77m86J31K24q5L07k21R3k26L86k02r7L01l44m8J15p1j80N10n8p3
$$ 149 -187 90 -396 -265 -41 -126 181 -40 53 -173 213 11 -86 215 -129 -177 -62 -133 -313 197 139 66
7988F6R8q9r6L1k7j1K41j16Qk78L20j24l41J28mJ91J9j02L0r4K34jp2j98LJ38
$$ 66 164 75 -21 10 -17 -28 213 97 105 -173 147 23 -318 -190 -194 -3 16 -86 -56 -150 84 83 11 -187 -184 -46
8014d6J04j77J62j77R8j10P7M9r9P3k19K40R5q3N5q4l14L87m6L7J80l0Q6k79j14
$$ -46 58 -119 43 -134 -36 -146 -69 -20 -119 -46 -265 -25 70 -13 42 -42 -356 31 -15 22 202 172 258 -21 -135
8039a35%L11l31K02pj56R4k91L82N2P1l70J87j91K72l93M96l41J00Q0N7m1n5l65
$$ -135 -135 176 -155 47 40 -116 -22 -313 69 121 192 -178 9 -182 90 -303 193 -148 -48 32 89 48 -7 -372
8063c72K70J33K16l08J64l27N3K16q0j27L69j71N8L8k46L78k74J01n6l43K15K54
$$ -372 -102 31 247 -61 103 -224 -171 45 -35 -162 207 36 94 132 -114 264 -10 91 35 -308 -93 161
8085A61p0L1l03nN39l61J24J77l72M4K4o9LJ06j2O1l37J05M08j76k0J7Q1JJ83
$$ 161 91 122 -181 -186 353 -8 116 293 -79 -35 -11 -80 -77 29 17 78 -259 -154 254 78 58 75 156 157 340
8110C40k91m51M34l7r4j16K59M2qj25m9J36j81L04k62k22M04J35q3k06K07l39
$$ 340 49 -402 32 -5 -99 -215 44 86 78 -47 -96 40 -141 163 -99 -321 83 218 135 -71 136 -203
8132b03M45k23R3r6Mj10R4k40R9L4k18J88N8Q7k49K88J47M7l25K58j25m1K03j65
$$ -203 242 19 112 16 20 -90 4 -236 -137 -103 -321 -133 -75 12 -237 51 198 245 -80 178 53 12 215 50
8156E0K30k57K5j7k6j78r7M24l29J99J73M6l11k7M08n82MJ78j70L07K30L6l50
$$ 50 280 23 48 31 5 -173 -270 154 -175 24 197 243 -68 -95 313 -269 -265 -87 -257 50 280 316 -34
8179c4M30n15k28K07M52n04J8K4K05j80K66k29
$$ -34 396 -119 -347 -140 312 -192 -174 -150 55 -125 141 -88
8191h8
$$ Imaginary data points
##PAGE= N=2
##DATA TABLE= (X++(I..I)), XYDATA
0@%%%%%%Qj6J6j7K5l2M0n2O1p3Q9j06J29j55J80k10K44k81L22l70M26m83N47o19
$$ 0 0 0 0 0 0 0 8 -8 8 -9 16 -16 24 -28 33 -40 49 -57 72 -83 97 -113 131 -150 172 -198 228 -255 292 -327
30c27O97p86Q82r87J101j226J365j518J685j868K070k293K538k809L112l451L832
$$ -327 370 -416 466 -521 580 -646 719 -799 886 -982 1088 -1205 1333 -1476 1636 -1815 2017
47B017m266M763n336O008o812P792r017J0603j2740J5803k0600K9231m9637J85840
$$ 2017 -2249 2514 -2822 3186 -3626 4166 -4851 5752 -6988 8815 -11785 17446 -32191 153649
61A53649J72799k97501j51905M6936J90672O4069m1911q8566l5751j3081L4540
$$ 153649 326448 28947 -122958 -76022 114650 178719 136808 48242 12491 -590 33950
72C3950M9247K1806o9517p0887K3532J02211L1195p8558r4409j048O1903N1256
$$ 33950 83197 105003 35486 -35401 -11869 90342 121537 42979 -51430 -52478 9425 60681
84F0681Q415n925l1914o8569n1841N3276J17938M4616q4255j01110o331O5722
$$ 60681 69096 63171 31257 -37312 -89153 -35877 82061 126677 42422 -58688 -65019 703
96G03L8320j2663q373J8353p712n1070k2918N5015O4555j8893p7400k9886N8179
$$ 703 39023 26360 17987 36340 28628 -22442 -45360 9655 74210 55317 -22083 -51969 6210
109F210P1772n127p5041o0558J5312P4059P0807K893q5838j07710j0877J18303
$$ 6210 77982 72855 -2186 -62744 -47432 26627 97434 100327 14489 -93221 -104098 14205
121A4205J23471j5057j38760j02060M5088J22528N0049o0211p5779j4025L0894
$$ 14205 137676 122619 -16141 -118201 -73113 49415 99464 39253 -36526 -50551 -19657
132a9657L2736K2068n06m0419n6987l434P4739P3520k6248j05357n8903N3548
$$ -19657 13079 35147 34641 -5778 -62765 -66199 8540 82060 55812 -49545 -108448 -54900
144e4900R3343K9477m6551o1061k5975K0184M5584L3732r064m5546l2335K0909
$$ -54900 38443 67920 21369 -39692 -65667 -45483 101 33833 24769 -20777 -53112 -32203
156c2203M6049Q057l6744k1259K3399K2378j4437j9954J7012L0676j2242n2617
$$ -32203 13846 21903 -14841 -36100 -12701 9677 -4760 -24714 -7702 22974 10732 -41885
168d1885j7618N7554O7056j2255p8485n2402K9260P2428M2456k0922n7757m0436
$$ -41885 -59503 -1949 65107 52852 -25633 -78035 -48775 23653 66109 45187 -12570 -53006
180e3006J1001N2685M7104n792n6586m4120K1929O2094K8841l1685n1146j7675
$$ -53006 -42005 10680 57784 51992 -4594 -48714 -26785 35309 64150 32465 -18681 -36356
192c6356K9180M7517K6368j7223n2337m7052J1256P5155O5414k4478r4245n6507
$$ -36356 -7176 40341 66709 49486 -2851 -49903 -38647 36508 101922 77444 -16801 -73308
204g3308M4148Q9246L1952n3584o7617n460M8323L6562r579l2420k0592O778K4968
$$ -73308 -29160 60086 92038 38454 -29163 -34623 13700 50262 40683 8263 -12329 -5551 19417
217A9417J7678p994k4652j6177N347J8759J2035j685o791m743j3511j7089P521
$$ 19417 37095 29101 4449 -11728 -6381 12378 24413 22728 15937 11194 -2317 -19406 -11885
230a1885L5688K6708j8317m7533k4208K5137M4145J3570k2916k6948p470P214
$$ -11885 23803 50511 32194 -15339 -39547 -14410 29735 43305 20389 -6559 -14029 -6815
242f815J4950J6245M178j8543k6570k149L1527L3446q311m7835l3130K2906N6298
$$ -6815 8135 24380 28558 10015 -16555 -18704 12823 46269 37958 -9877 -43007 -20101 36197
255C6197L0720k8351o1737l4837L1367O8608L4023l8357p1375k8238M5925O5870
$$ 36197 66917 38566 -23171 -58008 -26641 41967 75990 37633 -33742 -61980 -16055 49815
267D9815R177n4137m8516J0182M6546K3794j9281l3718j1723J4537J8992Q825
$$ 49815 58992 4855 -43661 -33479 13067 36861 17580 -16138 -27861 -13324 5668 14493
279A4493l746j3617j8012o663J5838K2822P256j4128k1952j0507R545J9572J2537
$$ 14493 10747 -2870 -20882 -27545 -11707 11115 18371 4243 -17709 -28216 -18671 901 13438
292A3438l330j6802j4484J137J6364J2609l122j0339m273k16R61N470R604M578
$$ 13438 10108 -6694 -21178 -20041 -3677 8932 5810 -4529 -8802 -9018 -8057 -2587 7017 11595
306A1595j1195k0685m555K7455L1109o956m3002k9793K1417N0954K4114l1370
$$ 11595 400 -20285 -24840 2615 33724 26768 -16234 -46027 -24610 26344 50458 19088
318A9088n2228j5225L6668M7315Q707l6456m2915l908L7887L7445l737l7956k8847
$$ 19088 -33140 -48365 -11697 35618 44325 7869 -35046 -38954 -1067 36378 32641 -5315 -34162
331c4162Q428L3099K2259j0494k7564j6487N616J9758J8123K318j9531k4008m007
$$ -34162 -25734 7365 29624 19130 -8434 -24921 -19305 453 18576 20894 1363 -22645 -26652
344b6652K1693K5467K566k4108k4008M185K4570J4357r152j7060o449Q720J0570
$$ -26652 -4959 20508 23074 -1034 -25042 -20857 3713 18070 8918 -8142 -14591 -5871 4699
357D699Q34o349k017K685l32l989j828P095R705O77j5301j7218N380K7494J8318
$$ 4699 5533 -816 -2833 -148 -480 -4469 -6297 798 10503 11180 -4121 -21339 -15959 11535 29853
372B9853j4912l3883j5256K3010L7151P626k9382l2505K76K8832K5437k698k6379
$$ 29853 14941 -18942 -34198 -11188 25963 33589 4207 -28298 -28022 810 26247 23549 -2830
385b830k1653N181K3642J7817l157k0840j9789J344K2427K1124r48k2065k2692
$$ -2830 -24483 -19302 4340 22157 19000 -1840 -21629 -20285 2142 23266 22318 253 -22439
398b2439n19K3798K5039n58k5680k4244K653K7282K2697p452k9088j5777J4653
$$ -22439 -22958 840 25879 25321 -359 -24603 -21950 5332 28029 20577 -8511 -24288 -9635
411i635K5278O341j6512j7952L51J5537R754n090q857j498L832J295j865o82N563
$$ -9635 15643 21984 5472 -12480 -12129 3408 13162 8072 -785 -2283 1549 2844 979 297 5860
426E860N812l902j2719o357R959J5788M924j2901j8108l716J5970J8425n55j7138
$$ 5860 11672 7770 -4949 -11306 -1347 14441 19365 6464 -11644 -15360 610 19035 18480 1342
440A342j5404R33J5397J4029j397j5085j3573p80J3259J6590K919j7368k0785
$$ 1342 -14062 -13129 2268 16297 14900 -185 -13758 -14538 -1279 15311 18230 862 -19923
453a9923k164K0962K2722N0k5331k4048M137K8763K0764q779k8183j7077J2027
$$ -19923 -22087 -1125 21597 21647 -3684 -27732 -23595 5168 25932 17153 -11030 -28107 -16080
466a6080K8489J1644j6603k3463n137J6714J8740O12j5282j3215L663J1776O981
$$ -16080 12409 24053 7450 -16013 -21150 -4436 14304 14916 -366 -13581 -9918 1858 8839
479H839k696n597l859J05J612K047K766K712j815o520l691L373O757L943k481
$$ 8839 6143 546 -3313 -3208 -1596 451 3217 5929 4114 -2406 -6097 -2724 4033 7976 5495
494E495p067m943K246O426M268o7n590p114k065N871R315L122p235j3553n640
$$ 5495 -1572 -6515 -4269 2157 6425 6358 768 -6346 -8411 -2540 6775 9897 2662 -10891 -16531
509a6531J0771J7757M184j6266k0210j625K0424K1470k988k5538j8792Q598K6015
$$ -16531 -5760 11997 16181 -85 -20295 -21920 -1496 19974 16986 -8552 -27344 -18746 7269
522G269J4642j2191k4866j0046J5664K2447M980j5587j7893k193J4840J5239j2
$$ 7269 21911 9720 -15146 -25192 -9528 12919 17899 2312 -15581 -17774 -2934 12305 12293
535A2293j2801j0856R82J0001Q809k49p425o875q45N324O257K277m222o426r98
$$ 12293 -508 -11364 -10382 -381 8428 8179 754 -6121 -6966 -1642 4615 6892 2670 -3756 -4754
550d754M017M221J76k429k248k37J365J67r48K333K965j668o444l271M533Q841
$$ -4754 -737 3484 3660 1231 -1017 -1254 111 278 -670 1663 4628 2960 -3484 -6755 -2222 6619
566F619M165p881j2633k513J2324J3967L50j5495j5053K950J9045J3502p182j8786
$$ 6619 10784 2903 -9730 -12243 81 14048 14398 -1097 -16150 -13200 5845 19347 12165 -6621
580f621j0730R699J8159P715j1276j6576m614J2087J3974L155j0143j3695k790
$$ -6621 -17351 -7652 10507 18222 6946 -9630 -14244 -2157 11817 14972 4829 -8866 -11656
593a1656J0588J2605K670r589j2034k852R267J2399J501r049j0639j629Q929J0075
$$ -11656 -1068 11537 14207 4618 -7416 -10268 -1001 11398 12899 3850 -6789 -8418 511 10586
607A0586J7r375p479K327P835M764l197o475k158M821L652j837k939Q31K542J35
$$ 10586 10603 1228 -6251 -3924 3911 8675 5478 -997 -3155 1666 5318 3481 542 1373 3915 4050
623D050l598l511L391O934K259p109q152j43R245Q804j306j1819r417L914J2920
$$ 4050 452 -3059 332 7266 9525 2416 -5736 -5879 3366 12170 10864 -955 -10372 -6458 6462
638F462P183n300j2766o818O247J3267M526p932j1750m454P492J1420M194q257
$$ 6462 13645 8345 -4421 -11239 -4992 8275 12801 4869 -6881 -11335 -3843 7577 11771 3514
652C514j2447l820Q918J1610L923r179j3255k480J0590J2099P34j0679j0217O79
$$ 3514 -8933 -12753 -3835 7775 11698 2519 -10736 -13216 -2626 9473 10207 -472 -10689 -10010
666a0010J1265Q419k812r714m882K961Q192M744l860o774j720M195M169P19k022
$$ -10010 1255 9674 6862 -2852 -7734 -4773 3419 8163 4303 -2471 -4191 4 4173 4892 2870
681B870k089P60M70n40n71K495K158j179l031k790J205M192L268j516n149l995
$$ 2870 781 1541 2011 1471 900 3395 5553 4374 1343 -1447 -242 3950 7218 5702 553 -3442
697c442J585N107M658k091o995n419K813Q106M416l155j0060n912N128J0943N169
$$ -3442 -1857 3250 7908 5817 -1178 -6597 -3784 4322 8738 5583 -4477 -10389 -5261 5682 10851
712A0851p099j1558n488P842J3328L902j0522j2237j353J0617J1886n47j1894
$$ 10851 3752 -7806 -13294 -5452 7876 11778 1256 -10981 -12334 -1717 10169 9622 -2272
725b272r043L398J1170O610l641r862m524M393R722L381n287o279j643L833N439
$$ -2272 -11315 -7917 3253 9863 6222 -3640 -8164 -3771 5951 9332 4045 -2234 -3877 -44 5395
740E395J809l112l237n75J843J502O72m14p01J75m73j335R3K110J322q71k310
$$ 5395 7204 4092 855 280 2123 3625 4297 3883 3182 3357 2884 1549 1642 3752 5074 4203 1893
757A893j505K0K921K944j613l925l555J333O383L943l435q709l685N663Q581K963
$$ 1893 388 408 3329 6273 4660 735 -2820 -1487 4896 8839 5404 -3305 -6990 -1327 7254 10217
773A0217n695r774k896P529R332J495p875r228m71Q974Q201q37r521p006K844
$$ 10217 4522 -5252 -8148 -619 8713 10208 2333 -6895 -7366 1608 9809 8972 -549 -7555 -4711
788d711Q846N825l456q599m548L906P925L788l698o917l516L404O992K423m052
$$ -4711 4135 9960 6504 -2095 -6643 -2737 5188 8976 5278 -1639 -5155 -1751 5241 7664 3612
803C612m616j405K952M047K53k679k099O95J302P34k70p59l62Q58k72j179o8J628
$$ 3612 -1004 -2409 543 4590 4843 2164 65 760 2062 2796 2526 1767 1405 2263 1991 812 744 2372
821B372J870j146k623k723J722N313K457l863o132j659M331O878K217o511p174
$$ 2372 4242 3096 473 -2250 -528 4785 7242 3379 -2753 -4412 -81 6797 9014 2503 -4671
836d671nO515O105k72o613o679J647O914N364k163p070n035K421P633M250l853
$$ -4671 -4676 1839 7944 7672 1059 -5620 -3973 2941 8305 6142 -928 -5963 -3542 4091 8341 4488
852D488p191l003L154N882L764l630o267k336L015N250K083k766m936j778L638
$$ 4488 -2703 -5706 -2552 3330 7094 3464 -2803 -5139 -2124 3126 5209 2443 -2493 -4271 -633
867f33L683N34k662k941L8J826K561l65j336p74m50L68J324O57m27k03l65j290
$$ -633 3050 3584 922 -2019 -1981 -155 2406 2041 705 -69 -519 -151 1173 1830 1403 1200 835 -455
885d55o22J801J827J53j369k233j700K700L638M96l570l823k40M007M209k95m772
$$ -455 -1077 724 2551 2704 1335 -898 -2598 102 3740 4236 666 -3157 -3397 610 4819 4524 -248
902b48m240J182M679M239r16o206m465J964O537L533k750n787l480K687O363K623
$$ -248 -4488 -3306 1373 5612 4696 -1510 -5975 -4011 2526 6059 3309 -2478 -5958 -3271 3092 5715
918E715m037n538j440L504M674J837l813m842j66L803L796J13l313l398N03L201
$$ 5715 1678 -3860 -5300 -1796 2878 4715 902 -3940 -4106 -303 3493 3606 293 -3105 -2602 599
934E99K252p02j605j465k15J396J285q4j24p74n95l62M32R51N16M64q81j983k48
$$ 599 2851 2149 544 -921 -1136 260 1545 1461 1337 563 -32 -394 38 989 1505 1969 1088 -895 -1143
953a143J791J662j53k029k297R2L384K286j251l512k046Q92M089K456j526m786
$$ -1143 648 2310 2157 128 -2169 -2077 1307 3593 2342 -1170 -3216 -2324 1765 4221 2695 -2091
969b091k766J972M950K796k330n347k675L674M640J798l454m207j620L363M957
$$ -2091 -4857 -2885 2065 4861 2531 -2816 -5491 -1817 2823 4621 1167 -3040 -4660 -1297 3660
984C660L17l536m208p0L744L794k56m540k971J252L769J758n77l151j724J229
$$ 3660 3977 441 -3767 -3837 -93 3701 3445 -1095 -4066 -2814 955 2713 2136 -1015 -2739 -1510
1000a510K349Q02j265p29n82K64R94k34j8L69O5l91q95n14J234J164P42j818k313
$$ -1510 839 1641 376 -353 -935 -671 323 89 71 440 505 114 -781 -1295 -61 1103 1845 27 -2286
1019b286M66K643J907m25l592k320J284M513J910k447m286j924K802M887J522
$$ -2286 -1820 823 2730 2305 -1287 -3607 -2323 2190 4100 1653 -2633 -4557 -1755 3132 4654
1034D654l544m975m69L733M291K96l951l978L02M509L294j217l656k905R69M360
$$ 4654 1110 -3865 -4334 -601 3690 3986 35 -3943 -3641 868 4162 2945 -711 -3616 -2647 1713
1050A713K246j725l319j812J373K904J807j828k791q24J634J841M82r88j570m07
$$ 1713 3959 2234 -1085 -2897 -1524 1380 3187 1359 -1432 -2256 -622 1219 1701 713 -857 -1264
1066a264R60Q41L35o59k92k87J58o4K48L58Q73n22j167p84K04K089Q56r57k407
$$ -1264 -304 537 872 213 -79 -366 -208 -272 -24 334 1207 685 -482 -1266 -1062 1027 1883 926 -1481
1085a481j435J942K960Q13j759k494j991K774L637L59k583l597n10L327L851j88
$$ -1481 -2916 -974 1986 2799 1040 -1454 -3445 -671 2966 3325 742 -2855 -3365 -38 3813 3625
1101C625l614l309N77L954K921q80l849k851K010L682J954j470l177k243K034
$$ 3625 11 -3298 -2721 1233 4154 3274 -575 -3426 -1416 2266 4220 2750 -427 -2670 -636
1116f36L307J057k306k511n28J962K432j4k162j397J75J227R87K62j325p72K22
$$ -636 2671 3728 1422 -1089 -1617 345 2777 2763 601 -796 -621 606 1593 1855 530 -242 -20
1133b0L35K24j59K1J28l44l80o09L35R10R97r15j971n05J252J918P3j284k290
$$ -20 315 539 380 401 529 185 -195 -804 -469 441 1438 523 -1448 -1953 -701 1217 1290 6 -2284
1152b284k8K034J913K06k068k622K09K490K388n10k511k379L66L442J937l10l720
$$ -2284 -2312 -278 1635 1841 -227 -2849 -2640 -150 2238 1728 -783 -3162 -2796 646 2583 2273 -1447
1169a447j894J389K743K042q80l729j571J483L223J165j536l216j188K470L115
$$ -1447 -3341 -1952 791 2833 1953 -1776 -3347 -1864 1359 2524 988 -2228 -3416 -946 2169
1184B169k9k355j992k35K119K040p06j887j029L99J436N55k07j155q65J082N79
$$ 2169 2140 -215 -2207 -2442 -323 1717 1011 -876 -1905 -1506 -70 485 278 -877 -1742 -660 -81
1201h1l67o68M30O42j63m06r26l25J414J249j096j178l76Q97J415J006j717k366
$$ -81 -448 -1116 -686 -44 -207 -613 -1539 -1864 -450 799 -297 -1475 -1851 -954 461 1467 -250 -2616
1219b616M2K246K218O0k706k397N38L133K025j122k683k068J545L061K195k394
$$ -2616 -2574 -328 1890 1950 -756 -3153 -2615 518 2543 1421 -1262 -3330 -1785 1276 3471 1077
1235A077l302q54K405K503J457k332l279l23L022K340J01k642j887M31K517J646
$$ 1077 -2225 -3079 -674 1829 3286 954 -2325 -2648 374 2714 2815 173 -1714 -1283 1234 2880
1251B880q83j918q95N01J670J055q93j822P7Q64L73K09l58o44j46O89K72n77j70
$$ 2880 1997 79 -816 -315 1355 2410 1517 -305 -228 636 1009 1218 860 216 70 759 1031 454 284
1270B84K73J94J61l60q41L44J265K50p04j456o4R63J801M33k561j632M81J928
$$ 284 557 751 912 552 -289 55 1320 1570 866 -590 -654 309 2110 2543 -18 -1650 -1169 759
1288G59K129n81k504k303J667L259Q95j589l106o86K103K856M01k490k494k6K747
$$ 759 2888 2307 -197 -2500 -833 2426 3321 1732 -1374 -2060 43 2899 3300 810 -1684 -1710 1037
1305A037K278j75k648k398P21L032J576j507k031j142R69K201L13j257j374k61
$$ 1037 3315 3140 492 -1906 -1185 1847 3423 1916 -115 -1257 -288 1913 2226 969 -405 -666
1321f66P97J122J84j288p59N58L29M28j60r64k42N07J02p42j78L24O42j50n10
$$ -666 131 1253 1437 149 -610 -52 277 705 545 -419 -661 -154 -52 -794 -972 -648 -6 -156 -666
1340f66o69o86R94J436o18j230j152M39J668Q14m96k312p13J293K269L43j353
$$ -666 -1335 -2021 -1027 409 -209 -1439 -2591 -2152 -484 330 -166 -2478 -3191 -1898 371 714 -639
1357f39k270m75K445J781J54k150j870P70J505K265m65k083j216N57K110R95k54
$$ -639 -2909 -3384 -939 842 996 -1154 -3024 -2254 -749 1516 1051 -1032 -2248 -1691 419 1414 1160
1374A160k319o74J232J712O63r59j720n91J049J723J88j267r23n8J396J037l71
$$ 1160 -1159 -1833 -601 1111 1774 815 -905 -1496 -447 1276 1464 197 -726 -784 612 1649 1278
1391A278j173n62K09J120l6q61Q9J13K47K43j144l1N22P34k43l71j188j68J978
$$ 1278 105 -457 -248 872 836 -25 64 177 424 667 -477 -508 14 748 505 134 -1054 -1222 756
1410G56Q27r38j537r9L78J730M50j195j759j21J540J803k84j624j540L01J847
$$ 756 1583 645 -892 -991 -613 1117 1567 372 -1387 -1508 32 1835 1551 -73 -1613 -1312 535
1427E35J254j67j840j124M59K087P78l76k172j035J000K260M09q60j834l22J598
$$ 535 1789 1622 -218 -1342 -883 1204 1982 1606 -566 -1601 -601 1659 2068 1208 -626 -948 650
1444F50R44M65j096j546j36J812O68j00j509k53K91J015L90p79n62L76M49j33
$$ 650 1594 2059 963 -583 -719 1093 1761 1661 152 -101 190 1205 1595 816 254 630 1079 946
1462I46m1m60r8J27L85k53n80M8M59J47J24o44q55J52J415N33q55j409l62R06
$$ 946 905 445 347 474 859 606 26 74 533 680 804 160 -695 -543 872 1405 550 -859 -1221 -315
1482c15J313M42j685j671L13J580J567o0k138j643O66J900J648j115k200r79J360
$$ -315 998 1440 -245 -1916 -1603 -23 1544 1484 -654 -2297 -1631 269 1917 802 -1398 -2377 -1017
1499a017K092L93j437j733j38J594J498J63j974j482Q40J600L89j86j288p22J068
$$ -1017 1075 1468 31 -1702 -1840 -246 1252 1415 -559 -2041 -1201 399 788 602 -686 -1408 -340
1516c40Q30K39p33r62L75P96L49J62j047k73P84J6K98n98k20K24N37K79j015l86
$$ -340 490 729 -4 -966 -591 205 554 716 -331 -604 180 196 494 -104 -324 -100 437 716 -299 -685
1536f85K84J022J19m97r55l68J097R36Rr74j262O07J056R47j43j416j411O37J669
$$ -685 -401 621 740 243 -712 -1080 17 953 962 -12 -1274 -667 389 1336 1193 -223 -1634 -997 672
1555F72Q59j051j788l62J286J925o51q66j400j24J623J583o22j651r24M88J249
$$ 672 1531 480 -1308 -1670 -384 1541 890 24 -1376 -1500 123 1706 1084 -567 -1491 -1003 246
1572B46J479o65j806n60R37J537n2o37j096j67O17J293k33q62p21P01N22L78n81
$$ 246 1725 1060 -746 -1306 -369 1168 1116 479 -617 -784 -167 1126 893 31 -690 11 533 911 330
1591C30n00j33Q66L93m61o36k89O45P08n86p82k10Q12O44L64r02j642N60J099
$$ 330 -170 -303 563 956 495 -141 -430 215 923 337 -445 -655 157 801 1165 263 -1379 -819 280
1610B80J089l28j684o46P38J161Q72j042j625p6J386J247q0j173j422L14J284
$$ 280 1369 1041 -643 -1289 -551 610 1482 440 -1185 -1261 125 1372 1292 119 -1303 -989 295
1627B95R02k27j295q56L77J337J044r21j296k18L20J249O60j252q57k02R68P36
$$ 295 1197 970 -325 -1181 -804 533 1577 656 -640 -858 -538 711 1371 119 -738 -940 28 764
1645G64l06l22p66J88Q18M89o00l45m47L10J115m11o65n79L83Q85J26o35k53j95
$$ 764 458 136 -630 -442 376 865 265 -80 -527 -217 898 487 -178 -757 -374 511 637 2 -251 -446
1665d46O09P20l64j299K04O10J189N6j061r13J04J269O31q04r31p67O39J427O20
$$ -446 163 883 519 -780 -576 34 1223 1279 218 -695 -591 678 1309 505 -426 -1193 -554 873 1493
1684A493j358j590M5J346J376Q2j703j218L69J556J111n98j798l66N99J680N96
$$ 1493 135 -1455 -1410 -64 1312 1394 -309 -1527 -1158 398 1509 911 -887 -1253 -654 1026 1622
1701A622j536j394lR96J364l35p91p62K45P16N38j92q49j98L14O29J08n66n91
$$ 1622 86 -1308 -1311 -315 1049 714 -77 -839 -594 122 660 468 -381 -579 -265 364 472 -94 -685
1720f85J20O32P05o28q82L5J137J93k40m55p24M00Q10N49j046n18m04J065P20
$$ -685 -565 67 772 144 -738 -703 434 627 387 -68 -792 -392 418 967 -79 -597 -1001 64 784
1739G84j15j096r55O76J292P38r98j443l69J040J479J51j097j398N12J022J231
$$ 784 669 -427 -1382 -706 586 1324 326 -1117 -1486 -446 1033 1184 87 -1311 -799 223 1454
1756A454o17j604p19Q66J459N60o64j644o11J108J378L5j147r88J80J069J025
$$ 1454 837 -767 -1486 -620 839 1399 735 -909 -1520 -412 966 1001 -146 -1134 -954 115 1140
1773A140n78j020q19R98P91M23p01q84j17P32Q34o47o08q5q4R92K41q70m43Q6
$$ 1140 562 -458 -1277 -279 512 935 234 -650 -767 -35 799 152 -456 -541 -625 367 608 -262 -705 -619
1793f19P25k4J78r78k89J014Q31j48j011o37O93P11O29o00j325m38J101J266k59
$$ -619 106 82 260 -718 -1007 7 838 690 -321 -958 -265 446 1075 475 -850 -1288 -187 1079 820
1812H20j003j018L24Q71R77m44j227l27O01J363M90r66j372m8Q37J141P1j130
$$ 820 -183 -1201 -877 -6 971 527 -700 -1027 -426 937 1427 461 -911 -959 -122 1019 1090 -40
1830d0q19J89R03J025q48p60o01K59J147N91p64r59m0R17N44O5o93n30L22L71
$$ -40 -859 -670 233 1258 410 -350 -951 -692 455 1046 282 -677 -717 200 744 809 116 -414 -92 279
1850B79N23o02n91m3J77J180k72p23k33k9R87k37J51o38l15N04N62j68q99q3M3
$$ 279 802 200 -391 -434 -257 923 651 -72 -305 -334 653 416 567 -71 -386 118 680 512 -387 -470 -427
1871d27J180J42o86j371L38J043Q17l50j081o55P34J125j67k28j515K63M27J334
$$ -427 753 895 209 -1162 -824 219 1036 686 -395 -1050 -316 809 642 414 -1101 -838 -411 923
1889I23K1j118p01j44J484M76j98j153n30K49J190M97o76p86J15P0J025L8o99
$$ 923 944 -174 -875 -1019 465 941 743 -410 -940 -691 499 996 320 -466 -351 -281 744 782 83
1908H3j018L19Q76K61j8r11l14M74O26Q1k23p61j7N34L29m4o68j57J71O60Q1o35
$$ 83 -935 -616 260 521 503 -408 -722 -248 378 459 236 -525 -542 -8 321 277 -391 -548 -377 283 364 -271
1930b71n35O15L41M76o71l42k68L97O27K05o58p29R4R95L79m45l46r85P61Q89
$$ -271 -806 -191 150 626 -45 -387 -655 -258 369 574 -84 -813 -719 276 655 210 -136 -1121 -360 529
1950E29M72q99o76m44Q22Q86K23j056j186N67J130O64n70j059l90O97J092l0o54
$$ 529 1001 102 -574 -1018 -196 690 913 -143 -1329 -762 368 1032 462 -597 -987 -290 802 772 118
1969A18q97k84J045R61k12j079l97K39Q25M67m78r74P0O43M94j48k31q60O47L56
$$ 118 -779 -1063 -18 943 731 -348 -745 -506 319 786 308 -666 -596 47 541 393 162 -698 -51 305
1989C05M19p62m90L97K41N75l12l41o90N02O31L57j135l82J40Q56P42j06j166
$$ 305 724 -38 -528 -131 110 685 373 32 -658 -156 475 832 -303 -685 -545 311 1053 947 -219
2008b19n92P12P40M33o93r84j97M72J260j74p46p63J43Q07R14o44q54k61K35J088
$$ -219 -811 -99 641 1074 381 -603 -800 -328 932 758 12 -751 -608 199 1113 469 -385 -646 -411 677
2028F77J38o02r06P9M15J121p7o04r73J60P56K77n61l37p8L57O90p3m53n66L56
$$ 677 815 213 -693 -614 -199 922 845 241 -732 -572 184 461 -100 -437 -515 -158 532 459 6 -560 -204
2049b04P36j19k56m05l28M58N40O5n17o98K19Q65K96p00q26L01O87P64o61m87
$$ -204 532 413 157 -248 -576 -118 422 487 -30 -728 -509 356 652 -48 -874 -573 114 878 217 -270
2069b70n04L50O57O21p17o28j73O64N34J02o19r87N84O55L56o05l45n46N90P79
$$ -270 -774 -424 233 854 137 -491 -664 0 534 636 17 -970 -386 269 625 20 -325 -871 -281 498
2089D98K48n91r23J30M20O53R8m80q26m8Q51O06o2m63o72L48N06J39j99q81J65
$$ 498 746 155 -768 -638 -218 435 533 53 -773 -821 30 636 574 111 -561 -213 293 432 233 -648 -483
2110d83M99L46j42m09l98O01L53o9k48m96Q5N69K31j80o75k4N31L20k44r4m37
$$ -483 16 362 220 -189 -587 14 367 298 50 -446 -361 208 439 259 -416 -440 91 411 167 73 -364
2131c64K0O44M57n94m61j70J76R73o3p98k47L67K33K89Q5m46r96O00N84N12n46
$$ -364 -344 300 757 163 -298 -468 -292 681 618 -180 -427 -60 173 462 547 101 -895 -295 289 801 255
2152B55p09l46K53J230O74j006j484N57O64N38k8r36m58M09R29P9n07p11q3N71
$$ 255 -454 -800 -547 683 1357 351 -1133 -576 88 626 598 -338 -796 -387 542 621 114 -597 -680 -109
2172a09P52k23n33l24K56N32K98n14o04N2L29J79K11n52j5J14N09J05j89o00J29
$$ -109 643 420 -113 -437 -181 351 649 135 -469 -417 -88 91 302 -250 -265 -151 358 463 274 -326 -197
2193a97M47k8Q9k57q25K75R72L25p58l49j62N04M96P4q06k94P3O92J28J29r72
$$ -197 250 222 311 54 -771 -496 476 801 43 -306 -468 36 532 606 -200 -494 -421 271 399 528 -444
2214d44m72P59O05M26q27o23l90J227P32q29k68m83L23Q67m25J6n82l15O81O90
$$ -444 -916 -157 448 874 47 -576 -966 261 993 164 -104 -587 -264 603 178 194 -388 -703 -22 668
2234F68n08k39n70L01K46N05Qp82k98N84M18Q8m52m51K53M01p4M26p68k65L09
$$ 668 160 -79 -649 -348 -102 403 411 -371 -669 -85 333 421 -31 -482 -229 172 98 524 -244 -509 -200
2255b00N70J04l71n64K83L37L50o0q85j43O12P70j96m88o46J85N89N04m86o49
$$ -200 370 474 103 -461 -178 159 509 449 -436 -579 33 803 607 119 -527 -342 247 751 265 -384
2275c84m82P65P10n0k92r04M12M81J81k08n82J7Q7M37M65m79m08k19J98M83L84
$$ -384 -866 -101 609 559 267 -637 -225 256 437 229 -353 -336 -249 188 653 174 -234 -453 -255 228 612
2296F12p61k48NL03O97m19k06l30o6P69J29m56k14j35J84N15J86n77o47M13O38
$$ 612 -149 -397 -392 -89 608 189 -17 -347 -413 356 485 29 -185 -320 -136 379 565 -12 -659 -246 392
2317C92L99p55n20l19R57M00l66n68l21P60K88J22m97n12K33L32L65k95k96j30
$$ 392 791 36 -484 -803 154 554 188 -380 -701 59 347 469 -28 -540 -307 25 390 95 -201 -331
2337c31k9Q06j57k78N3m91N19k6K90j73p12L50O9Q06n88nk02l42Q17K99l96n31
$$ -331 -360 446 289 11 64 -427 92 66 356 183 -529 -179 -110 696 108 103 -99 -441 376 675 279 -252
2359b52r0j46P14M43j048m44M21N70N79o19p30M32L50J66Mq25OLP98J83l14p75
$$ -252 -342 -488 226 669 -379 -823 -402 168 747 128 -602 -170 180 346 350 -475 -469 -466 332 515 201 -574
2381e74M64j75O39j42l78l01L58L90Ll91J65m10K59K24K25j82o63K13K94L78j9
$$ -574 -110 -285 354 212 -166 -467 -109 281 284 -107 58 -352 -93 131 356 174 -489 -276 18 396 377
2402C77l74l12O8M44L17l07n93J21K43M98J87q41m57M07O38K83j93n73p33Q82
$$ 377 3 -309 -241 203 520 213 -380 -259 -16 482 669 -172 -629 -222 416 699 506 -67 -800 82
2422H2L66J78o71o33L65O28N36o30l89k64N42L27k31k94j46q2K60M65m61n1K7
$$ 82 448 626 -45 -678 -313 315 851 221 -168 -432 110 437 206 -88 -234 -316 -56 409 -52 -103 -76
2443g6o0M82k93j99j44J33K54K9Q9l46j80Q9K54M92m15l78j38L73N57j24l31o10
$$ -76 -136 346 53 -146 -290 -157 97 126 215 -131 -311 -222 32 524 109 -269 -407 -34 523 399 68 -542
2465e42L48L18N42l75p45j87M28O12Jq24m58L91Q93L48n24p02L0M62O61k05n97
$$ -542 -194 124 666 291 -454 -641 -213 399 400 -424 -882 -491 402 750 226 -476 -446 16 677 472 -125
2486a25k25R3N54m9J6m73j10K72L35J39n71j41M6j7K82J95J57o96o6M13O7K23
$$ -125 -350 -257 297 248 264 -209 -319 -47 288 427 -144 -285 -239 -256 26 221 378 -318 -384 29 96 319
2508C19p00P4L57J95O1l60m13J71K46O23n93m33K14J47O80k09k67n04J18O75K27
$$ 319 -381 -307 50 245 306 -54 -467 -296 -50 573 -20 -453 -239 -92 588 379 112 -392 -274 401 628
2529F28p02m78J48M27L36n81J98m38L35N82l5m77k28l03N08N57j77k02l09J53
$$ 628 -74 -552 -404 23 359 -222 -24 -462 -127 455 420 -57 -285 -588 -80 477 300 98 -211 -58
2549e8K62j46L9j50k26K29M3O06l93K25o92K53K70M8q3p15l35N24O33m5n21k82
$$ -58 204 58 97 -53 -279 -50 -7 599 206 431 -261 -8 262 310 227 -488 -823 -299 334 289 -232 -514
2571e14j06P03J22k55m55K15O11Ll56l59r8P17K04n48k36%J93O68o20j07J37k35
$$ -514 -620 83 205 -50 -505 -290 321 324 -32 -391 -489 228 432 -116 -352 -352 -159 509 -111 -218 -81 -316
2593c16L23q2J3K20m64M04r3J17J06k11j49r0Q4M63j84L6n02N8N07N01n23m85
$$ -316 7 -75 -62 158 -306 98 5 122 228 17 -132 -222 -138 325 141 177 -325 -267 240 741 218 -267
2615b67j08K43P22k34n11j24O5P03J84n73k69p0J51O35l38o75J14J34N51j25l12
$$ -267 -375 -132 590 356 -155 -279 -214 489 673 100 -169 -239 -88 547 209 -466 -352 -218 333 208 -104
2636a04j26l45Q45j89J48n09L5J78j19M28Rm01nn2M5J63k2j3J34m50L62J01k64
$$ -104 -230 -575 270 81 229 -280 -245 -67 -186 242 251 -150 -155 -207 -162 1 -21 -34 100 -350 12 113 -151
2659a51j80L23K95J04j66k74n18N05M38k22k33l02J17O24J96o33Q0q7L08L61j97
$$ -151 -331 -8 287 391 225 -49 -567 -62 376 154 -79 -381 -264 360 556 -77 3 -84 224 585 388
2680C88m68m33N36K98J02j91q35K30N68n2l06kk07O11k56K59k24J62k16k48N19
$$ 388 -80 -513 23 321 423 232 -603 -373 195 143 -163 -165 -372 239 -17 242 18 180 -36 -284 235
2701B35k72O7j66K06l80o3L94J95n35j31M58j69M70n26k09Q1M96L76o96k67J58
$$ 235 -37 30 -136 70 -310 -373 21 216 -319 -450 8 -161 309 -217 -426 -345 151 527 -169 -436 -278
2722b78N57k8j39m84q5L39N05k6p73l5M41L61J04n09j32j47M41L07l55k23n4K89
$$ -278 279 251 112 -372 -457 -118 387 361 -412 -447 -6 355 459 -50 -182 -329 112 419 64 -159 -213 76
2744G6L09j58j74o22O08j28L22J8j3j25j65K01J78k02l8k00m6K57l2L45l99k15
$$ 76 385 227 53 -569 39 -89 233 251 238 113 -52 149 327 125 87 -113 -159 98 66 411 12 -203
2766b03j80N84J84l21l21j46N18L84n24l68k76L84N15K22n81J0R2o0M45o26j25
$$ -203 -383 201 385 64 -257 -403 115 499 -25 -393 -669 -285 230 452 -129 -119 -27 -87 358 -268 -393
2787c93K31L05k18j49J64k08L7J93J60l55j86L44P9M0J87k39k99J3N01j63l48
$$ -393 -162 143 -75 -224 -60 -268 -231 -38 122 -233 -419 -75 4 44 231 -8 -307 -294 207 44 -304
2808c04L35p2n4J31L32r8l77r1J39J73J84m40k8lQN28J73o10N1l5N56j62m23k39
$$ -304 31 -41 -95 36 368 270 -107 -198 -59 114 298 -142 -170 -173 -165 363 536 -74 -23 -58 498 336 -87 -326
2832c26K83L12J54l94l14N1J90M43o21J66k42L10P4j2j57m10N51j6M2jK46m65
$$ -326 -43 269 423 29 -285 -234 -44 399 -222 -56 -298 12 86 74 -83 -493 58 42 84 83 329 -136
2854a36j58J23NJ02O5j34R8Q9J83j59m65M98p5J44O7m99J22n1M43P5j00m50J33
$$ -136 -294 -171 -166 -64 1 -133 -35 54 237 78 -387 111 36 180 247 -252 -130 -181 262 337 237 -213 -80
2877h0j57O41O8p54RN4L15M4J78m53K0L50J06l97p5J68J70Q8j64j77j85L27j88
$$ -80 -237 404 472 -282 -273 -219 96 140 318 -135 -115 235 341 -56 -131 37 207 295 131 -46 -231 96 -92
2900i2R5j4K31m32j9L44k92m0K26J72m88J06R2q2m9J03N4J38j52N2O0k29k9M94
$$ -92 3 -11 220 -212 -231 113 -179 -219 7 179 -309 -203 -111 -193 -242 -139 -85 53 -99 -47 13 -216 -245 249
$$ [...]
8191i1
##END NTUPLES=NMR FID
##END=
