##TITLE=1H_EC-3230(11)
 DMSO, 8 sc, 
 8.7.2020
##JCAMPDX= 6.0         $$ Bruker NMR JCAMP-DX V2.0
##DATA TYPE= NMR FID
##DATA CLASS= NTUPLES
##ORIGIN= UXNMR, Bruker Analytische Messtechnik GmbH
##OWNER= root
$$ XWIN-NMR		Version 3.5
$$ Wed Jul  8 10:50:18 2020 Russian Standard Time (UT+4h)  she@DPX200
##.OBSERVE FREQUENCY= 200.1315
##.OBSERVE NUCLEUS= ^1H
##.DELAY= (6, 6)
##.ACQUISITION MODE= SIMULTANEOUS
##.ACQUISITION SCHEME= undefined
##.AVERAGES= 8
##.DIGITISER RES= 18
##SPECTROMETER/DATA SYSTEM= spect
##.PULSE SEQUENCE= zg30
##.SOLVENT NAME= CDCl3
##.SHIFT REFERENCE= (INTERNAL, CDCl3, 0, 15.7039)
##AUDIT TRAIL= $$ (NUMBER, WHEN, WHO, WHERE, WHAT)
$$ ##TITLE= Audit trail, XWIN-NMR		Version 3.5
$$ ##JCAMPDX= 5.01
$$ ##ORIGIN= Bruker BioSpin GmbH
$$ ##OWNER= she
$$ F:/spectra/data/she/nmr/H-F/1/audita.txt
$$ ##AUDIT TRAIL=  $$ (NUMBER, WHEN, WHO, WHERE, WHAT)
(   1,<2020-07-08 10:49:23.48 +0400>,<she>,<DPX200>,
      <created by zg, POWCHK disabled, PULCHK disabled
       configuration hash MD5:
       00 E9 B6 7A A2 85 ED C7 34 08 36 98 17 FE 4E 26
       data hash MD5: 16K
       63 24 A1 4A 77 BC A9 88 0D D9 43 C4 C9 BD 89 52>)
$$ ##END=
$$ 
$$ hash MD5
$$ F8 44 E3 C3 88 F9 DA F1 BC 91 13 04 7D 93 E8 2A
##$RELAX= 
##$RELAX= 
##$RELAX= 
##$RELAX= 
##$RELAX= 
##$RELAX= 
$$ Bruker specific parameters
$$ --------------------------
##$DU= <F:/spectra>
##$EXPNO= 1
##$NAME= <H-F>
##$PROCNO= 1
##$TYPE= <nmr>
##$USER= <she>
##$AMP= (0..31)
100 100 100 100 100 100 100 100 100 100 100 100 100 100 100 100 100 100 
100 100 100 100 100 100 100 100 100 100 100 100 100 100 
##$AQSEQ= 0
##$AQ_mod= 1
##$AUNM= <au_zg>
##$AUTOPOS= <>
##$BF1= 200.13
##$BF2= 200.13
##$BF3= 200.13
##$BF4= 200.13
##$BF5= 200.13
##$BF6= 200.13
##$BF7= 200.13
##$BF8= 200.13
##$BYTORDA= 1
##$CFDGTYP= 0
##$CFRGTYP= 5
##$CHEMSTR= <none>
##$CNST= (0..31)
1 1 145 1 1 1 1 1 1 1 1 1 1 1 1 1 1 1 1 1 1 1 1 1 1 1 1 1 1 1 1 1 
##$CPDPRG= <>
##$CPDPRG1= <>
##$CPDPRG2= <>
##$CPDPRG3= <>
##$CPDPRG4= <mlev>
##$CPDPRG5= <mlev>
##$CPDPRG6= <mlev>
##$CPDPRG7= <mlev>
##$CPDPRG8= <mlev>
##$CPDPRGB= <>
##$CPDPRGT= <>
##$D= (0..31)
0 1.2 0 0 0 0 0 0 0 0.06 0 0.03 0 0 0 0 0.0002 0 0 0 0 0 0 0 0 0 0 0 0 
0 0 0 
##$DATE= 1594190963
##$DBL= (0..7)
120 120 120 120 120 120 120 120 
##$DBP= (0..7)
150 150 150 150 150 150 150 150 
##$DBP07= 0
##$DBPNAM0= <>
##$DBPNAM1= <>
##$DBPNAM2= <>
##$DBPNAM3= <>
##$DBPNAM4= <>
##$DBPNAM5= <>
##$DBPNAM6= <>
##$DBPNAM7= <>
##$DBPOAL= (0..7)
0.5 0.5 0.5 0.5 0.5 0.5 0.5 0.5 
##$DBPOFFS= (0..7)
0 0 0 0 0 0 0 0 
##$DE= 6
##$DECBNUC= <off>
##$DECIM= 24
##$DECNUC= <off>
##$DECSTAT= 4
##$DIGMOD= 1
##$DIGTYP= 9
##$DL= (0..7)
0 120 120 120 120 120 120 120 
##$DP= (0..7)
150 150 150 150 150 150 150 150 
##$DP07= 0
##$DPNAME0= <>
##$DPNAME1= <>
##$DPNAME2= <>
##$DPNAME3= <>
##$DPNAME4= <>
##$DPNAME5= <>
##$DPNAME6= <>
##$DPNAME7= <>
##$DPOAL= (0..7)
0.5 0.5 0.5 0.5 0.5 0.5 0.5 0.5 
##$DPOFFS= (0..7)
0 0 0 0 0 0 0 0 
##$DQDMODE= 0
##$DR= 18
##$DS= 0
##$DSLIST= <SSSSSSSSSSSSSSS>
$$ [...]
##$SUBNAM2= <"">
##$SUBNAM3= <"">
##$SUBNAM4= <"">
##$SUBNAM5= <"">
##$SUBNAM6= <"">
##$SUBNAM7= <"">
##$SUBNAM8= <"">
##$SUBNAM9= <"">
##$SW= 24.9337058887773
##$SWIBOX= (0..15)
0 0 2 0 0 0 0 0 0 0 0 0 0 0 0 0 
##$SW_h= 4990.01996007984
##$TD= 16384
##$TD0= 1
##$TE= 0
##$TE2= 300
##$TE3= 300
##$TEG= 300
##$TL= (0..7)
0 120 120 120 120 120 120 120 
##$TP= (0..7)
150 150 150 150 150 150 150 150 
##$TP07= 0
##$TPNAME0= <>
##$TPNAME1= <>
##$TPNAME2= <>
##$TPNAME3= <>
##$TPNAME4= <>
##$TPNAME5= <>
##$TPNAME6= <>
##$TPNAME7= <>
##$TPOAL= (0..7)
0.5 0.5 0.5 0.5 0.5 0.5 0.5 0.5 
##$TPOFFS= (0..7)
0 0 0 0 0 0 0 0 
##$TUNHIN= 0
##$TUNHOUT= 0
##$TUNXOUT= 0
##$USERA1= <user>
##$USERA2= <user>
##$USERA3= <user>
##$USERA4= <user>
##$USERA5= <user>
##$V9= 5
##$VALIST= <valist>
##$VCLIST= <CCCCCCCCCCCCCCC>
##$VD= 0
##$VDLIST= <DDDDDDDDDDDDDDD>
##$VPLIST= <PPPPPPPPPPPPPPP>
##$VTLIST= <TTTTTTTTTTTTTTT>
##$WBST= 1024
##$WBSW= 4
##$XGAIN= (0..3)
0 0 0 0 
##$XL= 0
##$YL= 0
##$YMAX_a= 252973
##$YMIN_a= -167295
##$ZGOPTNS= <>
##$ZL1= 120
##$ZL2= 120
##$ZL3= 120
##$ZL4= 120
##$ABSF1= 10
##$ABSF2= 0
##$ABSG= 5
##$ABSL= 3
##$ALPHA= 0
##$AQORDER= 0
##$ASSFAC= 0
##$ASSFACI= 0
##$ASSFACX= 0
##$ASSWID= 0
##$AUNMP= <proc_1d>
##$AZFE= 0.1
##$AZFW= 0.1
##$BCFW= 1
##$BC_mod= 2
##$BYTORDP= 1
##$COROFFS= 0
##$CY= 11.3945322036743
##$DATMOD= 1
##$DC= 2
##$DFILT= <>
##$DTYPP= 0
##$F1P= 16.9975609425685
##$F2P= -3.02152046262296
##$FCOR= 0.5
##$FTSIZE= 0
##$FT_mod= 4
##$GAMMA= 1
##$GB= 0.15
##$INTBC= 1
##$INTSCL= 1
##$ISEN= 128
##$LB= 0.24
##$LEV0= 0
##$LPBIN= 0
##$MAXI= 10000
##$MC2= 0
##$MEAN= 0
##$ME_mod= 0
##$MI= 1.114404
##$NCOEF= 0
##$NC_proc= 0
##$NLEV= 6
##$NOISF1= 3.799351
##$NOISF2= 2.8
##$NSP= 1
##$NTH_PI= 0
##$NZP= 0
##$OFFSET= 15.70392
##$PC= 1
##$PHC0= -9799.592
##$PHC1= 23.60085
##$PH_mod= 1
##$PKNL= yes
##$PPARMOD= 0
##$PSCAL= 0
##$PSIGN= 0
##$REVERSE= no
##$SF= 200.130013532006
##$SI= 16384
##$SIGF1= 3
##$SIGF2= 2
##$SINO= 400
##$SIOLD= 16384
##$SREGLST= <1H.CDCl3>
##$SSB= 0
##$STSI= 0
##$STSR= 0
##$SW_p= 3612.71676300578
##$SYMM= 0
##$S_DEV= 0
##$TDeff= 0
##$TDoff= 0
##$TI= <>
##$TILT= no
##$TM1= 0
##$TM2= 0
##$TOPLEV= 0
##$USERP1= <user>
##$USERP2= <user>
##$USERP3= <user>
##$USERP4= <user>
##$USERP5= <user>
##$WDW= 1
##$XDIM= 8192
##$YMAX_p= 0
##$YMIN_p= 0
$$ End of Bruker specific parameters
$$ ---------------------------------
##NTUPLES= NMR FID
##VAR_NAME=  TIME,          FID/REAL,        FID/IMAG
##SYMBOL=    X,             R,               I
##VAR_TYPE=  INDEPENDENT,   DEPENDENT,       DEPENDENT
##VAR_FORM=  AFFN,          ASDF,            ASDF
##VAR_DIM=   8192,          8192,            8192
##UNITS=     SECONDS,       ARBITRARY UNITS, ARBITRARY UNITS
##FACTOR=    0.0002004,     1,               1
##FIRST=     0,             0,               0
##LAST=      1.6414764,     0,               0
##MIN=       0,             -167295,         0
##MAX=       1.6414764,     252973,          0
$$ Real data points
##PAGE= N=1
##DATA TABLE= (X++(R..R)), XYDATA
$$ [...]
2348b717k51K151K680P11k154k981l68K034K833P73j969k742j133K078L284J112
$$ -2717 -2968 -817 1863 2574 420 -2561 -2929 -895 1938 2711 742 -2000 -3133 -1055 2229 3341
2364C341k319k960q32K563K884J10k381k319j68J617K367k75j757j245p6J015
$$ 3341 1022 -1938 -2770 -207 2677 2787 406 -1913 -2081 -464 1903 1628 -129 -1374 -1450 -435
2380d35J031N06o80r42j053L01J036J828M3j198j678m71J494K569n1j943k235
$$ -435 596 1102 422 -520 -1573 -1272 -236 1592 1635 437 -1241 -1712 -218 2351 2300 357 -1878
2397a878q6K381K429l74k529k403L66K004K187k47k043k067L4J807K489j8j948
$$ -1878 -1964 417 2846 2472 -57 -2460 -2094 -90 2097 1850 -193 -2260 -2226 -419 2070 2052 104
2414A04k551j69K225K588N73k684k517n48K762K848J60k991k796P15K956K285
$$ 104 -2447 -2616 -391 2197 2770 86 -2431 -2979 -217 2631 2791 -200 -2996 -2281 675 2960
2430B960p80k781j860Q51K467J002o09j741j190K66J217J112O50j266j564m95
$$ 2960 2180 -601 -2461 -1610 857 1859 1250 -491 -1681 -1415 -198 914 1564 298 -1266 -1761
2446a761R05J887J107j071j894r99J170K212M15p95j931o24M62J895R91r96j310
$$ -1761 -856 1031 2138 1067 -827 -1826 -656 1556 1971 1176 -755 -1379 -917 978 1969 973 -337
2463c37j231P44J305O10L07j599j678m03J778K228Q30k507k398m91K855K586R2
$$ -337 -1568 -824 481 1091 1398 -201 -1879 -2282 -504 1724 2554 47 -2351 -2842 13 2599 2691
2480B691l529k345R23L278K300j028l281j873J321L084J119j307k415j225J096
$$ 2691 -838 -3183 -2260 1018 3318 2290 -991 -2864 -1543 1541 2660 1353 -1062 -2287 -1191
2495a191J965J029r36j745j117O42J496J739m89j509j353k09J910J642r9j765
$$ -1191 774 1803 867 -878 -1995 -1353 143 1882 1393 -116 -1469 -1678 232 1874 1775 10
2511A0j751L46J919J600o26j566j033M17Q89P88R3p25q97m02p4J237R20J9j295
$$ 10 -1741 -1395 524 2124 1498 -68 -1101 -684 205 993 1086 361 -536 -938 -1012 225 1145 1164 -131
2530a31j676K88J105K384l54k441j892R52K478J820o03l210j456J527K741J123
$$ -131 -1807 -1519 -414 1970 1616 -825 -2717 -1765 713 2533 1930 -1280 -2736 -1209 1532 2655
2546B655j328k590r95J329K249R88j454k103j025J254J833J333r75k143j306N14
$$ 2655 1327 -1263 -2258 -929 1320 2308 854 -1249 -2274 -1020 813 2146 1171 -972 -2278 -1764
2562a764K302J817j088k658r70J124K484J032j221k205o06J234K172K04j342j528
$$ -1764 538 2355 1267 -1391 -2361 -1237 1247 2279 1058 -1147 -1753 -519 1653 1857 515 -1013
2578a013j08P45P86J69j16m38p27l56M08J188O46m19j525j416R57K378R92j258
$$ -1013 -1121 -376 410 579 463 25 -702 -1058 -650 538 1184 765 -760 -2176 -1219 1159 2151 893
2596H93k550o63J608K400Q26j710k443n33K029J648P67j571k156l72J565J231
$$ 893 -1657 -2320 -712 1688 2514 804 -1639 -2172 -143 1505 2272 701 -1455 -1827 -262 969
2612I69O84p98k188j101J217J965J192r83k707j135J867K521O08j299k683n33
$$ 969 1653 855 -1333 -2434 -1217 748 1940 957 -1750 -2885 -1018 1503 2111 812 -1871 -2404
2628b404J833K281M00j768k150L47J513J646k61j454r29j59P98R22L43m85l42
$$ -2404 -571 1710 2110 342 -1808 -1461 52 1698 1437 -17 -946 -1105 -307 615 958 473 131
2645A31j308L61N07J263M92j342j324l09J723J426K8j858j523L45J637J563l37
$$ 131 -1177 -816 -309 954 1446 104 -1220 -1529 194 1620 1648 -210 -1733 -1388 249 1812 1475
2662A475j300j220j38J330J278J64j339j210m43P42J574Q90j285j697j221J482
$$ 1475 175 -1045 -1183 147 1425 1589 250 -960 -1403 -661 913 1803 518 -1179 -2400 -918
2678i18K512M41j756k512k93K099K285M72k654k042L39K442J513l27k143j134
$$ -918 1594 2035 279 -2233 -2526 -427 1858 2330 -324 -2366 -2027 415 1928 1601 -542 -1676
2694a676P70J102J291k23j432n56k69P37Q41L88m89j538r07R54J870Q66o23j985
$$ -1676 -906 196 1487 1264 -168 -724 -993 -256 585 973 484 -1054 -1961 -1007 863 1729 1106 -879
2712h79p90J108J607Q47j469j383p59J543J143P9l58j017o14N31N25Q56K36n90
$$ -879 -1669 -561 1046 1893 424 -959 -1718 -175 968 1047 689 -328 -942 -411 114 970 1206 616
2730F16j745j37P49J642O38j874j727m27K077J758K29k028k149M34K695Q99l38
$$ 616 -1129 -1266 -517 1125 1763 -111 -1838 -2265 -188 1570 1799 -229 -2378 -1944 751 1650 1312
2747A312j885j640Q68K213R03r46j090r81K98J210J327l70j396r55j2Q37J532
$$ 1312 -573 -2213 -1345 868 1771 825 -265 -1246 -948 262 1589 1219 -177 -1132 -1144 -307 1225
2764A225K27j595j494m7J410J487j85j446j188L73J367J156r8j568m59P2J011
$$ 1225 1452 -143 -1637 -1684 -274 1213 1028 -418 -1606 -1233 134 1290 1192 -376 -835 -763 248
2781B48M91J59n34m25p09K00R03O97R3r69j432j8J189J608r6j920j303R7K534
$$ 248 739 898 364 -61 -770 -570 333 1030 1123 154 -1278 -1296 -107 1501 1405 -515 -1818 -1721 813
2800H13J445j097k110q36N04K354O35p43j673o93Q24J596N15k34j549p46jJ467
$$ 813 2258 1161 -949 -1785 -1281 1073 1708 965 -708 -1401 -577 1019 1534 1300 -249 -995 -996 471
2818D71J226n71j753r86j4K063R20m45j901j371J075K100N15n71j972m59J101
$$ 471 1697 1126 -627 -1613 -1627 436 1356 911 -990 -2361 -1286 814 1329 758 -1214 -1673 -572
2835e72J313L45o09n99p23N92Q45K21j51l14l63p83J09J202O43o84j236o05M49
$$ -572 741 1086 477 -122 -845 -253 592 813 662 348 -15 -798 -689 513 1156 472 -764 -1369 -920
2854i20J593Q63r73j484r64J438J615M42j120j771j70J241J433K98j301j189P2
$$ -920 673 1536 563 -921 -1885 -447 1168 1610 490 -1281 -1451 -210 1223 1521 220 -969 -897
2871h97M32J666J93m02j507j010R23J513P37o84j974o86P80K188O17j350j898
$$ -897 -465 1201 1394 992 -515 -1525 -602 911 1648 964 -1010 -1696 -916 1272 1889 539 -1359
2888a359r22K034J427P2j070j171j67R78R51L19q55p20j73L46O83O22k62m24j376
$$ -1359 -2281 -247 1180 1252 182 -989 -1156 -178 773 1092 237 -483 -656 -310 373 995 733 309 -1067
2907a067K56Q53J241jj474j184k0J486J231k57j297j114R6J529R33l58j277j049
$$ -1067 -811 42 1283 1282 -192 -1376 -1396 90 1321 1064 -233 -1347 -1251 278 1211 853 -424 -1473
2925a473Q13R91L66N35q93p76p92Q00J126Q09p92j715k86Q69J578M27j032k175
$$ -1473 -660 331 697 1232 339 -437 -1229 -429 697 1506 714 -1001 -1287 -418 1160 1587 555 -1620
2943a620k5J380J666J33j373j960M81J505J159j4j540q91K23J076P26M20q58j147
$$ -1620 -1645 -265 1401 1534 161 -1799 -1318 187 1346 1332 -208 -1099 -876 200 926 1346 488 -659
2961f59l15N93R91P54o03j195p57O94J462K30o83j592l61Q51J297L09r12n18n40
$$ -659 -974 -381 610 1364 761 -434 -1191 -497 965 1195 512 -1080 -1441 -590 707 1016 104 -414 -954
2980i54N92J017J71k93q43m38J54L61Q45M69p50r79m64R04J348K81j163j849M09
$$ -954 -362 655 826 533 -310 -748 -594 -233 612 1081 331 -648 -1112 -208 1140 1421 258 -1591 -1182
2999a182J194J698n12j265j586L58J697Q81k46j524r37K86J629N77k62o30j296
$$ -1182 12 1710 1198 -67 -1653 -1295 402 1283 1037 -487 -1424 -1138 491 1068 806 176 -1120
3016a120N36J016O30J92j350o91j8Q55J247J63j574p81O8J085R05k17r43j477
$$ -1120 -584 432 1062 1254 -96 -787 -805 50 1297 1460 -114 -895 -827 258 1163 946 3 -1474
3034a474M73J177N58k25p73l63J1M84P28j80j7l05q33J63Q27Q14r2j027p86n4
$$ -1474 -1001 176 734 509 -264 -627 -616 -132 596 416 399 94 -739 -576 251 1065 973 -54 -840 -894
3054h94J028J297m82j512q41O05J405O94o27j196j113R02J000O37k83j191n18
$$ -894 134 1431 949 -563 -1404 -799 606 1300 673 -523 -1636 -734 266 903 620 -571 -1089
3071a089M24J251L93O6j081p82o8J338Q17j27j576q22M02J394R93p52j207p66
$$ -1089 -665 586 979 1045 -36 -818 -886 452 1269 1142 -434 -1256 -854 540 1533 781 -426 -1192
3089a192K09J522Q31q49j170k38J9J287M25m72p11k31J48M25O48j66k81p82n9
$$ -1192 -983 539 1370 521 -649 -887 -868 419 844 372 -339 -570 -422 3 651 485 204 -578 -637
3108f37M83Q07L47n49j079l54Q29Q87M73r62j218j33M04J463J61q79j041n33J156
$$ -637 -154 653 1000 451 -628 -982 -153 734 1207 245 -973 -1106 -702 761 922 43 -998 -1531 -375
3127c75R92O1p48o46l69K10J318O76k44j551l21J22J669K29m26j268n76J089R46
$$ -375 617 678 -70 -716 -1085 -875 443 1119 875 -676 -997 -875 794 1023 597 -671 -1247 -158 788
3146G88L36o74j078p19R97J112J62p96j004l56Q92P51L90l80q21j64K00Q56L61
$$ 788 1124 450 -628 -1347 -350 762 924 128 -876 -1232 -340 411 801 421 -400 -564 -364 492 853
3165H53l44o69m51l14R92J113k80r55o09j06Q01O88J17j101o06j13R02O95j33
$$ 853 509 -160 -611 -925 67 1180 900 -55 -664 -770 31 719 836 -265 -871 -984 -82 613 480
3184D80n65r54J87P11P44m7m96r06m6O73Q80L69m78j072l93Q17J258Q6q68j252
$$ 480 -85 -1039 -852 -141 603 556 60 -846 -892 -219 661 1030 552 -520 -913 -96 1162 1248 380 -872
3204h72k47Q42J379k76n47j292k59J116Q17J86j016p00r7P02J212Rp04j049JM73
$$ -872 -1119 -277 1102 826 279 -1013 -1272 -156 661 847 -169 -869 -966 -264 948 957 253 -796 -795 -322
3224c22J128K68m07j114j65O03R71J36o63r39l25M73Q01L97n51n79n16N61N35
$$ -322 806 1074 667 -447 -612 -9 962 1098 435 -504 -829 -356 445 842 291 -288 -804 -243 292
3243B92M47k01o55o36J34M18P63j23k23j042k34J150N79N4p39o29n6Q99R42k55
$$ 292 739 538 -117 -753 -619 -201 562 439 216 -826 -1060 90 669 723 -16 -645 -701 198 1140 885
3263H85r77r84p1J205J088m41p96j163L34J185P21m52p73o23P9R56N24n1n22r57
$$ 885 -92 -1076 -1147 58 1146 705 -91 -1254 -920 265 986 534 -239 -862 -783 173 697 646 124 -833
3283h33J51Q04P61K83j013o78l52J273O09j89p76p11j44R64P80l41q76l78j2L89
$$ -833 -682 122 883 1166 153 -525 -877 396 1005 816 40 -671 -815 149 929 588 -288 -666 -678 -289
3303b89K48N29n36n78N9j49Q36O29n06o24j21l28J166N39j92q41o64L92Q30K92
$$ -289 -41 488 -48 -626 -567 -716 120 749 243 -381 -502 -830 336 875 683 -158 -822 -430 400 692
3323F92o7p69j131O20P02N93l02q76n14L50Q27O90l15r43k17N3J278R4k25m77
$$ 692 625 -144 -1275 -655 47 640 338 -538 -1052 -702 125 815 500 -443 -660 -607 671 765 540 63
3343F3j245M92J074O65n78r32m18K23J302q7R6p31n91J62O69M60o0q47n49L6P96
$$ 63 -1182 -690 384 1049 471 -461 -879 -656 646 559 655 -76 -667 -505 164 624 564 -283 -832 -796 0
3364@M99J7m29o58j03P24P31n9p11o45K54K06R12J73p19n77l41L54Q41R4k47r13
$$ 0 499 516 87 -571 -674 50 781 722 11 -634 -380 -174 738 911 192 -385 -726 -372 469 563 316 -597
3386e97k40O31P63K32n42q45j39O08M08J77j77p15k86L09Q29Q04q25p56m15N77
$$ -597 -837 -206 557 789 247 -598 -737 -129 279 456 279 -436 -722 -413 416 1220 395 -361 -776 -199
3406a99R08K64m83r23m49O79P28R4o46m06l71M83J057K9o84l14j82m5O98M52l36
$$ -199 709 973 490 -433 -882 -203 525 619 -27 -433 -804 -321 736 765 81 -233 -415 -460 238 690 354
3427C54q72O1O4Q37M33n45o03k92R6M96N13N6r69j10R0L24Q37o1o76n28j89K33
$$ 354 -518 -457 -393 444 877 332 -271 -563 -467 29 542 598 -371 -481 -391 -67 770 709 33 -495 -684 -451
3449d51Q59K58m47r43j42P80N86K81r04o00LM22P63O12q10q54j34R35M97L56l68
$$ -451 408 666 219 -724 -866 -86 500 781 -123 -723 -720 -298 465 1077 267 -587 -721 214 711 1067 699
3470F99j274m9R3J344l01m42p13m47J174N65J0q12m54j19L96J129j1n01o16l08
$$ 699 -575 -624 -531 813 512 70 -643 -1090 84 649 659 -153 -607 -726 -330 799 788 287 -329 -637
3490f37K81O77J46j35n55j84K98N95N07p73o58l26M88Q20N1j19p12l18J7R79J74
$$ -637 -356 321 467 332 -223 -407 -109 486 993 220 -438 -764 -276 544 595 476 -236 -554 -537 442 616
3511F16k91o28l76J37N84P43m25m26q03L89P47M96R2r66q67O86O15K03ln84n01
$$ 616 325 -303 -679 -542 42 785 360 -66 -869 -480 267 763 855 -111 -978 -292 323 526 523 -61 -562
3532e62p0R59L11Q8r46p15J01Q42M45k8n65m66N3K15J109l7l56j037J58O78M00
$$ -562 -632 327 638 726 -220 -935 -834 8 453 425 -140 -606 -553 -338 771 734 378 -659 -501 177 577
3553E77J01o76l28K01K83K23Pl39l72k42K49R15K3n94m92q2L84M19K2o0m64m18
$$ 577 678 2 -326 -125 158 381 388 49 -323 -565 -316 599 622 28 -464 -546 -162 257 279 219 -245 -663
3575f63L86O13M59k19p40k04pP04N30o52p8q50R3J063M27l84p08l09L20N05L64
$$ -663 -277 336 795 576 -164 -368 -375 329 859 207 129 -721 -628 435 862 478 -230 -539 -219 286 650
3596F50j63r68m33M20P11N62n84l06o83N56N57P6J53o25l42o4N87O03k57j73p33
$$ 650 487 -481 -914 -494 217 779 195 -111 -794 -238 319 395 548 -77 -419 -483 104 707 450 277 -456
3617d56j24P05K23j57j94l62l6M19M09n1n05l63n3N17M29J69m30k89o25Q19N95
$$ -456 -580 125 348 191 -3 -365 -401 18 427 376 -129 -492 -545 -28 401 570 140 -149 -774 45 640
3638F40Km69j49n64J50Q14J7k68m85j00K82N55L91o18q17NN07K71L87l02n69k94
$$ 640 642 173 24 -540 -390 424 441 173 -312 -412 -130 425 816 198 -619 -614 -107 164 551 249 -320 -614
3660f14N21M14L34n16n51l17O59M95K12n02o89P7J39P67P7j10n45m07M32M88M4
$$ -614 -93 321 655 139 -412 -729 -70 425 637 135 -554 -477 -338 429 506 396 -149 -556 -124 364 408
3681D08q5p00p4N3N61K57j15p05k98N5N46M65R4l91j019N55M51L01j26p8o51K67
$$ 408 323 -377 -451 -398 163 420 305 -400 -698 -643 -97 368 462 71 -948 -393 58 359 233 155 -496 -229
3703b29J70L17M95o69o67K01M82M03J65p95m38j06L86O11J59n73n79q7P26M60
$$ -229 -59 258 753 84 -583 -382 100 503 668 -127 -565 -671 -285 326 485 -88 -667 -754 -28 432
3723D32J69o07m59K65N9P35J04m25q29J8K65Q72O0o65l53M3J42R30m03Jq79Q5
$$ 432 601 -6 -465 -200 -141 594 698 273 -556 -538 -273 599 659 -6 -359 -316 -174 756 353 354 -525 -440
3745d40J66L02J40j27j2n53J72M12M10o09j92k98M78N39J79k71j98n19N8P49M04
$$ -440 -274 28 168 41 29 -524 -352 60 470 -139 -331 -629 -151 388 567 296 98 -421 -363 386 790
3766G90j77q80j51L0M93K20J05n75q3l01P59K46j28n17m57M8L27J078J80j135
$$ 790 613 -267 -418 -388 105 325 430 -145 -228 -529 230 476 348 -169 -626 -578 -251 827 1007 -128
3786a28o37L87L88M15K71r16m03NM94J005l11m51o88K76O69K96l08l91l91k62
$$ -128 -765 -378 10 425 696 -220 -623 -618 -124 881 570 119 -569 -293 376 672 364 -27 -418 -680
3806f80O02M62k79m34j36j8J45O80J24m21n70J49K27N41o9j18m09p0q9O35K36
$$ -680 -78 384 105 -329 -465 -483 -338 342 466 45 -525 -376 -149 392 323 205 -204 -274 -363 272 508
3827E08m42rl42k17O44M88m76m85kL1L32M21J96r20l68K35P47J39j40n16m08K22
$$ 508 66 57 -285 -502 142 630 154 -331 -333 -302 30 451 647 -273 -641 -406 341 480 340 -176 -584 -362
3849c62Q59L61k20n44o45K10N05K29J97o47o58L82M07J81m2n05m67N79J69L49
$$ -362 497 858 638 94 -551 -341 164 393 590 -57 -715 -333 74 255 213 -292 -759 -180 -11 338
3869C38N4q00j33j50O38J44L46m20R4n51K33L38L95q89L30l84M8R94l18n88M1
$$ 338 392 -408 -541 -691 -53 91 437 17 111 -440 -207 131 526 -363 -33 -417 -369 625 307 -281 -240
3890b40K7j14O76R0m13o00J23M9L54M81l41m05n7K07L07L36k42n89l99L87P55
$$ -240 -213 -327 349 439 26 -574 -451 -402 -48 433 92 -313 -370 -163 144 480 238 -351 -750 -363 392
3911C92N3n38p7l68K97N14N56n27o40j83K73P60N5k74p53l0J01O06K57k5o78l38
$$ 392 445 -93 -170 -538 -241 273 829 302 -338 -521 -248 512 567 293 -460 -490 -389 217 474 449 -229 -567
3933e67L26N08M32l71l79o2j67P39j72J60n13o1k27O34J73k84j21n29K99N20n4
$$ -567 -241 267 699 328 -51 -113 -280 459 287 447 -66 -127 -354 280 453 169 48 -481 -182 338 284
3954B84k09j26o00O00J0L67km89j57j25J72R09l55j33k46k12K98N21j96k16n65
$$ 284 75 -51 -651 -51 -41 326 324 -165 -322 -447 -275 634 279 146 -100 -312 -14 507 311 95 -470
3975d70j96O53K89N24n50n29qM14K34j02k92l32j82M85L72J43m37q15O68J9M87
$$ -470 -666 -13 276 800 250 -279 -287 127 361 259 -33 -365 -547 -62 310 453 16 -799 -131 -112 375
3996C75J87m43n32N6K70O55L2o54k72L45m2M48n4l54m64j46M91K24J84jo59K33
$$ 375 562 119 -413 -357 -87 568 600 -54 -326 19 -23 425 371 17 -447 -593 -102 122 306 305 -354 -121
4018a21j82L15M79m79J82n60j16L27N68k28k90m13M36M87r5K11l51l30j35M97
$$ -121 -303 12 491 12 194 -366 -482 -155 413 185 -105 -518 -82 405 310 521 170 -160 -295 202
4038B02M6M54q81m81O2O38M60k63q9p04K35N92M31l88n04k17j06N79L96J69n94
$$ 202 248 702 -179 -660 -598 40 500 237 148 -556 -321 271 702 314 -190 -407 -513 66 462 631 37
4059C7l72n3L59Q43l39o80l92R6L38N57j49j42o98J20O37K20j05l96j58k90M79
$$ 37 -335 -388 -29 814 475 -205 -597 -501 -163 394 245 103 -595 -475 162 382 277 -119 -277 -567 -88
4080h8L64n5l72J86j57K82O0J23R2l66k05PM25J73k02n92j36L58j27O34j33l23
$$ -88 276 221 -151 35 -122 160 220 343 435 69 -136 -129 296 469 267 -325 -461 -103 -230 404 271 -52
4102e2n89M18N57j04J91o68j69k47Q26J59Ro32k74J90L04O55j50o24j89J72M68
$$ -52 -641 -223 334 230 421 -247 -416 -663 163 322 331 -301 -575 -385 -81 574 424 -200 -389 -217 251
4123B51K73j87l19m72P58k07K90k03m70k5j3N37p5J63m52l48J84M24Q0m0k61k99
$$ 251 524 337 18 -454 304 97 387 184 -286 -311 -324 213 138 301 -151 -499 -315 109 189 149 -112 -411
4145d11L03K1J82L17n80k65L34l28M30P7L5k17M3L7N93m13J38p04j50O95R4J41
$$ -411 -108 -87 95 412 -168 -433 -99 -427 3 80 115 -102 -59 -22 571 158 296 -408 -558 137 231 372
4167C72l01l50j18J04N83m3k34j90j45N88j38M98n31k29M6k0J81N76o18m17j24
$$ 372 71 -279 -397 -293 290 247 13 -177 -322 266 128 626 95 -134 -88 -108 73 649 31 -386 -510
4188e10M40M20p8K32r97k38O22J63L51l03l34K02NJ84m4R0j84j75K69L1J38L5
$$ -510 -70 350 272 504 -493 -731 -109 54 405 102 -232 -30 -25 159 115 205 21 -154 115 146 284 319
4210C19k28m04L34J46p3J01k84k90j60Q15L2k53k00k28J35J21K40K54j71m16l1
$$ 319 91 -313 21 167 94 195 -89 -379 -539 276 308 55 -145 -373 -238 -117 123 377 206 -210 -241
4231b41L02N73k78l96j36n11N30O53n2l86m43n1L37L86k99P4l32R6J61M19j38
$$ -241 61 634 356 -40 -176 -687 -157 496 444 58 -385 -436 -99 287 -12 62 -270 -174 -13 406 268
4252B68n37j9R0J33M15j54l33k4QK18J48J65k71m54oK64K70N65n04j75k09j9L71
$$ 268 -269 -288 -198 -65 350 196 -137 -161 -153 65 213 378 107 -347 -353 -89 181 746 242 67 -142 -161 210
4275B10K3J63o50l75L04L03J38K04l14j63k2k2M55k9p3l83l4M57L11k81K62p51
$$ 210 233 396 -254 -629 -325 -22 116 320 6 -157 -179 -201 254 225 152 -231 -265 192 503 222 484 -267
4297b67J9J62K29j96P4p07M95L40j7K57n93k00k3O49J76k33l16l89K46M22K57
$$ -267 -248 -86 143 -53 21 -686 -191 149 132 389 -204 -404 -427 222 398 165 -151 -540 -294 128 385
4318C85j13j49m65LPO10k1o08L83NR8O1P3l56j69Q5L43j34M51n00m2k45N23ok83
$$ 385 272 123 -342 -339 -332 278 257 -351 32 37 135 196 269 -87 -256 -171 172 38 489 -11 -53 -298 225 219 -64
4343f4L39n35p4K82K54o0o0k83J69o8N19k21L23o63l41M43L59P6m56J87n72M69
$$ -64 275 -260 -334 -52 202 142 82 -201 -32 -100 419 198 521 -142 -483 -40 319 395 -61 126 -446 23
4365B3Q2J42K12p51R6n8L79K85m9o40ko0K09M77j06m81j72L55J71N57m05j48k46
$$ 23 105 247 459 -292 -196 -254 125 410 361 -279 -281 -341 -132 345 239 -242 -414 -59 112 669 264 116 -130
4388a30l55Q19K44m66o09K01L33L0K33j76l10k54J53M28K66q2k50j61k39J2M74
$$ -130 -485 334 578 112 -497 -296 37 67 300 124 -186 -440 -287 141 407 325 75 -86 -325 -313 161
4409A61m1l90L66J36k05K93k12J63m30J89k10L39Q9m11L41m97M60o8L57m21k72
$$ 161 120 -270 96 232 27 320 108 271 -159 30 -180 159 248 -163 178 -319 141 73 430 9 -263
4430b63k71N09J68l0J19o71K95L20n0K87m15j67J4Q1M01J61k74l50n95N52L99
$$ -263 -534 -25 143 113 232 -439 -144 176 126 413 -2 -169 -155 -74 327 488 214 -136 -731 -179 220
4451B20j43m0k49j56K41K73l3Pn02n0J43N02r0q6k55J82j72L10L82l82j66k27
$$ 220 77 37 -212 -368 -127 146 113 120 -382 -432 -289 213 123 37 -218 -36 -208 102 484 102 -64 -291
4473b91J91P50n15J77m67nK48pN1N8l61L25j39N5J55j88J37l12O3K25J34K30p00
$$ -291 -100 650 135 312 -155 -160 88 81 132 190 -171 154 15 70 225 37 174 -138 -75 150 284 514 -186
4496a86K07m73N27k6J90l40k2o0M8N18J15k38m67K66k38M79L27o10k95j05K94
$$ -186 21 -452 75 49 239 -101 -123 -183 -135 383 498 260 -207 59 -179 300 627 17 -278 -383 -89
4517h9L05K49n76k44p5K19M69q4k91m6k45L16N22k70L2k57L0j35K38%r4J32m49
$$ -89 216 465 -111 -355 -430 -211 258 174 -117 -163 -408 -92 430 160 192 -65 -35 -170 68 68 -26 106 -343
4540c43L80k7L3L06n26j53K72N4J20l21K11o4k75L84j12L34j72l15q8j52O25J86
$$ -343 37 10 43 349 -177 -330 -58 -4 116 -205 6 -58 -333 51 -61 273 101 -214 -302 -454 171 357
4562C57o15J74j16K43N28l18Ol55k04M19J23k74J64o14L78m6O84m97j71nm14O26
$$ 357 -258 -84 -200 43 571 253 259 -96 -300 119 242 -32 132 -482 -104 -150 534 37 -134 -139 -553 73
4584G3K49j86j81j3n24P27J12m1j37l34K23J95K30m55n6k41N71j87l9N1j89J92
$$ 73 322 136 -45 -58 -582 145 257 216 79 -255 -32 163 393 -62 -118 -359 212 25 -14 37 -152 40
4606D0k95J00L3L12m72J34M7J36n9K12J57n72j36L37K47j23k1l85J51n2K82K15
$$ 40 -255 -155 -122 190 -282 -148 -101 35 -24 188 345 -227 -363 -26 221 98 77 -308 -157 -209 73 288
4628B88l77k9l44M89n13J075m41k39m81L34L90j7K44o02N7j40J19L64j48r4k38
$$ 288 -89 -118 -462 27 -486 589 148 -91 -572 -238 152 135 379 -223 -166 -306 -187 177 29 -65 -303
4649c03J95M57M9k72K4n35N30Q6J73j06l36n6k56L75K76j36l05J6p9N38j29k1
$$ -303 -108 349 398 126 150 -385 145 231 404 298 -38 -94 -350 25 301 165 -140 -124 -203 335 206 185
4671A85k83M4q0Q4J87j51J78m16LL63J90R0q3n30p7M08k03M73m80P7l61M59k8
$$ 185 -98 -54 -134 -50 137 -14 164 -252 -249 114 304 394 311 -219 -296 112 -91 382 -98 -21 -382 77 49
4694D9K44k03k77k26J66L76N4r7n83J75K15N26m15j12L29m36M5L00Q9N8n70J5
$$ 49 293 90 -187 -413 -247 129 183 86 -497 -322 -107 419 4 -108 221 -215 -170 130 219 277 -293 -278
4716b78n1N35l6R1l65j49q7N05L36k54l39j9j81L72J72o9k43j82J59K17p2n6j32
$$ -278 -329 206 170 261 -104 -253 -340 165 501 247 -92 -111 -292 80 252 183 -60 -242 -83 134 62 6 -126
4739a26J81J78k17R2J36J81p51J08L11K51J33m29L0k03L78l2k98K07l85n1J24
$$ -126 55 233 16 108 244 425 -326 -218 93 344 477 48 78 -125 253 221 -77 130 -255 -306 -182
4760a82J85L5j60j47LL87L6K14k85l75K63P6L78R0k93m85j03M26L54p0m50j64
$$ -182 3 38 -122 -269 -266 121 157 371 86 -289 -26 50 428 518 225 -260 -363 63 417 347 -103 -267
4782b67L00j66K16K1K95o29m4L9O88l70j39K12l64K88O3j68K45l1m27R9M36k97
$$ -267 33 -133 83 104 399 -230 -274 -235 453 83 -56 156 -208 80 143 -25 220 189 -238 -139 297 0
4804@K32l30pL0j12J13L62n65j89L82M22k95j4l76J92j61L49Q9K7k47k32L33J6
$$ 0 232 -98 -105 -75 -187 -74 288 -277 -466 -84 338 43 29 -347 -155 -316 33 122 149 -98 -330 3 19
4827A9J23J33k95k94J67j62M35L09l87l49J27M32Po7j83n00L23J43J14R5l91o8
$$ 19 142 275 -20 -314 -147 -309 126 435 48 -301 -174 258 265 198 15 -485 -162 -19 95 190 -201 -269
4849b69K43J11O7j57m11j33O10J60q5j33j93J88j71K57l0K59j59n8j39k94P36
$$ -269 -26 85 152 -5 -416 -549 61 221 136 3 -190 -2 -173 84 54 313 154 96 -43 -337 399
4870C99n66J32j79k36L78L07j65N8m85Q1N2K08L93k72k74l18L36m5M08j44k07
$$ 399 -167 -35 -214 -450 -72 235 70 128 -357 -276 -224 -16 377 105 -169 -487 -151 -196 212 68 -139
4891a39J54k56L8N81Ln44J8r3K49J99J07n83k69M23O4K92k99p2l2J31K40o1j88
$$ -139 15 -241 -203 378 381 -163 -145 -238 11 210 317 -266 -535 -112 -48 244 -55 -127 -159 -28 212 151 -37
4914c7j87k65L04L68J62m10j83k06N12j91r9O45n16Pj36L33J95l04K5l5J11j48
$$ -37 -224 -489 -185 183 345 -65 -248 -454 58 -133 -232 413 -103 -96 -232 101 296 -8 17 -18 93 -55
4936e5J92j14n4q5K37P0p1r9j9J93l38J23K67j8l90K54Q8j89l7L78j88k31n64
$$ -55 137 23 -31 -116 121 191 120 21 2 195 -143 -20 247 229 -161 93 181 -8 -45 333 145 -86 -650
4959f50L69N46k67K1l10j5L6M76L22n57J06n89M69m1L28l59Qj3K04j9J19o0l13
$$ -650 -281 265 -2 19 -291 -306 -270 206 528 -29 77 -512 -43 -84 244 -115 -107 -120 84 65 184 124 -189
4982a89j0K22m8M37o0m25k06J27K24L60n05k5J0j48K99J13l33L51k94P8L55l77
$$ -189 -199 23 -25 412 352 -73 -279 -152 72 432 -73 -98 -88 -236 63 176 -157 194 -100 -22 333 -44
5004d4J38j29n5j85K97J82q8j46MK7MJ07r2r3m3QK9L8j02K60j83k3j88N02p7J38
$$ -44 94 -35 -90 -275 22 204 116 -30 -26 1 5 112 20 -73 -116 -108 -79 -41 -143 117 -66 -89 -277 225 148 286
5030B86j92k52R2n9K37j00k09j4l3O26j8j92k50K9l4L87J68m22o39L13L1M95q4
$$ 286 94 -158 -66 -125 112 12 -197 -211 -244 382 364 172 -78 -49 -83 304 472 50 -589 -276 -245 250 166
5053A66o44N97n54N88R3l42LJ28k62J70O4K88q0k98J79k13J03K60j65Q9l39J72
$$ 166 -478 119 -435 153 246 -96 -93 35 -227 -57 7 295 215 -83 96 -117 -14 246 81 170 -169 3
5075Cj07K61O9m16J49q2K47J85m50J58k08o5J20K30j07l76K15n2L03K54J57k5
$$ 3 -104 157 226 -190 -41 -123 124 309 -141 17 -191 -256 -136 94 -13 -389 -174 -226 77 331 488 463
5097D63n24O2J93j11K66k42l79J86J35L19J30l9q91L35J62j53o6J77L14l48J92
$$ 463 -61 1 194 83 349 107 -272 -86 49 368 498 459 -432 -97 65 -88 -154 23 337 -11 181
5118A81j98J41p7m07L69m3J09k94K72l18L11j19K73J98p57N04k61k2J87N7l5N9
$$ 181 -17 124 47 -360 9 -34 75 -219 53 -265 46 -73 200 398 -359 145 -116 -138 49 106 71 130
5140A30l02K1K47O1k1j83M2o3r4K15R7k57nj53L46J79l5k15k5p7L08P6R2k49k76
$$ 130 -172 -151 96 157 136 -47 -5 -68 -162 53 150 -107 -112 -265 81 260 225 10 -15 -92 216 292 384 135 -141
5165a41L2N89l02j60K5j01k04K79J53j14r6j28N8M53m36J85P5m44j7M50K29m35
$$ -141 -109 480 178 18 43 -58 -262 17 170 56 -40 -168 -110 343 -93 92 167 -277 -294 156 385 -50
5187e0J48l42J63K18J27m09P2k05M77q1K08k41k94p0L69j70M37J3n94K47l72K03
$$ -50 98 -244 -81 137 264 -145 -73 -278 199 118 326 85 -209 -279 90 -80 357 370 -224 23 -349 -146
5209a46K24J87k63m6n9o5M08n6J36l13j97K1K53j13J34j88j36K85J05M1m6n4k54
$$ -146 78 265 2 -44 -103 -168 240 184 320 7 -190 -169 84 -29 105 -83 -219 66 171 212 166 112 -142
5232a42J2L61j76p0j53L86l64J86M60k87k59N6j0K47k6O7j01m16K46L63m01J67
$$ -142 -130 231 55 -15 -168 218 -146 40 500 213 -46 10 0 247 221 288 187 -229 17 380 -21 146
5254A46p9j23o3J68nj19J0R5l77L16J5QJ56k47j26N3K44k41J88r8J91j57J17Q
$$ 146 67 -56 -119 49 44 -75 -65 30 -347 -31 -16 -8 148 -99 -225 -172 72 -169 19 -79 112 -45 72 80
5278H0J3k2n44O24L06j05k69k09j27J00J11J54J1L3m67K86R9K0l7j62k15L15K46
$$ 80 93 71 -473 151 457 352 83 -126 -253 -153 -42 112 123 156 -311 -25 74 94 57 -105 -320 -5 241
5301B41m46K84p6j53M95k44K5j08J90m34K48l5k3p7J77l46K67o1K86k75m4K00
$$ 241 -205 79 3 -150 345 101 126 18 208 -226 22 -13 -36 -113 64 -282 -15 -76 210 -65 -109 91
5323I1n19N78j83q1Qj78K39K64n5N2j78j93J93J16L6m02K27j43L90n46J24M58
$$ 91 -428 150 -33 -114 -106 -284 -45 219 164 216 38 -155 38 154 190 -212 15 -128 262 -284 -160 298
5345B98k01R6m32R0K24p6j26O2Nk43L83r9r6j03M5K82o3K60q6m06k09P96k67q3
$$ 298 97 193 -239 -149 75 -1 -127 -65 -60 -303 80 -19 -115 -218 -173 109 46 306 220 -186 -395 401 134 51
5369E1N0k38M9J98N3j12j90J11J3j7Q4Op8j35j30L36j69L65j03l71j1M5M10j18
$$ 51 101 -137 -88 110 163 51 -139 -28 -15 -32 52 58 -20 -155 -285 51 -118 247 144 -227 -238 -193 217 99
5393I9q0k7n5J12p2j15J31J97k89j25P25m23o4l10M19l07R4M11n88K40k64Q6K88
$$ 99 19 -8 -63 49 -23 -138 -7 190 -99 -224 501 78 14 -296 123 -184 -90 321 -267 -27 -291 -205 83
5416H3j7J02k89p8J16J25J75Q8n43k9j9M17O0J06j32o27O1K20M49l27O3k28K76
$$ 83 66 168 -121 -199 -83 42 217 305 -238 -267 -286 131 191 297 165 -462 -401 -181 268 -59 4 -224 52
5439E2k32L88K00m01k55M03j65O8L17l01l07R8L22q3J32l27Lj89N31l48K35j95
$$ 52 -180 208 408 7 -248 155 -10 58 375 74 -233 -135 187 104 236 -91 -88 -277 254 -94 141 -54
5461e4k16L13j19Q4J7m0j13r5K24J52O2k89l68K65j5J09P4J14j06k05J69p9N49
$$ -54 -270 43 -76 8 25 -15 -128 -223 1 153 215 -74 -442 -177 -192 -83 -9 105 -1 -206 -37 -116 433
5484D33m47j2k58K21J94N9l02k31K67j28K02N7Nl58L25n40N26j19j03J63j04j10
$$ 433 -14 -26 -284 -63 131 190 -112 -343 -76 -204 -2 55 60 -298 27 -513 13 -106 -209 -46 -150 -260
5506b60K20K98l80J67j46L2K96k74KR3q1J85j20J79p5j07J80k85K14j29K02m24
$$ -260 -40 258 -122 45 -101 -69 227 -47 -45 48 -33 152 32 211 136 29 209 -76 138 9 211 -213
5528b13K37l68K74K43m14K56l45M1K46K18Q7q7r3k91K61j55L18k04k32M42l63
$$ -213 24 -344 -70 173 -241 15 -330 -289 -43 175 262 175 82 -209 52 -103 215 11 -221 221 -142
5549a42K2L00j72k50N7m8L84Rk30J6j84K29L92l25q1j75l5J29J32J47k03k60Q5
$$ -142 -120 180 8 -242 -185 -233 151 160 -70 -54 -238 -9 383 58 -23 -198 -233 -104 28 175 -28 -288 -203
5572b03M42j97O1l7j04K2N0J11j62K23l10m9J87J21k77m6J80p3j35L01L9j8l25
$$ -203 239 42 103 66 -38 -16 34 145 -17 206 -104 -153 34 155 -122 -168 12 -61 -196 105 144 126 -199
5595a99J14j85J24J78L0J00N7k56K89j44P6n6pl32Kk7K52L6m1o0n2J9K83j72k68
$$ -199 -85 -270 -146 32 62 162 219 -37 252 108 184 128 121 -211 -209 -236 16 52 11 -49 -101 -82 201 29 -239
5620b39M31j54J74Lj40j41k4J37N8oP4l93N2L22M07o26q8Mj8L02l56J0L65k86
$$ -239 192 38 212 215 75 -66 -90 47 105 99 173 -220 -168 154 561 -65 -153 -149 -167 135 -221 -211 154 -132
5644a32R6j73L39J03l75J19k08N3j5M85j46l72J30j41K03M1J15K9q0k64M45m22
$$ -132 -36 -209 130 233 -142 -23 -231 -178 -193 292 146 -226 -96 -237 -34 7 122 151 71 -193 252 -170
5666a70K5J71k28K02J2k6L85l29k97J50J81j26K15l38J63j78K79p7L91o26J45
$$ -170 -145 26 -202 0 12 -14 371 42 -255 -105 76 -50 165 -173 -10 -188 91 14 405 -221 -76
5687g6Q1j9L3O2J42k35j27Q1K40j12J15n71M73K67p9l18J24n0j64K03Qj00J12
$$ -76 5 -14 19 81 223 -12 -139 -58 182 70 185 -386 87 354 275 -43 81 31 -133 70 78 -22 90
5710I0k52k45L43K63m1o82M69J61k17N4k83K74j29o2J64K92N2k53L25k26J97j48
$$ 90 -162 -407 -64 199 158 -524 -55 106 -111 -57 -340 -66 -195 -257 -93 199 251 -2 323 97 294 146
5732A46J68l20j80J21k23L20p5n7J25j60k16L38M9M7L9R1k43k21O64m76p5K09
$$ 146 314 -6 -186 -65 -288 32 -43 -100 25 -135 -351 -13 36 83 122 213 -30 -251 413 -63 -138 71
5754G1o1K3k57j6M27k54l04N10l55j95J40N08o5j00k89P2j23O4j24K39O8p8j31
$$ 71 10 33 -224 -240 187 -67 -371 139 -216 -411 -271 237 172 72 -217 -145 -268 -204 -328 -89 -21 -99 -230
5777b30R6j00J51L29N7k36k30K72l16L99k29L1L60l50l2Q1J98o5o76N09r7J00
$$ -230 -134 -234 -83 246 303 67 -163 109 -207 192 -37 -6 354 4 -28 53 251 186 -490 19 -78 22
5799B2J70Km12K72K28q8j51j46K05r3R7n0J18K8j15k21K72l71O24j14m56L10j80
$$ 22 192 194 -218 54 282 194 43 -103 102 9 106 56 174 202 87 -134 138 -233 391 277 -179 131 -49
5822d9K5J96k71L08l06J02J12k11J76j6m14J02L32j10O8%j45J86mJ97r5k02j58
$$ -49 -24 172 -99 209 -97 5 117 -94 82 66 -348 -246 86 -24 44 44 -101 85 81 278 183 -19 -177
5845a77J9K10r4N2K69j58j13q8R3Q9j49l9p2L69l42J57R0m24j4L54J73q6m2q9
$$ -177 -158 52 -42 10 279 121 8 -80 13 102 -47 -86 -158 211 -131 26 116 -308 -322 32 205 119 77 -12
5869a2l68J78L60M9k7k12n2R3J66l03K72m1j44L42k96J28o4m1k27J33J88k29p4
$$ -12 -380 -202 158 207 180 -32 -84 9 175 -128 144 103 -41 301 5 133 69 28 -199 -66 122 -107 -181
5892a81j88L84m8K26k23k80Q4k5L35j11J87m26n6j23O72j7j91k30L6K45j85L93
$$ -181 -369 15 -33 193 -30 -310 -226 -251 84 -27 160 -266 -322 -445 227 210 19 -211 -175 70 -115 278
5914B78O7n80MK50J05j13R4l83J30K73p5l15K94K21m50J45J12L7K10k10j85p2
$$ 278 345 -235 -231 19 124 11 105 -278 -148 125 50 -265 29 250 -200 -55 57 94 304 94 -91 -163
5936a63R2r1L40j20j75k46J27K75N4j26n1O7O6j57L53l2n4k79j41L60m5j15m3
$$ -163 -71 -162 178 58 -117 -363 -236 39 93 -33 -84 -17 49 -108 245 213 159 -120 -261 99 54 -61 -104
5959a04l3L15k01J89R2l84L5J85o2J75J6k41LN4R9k80O7J04Q2q8N5j11k66J87
$$ -104 -137 178 -23 166 258 -126 -91 94 32 207 223 -18 -15 39 138 -142 -75 29 111 23 78 -33 -299 -112
5983a12R8J67j30J77k05j68q3M67j88k43L88n8n34L11o7J72K66J0k89l2J61K29
$$ -112 -14 153 23 200 -5 -173 -256 211 23 -220 168 110 -424 -113 -180 -8 258 268 -21 -53 108 337
6005C37m40K74n87L24K22j62O5o6q7Q5J04J21k02j05K5P1M9O0K06Om80J70J88
$$ 337 -103 171 -416 -92 130 -32 33 -33 -120 -35 69 190 -12 -117 -92 -21 28 88 294 300 -180 -10 178
6028A78Q1l55Q4k2j20n2O8J85j56l7J16Pm3J99j1j05O4m10K34J71m9J28j89j02
$$ 178 259 -96 -12 -34 -154 -206 -138 47 -109 -146 -30 -23 -66 133 122 17 81 -329 -95 76 27 155 -34 -136
6052a36J89J90j02j16q7M5MJ16j26J12k61K27k08K21j29L4J71j46k24K82K92l67
$$ -136 53 243 141 25 -62 -17 -13 103 -23 89 -172 55 -153 68 -61 -27 144 -2 -226 56 348 -19
6074a9j41l3L1N30k34p2j33K69j38K2kK12l65K2J74K05j69l8j84R1l58L89K0o0
$$ -19 -160 -193 -162 368 134 62 -71 198 60 82 80 292 -73 -51 123 328 159 121 -63 28 -330 59 79 19
6098A9j76J89NN0m05O31n76J91K9j83L36l48K04n7J26o4K61l34J6n1K17k91K47
$$ 19 -157 32 37 87 -318 313 -263 -72 -43 -226 110 -238 -34 -91 35 -29 232 -102 -86 -137 80 -211 36
6121C6J76k30j1J87m14Q8J75k77K41j0N3L27l07l3j36K0K55p0j4j31K44K1k7J3
$$ 36 212 -18 -29 158 -256 -168 7 -270 -29 -39 14 341 34 1 -135 -115 140 70 56 -75 169 190 163 176
6145A76N4k54J0j28K35k08J83m5K0j47P4M9K5j59L26k55k17N84o72K74J52k54
$$ 176 230 -24 -14 -142 93 -115 68 23 43 -104 -30 19 44 -115 211 -44 -261 323 -349 -75 77 -177
6167a77J62K17l55K2K50j05k38L04N5M0k03m4P7j39l8K12k9j12j09o7M27l8k85
$$ -177 -15 202 -153 -131 119 14 -224 80 135 175 -28 -72 5 -134 -172 40 11 -101 -210 -277 150 112 -173
6190a73J44j82N72j94m5Q0m9k16m2j68M29l67R7L88j13p5j06R4k94K62K00j92
$$ -173 -29 -211 361 167 122 202 153 -63 -105 -273 156 -211 -114 274 161 86 -20 74 -220 42 242 50
6212E0J69l18k0J21j20J35k54J95j14K99m52M10j33L2j13N2J50o3j7j36M10o6
$$ 50 219 -99 -119 2 -118 17 -237 -42 -156 143 -309 101 -32 0 -113 -61 89 26 9 -127 283 217
6234B17m71L07J44k65J75m08L24K81l97J49J41m66M22k91K64q7j03Q2k53J51K51
$$ 217 -254 53 197 -68 107 -301 23 304 -93 56 197 -269 153 -138 126 39 -64 18 -235 -84 167
6255A67j74L71j93k90q5N7N1J36l76K02K80N7l21o7R7m3O4J5j9j87K40j15K20
$$ 167 -7 364 171 -119 -204 -147 -96 40 -336 -134 146 203 -118 -185 -88 -131 -67 -52 -71 -258 -18 -133 87
6278H7j02J03q6K4k81L80j35J52j00K64l6p3j74J05l29L34J0K09k65R9k72o8L94
$$ 87 -15 88 2 26 -255 125 -10 142 42 306 270 197 23 128 -201 133 143 352 87 186 -86 -154 240
6301B40l04K65l19K27l62L09k16R4P4o4r8j5M67k12K6k59L06k91K83j77L59j54
$$ 240 -64 201 -118 109 -253 56 -160 -66 8 -56 -154 -169 298 86 112 -147 159 -132 151 -26 333 179
6323A79j52l8K88k90L25l02k31J10q3N2L32k62K49j96m4M9L8L4l54J25J10J89
$$ 179 27 -11 277 -13 312 10 -221 -111 -194 -142 190 -72 177 -19 -63 -14 24 58 -296 -171 -61 128
6345A28o8k45K12J08m59L02j2k2J42j20K2P0J33j59l8o1K56O9j58j98m2K16j98
$$ 128 60 -185 27 135 -324 -22 -34 -56 86 -34 -12 58 191 32 -6 -67 189 258 100 -98 -140 76 -122
6368a22K72J15n30J82K82q7M6J17l44j75K32J7Pk53L37j58j48K35k4k8j66Q5K19
$$ -122 150 265 -265 -83 199 112 158 275 -69 -244 -12 5 12 -241 96 -62 -210 25 1 -27 -193 -108 111
6391A11l03N09l19L13j73Q4k22K94r1n7j96k38J73M47k34Rj64J52Q2j34J27r8
$$ 111 -192 317 -2 311 138 222 0 294 203 146 -50 -288 -115 332 98 107 -57 95 177 43 170 72
6413G2j58J97k39j1M00k82O6j44J04l64K09J73N1jLj81J8K55j77N0j45J75j81
$$ 72 -86 111 -128 -139 261 -21 45 -99 5 -359 -150 23 74 73 76 -105 -87 168 -9 41 -104 71 -110
6436a10J29J3j3j32o2J55R6j45N8O2R5j3J14m42K17q2R8n4N7k74L33k42l1M0O5
$$ -110 19 32 19 -113 -175 -20 76 -69 -11 51 146 133 247 -195 22 -60 38 -16 41 -233 100 -142 -173 -133 -68
6461f8K06l86J1K65o9J73r8kP1R0k40k89L22m45q4P56ml30R1N8j61J56J42j07
$$ -68 138 -248 -237 28 -41 132 34 32 103 193 -47 -336 -14 -459 -543 213 209 -121 -30 28 -133 23 165 58
6485E8Q5k49J67j05Q2J15m4q4m6K4K08j36p3kk49J43n9L22l12J29J04J11q7J91
$$ 58 143 -106 61 -44 38 153 109 25 -21 3 211 75 2 0 -249 -106 -165 157 -155 -26 78 189 102 293
6509B93n61K77m8K6M28m51N3J6J02k14KRj12J55K10j43K1q5Q1j72j6O8kL36o2
$$ 293 -268 9 -39 -13 415 -36 17 33 135 -79 -77 -68 -180 -25 185 42 63 -22 59 -113 -129 -61 -63 273 211
6534B11k45K35j48k3j79j20J01L51k41jM19l44j4k53L9O53l33ol48J53J50o2R0
$$ 211 -34 201 53 30 -149 -269 -168 183 -58 -59 360 16 2 -251 -212 441 108 102 -246 -93 57 -5 85
6557H5lj05Rj02J17j06M8J5R7L0L6k41J1j40O2K48j40J6K68j7qm48K58q5Jj31
$$ 85 82 -23 -14 -116 1 -105 -57 -42 55 85 121 -120 -109 -249 -187 61 -79 -63 205 188 180 -268 -10 -95 -94 -225
6583b25J11j46j98O22l45K26n8j05J04j43J99q7K56m18J21p0K60J65m22J2l9L97
$$ -225 -114 -260 -458 164 -181 45 -13 -118 -14 -157 42 -45 211 -207 -86 -156 104 269 -153 -141 -180 217
6605B17o0j50J33M8p4l5l3L57l31j55K11l11J10J00Lm7N4L35k43K40k67k06J22
$$ 217 157 7 140 188 114 79 46 403 72 -83 128 -183 -73 27 30 -17 37 372 129 369 102 -104 18
6628A8N5n5j51l7K01O9j38k2J46j29M2n2J40L19m38L34k06m5o5j98K02p1J71k30
$$ 18 73 18 -133 -170 31 100 -38 -60 86 -43 -1 -53 87 406 -32 302 96 51 -14 -212 -10 -81 90 -140
6652a40KL77j38m8K36j31j81J07k51L34j97K73n17K42J43j10J69j69J47r2J89
$$ -140 -138 239 101 53 289 158 -23 84 -167 167 -30 243 -274 -32 111 1 170 1 148 56 245
6673B45j68J61l11P5K76j56m28K42j83K23Q7j67K45j06l38M1j06M12j00N5j1P1
$$ 245 77 238 -73 2 278 122 -306 -64 -247 -24 63 -104 141 35 -303 -262 -368 44 -56 -1 -12 59
6695E9k41J43R4l2M1J61l62k8K44k57K30kl0j16Mo0M03k38j7p1n7O6J74j96M01
$$ 59 -182 -39 55 23 64 225 -137 -165 79 -178 52 50 20 -96 -92 -152 251 13 -4 -75 -132 -66 108 -88 313
6720C13n23J4M4J64l30L16J45j29K3k26J47m00N53j97j98K47OO3J37l37K08k57
$$ 313 -210 -196 -152 12 -318 -2 143 14 37 -189 -42 -442 111 -86 -284 -37 -31 32 169 -168 40 -217
6742b17M52j38j60P8j80K92l95k3K31OJ83k85L91k76K8j67J36O4q2J01j56J20
$$ -217 235 97 -63 15 -165 127 -268 -291 -60 -54 129 -156 235 -41 -13 -180 -44 20 -62 39 -117 3
6764CJ51m5o8n4R5K74q17M25k31N3N68l16j32K37j28l98O3K65j28K69k08J36J84
$$ 3 154 109 41 -13 82 356 -461 -36 -267 -214 354 38 -94 143 15 -383 -320 -55 -183 86 -122 14 198
6787A98Q4j4k53L31p6n0k87J82M53p46J99j43lk72K67M67n99J20J11J73j74P2
$$ 198 282 268 15 346 270 220 -67 115 568 -178 21 -122 -125 -397 -130 337 -262 -142 -31 142 -32 40
6809D0j7k86K51j08j12N31n79K33R7O0j31q6j5rJ86M46q11M74l24K33J2m3n0J09
$$ 40 23 -263 -12 -120 -232 299 -280 -47 50 110 -21 -107 -122 -131 55 501 -310 164 -160 73 85 42 -8 101
6833A01j73J7K64j64j88Q3J29l55M54l22K88p5l0N9j00L69n13J70P4l7K29J20
$$ 101 -72 -55 209 45 -143 -60 69 -286 168 -154 134 59 29 88 -12 357 -156 14 88 51 280 400
6855D00n97M85m40kk6J81N5j91J21O7j42K03l25K07j42j78L43K31l71K00k10K19
$$ 400 -197 288 -152 -154 -180 1 56 -135 -14 53 -89 114 -211 -4 -146 -324 19 250 -121 79 -131 88
6877H8O9P3N6m90K93o5J98k09Q3k40P4J55J9j37J29J04j25j91J24P1j32OO1q3
$$ 88 157 230 286 -204 89 24 222 13 96 -144 -70 85 104 -33 96 200 75 -116 8 79 -53 -47 14 -69
6901f9k89M56j8j76J04j17J47J09L5l0k91L08Q6l32L35l04J06j44L42l74k40N92
$$ -69 -358 98 80 -96 8 -109 38 147 182 152 -139 169 255 -77 258 -46 60 -84 258 -116 -356 236
6923B36m55NJ86j00P9M18l11j76q6K87j84R7j42P5R8k38J7M34k83J83K87l97r0
$$ 236 -219 -214 -28 -128 -49 369 58 -118 -204 83 -101 -4 -146 -71 27 -211 -194 240 -43 140 427 30 -60
6946f0K97l23Q9n7J82j32l9Q8j17j5K52Q8J55l99qk38M01J14l35L9Pj08L88k3
$$ -60 237 -86 3 -54 128 -4 -43 45 -72 -87 165 253 408 9 1 -237 164 278 -57 -18 -11 -119 269 246
6970B46k47m1K08q7j22N0j1K19j79K81l11J14l09K99Q1l87N17l81Q7J74m22L89
$$ 246 -1 -42 166 79 -43 7 -4 215 36 317 6 120 -189 110 191 -196 321 -60 27 201 -221 168
6992A68l53L21N1p4m75M74j12J94j43n1J44l35J62N9J26k49K40R0k01K52j32k0
$$ 168 -185 136 187 113 -362 112 0 194 51 0 144 -191 -29 30 156 -93 147 237 36 288 156 136
7014A36j69j6K90l37k8J23rJ41k34L88m74M45l99J49m9l51M78k43K77j20k67J31
$$ 136 -33 -49 241 -96 -124 -1 -10 131 -103 285 -189 256 -143 6 -43 -394 84 -159 118 -2 -269 -138
7036a38J78K43n48J03J15J29Q6j40k53J64n1M8k3J82k00o5J81J53l18J44J01J38
$$ -138 40 283 -265 -162 -47 82 168 28 -225 -61 -112 -64 -87 95 -105 -170 11 164 -154 -10 91 229
7058B29k88j0K01R6m29L01j0K05l65K56j78j16k8P1M2L5L18n19J82o2J51j5l00
$$ 229 -59 -69 132 228 -201 100 90 295 -70 186 8 -108 -136 -65 -23 12 330 -189 -7 -69 82 67 -233
7081b33K07J42k88J8l2m7J43k33K87K51l77O4J28m9k05L33K00k07j35K40L6l58
$$ -233 -26 116 -172 -154 -186 -233 -90 -323 -36 215 -162 -98 30 -19 -224 109 309 102 -33 207 243 -115
7103a15j9K82o7O4j39j4p0J42j89J30r2Q1k8J8M32p84M02n5J33M2p1n45O81r0
$$ -115 -134 148 81 145 6 -8 -78 64 -125 5 -87 -6 -34 -16 416 -368 34 -21 112 154 83 -462 219 129
7127A29q1j27K18j08k73L16P0k6p1j74J33J63n0k02K68m40J72J24l9l3K5m4p0
$$ 129 48 -79 139 31 -242 74 144 118 47 -127 6 169 119 -83 185 -255 -83 41 2 -31 -6 -50 -120
7150a20M00k13j00J77K24m11R3N6J31m53K31o1J69j26K07k43K06k12l2L23j00
$$ -120 280 67 -33 144 368 -43 50 106 237 -216 15 -46 123 -3 204 -39 167 -45 -77 246 146
7171A46J79k51R3j21R6l32L48J50k28J93l41L4O7K76l57m2J11j48J56k52K19m28
$$ 146 325 74 167 46 142 -190 158 308 80 273 -68 -34 33 309 -48 -90 21 -127 29 -223 -4 -432
7193d32L3N62k61k90N98k28l20L40j34j1M80m33j44K90L5j89N9J55l20N24n00
$$ -432 -399 163 -98 -388 210 -18 -338 2 -132 -143 337 -96 -240 50 85 -104 -45 110 -210 314 -186
7214a86K95q2k77O15q01N12j67n7j87L04j85L72k93J63j05K26l57P2J58k71J44
$$ -186 109 27 -250 365 -436 76 -91 -148 -335 -31 -216 156 -137 26 -79 147 -210 -138 20 -251 -107
7235a07M3J23J33j39l09N39l39K37j51m2J4o8J14n29O09o9j85K31j55R3jk9m1
$$ -107 -64 59 192 53 -256 283 -56 181 30 -12 2 -66 48 -481 128 59 -126 105 -50 43 42 13 -28
7258b8k7j20L37q7q4k77J11J85j95K40j38J72j48K53k60j54L02l00L84m11j18
$$ -28 -55 -175 162 75 -9 -286 -175 10 -185 55 -83 89 -59 194 -66 -220 82 -218 166 -245 -363
7279c63N56m78M27j44k49K38J27k2k84K36k79J66l8j61L21l34M52j95J62J89m10
$$ -363 193 -285 142 -2 -251 -13 114 92 -192 44 -235 -69 -107 -268 53 -281 171 -24 138 327 -83
7300h3K23j64l5R9M5j34J08J59m32L05j93J71J10m79K47j36J28o9L33k36L30k46
$$ -83 140 -24 -59 40 85 -49 59 218 -214 91 -102 69 179 -300 -53 -189 -61 -130 203 -33 297 51
7322E1K74k20p2J7K4j23QK3o4J25j22P9P8ro2J18j65J78m97K83J4K6K52j06J81
$$ 51 325 105 33 50 74 -49 -41 -18 -82 43 -79 0 78 69 7 125 -40 138 -359 -76 -62 -36 216 110 291
7347B91k40l24L88ro8k85R1L13K5j33j90O1L3k6j26K55K5k50R0K39k18j10j7K47
$$ 291 51 -273 115 106 38 -247 -156 157 182 49 -141 -80 -47 -73 -199 56 81 -169 -79 160 -58 -168 -185 62
7371F2k67J65K35l17Rk09L19J2J7m1r0K75p4Rm0N9K2J62m33J56O8k67JK42j02
$$ 62 -205 -40 195 -122 -113 -322 -3 9 26 -15 -105 170 96 105 65 124 146 308 -125 31 99 -168 -167 75 -27
7396b7L0j30J35L9j61j25M74k86J31K6j73K16k54J1k17L90J21j31k93L0J68J76
$$ -27 3 -127 8 47 -114 -239 235 -51 80 106 -67 149 -105 -94 -311 79 200 69 -224 -194 -26 150
7418A50j82K21k1J64l37k44M13j83J70j22l37K98l42N34j14rk52N46m74j33J68
$$ 150 -32 189 168 332 -5 -249 164 -19 151 29 -308 -10 -352 182 68 59 -193 353 -121 -254 -86
7439h6J3J08qj06K40J22Q7k69j46K69l72K15J40L6j05l1k59p6O0J93N1j42m4K68
$$ -86 -73 35 27 -79 161 283 370 101 -45 224 -148 67 207 243 138 107 -152 -228 -168 25 76 -66 -110 158
7463A58J4m52K86J40J16k13J21j47L9J02j36r7j27J93k77L68j10J16j86M8K52
$$ 158 172 -280 6 146 262 49 170 23 62 164 28 -69 -196 -3 -280 88 -22 94 -92 -44 208
7484B08j04K53m22J37J2j48J09k9r0q5k9N3L18KQ5m5r9r2N3l1n05M00J14k23m0
$$ 208 104 357 -65 72 84 -64 45 16 -74 -159 -188 -135 183 185 270 225 126 34 87 56 -449 -49 65 -158 -198
7509a98J96J27J85k53k57J18R1q1J14K0l47M3L45Op9R2j96m2J24J08qm6q0J07
$$ -198 -2 125 310 57 -200 -82 9 -72 42 62 -285 -242 103 109 30 122 -74 -116 8 116 108 62 -18 89
7533H9L8m77K14J77n7L53j61J37m52Q2J82o0o1J65k21J99m9k2J19Ql64L26ol54
$$ 89 127 -350 -136 41 -16 337 176 313 -139 -57 125 65 4 169 -52 147 98 76 195 203 -161 165 159 -195
7557a95K83O0r0M49o61L64j13Oj00j70K12p6j11m0J53o8j96M56ok26J22M9k77
$$ -195 88 148 58 507 -154 210 97 103 3 -167 45 -31 -142 -182 -29 -97 -293 163 157 -69 53 102 -175
7580a75M5J75j05K83j28l15q6K99j6PJ99l29K53j22K3J03K39n38O5K96j91J30
$$ -175 -130 45 -60 223 95 -220 -306 -7 -23 -16 183 -146 107 -15 8 111 350 -188 -123 173 -18 112
7602A12l14L33k39J42J65k91OK00j02j39J65J70j95m8k64N39n98O19l80qk5K62
$$ 112 -202 131 -108 34 199 -92 -86 114 12 -127 38 208 13 -35 -299 240 -358 261 -119 -127 -152 110
7624A10j41J9J03k12j25K30K07l50R9K6J28j81J35k2K22j92k51N7L07k9p6k14
$$ 110 -31 -12 91 -121 -246 -16 191 -159 -60 -34 94 -87 48 26 248 56 -195 -138 169 140 64 -150
7646a50L34n5J5M6m39L19n8J37r8K3K31j92J9m56N90k61j68N3p9J84R5J7j86M4
$$ -150 184 129 144 190 -249 70 12 149 51 74 305 113 132 -324 266 5 -163 -110 -189 -5 90 107 -79 -35
7670c5o0L86k07J18l24n8j79M26M4o4q7q9J91o9L2L7L4m18J74j24K46j23K47j66
$$ -35 -95 291 84 202 -122 -180 -359 67 111 47 -40 -129 62 -7 25 62 96 -322 -148 -272 -26 -149 98 -68
7694f8J3j07J24k0R9j96J46qO4K43m11j48M28No33M75J87k87K2Q5J0J53J5j09
$$ -68 -55 -162 -38 -58 41 -155 -9 -17 47 290 -121 -269 159 164 -469 6 193 -94 -72 13 23 176 191 82
7718H2n7j17n7M25R2j29l36R9j85K66Jj17K51j0J6j2k93p8K86m64L45Nm5K68j07
$$ 82 25 -92 -149 276 368 239 -97 2 -183 83 84 -33 218 208 224 212 -81 -159 127 -337 8 13 -32 236 129
7743A29l4j23l08j38N99k7j77j6j04K34k11J10M74n14L02k68J11J67nj60j91K79
$$ 129 95 -28 -336 -474 125 98 -79 -95 -199 35 -176 -66 408 -106 196 -72 39 206 201 41 -150 129
7765A29j69j18K07j95J59k8r3K20n9o8L79o17K78J31k73L41J16k27l5k46L55j69
$$ 129 -40 -158 49 -146 13 -15 -108 112 53 -15 364 -253 25 156 -117 224 340 113 78 -168 187 18
7787A8O4j99j42M63M3j37m51N64kk99J45p8j76K20J8p4J79k90K35n2n9M11m58
$$ 18 82 -117 -259 204 247 110 -341 223 221 -78 67 -11 -187 33 51 -23 156 -134 101 49 -10 401 -57
7810e7L77l17O5M7k27R9j50N9k8l4N6n3J68o3L01j17k2P4m30K29K32K1j18k43
$$ -57 320 3 68 115 -112 -13 -163 -104 -132 -166 -110 -163 5 -58 243 126 104 178 -252 -23 209 230 112 -131
7834a31J60j44J8k5n0K61p6j27J50M9n2K22l03pJ41j9j84o9pK54J23k33j31J73
$$ -131 29 -115 -97 -122 -172 89 13 -114 36 85 33 255 -48 -55 86 67 -117 -186 -193 61 184 -49 -180 -7
7858gj04P6o6k00K83Jk83M60k34K78l26J7J69k0m6J36l35K51j09j77K18N8M4j10
$$ -7 -111 -35 -101 -301 -18 -17 -300 160 -74 204 -122 -105 64 44 -2 134 -201 50 -59 -236 -18 40 84 -26
7882b6J50k27rJ71l30J41K08N3l83M31j07J17K4l44J22L46n50L6N17l40Nj07R5
$$ -26 124 -103 -112 59 -271 -130 78 131 -252 179 72 189 213 -131 -9 337 -213 -177 340 0 5 -102 -7
7905gJ19j04R2j19M1J43l72M68m98K30j58o7L49k10K02O0j66K18n15L48J5l69
$$ -7 112 8 100 -19 22 165 -207 261 -237 -7 -165 -232 117 -93 109 169 3 221 -294 54 69 -300
7927c00L08J62j50Q0j01j61O0J35j79L1K42ok14J64k03J01r5l1J76K13P3k81k35
$$ -300 8 170 20 100 -1 -162 -102 33 -146 -115 127 121 -93 71 -132 -31 -126 -157 19 232 305 24 -211
7950b11K56l56L95k41K89P0l07L20m16J98R0n7k85K70J32k58Q0r1J38J60M4j86
$$ -211 45 -311 84 -157 132 202 -105 215 -201 -3 87 30 -255 15 147 -111 -31 -122 16 176 220 34
7972C4m4j68j8K19j17O4n8J60j26l33M25l2k22j60J76kr9M71m88L46j55J92K02
$$ 34 -10 -178 -196 23 -94 -30 -88 72 -54 -387 38 6 -216 -376 -200 -202 -301 170 -318 28 -127 65 267
7995B67k81l31J45O9l8J30J55j42N9o4n0O3n3r9P3K04j25K44j12j20K33m22L05
$$ 267 -14 -345 -200 -131 -169 -39 116 -26 33 -31 -81 -18 -71 -170 -97 107 -18 226 114 -6 227 -195 110
8018A10KNl56K95K51k80j78J27l61J01K32R6J43l52K0k9L7P7J62j41J59K68l55
$$ 110 112 117 -239 56 307 27 -151 -24 -385 -284 -52 44 187 -165 -145 -174 -137 -60 102 -39 120 388 33
8041C3r0p0L6j61L83K00n31L48j60j63M3k5J73n4k80O44m60r0J99J5J13j03p6
$$ 33 -57 -127 -91 -252 131 331 -200 148 -12 -175 -132 -157 16 -38 -318 326 -134 -224 -25 -10 103 0 -76
8064g6j17J33P2r7J85M2j93J23k40J43J47Q0j91L2L7J32k98K4J49P9l7K8l66K23
$$ -76 -193 -60 12 -85 100 142 -51 72 -168 -25 122 202 11 43 80 212 -86 -62 87 166 129 157 -209 14
8088A4J06k32J77m24K84K5J06j40p0k2K24n9kK59k17K01j80Q7n6j65K04K96n18
$$ 14 120 -112 65 -359 -75 -50 56 -84 -154 -176 48 -11 -13 246 29 230 50 137 81 -84 120 416 -102
8111a02K27n1k55L05o1l55K18J49q9M3r3K2j71L19O9j30j69K03j9j06m5J65K15
$$ -102 125 74 -181 124 63 -292 -74 75 -14 29 -64 -42 -213 106 175 45 -124 79 60 -46 -91 74 289
8134B89m7j42J8p8k26K82l46K28j83J87J85n30M16q1m34K83L73K2k87K53l54K10
$$ 289 242 100 118 40 -186 96 -250 -22 -205 -18 167 -363 53 -28 -462 -179 194 216 -71 182 -172 38
8156C8l16L07J17l59K91Q5j43p5J06j67J01J31n5m18L77L15m79M48k04j04J29
$$ 38 -278 29 146 -213 78 163 20 -55 51 -116 -15 116 61 -357 20 335 -144 304 100 -4 125
8177A25N7k41J13j03Q8l4j35O1J2j21L47l23J36P9
$$ 125 182 -59 54 -49 39 5 -130 -69 -57 -178 169 -154 -18 61
8191F1
$$ Imaginary data points
##PAGE= N=2
##DATA TABLE= (X++(I..I)), XYDATA
0@%%%%%%Qj6J6j6K2l0L2m0M9n7P2q8J04j21J40j64J94k24K56k93L34l81M31m85
$$ 0 0 0 0 0 0 0 8 -8 8 -8 14 -16 16 -24 25 -32 40 -48 56 -65 75 -89 105 -119 137 -156 178 -203 228 -257
30b57N50o20O93p75Q67r66J076j197J326j469J628j805K000k215K451k717L019
$$ -257 293 -327 366 -409 458 -508 568 -629 697 -772 856 -949 1051 -1164 1287 -1430 1589
47A589l359L751m204M733n369O142p105Q353j0040J2455j6234K3040l9138J47760
$$ 1589 -1770 1981 -2223 2510 -2859 3283 -3822 4531 -5509 6946 -9288 13752 -25386 122374
61A22374J30599k40649j27176L7137J59074O2343l3188q7473m5080k718M8949
$$ 122374 252973 12324 -114852 -77715 81359 143702 110514 23041 -22039 -24757 24192
72B4192M6539Q641n9305n7795O996P5785M5328l5726p6158k9523K6903M9610L7704
$$ 24192 70731 79372 20067 -37728 -30732 45053 90381 54655 -21503 -51026 -24123 25487 63191
85F3191J4377l8247q1432n1378N5248J16770M4543q1666j06718j2832P3339N5717
$$ 63191 77568 39321 -42111 -93489 -38241 78529 123072 41406 -65312 -78144 -4805 50912
97E0912q550k9786r768p454j7101K728M1703L3604k8915o5518j5139O5272P0043
$$ 50912 42362 12576 2808 -4646 -21747 -19019 22684 56288 27373 -38145 -53284 11988 82031
110H2031j1592q1767o1113K1572Q2993P0365q508r3470r6797P236J17595J01888
$$ 82031 70439 -11328 -72441 -50869 32124 102489 93981 511 -96286 -89050 28545 130433
122A30433l0320j28346q1194M8871J09835M2704n7839p5899j7060L6488L9668
$$ 130433 100113 -28233 -109427 -60556 49279 91983 34144 -41755 -58815 -22327 17341
133A7341K0368n746m0263n3769m541P0603P5275j5431r6317o8214L5773R3649
$$ 17341 37709 31963 -8300 -62069 -66610 3993 79268 63837 -32480 -100694 -64921 28728
145B8728N0292l4322p4323m3838J9183O0838M6180j3285n9971m1833K1150N4693
$$ 28728 79020 44698 -29625 -73463 -54280 6558 52738 39453 -20518 -62351 -41201 13492
157A3492K1709l0144l5211p49J8332Q042J819J3976R534k8580m6916K284O9723
$$ 13492 35201 5057 -30154 -30903 -12571 -4529 -2710 11266 20800 -7780 -54696 -52412 17311
170A7311O0630k7101q8845m8012M5383Q6426L8119m2539p3371l1624L5354O4630
$$ 17311 77941 50840 -38005 -86017 -40634 45792 83911 41372 -31999 -63623 -28269 36361
182C6361L2800l0233o2507l0487L5545O3227K1312m0939n5379j4418L4619N0012
$$ 36361 69161 38928 -23579 -54066 -18521 44706 66018 25079 -30300 -44718 -10099 39913
194C9913K5898j9879n7381m6968J6945P9033O3322k6923r4788n8524M4376R4873
$$ 39913 65811 45932 -11449 -58417 -41472 37561 100883 73960 -20828 -79352 -34976 59897
206E9897L8020n4324p7157j5553N0294N0979J320l9255l6224k198K8149K9940
$$ 59897 97917 43593 -33564 -49117 1177 52156 53476 14221 -22003 -24201 3948 33888
218C3888L499k4504l0051q177J7592K5856J5227m221k3314l1260j1692K8677N0664
$$ 33888 37387 12883 -17168 -25345 -7753 18103 33330 29109 5795 -25465 -37157 -8480 42184
231D2184J8970l9164n9137j3614M6830N4412L417m4896l9135L424L0847K5696
$$ 42184 61154 21990 -37147 -50761 -3931 50481 53898 9002 -30133 -26709 4138 29834
243B9834J995j8219k6847j4823J5816L8472K2524k4065n1014k5386L1737O1536
$$ 29834 31829 13610 -13237 -28060 -12244 26228 48752 24687 -26327 -51713 -19976 41560
255D1560K7917l7094o8418l1232M2408P5950L0579m9274p8631k2391N7285P1508
$$ 41560 69477 32383 -36035 -67267 -24859 51091 81670 32396 -46235 -68626 -11341 60167
267F0167N789o2206n5974R440N4207L4122j7272m1098k2524Q707K5417K0572L549
$$ 60167 65956 3750 -52224 -42784 11423 45545 28273 -12825 -35349 -26642 -1225 19347 22896
280B2896j9353k9501j4768J8621L7075J9291j8567l8578k1858J6659L9924K4090
$$ 22896 3543 -25958 -40726 -22105 14970 34261 15694 -22884 -44742 -28083 11841 35931
292C5931j3800l8036k3936J5117L7755J9226j6843l0677j2405J3445K0504J0296
$$ 35931 22131 -15905 -39841 -24724 13031 32257 15414 -15263 -27668 -14223 6281 16577
304A6577k712j3726j8179j0403J4027L3377J9649k2689m8292k0402L6169N7665
$$ 16577 13865 139 -18040 -28443 -14416 18961 38610 15921 -32371 -52773 -16604 41061
316D1061J5979m6123n8265o619N1685N4398J50n1641m8420M801N1724M2534j1445
$$ 41061 57040 10917 -47348 -53967 -2282 52116 52266 625 -47795 -42994 8730 51264 39819
329C9819n0362l4477J4668M3192K6188j3196l5209k4120M534K7438K7760L600
$$ 39819 -10543 -45020 -30352 12840 39028 25832 -9377 -33497 -28963 -1525 26235 29835
341B9835k6682l4625q114L0685L9470O401l3918l7257l35L5274L1460m432l0901
$$ 29835 3153 -31472 -39586 -8901 30569 36970 3052 -34205 -34540 734 32194 27762 -3139
354c139k2554O020K3870J6418l617j5870j3773k443Q138J3524R327j993j5212
$$ -3139 -25693 -19673 4197 20615 16998 1128 -12645 -15088 -6950 6574 15901 13908 -1304
367a304k0002n022K1063L1545O950l1198l9015k537M1049M1274n162m6286l5529
$$ -1304 -21306 -26328 -5265 26280 33230 2032 -36983 -39520 1529 42803 37641 -8645 -44174
380d4174J4293M5783K8094j7183m1692k2262J7715L6646J9506j5279l3291k0725
$$ -44174 -29881 15902 43996 26813 -14879 -37141 -19426 17220 36726 21447 -11844 -32569
392c2569R902L1822K3668p461l2111k7532L978L3494L1213l505l5725l2591N642
$$ -32569 -22667 9155 32823 25362 -6749 -34281 -30303 3191 34404 30899 -4826 -37417 -31775
405c1775L8963L2701j0045m0667k5559J6758L8101J7543j8691l0702r806J6515
$$ -31775 7188 39889 29844 -10823 -36382 -19624 18477 36020 17329 -13373 -23179 -6664
417f664K1700O057r686j4009p982P26Q579J1696O695o140j7979j4522O168K4416
$$ -6664 15036 21093 11407 -2602 -10584 -9858 -1279 10417 17112 10972 -7007 -21529 -15361 9055
431I055J8657r020k8818j9170J1666L2303J8406j4898l2110j4902J6565L0013
$$ 9055 27712 18692 -10126 -29296 -17630 14673 33079 18181 -13929 -28831 -12266 17747
443A7747J2512j6038k7103j2879J2143K5190J5456r411k7544k0922O915L0977
$$ 17747 30259 14221 -12882 -25761 -13618 11572 27028 17617 -9927 -30849 -23934 7043
455G043K4017r054l5395k6482J2022L9105K4951j5777l9919k1313K0616L9546
$$ 7043 31060 22006 -13389 -39871 -27849 11256 36207 20430 -19489 -40802 -20186 19360
467A9360J6485k2559l4745j0102K3639K9695N529k0460k2580l812J5395J7020
$$ 19360 35845 13286 -21459 -31561 -7922 21773 27302 6842 -15738 -19550 -4155 12865
479A2865M169q307j3780q772K062J2654J3788J490j4449j8228k996J6566J9980
$$ 12865 17034 8727 -5053 -13825 -11763 891 14679 16169 1720 -16508 -19504 -2938 17042
492A7042K475j7113j9322k442J7769J8472K223j5902j6841k853J2575J6468N792
$$ 17042 19517 2404 -16918 -19360 -1591 16881 19104 3202 -13639 -16492 -3917 12551 18343
505A8343j0101j8021j0601P496K0584J4511p739k6112j9716R636L1020K0375j4087
$$ 18343 8242 -9779 -20380 -12884 7700 22211 14472 -11640 -31356 -21720 9300 29675 15588
518A5588l5908j8561J9477L7286J5047k2818l5333r544K5620L2815N446k4550
$$ 15588 -20320 -38881 -19404 17882 32929 10111 -25222 -34766 -9146 23669 29115 4565
530D565k7783k238K3233K3901J442j9220j9887k978J5668J7639M306j1582j7439
$$ 4565 -23218 -25456 -2223 21678 23120 3900 -15987 -18965 -3297 14342 18648 7066 -10373
543a0373p622R331J7407R222q184j8348r806Q531J7793R170p527j6024p787O231
$$ -10373 -17995 -8664 8743 17965 9781 -8567 -18373 -9842 7951 17121 9594 -6430 -14217 -7986
557g986J3543Q405k856j0073r970j328R186J2992N343r475j6954r121J0073K1063
$$ -7986 5557 13962 11106 1033 -8937 -10265 -1079 11913 17256 7781 -9173 -18294 -8221 12842
571A2842J1017j2853k6288j1779J6430K8299J0279k0629k8352o693K2741K7849
$$ 12842 23859 11006 -15282 -27061 -10631 17668 27947 7318 -21034 -27727 -4986 22863
583B2863L742k3573k4929m98K3183K2330O35k0591k0610j117J8723K0038K511
$$ 22863 26605 3032 -21897 -22395 788 23118 23753 3162 -17448 -18565 158 20196 22707
596B2707j7492k0706l778J6293K0497L888j6136k0205n192J5213K0382M025j5795
$$ 22707 5215 -15491 -19269 -2976 17521 21409 5273 -14932 -20124 -4911 15471 19496 3701
609C701j8575k364J5123J6202J760j3026j3251n06J0046J0783K697n774q884n764
$$ 3701 -14874 -17238 -2115 14087 15847 2821 -10430 -10936 -890 9893 12590 6816 -2068 -7832
623g832J319R138R932J536j0818j4491l841J2874J7096L692j5615j9907l334J7384
$$ -7832 -6513 2625 12557 14093 3275 -11216 -15057 -2183 14913 18605 2990 -16917 -20251 -2867
637b867K0875J528j9217k0568k96J9773K0741j054k0180j8913J589J9339J8256
$$ -2867 18008 19536 319 -20249 -20545 -772 19969 18915 -1265 -20178 -18589 750 19006
650A9006l39j8802j8762j36J8476J8999J047j9089k0292r36J9378J9898Oj9660
$$ 19006 18667 -135 -18897 -19033 -557 18442 19489 400 -19892 -20828 -1450 18448 18454 -1206
664a206j9191J230J9474J7404j941j7540j5006K748J6662J3494r86j3441j1944
$$ -1206 -20397 -19167 307 17711 15770 -1770 -16776 -14028 2634 16128 15142 1701 -10243
677a0243J010J1957J1390J081q445j0703m089O085J1542P244n510j3486r365M981
$$ -10243 -9233 2724 14114 15195 6750 -3953 -8042 -1957 9585 16829 11319 -2167 -11532 -6551
691f551J3919R379m851j5044j1043M672J4676J0660l550j5223j2154L182J5719
$$ -6551 7368 16747 11896 -3148 -14191 -9519 5157 15817 12267 -2956 -15110 -11928 3791
704C791J2979k713j5282j4811J412J6600J6071j086j7908j7414L46J9014J8278
$$ 3791 16770 14057 -1225 -16036 -14624 1976 18047 16961 -947 -18361 -18015 999 19277
717A9277j517k0538j9103K489K1701J7945m482k2022j6457O650K1715J4206o706
$$ 19277 17760 -2778 -21881 -19392 2309 20254 15772 -6250 -22707 -16057 5658 19864 13158
730A3158j9416j2124O942J8591J1097n221j5368j0363M407J4140J0631k119j2112
$$ 13158 -6258 -18382 -11440 7151 18248 13027 -2341 -12704 -8297 5843 16474 14355 2243
743B243j0649K03J0574J0760J000r558j1076l276Q217J1729L475p838j2956n124
$$ 2243 -8406 -8203 2371 13131 14131 4573 -6503 -9779 -1562 10167 13642 5804 -7152 -12276
757a2276P969J2881N626o581j3539p236O138J4022R683m973j5535j1490M785J7654
$$ -12276 -4307 8574 14200 7619 -5920 -13156 -7018 7004 16687 11714 -3821 -15311 -10526 7128
771G128J2222n411j8435j3018N151J9126J3006o437k0024j3157P168K0146J2133
$$ 7128 19350 13939 -4496 -17514 -12363 6763 19769 13332 -6692 -19849 -12681 7465 19598
784A9598q382k0432j1187R259K0443J0247r087j8848r817R383J8061R881p545
$$ 19598 11216 -9216 -20403 -11144 9299 19546 10459 -8389 -18206 -8823 9238 19119 11574
797A1574j7080r380O994J6459R163o190j5055r255N670J3584Q153m662j2416q467
$$ 11574 -5506 -14886 -7892 8567 17730 11540 -3515 -12770 -7100 6484 14637 9975 -2441 -10908
811a0908L111J1018Q456k146r919r146M33R380J0350J800q913j0804l003Q283
$$ -10908 -7797 3221 11677 9531 -388 -9534 -9101 279 10629 12429 3516 -7288 -10291 -2008
825b008J2657N306p521j4265p091Q276J6007P742r136j7469q470J0231J8057P071
$$ -2008 10649 15955 8434 -5831 -12922 -4646 11361 19103 9967 -7502 -15972 -5741 12316 19387
839A9387j1099j8343p301J1319J8587O590j2266j8462o022J2329J8451O083j2590
$$ 19387 8288 -10055 -17356 -6037 12550 19140 6874 -11588 -17610 -5281 13170 19253 6663
852F663j7777n238J2459J6382N714j0923j5954n353R881J5175N410r164j4981
$$ 6663 -11114 -16352 -3893 12489 18203 7280 -8674 -14027 -4146 11029 16439 7275 -7706
865g706n501Q336J3977N304q268j2732o246O512J2605O363n159j1946p582M249
$$ -7706 -13207 -4871 9106 14410 6142 -6590 -12836 -6324 6281 12644 7485 -4461 -12043 -7794
879g794J1948Q795l007j1607r146K599J1057J0079n75j1341j1054K59J0896J1490
$$ -7794 4154 12949 9942 -1665 -10811 -8212 2845 12924 12349 1008 -10046 -9787 1109 12599
893A2599J240j1809j3245j564J1844J3538J406j3099j4301j656J2776J4367K024
$$ 12599 13839 2030 -11215 -12779 -935 12603 14009 910 -13391 -15047 -2271 12096 14120
906A4120j2743j5523k211J3232J6235K540j3904j5275k001J3659J5679J955j3733
$$ 14120 1377 -14146 -16357 -3125 13110 15650 1746 -13529 -15530 -1871 13808 15763 2030
919B030j4580j435J2960J4262J368j2980j4192j039J2400J2846J404j1699j2829
$$ 2030 -12550 -13985 -1025 13237 14605 1625 -12567 -13606 -1206 11640 13044 1345 -11484
932a1484j706J0492J2273K081q738j1536l401Q491J1070M678o854j0690n079N757
$$ -11484 -13190 -2698 9575 11656 2918 -8618 -12019 -3528 7542 12220 5366 -5324 -10403 -4646
946d646J1634O088m952j1799o667L796J1408P910l682j2520r013L245J2611R379
$$ -4646 6988 13076 8124 -3675 -10342 -6546 4862 12772 9090 -3430 -12443 -9198 3413 12792
960A2792l165j3837j0599L810J3495J0472k672j3617j1444K522J4354J1785j958
$$ 12792 9627 -4210 -14809 -10999 2496 12968 10296 -3321 -14765 -12243 2111 13896 11938
973A1938j4042j2238K566J4324J2243k344j4905j1705K753J4219J1413k746j4072
$$ 11938 -2104 -14342 -11776 2548 14791 12447 -2458 -14163 -11410 2809 14222 11476 -2596
986b596j1902K847J3487J1513k577j4187j1327K625J3424J0639j853j2107j0593
$$ -2596 -14498 -11651 1836 13349 10772 -3415 -14742 -12117 1307 11946 10093 -2014 -12607
999a2607J796J1577R965m45j0324r539M04R342R479N20q136r735j732P617R335
$$ -12607 -10811 766 10731 10286 -38 -9577 -9173 169 9648 10168 2032 -7703 -9435 -1818 7517
1014G517K636o823j0427m007O071J0457N282n620j1809o356N330J2949P222n439
$$ 7517 10153 3330 -7097 -11104 -5033 5424 10706 5086 -6723 -13079 -7749 5200 12422 6983
1028F983j3252p744O057J3994Q607o293j4123q344O426J4783Q559o540j5533q197
$$ 6983 -6269 -14013 -7956 6038 14645 8352 -5771 -14115 -7689 7094 15653 9113 -6420 -14617
1042a4617O993J4926P386o668j5134p500O603J4332P581p046j4004p020O612J3427
$$ -14617 -7624 7302 14688 8020 -7114 -14614 -8011 6321 13902 6856 -7148 -14168 -7556 5871
1056E871O904o137j2054o716N230J2168O640m584j0570o877L990J0001P203k756
$$ 5871 12775 6638 -5416 -12132 -6902 5266 11906 7322 -3248 -10125 -6135 3866 11069 8313
1070H313j0085p502K144Q780P824j535q747q117o43Q719Q963N64p862r622j601
$$ 8313 -1772 -9274 -7130 1650 9474 7939 -808 -8925 -9568 -849 8114 8678 816 -8806 -10407
1085a0407P920J0478K706q515j0604k554Q111J2031L349q237j1888m007Q902J2761
$$ -10407 -2487 7991 10697 2182 -8422 -10976 -2865 9166 12515 4278 -7610 -11617 -2715 10046
1099A0046M382r352j3260m249R232J3245M042r616j3371m367R950J3493K971r318
$$ 10046 14428 5076 -8184 -12433 -3201 10044 14086 4470 -8901 -13268 -3318 10175 13146 3828
1113C828j2644l471Q995J2733L188q848j1761k930Q613J1587K950q110j0427l078
$$ 3828 -8816 -12287 -3292 9441 12629 3781 -7980 -10910 -2297 9290 12240 4130 -6297 -9375
1127i375O961J0151L232o143j0075m100N231R049M014m309q800n350L135Q580
$$ -9375 -2414 7737 10969 4826 -5249 -9349 -4118 4931 8945 4636 -4164 -9514 -6379 2201
1141B201N984k320q721o941J698Q947P915r37r617p924Q19R792R057p61r550r144
$$ 2201 8185 5865 -2856 -9797 -8099 848 8763 7826 -1791 -9715 -8896 896 9953 9192 -358 -9502
1157i502M71R940J0067r82j0231j0441L89J0410R980k14j0403j0543K84J0269
$$ -9502 -9031 909 10976 9994 -237 -10678 -10289 121 10101 9887 -516 -11059 -10775 -506
1171e06R990O8j0021r890l45J0021J0244P01j0027r952l66J0069J0063M04r844
$$ -506 9484 9552 -469 -10359 -10704 -683 9561 10262 235 -9717 -10083 -14 10049 10453 609
1186F09r817n7Q968R443L04q982r125q20Q013Q493J184p732q618j377O564Q185
$$ 609 -9208 -9265 -297 9146 9450 468 -8657 -9477 -1464 7029 8213 481 -8137 -9514 -2950 5235
1202E235J871n488q091k658N273P948L383m065p716m522M328Q180N019l313q547
$$ 5235 7106 1618 -6473 -9131 -3858 4090 7473 3408 -4308 -8830 -4502 3678 8697 5384 -3163
1217c163n895L577Q881O096l075r300p197K888J0026O894k354j0505p481K402
$$ -3163 -9058 -5481 3400 9496 6421 -2879 -10076 -7188 2838 9732 7378 -3127 -10608 -8206
1231h206J0654P850k433j0784p750K737J1055Q093k513j0806p991L392J1121P604
$$ -8206 2448 10298 7865 -2919 -10669 -7932 3123 11216 8703 -2103 -10094 -6702 4419 12023
1245A2023l319j0637p142K995J0171O854l431r674o431K221Q707O787k401q054
$$ 12023 8704 -1933 -9075 -6080 4091 10945 7514 -2160 -8591 -6370 2337 9124 6723 -1331
1259a331o572J173P998O408r73p196o304K55O475P219K73o067p040o96N966P036
$$ -1331 -7903 -6730 1268 7676 6703 -493 -6797 -6542 -67 7152 7425 1358 -5682 -6378 -412 6624
1275F624J635n465p341k122M754P416K728m640p677l430L571Q624L835l860q967
$$ 6624 8259 2794 -4547 -6669 -1915 5501 8229 3589 -4088 -7518 -3947 4677 8512 4652 -4315
1290d315m704M259R120N613m235r946n182M821J0542N520m835j0541n267N616
$$ -4315 -9019 -4760 4360 9973 5738 -4208 -9390 -4569 5973 11493 6658 -3883 -9150 -3534
1304c534J0649N134n818j0390m888N323J0309M432o019r580m033N022Q694M040
$$ -3534 7115 12249 6431 -3959 -8847 -3524 6785 11217 5198 -4382 -8415 -3393 5301 9341
1318I341n088q430l862M339P630L788l838p494l543L187O699M046j970o997l981
$$ 9341 4253 -4177 -8039 -3700 3930 7718 3880 -3614 -7157 -3970 2729 6775 4805 -2192 -6173
1333f173J501N853M358p05n708n360l5N211N699L92m980o755j575N377O843J985
$$ -6173 -4672 1181 5539 4834 -874 -6234 -6269 -1058 4641 5033 53 -6702 -8277 -2900 3943 5928
1349E928n844p439k475O082Q553K565o198q827j907O922Q669K614o881q615j696
$$ 5928 84 -7355 -9830 -3748 4805 7370 1172 -7655 -9562 -2640 6029 8643 1762 -6853 -8549
1364h549P024Q605J801o787q734j483O297Q766J152n959q523j997O582P697J764
$$ -8549 -1525 7080 8881 2094 -6640 -8123 -1826 6940 8092 2133 -6390 -8387 -1805 5892 7656
1379G656o035p648j821N587P799K025n929o586j620M763P138K186n033o324j990
$$ 7656 1621 -6027 -7848 -2261 5538 7563 1634 -4952 -6572 -1809 5329 7515 2482 -3842 -5832
1394e832L904N917K277k999n536l497K432N526L128j805n587m041R91N191M989
$$ -5832 -1928 3989 6266 3267 -2269 -5766 -3334 2192 5320 3515 -2072 -6113 -5122 69 5058
1409E058o29n781n544O41N931O307J17o284o352j53P321O661J5o941o789K69P014
$$ 5058 4429 -1352 -6896 -6255 -324 5983 6100 -184 -6536 -6689 632 7293 7308 367 -6422 -6153 861
1426H61O941lp189p089P1P389O730l12p470o972L64P261O858m19o848o639P04
$$ 861 7802 7799 610 -6479 -6408 981 7711 7399 -71 -7043 -6679 582 7440 7021 173 -6466 -5762
1443e762P037N968l22o361n777L82N856O243k40n736n464k25N120N155M38m355
$$ -5762 1275 7243 6921 560 -5217 -4835 1021 7264 7024 1288 -4176 -4401 719 5874 6312 1957
1459A957n516q68L330N440J260l443n707j886L139N156K808l202n408k977K950
$$ 1957 -3559 -4427 -1097 4343 5603 2160 -3547 -5433 -2294 2862 5670 2468 -2940 -5917 -2967
1474b967N124L957k518n771l349J870N865L994j483o008m655J318O294M860j424
$$ -2967 2157 6114 3596 -2175 -5524 -3654 2211 6205 4722 -1286 -5941 -4623 1671 6531 5107
1489E107o633n367J090O710N866j611p398n672J386P524O078j822p899n332K008
$$ 5107 -1526 -6893 -5803 907 6773 5162 -2236 -7908 -6522 1002 7080 5258 -2641 -7973 -5965
1504e965P848N639k176p310m811K413P078M422k296o520m231K178O075L808k135
$$ -5965 1883 7522 5346 -1964 -6775 -4362 2716 7138 4842 -1678 -5909 -3731 2344 6152 4017
1519D017n388l896J225M939L276o21m120m287L70L675M202N21l869l840j048K930
$$ 4017 -1371 -5267 -4042 897 4173 3552 -568 -4855 -4485 -810 3392 3913 44 -3796 -4844 -1914
1535a914M894J394k658m510j810K450N028K647k496n309l134K084N865L278k665
$$ -1914 2980 4374 1716 -2794 -4604 -2154 2874 5521 3025 -2284 -5418 -3334 2531 5809 3144
1550C144o037m012K737O679M105l371o818m189L368P344L890l343p115l746L361
$$ 3144 -2893 -6905 -4168 2511 6616 3245 -3573 -7762 -4394 2950 6840 3497 -3618 -7364 -4003
1565d003P672L481l343o857l613L968O523L458l582o104l520L153N954K935k875
$$ -4003 3669 7150 3807 -3050 -6663 -2695 3828 7286 3704 -2400 -5920 -2767 3187 6122 3247
1580C247o098k751K679N433K647k395n114k378J457M854K703j751l652k560P56
$$ 3247 -2851 -5602 -2923 2510 5157 2762 -2352 -4730 -3273 1581 4284 2533 -1119 -3679 -2923
1595b923L774K764j72l135k956n32K995L822R94k832m391j561K444N083K301l632
$$ -2923 851 3615 3443 308 -2648 -3180 -185 3637 4631 1799 -2592 -4153 -1709 3374 5675 2043
1611B043n393k995L796N640K585l745o178k724M443O501K331m414o314k281M997
$$ 2043 -3350 -6345 -2549 3091 5676 1931 -4247 -6971 -2528 3973 6304 1890 -4424 -6705 -1708
1626a708O511J964m633o297j692M568O356J650m600o146j381M109N445J463m283
$$ -1708 4803 6767 2134 -4163 -5855 -1287 5069 6719 2119 -4027 -5408 -1299 4146 5609 1326
1641A326n132j856M360M872P44l176m886j140L182M221J591k542m146j453K224
$$ 1326 -3806 -5662 -1302 3570 4314 1138 -3748 -4888 -1706 2515 4106 1564 -2582 -4035 -1811
1656a811L914K220j463l808k497J371L674K171m19l706l457M89L685L231L57l833
$$ -1811 2103 4323 2860 -948 -3445 -2074 1600 3771 3352 -354 -3811 -3322 363 3594 3951 118
1672A18m276m88L800M554P74m087m523r79M109N032R01m332n276n30M523N601
$$ 118 -4158 -4646 -846 3708 4482 395 -4128 -5107 -998 4034 4935 603 -4673 -5203 -680 4921
1688D921Q32m490n703q08M863N528Q89n462n376q32N107N602L25n439n407l5M935
$$ 4921 5753 1263 -4440 -5248 -385 5143 6032 570 -4806 -5638 -531 5071 5396 -43 -5450 -5485 -550
1705e50M837J23m781m521m7M519L953P85m396l693P8L151L657O66k850l444r82
$$ -550 4287 4410 -371 -4892 -4939 -420 3533 4318 -78 -3771 -3693 -542 3115 3781 931 -2513 -3495
1722c495K309L614J096k001l270j952J659L352J718p67l681k745P04L847K982
$$ -3495 -1186 2428 3524 1523 -1747 -3699 -2040 1312 3030 2263 -1418 -4163 -3459 388 3370
1737C370l85m012l256M34M217L586Jm392l888M82M443M123q3m763m624N84M876
$$ 3370 2985 -1027 -4283 -3849 368 3954 3955 -437 -4325 -3843 600 4723 4640 -123 -4747 -4163 713
1754G13M561m00n068m869L10N086M632l50n447m869O74N400M305o37n305m025
$$ 713 5274 4874 -194 -5063 -4753 333 4965 4615 -832 -5701 -5027 373 4678 4041 -1264 -5289
1770e289R12N402L903q09n270l122J021M293L729q09m199l152K22L929L122r62
$$ -5289 -4377 1025 4928 4119 -1151 -4273 -3252 1041 4770 3961 -238 -3390 -3168 761 3883 2921
1786B921l261k431o6K440K460N71j907k726j068J459K755J662j296l060k053J180
$$ 2921 -340 -2771 -2837 -397 2063 2634 727 -1999 -3067 -1608 1147 2809 1513 -1547 -3600 -2420
1802b420L919K277r48l739k890J235M125L452r85m730m066J293N139L673j359
$$ -2420 1499 3776 2828 -911 -3801 -2566 1559 5011 4026 -704 -4770 -3477 1662 5335 3976
1817C976n624l696J643N347L573j730n720l580J923N785L525k381n475k988K548
$$ 3976 -1648 -5344 -3701 1646 5219 3489 -2231 -5811 -3888 1897 5422 3041 -2434 -5422 -2874
1832b874N244K967k259n132k789K532M862K348j896m520k320J676M073J706j375
$$ -2874 2370 5337 3078 -2054 -4843 -2311 2551 4899 3003 -1517 -3837 -2161 1912 3618 2243
1847B243l524k472J206L274K144p18l013k033M7K781K342M95k588k938o06K364
$$ 2243 -1281 -3753 -2547 727 2871 2153 -860 -2893 -2846 -65 2277 2772 184 -2754 -3360 -996
1863i96L287J057j767l288j409J474M017K091j848m258k524K277M175K616k574
$$ -996 2291 3348 1581 -1707 -3116 -1642 2375 4466 2618 -1640 -4164 -1887 2288 4904 2330
1878B330n031k337K414M914K369k358n286k822L260N230K352k964n256j992K890
$$ 2330 -2701 -5038 -2624 2290 4659 2301 -2985 -5807 -2547 2683 5035 2071 -3185 -5177 -2287
1893b287N553J977l105n435j058K913M904J555l020m689j458K886L945J628l142
$$ -2287 3266 5243 2138 -3297 -4355 -1442 3462 5017 1997 -2692 -4150 -1264 2681 4309 1167
1908A167l953r59K117L370J196j835k921j632J458L166J542r24k757j796M27K738
$$ 1167 -2786 -3745 -1628 1742 2938 1103 -1818 -3450 -1992 1174 2716 1792 -965 -2761 -2334 404
1924D04K507k73k192k861n5K298L331M10k900l058p66K996L117Q98l385l526j037
$$ 404 2911 2638 446 -2415 -2470 -172 3159 3569 669 -2389 -3155 -159 2958 3856 471 -3055 -4092
1941d092K694M566O70l109m272j077L389M320J138l059m947q41L659M768P64l115
$$ -4092 -1398 3168 3838 729 -3543 -4620 -1231 3089 4227 1168 -3779 -4620 -961 3807 4571 1456
1957A456m493j373L575M719J076m010m641o94L779L985O18l429m539m59L487L750
$$ 1456 -3037 -4410 -835 3884 4960 950 -3691 -4385 -606 3379 3997 568 -3971 -4430 -943 2807
1973B807P29l392l406n69L078L231Q51k701l039o64K169L106P66j355k623j672
$$ 2807 3536 144 -3262 -3831 -753 2478 3329 628 -2411 -3075 -906 2200 2966 1611 -1012 -2684
1989b684J474K522J604j010k409j986K63K709J903l05k570k848N22K683L217L6
$$ -2684 -1210 1312 2916 1906 -503 -2489 -2226 483 2386 2081 -489 -3337 -2815 -132 3085 3121
2005C121l159l441m76L048M188M12l236m086k50M253L679M90m553l654j88M339
$$ 3121 -38 -3479 -3955 -907 3281 3693 457 -3629 -3879 374 4053 4543 -10 -3664 -3852 487
2021D87M000l44m335l937K42M464L816r68m360l390N98L944L312m18m068k861
$$ 487 4487 4143 -192 -4129 -3887 577 4393 3425 -935 -4325 -3727 217 3529 3111 -957 -3818
2037c818P97L526K824m2l380l145P92K658K714M4k707k491l10K665K602M1k230
$$ -3818 -3021 505 3329 3287 -93 -3238 -2446 212 2926 2970 263 -2228 -2538 127 2729 2770 540
2054E40k304n95J591K171Q78j152k598j300P94K572J596j82k589k517L87L402
$$ 540 -1764 -2359 -768 1403 2281 1129 -1469 -2769 -1975 597 2193 2011 -578 -3095 -2708 694
2070F94K581j56l132l385N13L866L437r46m146l136N98M325L279j216m467l369
$$ 694 3275 3119 -13 -3398 -2885 981 4418 3472 -674 -3810 -3212 1113 4392 3176 -1291 -4660
2086d660J916L955K989j490m459k757J614M300K539j642m090k428J778L939K507
$$ -4660 -2744 1211 4200 2710 -1749 -4506 -2892 1408 3947 2305 -1785 -4213 -2435 1504 4011
2101D011j588m032j585J424L196K184j555l019j796J039K753J659q25k524j606
$$ 4011 2423 -1609 -3194 -1770 1426 3610 2055 -964 -2760 -1721 1032 2691 1866 -658 -2264
2116b264K63J972J759j70j750j804l78J275K438R12j324k469j360J379L038J620
$$ -2264 -2001 -29 1730 1560 -190 -1994 -2372 -1097 1341 2253 929 -1540 -2900 -1521 1517 3137
2132C137j293l198j759J415L544K291k226l534k183K037L799J840j994m026j593
$$ 3137 1844 -1354 -3113 -1698 1846 4137 1911 -1623 -3806 -1769 2030 3870 1876 -2150 -3743
2147c743J696L800J751j722m145j616K088L682K082j906l738k424K273M204J836
$$ -3743 -2047 1753 3504 1782 -2363 -3979 -1891 1791 3873 1967 -1771 -4195 -1922 2282 4118
2162D118k360l601j752J876M341J317k307l567j385K256L188P98j932k936q94
$$ 4118 1758 -1843 -3595 -1719 2622 3939 1632 -1935 -3320 -1064 2124 2922 990 -1946 -2840
2177b840J669K325R29j025k164j284Q42J819J480j21j823j840Q2K059K337Mj823
$$ -2840 -1171 1154 2083 1058 -1106 -2390 -1548 271 1751 1630 -193 -2033 -1951 108 2445 2449 626
2194F26k461m62K071K466O15k201k590o43J987K667O53k243k686j264K148L213
$$ 626 -1835 -2297 -226 2240 2855 654 -1936 -2579 -592 2075 2728 485 -2201 -3465 -1317 1896
2210A896J029k181l133j067K112L663J251k263m047j138L260L526J088k883m108
$$ 1896 2925 744 -2389 -3456 -1344 2319 3570 1307 -2740 -3878 -618 2908 3996 1113 -2995
2225b995m55L340L421K02k969l230k43K446K895M60k871k103p15K063K251P26
$$ -2995 -3450 -110 3311 3513 544 -2686 -2929 -483 2412 2872 1 -2102 -2817 -754 1497 2223
2241B223j804k191q07J263K636O07q26k542p19J249K359J192j279k153j177Q23
$$ 2223 419 -1772 -2579 -1316 1320 1927 1101 -1441 -2160 -911 1448 2640 1361 -792 -1969 -1146
2257a146K330J142p59j910j568N6J976J458L23k019j848m87J533L138K97j975
$$ -1146 1184 2326 1567 -343 -1911 -1855 121 1579 1902 -117 -1965 -2452 -919 2219 2516 541
2273E41l066r18K513L583P75k660l714l85L318L637l12l462l079L64L444L049
$$ 541 -2525 -3443 -930 2653 3428 768 -2946 -3331 -13 3624 3312 -150 -3229 -2865 579 3628
2289C628r96l058k623L99L246J798j50k730k061K42J922K613q0k438k142l9K073
$$ 3628 2632 -426 -3049 -2650 596 2394 2244 -486 -2547 -2305 -383 2230 2150 -288 -2430 -2469 -396
2306c96K641Pk202k081J79J933K174m8j916j937j9J938J230q8p31j446q46O12
$$ -396 2245 2252 50 -2031 -1852 81 2255 2207 291 -1646 -1665 273 1503 1415 684 -762 -1608 -996
2324i96J338J066J7j850j781J68K023K175j81k124k651O5L340K336m83k959k621
$$ -996 342 1408 1425 -425 -2206 -2038 -15 2160 1979 -145 -2796 -2731 609 2945 2462 -497 -3118
2341c118Q84L207K728j513l009k064R54K883K221j131k875k057M09L082J929o22
$$ -3118 -2234 973 3701 2188 -821 -2885 -1931 952 3173 2042 -833 -2890 -2481 601 2530 1908
2357A908k718k514Q60K974K185n74l279k161J028L159J980j377k697j542J894
$$ 1908 -810 -3324 -2464 510 2695 2121 -1158 -3319 -2291 868 2848 1471 -1226 -2768 -874
2372h74K310J089j466k088n65J169J240N70m39q40j183k70N32J547M30k48k081
$$ -874 1436 2525 1059 -1029 -1594 -425 815 1385 946 106 -1077 -1347 -815 732 1162 914 -1167
2389a167j338J221K231J368r10l004j022J406K623J411j427k914j203J923K739
$$ -1167 -2505 -1284 947 2315 1405 -1599 -2621 -1215 1408 2819 1392 -1522 -2725 -802 1937
2404A937P46j065k613j307J278K184J372j054k342j906J004K445K088j020k937
$$ 1937 2683 1618 -995 -2302 -1024 1160 2532 1478 -864 -2770 -1766 679 2767 1747 -1190
2419a190k233J317L194K183j852l000j847J737L669Q40k044k455p56J885K587
$$ -1190 -3423 -2106 1088 3271 1419 -1581 -3428 -1691 1978 2818 774 -1681 -2437 -552 2035
2434B035L13j913j520p84J250J556O69q97j646l30j03J363R66M92j641j887O4
$$ 2035 2348 435 -1085 -1869 -619 937 1606 709 -937 -1267 -1370 -7 959 1451 -190 -2077 -2013
2451b013J786J755L04j884j876J48K106J586N9j655j554J2R90J702N06r60j843
$$ -2013 -227 1528 1832 -52 -1928 -1780 326 1912 1971 316 -1238 -1226 -236 1466 1972 1012 -831
2468h31q87O42K104R68o97k489j585J017L049J602j818l028j247K129K919J244
$$ -831 -1718 -1076 1028 1996 1299 -1190 -2775 -1758 1291 2893 1075 -1953 -3200 -1071 1848 3092
2484C092k367l121m13K257L218r0k255k296j91K225J753P6j799j445k66R75J733
$$ 3092 725 -2396 -2809 -552 2666 2576 321 -1975 -2166 59 1812 1888 89 -1356 -1622 -647 1086
2501A086P87j065k146p74J003K028N06o62k245j035J276K224Q75j214j839k83
$$ 1086 1873 808 -1338 -2112 -1109 919 1425 763 -1482 -2517 -1241 983 1858 644 -1195 -1478
2517a478J144J111N79m28j051n99J13P90P49M68p42j362j062Q25K127Q38j048
$$ -1478 -334 777 1356 928 -123 -722 -609 181 930 1398 656 -706 -1768 -943 1184 2022 974
2534I74k362j419J891K800Q35k538k896j78K650K664m1k294k681N30K432J641
$$ 974 -1388 -2807 -916 1884 2719 181 -2715 -2893 -243 2421 2380 86 -2595 -2065 367 2008
2550B008K47k279j698J02J448J899K49j602k060m11J437K289M28j752k441k01
$$ 2008 2255 -24 -1722 -1620 -172 1727 1976 374 -1686 -2097 -660 1629 2057 305 -2136 -2337
2566b337J761K307Q1k071j994K53K247J527l62j941o85MJ546O15j37l21r25j30
$$ -2337 -576 1731 1812 -259 -2253 -2000 247 1774 1412 -529 -1214 -1210 336 951 814 493 -432 -562
2584e62L39L00R44K59q42j758m40J499J918j51j704k237L23K057K344m83k783
$$ -562 -223 77 1021 1280 438 -1320 -1760 -261 1657 1506 -198 -2435 -2112 -55 2289 1806 -977
2601i77j364O57K455J273l19k227j332P05K144Q74l76j584j476J13J563J705K91
$$ -977 -2341 -1684 771 2044 1725 -502 -1834 -1129 1015 1889 1513 -71 -1547 -1434 129 1834 2125
2618B125j840k325j89K166K341o19k159k441Q72K259J922q48k633j108R81K050
$$ 2125 285 -2040 -2229 -63 2278 1659 -500 -2941 -2069 190 2112 1264 -1369 -2477 -1496 554
2634E54J285j075j662n66P97Q32Q79n77p78k59k26K34J217N46n07j448j237J087
$$ 554 1839 764 -898 -1464 -667 165 1044 467 -311 -570 -796 -562 655 1201 694 -754 -1991 -904
2652i04J299J150q47k327q11J498K062N43j245j567n33R35J549N96m05j308p81
$$ -904 395 1545 698 -1629 -2440 -942 1120 1663 418 -1149 -1682 -747 802 1398 993 -315 -1096
2669a096K88J362J287k96j479j594J41J714K069m01k651j909R22K480J410r99
$$ -1096 -808 554 1841 1545 66 -1528 -1387 327 2396 1995 -656 -2565 -1643 837 2247 1248
2685A248k678j396J442K703O94j468k334j66J328J779K69r87j158o22Q22P54R66
$$ 1248 -1430 -2826 -1384 1319 2013 545 -1789 -1955 -627 1152 1421 434 -724 -1346 -524 230 1196
2702A196j39j341q07k85J568R06L15j245j885J8K028J097n05j512j050L26J581
$$ 1196 1057 -284 -1091 -1376 192 1098 1413 168 -1717 -1699 329 1426 921 -591 -1641 -1315 266
2719B66M50j9j119p36P33K24O95N85l94r16q77K90J224J542l98j907j664P15K261
$$ 266 716 697 -422 -1158 -425 -201 494 1079 685 -231 -1108 -818 406 1948 1550 -357 -2021 -1306 955
2738I55J134p06k952r55J397K526N75j637k227l97J820J699P45j515k020p1J465
$$ 955 2089 1383 -1569 -2524 -1127 1399 1974 337 -1890 -2287 -467 1232 1977 462 -1558 -1629 -164
2755a64J330J25o39j770p0M63J704N58m11j774j315R77J740R53j232j672p15J014
$$ -164 1166 1291 652 -1118 -1188 -725 979 1537 1126 -648 -1963 -986 754 1707 475 -1197 -1912 -898
2773h98J602N67r44j320k29O87J160L02p00o25k28J27J94P59O10o59p37j245J049
$$ -898 704 1271 327 -993 -1222 -535 625 927 227 -398 -626 -499 -305 454 1064 405 -332 -1577 -528
2792e28J346J083j337j706r30J741K094R9j784k030K11J502J584j32j531j255
$$ -528 818 1901 564 -1142 -2072 -331 1763 1862 78 -1952 -1741 -239 1345 1213 -318 -1573
2808a573O7J377J480J02j342j181j23J217J464N4q34j474m37J089J358K07r71
$$ -1573 -1506 -129 1351 1453 111 -1070 -1193 24 1488 1542 708 -766 -1203 -114 1244 1451 480
2825D80j801l71J407J273N19j382j978K92J407J139J0j445k59k99J162L83k3l15
$$ 480 -1321 -1692 -285 988 1507 125 -1853 -1561 -154 985 995 -450 -709 -1008 154 537 514 199
2843A99p90R2p5P22P36L07j001j222l10J377J488Rj705j263O7J679J374o80j623
$$ 199 -591 -499 -574 148 884 1191 190 -1032 -1342 35 1523 1532 -173 -1436 -1369 310 1684 1004 -619
2862f19j011L58J633Q79o27j304m25J39J097J137j55j130j091j77J413J518l58
$$ -619 -1630 -1272 361 1240 613 -691 -1116 -977 120 1257 1102 -28 -1119 -1296 117 1635 1277
2879A277j122j696J49J579J514J06k048j638Q01J434J318n30j450j310N68J512
$$ 1277 155 -1541 -1392 187 1701 1807 -241 -1879 -1078 356 1674 1144 -306 -1616 -1048 464
2895D64Q50p01q97o25J87Q71L92J17j72j103k51O11J102L55o79q07r52Q55J203
$$ 464 1314 613 -284 -909 -722 149 541 658 486 -617 -868 -257 845 1200 521 -286 -1238 -383 820
2914H20P51r69j218q64Q88J510L73j115r32m97P92P57K87k84n62q16L5J127J276
$$ 820 1571 602 -616 -1480 -592 918 1291 176 -756 -1253 -461 296 583 299 -263 -1079 -1044 83 1359
2933A359l96j013j412K38J903J137o85j382j325L54J963J346r51k001j109J204
$$ 1359 963 -50 -1462 -1224 679 1816 1131 -251 -1576 -1222 741 2087 1136 -865 -1974 -770
2949g70J718N44j026j308p06J271M46Q86o08q53m70pJ404N02j58o35j105%J053
$$ -770 948 1492 466 -842 -1548 -277 169 1055 447 -406 -876 -883 521 1023 865 230 -875 -875 178
2968A78J254k25j385q02J29J020J184n56r88o00kR25M29K81j042k22l29M86O64
$$ 178 1432 1207 -178 -980 -851 169 1353 797 -191 -791 -793 132 561 842 -200 -422 -751 -265 399
2987C99K83j55q82q47N24J032Q86k27j322r94K86K081O83j043j895n57R85J693
$$ 399 682 527 -355 -1202 -678 354 1240 1013 -309 -1303 -1017 1064 1747 704 -1191 -1748 -763 930
3005I30M42p33j582p34J065J090P23j152r70n26P48J403K39m64j146o98O31J024
$$ 930 1372 639 -943 -1677 -612 478 1201 49 -921 -1447 -699 704 943 479 -667 -1365 -734 290
3023B90J148o59j557k45K94J638M44q81r87o78O21J205M11o70j153l76P21O24
$$ 290 1438 779 -778 -1023 -729 909 1353 472 -515 -1193 -572 633 1044 374 -779 -1155 -434 190
3041A90J56r1o93p4l17N18N94M53k61j180k88N38J555L12r18j228n41J079J500
$$ 190 346 255 -438 -512 -829 -311 283 736 475 -705 -993 -455 1100 1412 494 -734 -1275 -196 1304
3060A304K96j350j288k43J156J271Q2j356r52mQ69J190r4q56j028k85R99R68N97
$$ 1304 1600 250 -1038 -1281 -125 1146 1228 -128 -1080 -1084 -215 975 881 25 -1003 -1288 -289 679 1276
3079A276j063p55r02Q86J653M20j379j276lJ008J028K01q55j413J8J464N65J67
$$ 1276 213 -542 -1444 -558 1095 1515 136 -1140 -1143 -135 893 1094 239 -1174 -1156 308 873 1040
3097A040q66q63K27K19M75k6K08p51j38j71P92O47q6j113m92J11J244N76O0j361
$$ 1040 174 -689 -462 -243 232 206 414 -337 -475 -646 146 793 707 -406 -898 -787 457 1033 1093 -268
3117b68m37K32Q54R41p17o24p98K0Q88J034m20r49n19k77J154N58J85j082j098
$$ -268 -705 -473 381 1322 605 -19 -817 -797 91 1125 705 -244 -763 -1040 114 672 857 -225 -1323
3136a323p2J406P52j0p94j066P5J437Q69j6j129j289M17J170O26j32j203r19M19
$$ -1323 -1395 11 763 753 -41 -1107 -1032 405 1274 1258 129 -1160 -743 427 1053 921 -282 -1201 -782
3155g82J044Q50o58l82r60J79P15N38N9p66o95k48P93J031K14p08p47m9M30J143
$$ -782 262 1112 454 72 -888 -709 6 544 603 -163 -858 -1106 -313 718 932 224 -523 -572 -142 1001
3175A001p9p97q70j08M42J002M05q34o38m15M03R96N17m19j013o32L19Q58O30
$$ 1001 922 125 -745 -853 -411 591 996 162 -476 -891 -488 508 1025 606 -407 -1039 -720 138 768
3194G68o9j090p87K84J148R62k39j366o05O1J537Q38n67j411n63M21J162O62n96
$$ 768 699 -391 -1178 -894 254 1216 977 -389 -994 -933 604 1442 875 -536 -1099 -678 484 1146 550
3213E50r81o03O89N75O15m46p66o50L30R97M65k90p53m77j45J142N57n3r12q52
$$ 550 -431 -1034 -345 230 845 399 -367 -1017 -687 310 775 485 -268 -745 -890 252 809 756 -156 -1008
3233a008N74P87O53j67p00q03K1Q13M81j39o16n41K5L22O19L99m35p13m78O13
$$ -1008 -434 353 1006 839 139 -664 -643 170 651 512 -104 -645 -620 -298 321 720 285 -428 -906 -293
3253b93N53O54l79j070l42L68J088K73m48r68o74O00J147O96p11j057l92Q64O40
$$ -293 260 914 535 -535 -877 -509 579 852 404 -564 -1238 -638 509 1205 494 -563 -955 -91 549
3272E49O81r80r92k89M71Q99M29m26j160P4K99Q66J41k27r12j34L83J132J14l89
$$ 549 1230 250 -742 -1031 -560 339 768 342 -818 -744 -445 421 562 335 -577 -711 -328 804 918 529
3292E29q50l94M76P32M54m54r46k42L53N91L55k33m22m18k17N08N53K65k99j076
$$ 529 -321 -715 -239 493 947 493 -453 -695 -342 249 604 371 -51 -469 -686 -178 375 640 341 -735
3312g35o4Q48L41nj98r68k9R45P70j12n09o69m91L31J115J92p49p73K37O33M66
$$ -735 -799 49 390 385 187 -781 -810 135 905 793 284 -385 -876 -545 570 762 13 -760 -523 110 576
3333E76K67r08q26j37P15Q46O82j266p59r3P82P67J70j101m69m9Q65J137m95n99
$$ 576 843 -65 -891 -1028 -313 533 1215 -51 -810 -903 -121 646 816 -285 -754 -803 62 1199 704 105
3353A05o93k74Q38P89Q5o27o81j20N96K13N30k99o85l33K42N35L08k07o80l63
$$ 105 -588 -862 -24 765 850 223 -458 -578 18 231 761 462 -223 -556 -314 221 529 322 -358 -721
3373g21j28Q19P29M6q15n98K72M49Q59m03o96m94L43O77N18j21r33m23P3M55N26
$$ -721 -849 -30 699 745 -70 -668 -396 53 912 509 -187 -681 -338 339 857 736 -197 -620 -547 -92 434
3394D34K62p83o16O5M30P31J68j098n39J97O93O70k26p47l98qQ51O56l7m77r26
$$ 434 696 -87 -703 -638 -208 523 691 -407 -946 -749 -56 614 388 -359 -757 -765 86 742 705 228 -698
3415f98K19N62Q14l95l62q61J51M33N70J86n78o39l69M84N65L89l43n74m11N63
$$ -698 -479 83 897 502 140 -721 -570 -137 433 619 41 -598 -967 -483 82 471 128 -446 -857 -294
3435b94Q31j63m60k46m28O50M16M80m57m53m12K31Q39J71k60l85j039L77J079
$$ -294 537 374 -86 -332 -760 -110 306 786 329 -124 -536 -305 534 705 445 60 -979 -602 477
3454D77J41k53n71q85K45J116K38p6r52k70L35O85N25j64r25n45N38N93L20J77
$$ 477 618 365 -206 -1091 -846 270 508 432 -520 -790 -455 230 755 591 -334 -879 -341 252 572 749
3474G49r03n15K11M45N23N4j042l35M3O66P28l02m56o09r6J011K18n1n11l30j78
$$ 749 -154 -669 -458 -13 510 564 -478 -813 -770 -104 624 322 -134 -743 -839 172 390 339 -172 -502 -680
3495f80M23J168j55o62p77L91K77O70q5m02o71K24P7N48K12l36n23o31M43J072
$$ -680 -257 911 756 94 -683 -292 -15 655 570 168 -503 -279 -202 346 558 222 -301 -932 -489 583
3515E83L9l68q33k16N76N00M07l52q06j46N34M33M95m44o91l49N61O38J92k80
$$ 583 622 254 -579 -795 -219 281 688 336 -470 -616 -82 351 846 402 -289 -638 -77 561 753 473
3535D73q73Q2J35N78L43n77q58n59Q38N55M61k91p09m60Q9O35P26k68q50j97O20
$$ 473 -400 -318 -183 395 738 161 -697 -1256 -418 137 598 307 -402 -862 -773 -138 588 320 -530 -727 -107
3556a07L19L30j50n24n27L54O33M84l86l92l87K4N94J3K7j15q38K69M86K48L26
$$ -107 212 542 392 -132 -659 -305 328 812 426 34 -353 -329 265 278 305 190 -648 -379 107 355 681
3577F81j022k1l48O76M75L18o11n68J11L05P20J20q74l96m9N94N46r2m15n57k
$$ 681 -341 -362 -710 -34 441 759 148 -420 -309 -4 716 836 -38 -434 -483 111 657 565 150 -407 -409
3598d09K86P62l11l97l02k07J63R26j7m80n45j31O46K51L62p16n20o8M50P23J70
$$ -409 -123 639 328 -69 -371 -578 -415 511 494 14 -531 -662 -16 235 597 -119 -639 -707 -257 466 636
3619F36k70q46K75n6O83L11k10o55k53J8L47N94k82n26k98P4N71M52k22m11o09
$$ 636 366 -480 -205 -261 422 733 523 -132 -385 -367 -20 574 292 -234 -532 -458 113 565 343 -68 -677
3640f77j97J010M35k75m45l92K43N01M48k32o57k83J70N98K69K21p22m49j44O23
$$ -677 -874 136 571 296 -149 -541 -298 203 651 419 -238 -521 -351 247 516 737 15 -434 -578 45
3660D5M25l4n57m29M7L96P47j5j093q4P5P52N18K0q17m69o0M59O32lk64p30K8
$$ 45 470 436 -121 -550 -503 -107 640 625 -468 -552 -477 275 793 813 -4 -473 -533 -74 558 555 291 -439 -411
3683d11P05L91j93l32p70K22m0R22J71q51q5n0J08L08J75j24q70N8O28O67l47
$$ -411 294 685 492 160 -610 -388 -428 494 665 -186 -271 -321 -213 95 270 146 -724 -666 -38 629 282
3704B82n7l73j10o1M90N70k94n32o50O93K36N49k99n15o41K62N64N67m83o80j36
$$ 282 225 -148 -258 -319 171 741 447 -85 -735 -42 194 743 444 -71 -712 -450 114 681 198 -482 -618
3725f18L82J46Q05n90m07m12L09M94Q65n73n19j39k96Q57M89j27p15m85j19Q28
$$ -618 -236 -90 715 125 -282 -694 -385 109 974 401 -118 -257 -553 304 793 666 -49 -534 -653 175
3745A75K53P3o79l88K77N82j21j41k91l59J61L09M95l7j49q92K84L41K29K97l57
$$ 175 428 501 -178 -566 -289 293 172 31 -260 -619 -458 -149 346 309 160 -732 -448 -107 122 419 62
3766F2j09j95l3O65m5J40r71K34o5P24r8k02o30k90N25L46O75p07n77k41M96M24
$$ 62 -47 -242 -275 390 345 485 -486 -252 -317 407 309 107 -523 -813 -288 58 733 26 -551 -792 -296 128
3788A28K18K0p46k88O88K48K34l43m19l27N39O27K1k92q71o0M54M30N3J38q27
$$ 128 346 366 -380 -668 20 268 502 159 -260 -587 -48 579 600 308 -563 -623 -169 261 314 452 -375
3809c75k12L29K42K56k62n83J3M14L12L97k73k13o02k7P72P1J21l82n35K39M87
$$ -375 -587 -258 -16 240 -22 -605 -592 -178 134 531 258 45 -557 -584 188 259 380 -2 -537 -298 189
3830A89M75k12l32l84j32M76K92M17p52o62M34%O10J06p40m47j01Q55M79j91m27
$$ 189 664 452 120 -264 -396 80 372 789 37 -625 -191 -191 419 525 -215 -662 -763 92 571 380 -47
3851d7n71j47O25Q07J91p37o76L42L24K59r9q8n87O3N24J49K82n99l45J98l3O66
$$ -47 -618 -765 -140 667 858 121 -555 -213 111 370 271 183 -404 -341 183 332 614 15 -330 -132 -165 501
3873E01k05m95k6l61J52N52K29k02m19j33K00L26J32k88k72J49k84N30K90j06
$$ 501 296 -199 -225 -586 -434 118 347 145 -274 -407 -207 119 251 -37 -309 -160 -444 86 376 270
3893B70j85l73J18N29J52m07q60L21o2N67J52N7m76m90N30K75L02m6l78m81j62
$$ 270 85 -288 -170 359 511 104 -756 -435 -497 70 222 279 -197 -687 -157 118 420 374 -4 -485 -647
3914f47P65N16k61j52o03K11K82P14m2n22o78J60M66L54l69k49k46j12P63L64
$$ -647 118 634 373 221 -382 -171 111 825 783 261 -417 -257 209 563 194 -55 -301 -413 350 714
3934G14l67n24N7l28P91L16j93n42j28L5N7M15j6N2n48N9R4J56R4J97m35l03J92
$$ 714 347 -177 -120 -448 343 659 466 -76 -204 -169 -112 303 287 339 -209 -150 -56 100 194 391 -44 -347 -155
3957a55K05L00j26o38l6L09K7L53M5k60k71k77Q06j8K46p61j94J82P10L54n99
$$ -155 50 350 224 -414 -450 -141 -114 239 284 24 -247 -524 282 264 510 -251 -445 -263 447 801 202
3978B02k70n3j85L10O03m70k04l59k5R54r7j95q31J12j63O35N92m83m40m5NP68
$$ 202 -68 -121 -306 4 607 137 -67 -426 -451 503 406 211 -620 -508 -671 -36 556 73 -367 -412 -407 361
4000C61K91k55m76l63M47J15L06k98j8n70L81O26l54R9m92j96k44P74J50k39k8
$$ 361 652 397 -79 -442 5 120 426 128 110 -460 -79 547 193 292 -200 -396 -640 134 284 45 17
4021A7l36m2L59J30N2j56k63k9J25M92O9j13p94P9L77M98k24k2k96n09O25L07
$$ 17 -319 -361 -2 128 180 24 -239 -268 -143 349 418 305 -489 -410 -33 465 241 219 -77 -586 39 346
4043C46L29o26l17k32L39O55j02j85o47k85L52N22K43k82n26Q1l0P18J22n34j54
$$ 346 675 49 -268 -500 -161 494 392 207 -440 -725 -373 149 392 110 -416 -335 -365 353 475 -59 -213
4064b13Rj2M17K87n6m52m21N49q4P24n14k43l48K67L58R9m3l76l57J97P9M93l04
$$ -213 -204 -216 201 488 432 -20 -441 108 24 748 234 -9 -357 -90 268 367 324 -52 -409 -212 -133 360 56
4087E6j02j35j79L01L23K95k47n28O4J35K41L73n34m71l2L13M74j9k17n82L10
$$ 56 -46 -181 -360 -59 264 559 312 -216 -152 -17 224 597 63 -408 -440 -127 347 328 111 -471 -161
4108a61J27K25M4k29n05l21N55P46K9m40n15J97Q8N26K09o58l66J34L58M76L7
$$ -161 -34 191 235 6 -499 -820 -265 481 510 70 -445 -248 -160 366 575 -83 -449 -315 43 519 556
4129E56k58n79j6K39K98J83j90o30j28L91L48J90l87j31k93L74K22Q9k02l09P7
$$ 556 298 -281 -297 -58 240 423 233 -397 -525 -134 214 404 17 -114 -407 -33 189 278 76 -233 -156
4150a56l88N64M25j25n50o1M3L72Q9p5q9k45J63L9N47k69k85n45L17L08M50j66
$$ -156 -544 20 445 320 -230 -291 -248 124 213 138 49 -196 -33 6 553 284 -1 -546 -229 79 529 363
4172C63m39l81R8M53K76j5k09n06j20O18L51j69n39m2J11K45L79J65o87m22J51
$$ 363 -76 -457 -359 94 370 355 146 -360 -480 138 489 320 -219 -261 -150 95 474 639 -48 -470 -319
4193c19M77J25k60q3k90J2M87k35K08k74m34K73M11R4O2l01l70K17J54M24k6l47
$$ -319 158 283 23 -60 -350 -338 149 -86 122 -152 -586 -313 98 192 254 -47 -417 -200 -46 378 352 5
4215EJ53k86q3O75q3k37j90l06K92J47M1J91o92k88M51M95K03k08p50r8O2N97
$$ 5 158 -128 -211 464 381 144 -46 -352 -60 87 128 319 -373 -661 -210 285 488 280 -470 -568 -506 91
4237I1k45K48k74p9J52pJ87O2l98k23J92L74M19j97n95j33L99j24N43n8o41l74
$$ 91 -154 94 -180 -259 -107 -114 73 135 -263 -486 -294 80 499 302 -293 -426 -27 -151 392 334 -307 -681
4259f81M54K69L08k43j60l54J10L01K44n04r7N2K47L13j70Qk36j45k1N97n54J81
$$ -681 -227 42 350 107 -53 -407 -297 4 248 -256 -353 -301 -54 259 89 97 -139 -284 -305 292 -262 -81
4281h1L32l17N7J85J15J38l96j22l29J97K02L96o26J73m47L78L74M5k22r6j97
$$ -81 251 -66 -9 176 291 429 33 -89 -418 -221 -19 377 -249 -76 -523 -145 229 274 52 -44 -241
4302b41l0K25M73j68o91K78KK26L28m0n98j01L23N17q1k75l90l08O84J9L82n21
$$ -241 -271 -46 427 259 -432 -154 -152 74 402 362 -236 -337 -14 503 422 147 -243 -551 133 152 534 13
4324A3j18o18O68L05O2J34q10j59J26O19l49L73n17J65J13L20o6m56N4J68k8k1
$$ 13 -105 -723 -55 250 312 446 -364 -523 -397 222 -127 246 -271 -106 7 327 261 -195 -141 27 -1 -22
4346b2J59Q6m40j22j4K21P6L42P8n98k5N70l21M3n8l09R5K34M17k94K30n99j06
$$ -22 137 223 -217 -339 -353 -132 -56 286 364 -234 -259 311 -10 33 -25 -334 -239 -5 412 118 348 -251 -357
4369c57K94L97k2l64j71k3M59J61p6j9p10k60O96K27K25m46k70r5L93K45M09o12
$$ -357 -63 334 312 -52 -223 -246 213 374 298 279 -431 -691 5 232 457 11 -259 -354 39 284 693 81
4391H1n66K58L43PJ20k73l15K55K48J1K10n17j41P7j35M96l3j06m48J04OM65M72
$$ 81 -485 -227 116 123 243 -30 -345 -90 158 169 379 -138 -279 -202 -337 159 126 20 -428 -324 -318 147 619
4414F19l28m64q3J18L38m8o0J0j44o7l2L77N3r1m33k3N57q9O3m99j56j47O64J17
$$ 619 291 -173 -256 -138 200 152 92 102 -42 -109 -141 236 289 198 -235 -258 299 210 273 -226 -382 -529 135 252
4438B52R3o01j78J02N50J49j07m90j08n9M20K33j42K7n52R6J77N61M1n74n9L6
$$ 252 345 -256 -434 -332 218 367 260 -230 -338 -397 23 256 114 141 -411 -315 -138 423 464 -110 -169 -133
4460a33L12Lk4j21l68J84K00L0J17j90r5j70N14L7j95k03j70J60J97K09j87k76
$$ -133 179 182 158 37 -331 -147 53 83 200 10 -85 -255 259 296 101 -102 -272 -112 85 294 107 -169
4482a69L34m09L91J13L2j56k77j2k25K27K87p4j73j66k75Q79J85m56Q1m21n1K52
$$ -169 165 -244 147 260 292 136 -141 -153 -378 -151 136 62 -111 -277 -552 327 512 56 137 -284 -335 -83
4504h3N29j32m74r8k5N63jj45k97j59L24J61K29k85j48l07J35J12L07j84l90K31
$$ -83 446 314 -160 -258 -283 280 279 134 -163 -322 2 163 392 107 -41 -348 -213 -101 206 22 -368 -137
4526a37l50L12M46j88j99J48n50O17k27J1nNO8l2K52j12k77K77K1k09L31L6q7
$$ -137 -487 -175 271 83 -116 32 -518 99 -128 -117 -122 -117 -49 -81 171 59 -218 59 80 -129 202 238 151
4549A51l33M4K07j03L66k75k57l14L03K55M72m94k09n0L02P0p8nl75K98O0j32
$$ 151 -182 -138 69 -34 332 57 -200 -514 -211 44 516 22 -187 -237 65 135 57 52 -323 -25 35 -97
4571i7N48k12k73k98M27ML87m48r9k12K50J38P5k21p6j53K11PR0M41l96p72O18
$$ -97 451 239 -34 -332 95 99 486 38 -61 -273 -23 115 190 -31 -107 -260 -49 -42 48 489 93 -679 -61
4594f1K34Jp0l07O0r6N86j35j86j02q5J67J12L93l59j44n7K3J77J51o0n93j97
$$ -61 173 174 104 -203 -143 -239 347 212 26 -76 -161 6 118 511 152 8 -49 -26 151 302 242 -351 -548
4617e48L12n2L69J20k80j22J55oQ8K24l01j17q1l1N54j06Q5j99l87L76J39J06
$$ -548 -236 -288 81 201 -79 -201 -46 -52 36 260 -41 -158 -239 -270 284 178 263 64 -323 53 192 298
4639B98k6l88j38o3O02r3j60m49J06J9L27K90k37l12n4J99K61l6r8m55K36K80
$$ 298 272 -116 -254 -317 285 192 32 -417 -311 -292 35 325 88 -224 -278 -79 182 146 48 -407 -171 109
4661A09L84m04n4j78j76M69K25k01k61Q3m51M98l30K74n3k2j3lR2J86k39N8m27
$$ 109 493 89 35 -143 -319 150 375 174 -87 -4 -455 43 -287 -13 -66 -88 -101 -104 -12 174 -65 -7 -434
4684d34L84R2J05L94m57m48K78M37p7k49L04o02K55j53O55k78q4n46J60K76J36
$$ -434 -50 42 147 541 84 -364 -86 351 274 25 329 -273 -18 -171 484 206 122 -424 -264 12 148
4705A48N7j82m63j3N92N2n8p1j22r7K93J80j95k73r5QJ41L9K10k72mj12K51L60
$$ 148 205 23 -440 -453 139 191 133 62 -60 -157 136 316 121 -152 -247 -239 -98 -59 151 -121 -125 -237 14 374
4729C74m14j00j17L13P4Q0j71o1l79J35K66k16M37l81j79L26Ml9K0J32P8k66K3
$$ 374 -40 -140 -257 56 130 210 39 -22 -401 -266 0 -216 221 -160 -339 -13 -9 -48 -28 104 182 -84 -61
4752f1J33J11P6n73J23O2K46j21K17k51m7n6M61j13r6On22J64M61K5p3p8l78N6
$$ -61 72 183 259 -314 -191 -129 117 -4 213 -38 -85 -141 320 207 111 117 -405 -241 220 245 172 94 -284 -228
4776b28J22L08J11l05j86k97M92K86o2l03j07L70JJ08l17J9o88L24Pq0M34j83
$$ -228 -106 202 313 8 -178 -475 17 303 241 -62 -169 201 202 310 -7 12 -676 -352 -345 -425 9 -174
4798a74M7M0K88j03K49k65p3O0K45mj22p2r2j74l65L50P11n98L13l11r0J3J98
$$ -174 -127 -87 201 98 347 82 9 69 314 310 188 116 24 -150 -515 -165 546 -52 261 -50 -140 -127 71
4821G1j61p7P9R6N9K7l68K63m03L54K80J61j79n63R5Q0K21J67r3l75jL66M11k38
$$ 71 -90 -167 -88 8 67 94 -274 -11 -414 -60 220 381 202 -361 -266 -186 35 202 109 -266 -267 99 510 272
4845B72r2o85M46j94K93K60j32j40j89P7P1K55m74K23j3jK54M8l16j69l8J84N4
$$ 272 180 -505 -59 -253 40 300 168 28 -161 -84 -13 242 -232 -9 -22 -23 231 279 -37 -206 -244 -60 -6
4868fq0L05l47k75L57r8M42j01j91m52K06j03L84L4K79o22l09N36J76J86j76k42
$$ -6 -86 219 -128 -403 -46 -144 298 197 6 -446 -240 -343 41 75 354 -268 -577 -41 135 321 145 -97
4890i7l50M29K20j38J07r0j46l32L55O39l42k87l13N01K09q5n8m61j47L83L8K12
$$ -97 -447 -18 202 64 171 81 -65 -397 -42 597 255 -32 -345 156 365 280 222 -239 -386 -3 35 247
4912B47J5m14L42k42O7L7J8n59L38M27j82kJ9l18K64L2MK81k64k92J58L70l22
$$ 247 262 -152 190 -52 15 52 70 -489 -151 276 94 92 111 -207 57 89 93 374 110 -182 -24 346 24
4935B4J34k00m47L17J47L6L6q0j43l2J70L56k48j37P5j33J20K6K42O5l37j23Q1
$$ 24 158 -42 -489 -172 -25 11 47 -33 -176 -208 -38 318 70 -67 8 -125 -5 21 263 328 -9 -132 -51
4958e1j06m2L83l06j77J39K60J61o7r8q5j26j3J61j47K03l62l40N34J71Q2q5k52
$$ -51 -157 -199 184 -122 -299 -160 100 261 194 96 11 -115 -128 33 -114 89 -273 -613 -79 92 174 89 -163
$$ [...]
8191C9
##END NTUPLES=NMR FID
##END=
