##TITLE=1H_EC-3230(1)
 DMSO-d6, 8 sc, 
 7.7.2020
##JCAMPDX= 6.0         $$ Bruker NMR JCAMP-DX V2.0
##DATA TYPE= NMR FID
##DATA CLASS= NTUPLES
##ORIGIN= UXNMR, Bruker Analytische Messtechnik GmbH
##OWNER= root
$$ XWIN-NMR		Version 3.5
$$ Tue Jul  7 10:33:13 2020 Russian Standard Time (UT+4h)  she@DPX200
##.OBSERVE FREQUENCY= 200.1315
##.OBSERVE NUCLEUS= ^1H
##.DELAY= (6, 6)
##.ACQUISITION MODE= SIMULTANEOUS
##.ACQUISITION SCHEME= undefined
##.AVERAGES= 8
##.DIGITISER RES= 18
##SPECTROMETER/DATA SYSTEM= spect
##.PULSE SEQUENCE= zg30
##.SOLVENT NAME= DMSO
##.SHIFT REFERENCE= (INTERNAL, DMSO, 0, 15.7039)
##AUDIT TRAIL= $$ (NUMBER, WHEN, WHO, WHERE, WHAT)
$$ ##TITLE= Audit trail, XWIN-NMR		Version 3.5
$$ ##JCAMPDX= 5.01
$$ ##ORIGIN= Bruker BioSpin GmbH
$$ ##OWNER= she
$$ F:/spectra/data/she/nmr/H-F/1/audita.txt
$$ ##AUDIT TRAIL=  $$ (NUMBER, WHEN, WHO, WHERE, WHAT)
(   1,<2020-07-07 10:32:07.53 +0400>,<she>,<DPX200>,
      <created by zg, POWCHK disabled, PULCHK disabled
       configuration hash MD5:
       00 E9 B6 7A A2 85 ED C7 34 08 36 98 17 FE 4E 26
       data hash MD5: 16K
       95 AE 2B B0 A3 B9 17 EF 6E 45 6B AE 31 A1 6A AF>)
$$ ##END=
$$ 
$$ hash MD5
$$ BF C7 68 0E F2 17 AF 81 C9 EF 6A 8C 8B DF 13 79
##$RELAX= 
##$RELAX= 
##$RELAX= 
##$RELAX= 
##$RELAX= 
##$RELAX= 
$$ Bruker specific parameters
$$ --------------------------
##$DU= <F:/spectra>
##$EXPNO= 1
##$NAME= <H-F>
##$PROCNO= 1
##$TYPE= <nmr>
##$USER= <she>
##$AMP= (0..31)
100 100 100 100 100 100 100 100 100 100 100 100 100 100 100 100 100 100 
100 100 100 100 100 100 100 100 100 100 100 100 100 100 
##$AQSEQ= 0
##$AQ_mod= 1
##$AUNM= <au_zg>
##$AUTOPOS= <>
##$BF1= 200.13
##$BF2= 200.13
##$BF3= 200.13
##$BF4= 200.13
##$BF5= 200.13
##$BF6= 200.13
##$BF7= 200.13
##$BF8= 200.13
##$BYTORDA= 1
##$CFDGTYP= 0
##$CFRGTYP= 5
##$CHEMSTR= <none>
##$CNST= (0..31)
1 1 145 1 1 1 1 1 1 1 1 1 1 1 1 1 1 1 1 1 1 1 1 1 1 1 1 1 1 1 1 1 
##$CPDPRG= <>
##$CPDPRG1= <>
##$CPDPRG2= <>
##$CPDPRG3= <>
##$CPDPRG4= <mlev>
##$CPDPRG5= <mlev>
##$CPDPRG6= <mlev>
##$CPDPRG7= <mlev>
##$CPDPRG8= <mlev>
##$CPDPRGB= <>
##$CPDPRGT= <>
##$D= (0..31)
0 1.2 0 0 0 0 0 0 0 0.06 0 0.03 0 0 0 0 0.0002 0 0 0 0 0 0 0 0 0 0 0 0 
0 0 0 
##$DATE= 1594103527
##$DBL= (0..7)
120 120 120 120 120 120 120 120 
##$DBP= (0..7)
150 150 150 150 150 150 150 150 
##$DBP07= 0
##$DBPNAM0= <>
##$DBPNAM1= <>
##$DBPNAM2= <>
##$DBPNAM3= <>
##$DBPNAM4= <>
##$DBPNAM5= <>
##$DBPNAM6= <>
##$DBPNAM7= <>
##$DBPOAL= (0..7)
0.5 0.5 0.5 0.5 0.5 0.5 0.5 0.5 
##$DBPOFFS= (0..7)
0 0 0 0 0 0 0 0 
##$DE= 6
##$DECBNUC= <off>
##$DECIM= 24
##$DECNUC= <off>
##$DECSTAT= 4
##$DIGMOD= 1
##$DIGTYP= 9
##$DL= (0..7)
0 120 120 120 120 120 120 120 
##$DP= (0..7)
150 150 150 150 150 150 150 150 
##$DP07= 0
##$DPNAME0= <>
##$DPNAME1= <>
##$DPNAME2= <>
##$DPNAME3= <>
##$DPNAME4= <>
##$DPNAME5= <>
##$DPNAME6= <>
##$DPNAME7= <>
##$DPOAL= (0..7)
0.5 0.5 0.5 0.5 0.5 0.5 0.5 0.5 
##$DPOFFS= (0..7)
0 0 0 0 0 0 0 0 
##$DQDMODE= 0
##$DR= 18
##$DS= 0
##$DSLIST= <SSSSSSSSSSSSSSS>
$$ [...]
##$SUBNAM2= <"">
##$SUBNAM3= <"">
##$SUBNAM4= <"">
##$SUBNAM5= <"">
##$SUBNAM6= <"">
##$SUBNAM7= <"">
##$SUBNAM8= <"">
##$SUBNAM9= <"">
##$SW= 24.9337058887773
##$SWIBOX= (0..15)
0 0 2 0 0 0 0 0 0 0 0 0 0 0 0 0 
##$SW_h= 4990.01996007984
##$TD= 16384
##$TD0= 1
##$TE= 0
##$TE2= 300
##$TE3= 300
##$TEG= 300
##$TL= (0..7)
0 120 120 120 120 120 120 120 
##$TP= (0..7)
150 150 150 150 150 150 150 150 
##$TP07= 0
##$TPNAME0= <>
##$TPNAME1= <>
##$TPNAME2= <>
##$TPNAME3= <>
##$TPNAME4= <>
##$TPNAME5= <>
##$TPNAME6= <>
##$TPNAME7= <>
##$TPOAL= (0..7)
0.5 0.5 0.5 0.5 0.5 0.5 0.5 0.5 
##$TPOFFS= (0..7)
0 0 0 0 0 0 0 0 
##$TUNHIN= 0
##$TUNHOUT= 0
##$TUNXOUT= 0
##$USERA1= <user>
##$USERA2= <user>
##$USERA3= <user>
##$USERA4= <user>
##$USERA5= <user>
##$V9= 5
##$VALIST= <valist>
##$VCLIST= <CCCCCCCCCCCCCCC>
##$VD= 0
##$VDLIST= <DDDDDDDDDDDDDDD>
##$VPLIST= <PPPPPPPPPPPPPPP>
##$VTLIST= <TTTTTTTTTTTTTTT>
##$WBST= 1024
##$WBSW= 4
##$XGAIN= (0..3)
0 0 0 0 
##$XL= 0
##$YL= 0
##$YMAX_a= 357200
##$YMIN_a= -212195
##$ZGOPTNS= <>
##$ZL1= 120
##$ZL2= 120
##$ZL3= 120
##$ZL4= 120
##$ABSF1= 10
##$ABSF2= 0
##$ABSG= 5
##$ABSL= 3
##$ALPHA= 0
##$AQORDER= 0
##$ASSFAC= 0
##$ASSFACI= 0
##$ASSFACX= 0
##$ASSWID= 0
##$AUNMP= <proc_1d>
##$AZFE= 0.1
##$AZFW= 0.1
##$BCFW= 1
##$BC_mod= 2
##$BYTORDP= 1
##$COROFFS= 0
##$CY= 11.3945322036743
##$DATMOD= 1
##$DC= 2
##$DFILT= <>
##$DTYPP= 0
##$F1P= 16.9975609425685
##$F2P= -3.02152046262296
##$FCOR= 0.5
##$FTSIZE= 0
##$FT_mod= 4
##$GAMMA= 1
##$GB= 0.15
##$INTBC= 1
##$INTSCL= 1
##$ISEN= 128
##$LB= 0.24
##$LEV0= 0
##$LPBIN= 0
##$MAXI= 10000
##$MC2= 0
##$MEAN= 0
##$ME_mod= 0
##$MI= 1.114404
##$NCOEF= 0
##$NC_proc= 0
##$NLEV= 6
##$NOISF1= 3.799351
##$NOISF2= 2.8
##$NSP= 1
##$NTH_PI= 0
##$NZP= 0
##$OFFSET= 15.70392
##$PC= 1
##$PHC0= -9793.118
##$PHC1= 11.20086
##$PH_mod= 1
##$PKNL= yes
##$PPARMOD= 0
##$PSCAL= 0
##$PSIGN= 0
##$REVERSE= no
##$SF= 200.130013532006
##$SI= 16384
##$SIGF1= 3
##$SIGF2= 2
##$SINO= 400
##$SIOLD= 16384
##$SREGLST= <1H.CDCl3>
##$SSB= 0
##$STSI= 0
##$STSR= 0
##$SW_p= 3612.71676300578
##$SYMM= 0
##$S_DEV= 0
##$TDeff= 0
##$TDoff= 0
##$TI= <>
##$TILT= no
##$TM1= 0
##$TM2= 0
##$TOPLEV= 0
##$USERP1= <user>
##$USERP2= <user>
##$USERP3= <user>
##$USERP4= <user>
##$USERP5= <user>
##$WDW= 1
##$XDIM= 8192
##$YMAX_p= 0
##$YMIN_p= 0
$$ End of Bruker specific parameters
$$ ---------------------------------
##NTUPLES= NMR FID
##VAR_NAME=  TIME,          FID/REAL,        FID/IMAG
##SYMBOL=    X,             R,               I
##VAR_TYPE=  INDEPENDENT,   DEPENDENT,       DEPENDENT
##VAR_FORM=  AFFN,          ASDF,            ASDF
##VAR_DIM=   8192,          8192,            8192
##UNITS=     SECONDS,       ARBITRARY UNITS, ARBITRARY UNITS
##FACTOR=    0.0002004,     1,               1
##FIRST=     0,             0,               0
##LAST=      1.6414764,     0,               0
##MIN=       0,             -212195,         0
##MAX=       1.6414764,     357200,          0
$$ Real data points
##PAGE= N=1
##DATA TABLE= (X++(R..R)), XYDATA
$$ [...]
$$ plain form
2033 -28 -253 -185 240 245 224 -211 -537 -281 124 342 119 -79 -421 -25 140 24 84 -158 -308 -243 199 69
2055 69 35 -29 -376 -378 -148 215 208 -158 23 -266 18 134 -50 -285 -145 38 -66 163 511 337 103 -159
2077 -159 -158 99 265 71 -206 -427 -318 -132 255 155 -288 -462 -369 158 414 -72 -125 -472 -53 255 298 231
2099 231 -386 -446 -20 289 355 379 -112 -539 -463 472 361 199 7 -129 -250 135 330 -5 -243 105 -171
2120 -171 109 -195 24 -13 -353 -231 63 -28 -37 70 -243 -125 -238 -259 184 -37 -248 -176 -91 229 127 356
2142 356 -400 -27 -217 380 630 200 -118 -173 -138 21 448 227 -362 -331 -255 383 516 417 -444 -307 -160 326
2164 326 439 56 50 -337 -129 -12 124 135 -548 -192 -7 280 91 -39 160 -200 -228 140 231 199 53 -400
2186 -400 -58 125 214 -49 -53 -38 -373 102 246 4 -15 -32 86 254 85 187 138 -30 151 -18 12 83 -64
$$ packed form
2033b8k25O8M25Nk1m35l26K56M05K18k23j98l42L96J65j16O0k42j50O5M42j30
2055F9l4o4l47kK30L63pl66J81k89K84J16j84k35J40J83j04K29L48j74k34k62
2077a59JK57J66j94k77k21J09J86L87j00m43j74R3N27K56m86n3l47M19L08M3o7
2099B31o17o0M26L09O6K4m91m27P6R35j11j62j92j36j21L85J95l35k38L48k76
2120a71K80l04K19l7l40J22K94r1rJ07l13J18j13k1M43k21k11P2Q5L20j02K29
2142C56p56L73j90N97K50m30l18n5L5J59M27k21n89L1P6O38J33r9q61J37J47M86
2164C26J13l83ol87K08J17J36J1o83L56J85K87j89j30J99l60k8L68R1l2j46m53
2186d00L42J83Q9k63mJ5l35M75J44k42j9j7J18J68j69J02m9j68J81j69L0P1j47
$$ plain form
2209 -64 -361 -216 -113 271 -52 216 140 -329 -183 -108 -130 -91 -256 -295 -225 135 296 189 -127 -90 -247 58 -24
2232 -24 317 66 82 -41 97 266 -109 127 -378 102 314 -6 202 -196 -73 -112 220 70 32 -250 -138
2253 -138 87 67 50 -52 -350 76 15 -72 93 -102 70 -317 -40 -479 -103 -260 138 -248 -247 -64 -74 131
2275 131 206 18 40 157 -85 202 210 -86 -464 -102 297 137 -46 -165 -10 115 408 134 -103 -151 -215 401
2297 401 193 -112 -116 120 21 183 355 306 -139 -106 -9 5 83 51 -40 -484 159 -174 -121 -125 -186 -278 -157 -231 -1
2322 -1 133 125 -3 -71 -112 19 313 64 101 -83 -54 -307 327 -254 45 -165 -22 -35 26 -48 346 -221 -123 126
2346 126 528 95 -227 21 -288 182 344 101 -79 -165 -281 -103 167 143 -120 10 -26 -191 91 371 -113
2367 -113 -228 116 -252 133 117 -119 -38 -104 13 -38 -58 -88 60 -245 -17 150 -205 315 -95 -84 99 -50
$$ packed form
2209f4k97J45J03L84l23K68p6m69J46P5k2L9j65l9P0L60J61j07l16L7j57L05q2
2232b4L41k51J6j23J38J69l75K36n05M80K12l20K08l98J23l9L32j50l8k82J12
2253a38K25k0j7j02k98M26o1q7J65j95J72l87K77m39L76j57L98l86JJ83j0K05
2275A31P5j88K2J17k42K87Qk96l78L62L99j60j83j19J55J25K93k74k37m8o4O16
2297D01k08l05mK36r9J62J72m9m45L3R7J4P8l2r1m44O43l33N3mo1r2J21p4K30
2322aJ34qj28o8m1J31K94k49L7j84K9k53O34n81K99k10J43j3O1p4L94n67R8K49
2346A26M02m33l22K48l09M70J62k43j80q6j16J78K70k4k63J30l6j65K82K80m84
2367a13j15L44l68L85j6k36Q1o6J17n1k0l0J48l05K28J67l55N20m10J1J83j49
$$ plain form
2389 -50 106 59 -171 211 34 6 111 -351 -229 -125 -420 -14 171 228 -43 -123 172 138 20 5 -72 -3 -244
2412 -244 -69 241 97 -157 -372 234 132 -100 28 -140 -270 -147 -128 111 243 95 -283 109 394 19
2432 19 23 226 -8 -38 233 29 35 -83 -404 297 129 98 -59 -266 72 69 115 234 -22 22 -283 56 -66 -135
2456 -135 119 -215 -235 -106 -150 110 80 192 332 175 33 75 182 -19 -131 -258 -208 229 52 -81 -519 -147
2478 -147 263 -40 -138 -140 -231 -19 -119 -3 186 -87 -93 -171 96 176 -270 -147 -365 -62 5 88 16 -87 59 -194
2502 -194 -71 -16 130 89 174 19 126 -42 27 -68 125 243 -105 -169 -105 59 25 304 -99 28 90 -130 -150
2525 -150 -154 -35 17 267 -32 298 -77 55 3 269 -26 127 81 -202 -174 -35 51 81 -32 -236 -83 -53 387
2548 387 -92 -151 -195 -250 54 116 64 151 -399 46 -179 47 45 -180 -16 25 135 169 162 -333 -35 112 48 -36 -105
$$ packed form
2389e0J56m7k30L82j77k8J05m62J22J04k95M06J85N7k71q0K95l4j18j5p7O9k41
2412b44J75L10j44k54k15O06j02k32J28j68j30J23J9K39J32j48l78L92K85l75
2432A9MK03k34l0K71k04Oj18l21P01j68l1j57k07L38lM6J19k56M4l05L39j22o9
2456a35K54l34k0J29m4K60l0J12J40j57j42M2J07k01j12j27N0M37j77j33m38L72
2478a47M10l03r8kr1K12j00J16J89k73op8K67Q0m46J23k18L03O7Q3p2j03J46k53
2502a94J23N5J46m1Q5j55J07j68O9r5J93J18l48o4O4J64l4K79m03J27O2k20k0
2525a50mJ19N2K50k99L30l75J32n2K66k95J53m6k83K8J39Q6L0j13k04J53L0M40
2548C87m79n9m4n5L04O2n2Q7n50M45k25K26kk25J64M1J10L4pm95K98J47o4q4o9
$$ plain form
2573 -105 -149 120 -55 215 135 -299 -83 -79 -33 233 31 -69 37 -51 254 146 -14 -139 -432 129 -224 33
2595 33 55 269 -36 -366 -95 -75 -177 -33 -88 194 -205 109 -239 -50 79 174 -158 -154 348 357 16 -290 -68
2618 -68 -9 415 282 118 -311 -28 183 26 -249 -150 -152 -93 138 226 188 91 -181 -104 51 350 70 107 -260 69
2642 69 -58 -86 331 -298 48 -326 -8 129 299 341 -150 104 111 -150 -184 -40 -358 161 193 -30 -111 356 215
2665 215 116 16 -87 441 215 -128 -287 -43 -309 -3 -77 1 -340 -218 57 360 90 26 -222 99 39 84
2687 84 155 200 -118 -74 143 -219 -372 28 -121 209 -65 368 8 5 -182 -289 -36 -175 -74 -182 265 12
2709 12 -375 89 150 -65 -92 -378 137 -122 -196 -179 -194 70 -104 -166 109 237 -110 12 -22 -147 100 -39 -28
2732 -28 -185 -126 198 -40 -18 -158 -152 177 45 -11 15 -106 -67 -101 270 292 -117 183 -406 -383 59 -32 29 -310
$$ packed form
2573a05m4K69j75K70q0m34K16MM6K66k02j00J06q8L05j08j60j25k93N61l53K57
2595C3K2K14l05l30K71K0j02J44n5K82l99L14l48J89J29R5l32MN02Rl41l06K22
2618f8N9M24j33j64m29K83K11j57k75R9kN9K31Q8l8r7k72P7J55K99k80L7l67L29
2642F9j27k8M17o29L46l74L18J37J70M2m91K54Pk61l4J44l18N19L2k23q1M67j41
2665B15r9j00j03N28k26l43j59K44k66L06p4P8l41J22K75L03k70o4k48L21o0M5
2687H4P1M5l18M4K17l62j53M00j49L30k74M33l60lj87j07K53j39J01j08M47k53
2709A2l87M64O1k15k7k86N15k59p4J7j5K64j74o2K75J28l47J22l4j25K47j39J1
2732b8j57N9L24k38K2j40OL29j32n6K6j21L9l4L71K2m09L00n89K3M42r1O1l39
$$ plain form
2756 -310 -222 -198 126 -272 23 -103 -278 358 157 -305 34 -78 -211 190 13 78 62 -272 -257 37 -47 270
2778 270 9 302 -104 -201 152 30 -253 -120 30 69 -37 -10 -227 -37 -10 -87 -31 43 -220 121 -156 -152 118
2801 118 -56 76 -301 35 138 -133 -281 44 123 -264 213 309 257 209 51 53 -86 -109 62 139 -389 -274 -370
2824 -370 183 217 279 -100 -115 -196 28 -53 -43 -50 -328 -23 108 -205 112 28 -97 -278 226 56 -165 -153 -358
2847 -358 -188 -59 242 117 -14 -170 -94 266 -169 -194 84 31 30 224 -2 272 68 -174 124 -219 120 -92
2869 -92 -18 33 52 11 -49 -28 170 69 -86 40 39 150 -216 -172 -161 -152 33 236 -227 -37 -271 -132 351 24
2893 24 166 -47 37 -218 -81 222 102 -119 23 6 205 -148 -151 34 40 28 275 -109 78 20 31 -202 51
2916 51 83 -39 -4 -163 -86 20 105 -115 201 -86 186 223 -379 215 148 -322 -66 -60 -353 -60 -145 -56 -83 362
$$ packed form
2756c10Q8K4L24l98K95j26j75O36k01m62L39j12j33M01j77O5j6l34J5K94q4L17
2778B70k61K93m06r7L53j22k83J33J50L9j06K7k17J90K7p7N6P4k63L41k77MK70
2801A18j74J32l77L36J03k71j48L25P9l87M77R6n2m8j58Kj39k3J71P7n28J15r6
2824c70N53L4O2l79j5q1K24q1J0pk78L05J31l13L17q4j25j81N04j70k21J2k05
2847c58J70J29L01j25j31j56P6L60m35k5K78n3jJ94k26K74k04k42K98l43L39k12
2869i2P4N1J9m1o0K1J98j01j55J26jJ11l66M4J1RJ85K03m63J90k34J39M83l27
2893B4J42k13Q4k55J37L03j20k21J42j7J99l53lJ85Oj2K47l84J87n8J1k33K53
2916E1L2j22L5j59P7J06Q5k20L16k87K72L7o02N94o7m70K56Ok93K93q5Q9k7M45
$$ plain form
2940 362 9 54 -190 -80 8 -67 -18 265 57 17 191 -344 190 -85 144 -57 41 140 -2 211 -245 151
2962 151 -524 93 108 -86 224 68 -161 18 100 286 -10 -67 28 3 351 100 119 50 -18 125 -94 -9 -14 116
2986 116 81 -189 -3 17 175 -117 -79 -289 137 64 52 -114 -349 -118 312 2 253 82 -134 -197 -33 143
3008 143 151 -16 -147 66 -66 -5 352 -87 -84 10 -162 228 331 8 -89 38 74 179 156 211 -92 43 163
3031 163 27 267 113 53 121 -57 351 -150 -154 71 -174 -106 32 43 -15 130 17 -64 27 183 67 40 150
3054 150 -131 -60 -35 165 -19 57 85 263 9 85 174 -192 36 65 -107 11 12 -260 239 -6 -221 -109 -131
3077 -131 -169 -156 -19 -111 29 29 172 92 68 105 44 113 -64 -46 -71 153 -116 75 -164 -51 201 -139 -4 23
3101 23 -136 -262 -34 -129 75 -224 81 -147 471 -53 31 -129 -334 -74 55 -66 -54 52 100 -146 -222 -92
$$ packed form
2940C62l53M5k44J10Q8p5M9K83k08m0J74n35N34k75K29k01R8R9j42K13m56L96
2962A51o75O17J5j94L10j56k29J79Q2J86k96n7R5k5L48k51J9o9o8J43k19Q5nJ30
2986A16l5k70J86K0J58k92L8k10M26p3j2j66k35K31M30l10K51j71k16o3J64J76
3008A43Qj67j31K13j32O1L57m39LR4j72L90J03l23r7J27L6J05k3N5l03J35J20
3031A63j36K40j54o0O8j78M08n01mK25k45O8J38J1n8J45j13q1R1J56j16k7J10
3054A50k81P1K5K00j84P6K8J78k54P6Q9l66K28K9j72J18Jk72M99k45k15J12k2
3077a31l8J3J37r2J40%J43q0k4L7o1O9j77J8k5K24k69J91k39J13K52l40J35K7
3101B3j59j26K28r5K04k99L05k28O18n24Q4j60k05K60J29j21J2J06M8k46p6J30
$$ plain form
3123 -92 -291 -97 -123 -130 10 134 25 72 -170 -217 85 269 220 104 92 -238 -211 43 -86 8 45 17 98 -75
3147 -75 -17 16 -136 -29 190 82 -12 49 -152 -45 218 -182 76 -141 -153 -20 110 40 -71 -35 -181 -111 -276
3170 -276 76 -120 -151 33 -15 -276 -14 43 107 -196 56 278 91 -95 116 -5 -367 134 -209 94 114 70
3192 70 264 -179 145 245 -164 90 201 -233 5 -215 36 -136 -252 241 -42 -123 191 -52 -23 -88 16
3213 16 161 88 -150 254 143 -137 92 6 -30 -162 -127 -63 -71 -19 -222 -140 -220 -218 325 23 -22 -294 184 -52 22
3238 22 182 -155 -277 264 -162 -41 43 -145 -178 -133 -125 11 262 -178 -48 65 181 -329 -184 80 28 -77
3260 -77 -121 239 314 -56 103 -42 -43 -120 182 146 -246 -61 -306 -115 -208 192 82 -85 -229 248 159 35 -23
3283 -23 -144 -180 74 -15 172 -90 156 -23 -60 307 -1 -98 224 152 172 -122 -124 263 -188 42 14 85 -588 -67
$$ packed form
3123i2j99J94k6pJ40J24j09M7k42m7L02J84m9j16j2l30K7K54j29R4L7k8Q1j73
3147g5N8L3j52J07K19j08r4O1k01J07K63m00K58k17j2J33J30p0j11L6j46P0j65
3170b76L52j96l1J84m8k61K62N7O4l03K52K22j87j86K11j21l62N01l43L03K0m4
3192G0J94m43L24J00m09K54J11m34K38k20K51j72j16M93k83q1L14k43K9o5J04
3213A6J45p3k38M04j11k80K29q6l6j32L5O4qN2k03Q2q0KN43l02m5k72M78k36P4
3238B2J60l37j22N41m26J21Q4j88l3M5QJ36K51m40J30J13J16n10J45K64n2j05
3260g7m4L60P5l70J59j45jp7L02l6l92J85k45J91r3M00j10j67j44M77q9j24n8
3283b3j21l6K54q9J87k62K46j79l7L67l08r7L22p2K0k94kL87m51K30k8P1o73N21
$$ plain form
3307 -67 -87 -255 -121 -184 199 -180 -252 47 61 303 98 170 34 -382 -51 205 11 -277 66 -42 -26 -172
3329 -172 120 274 56 -17 22 156 44 353 4 -120 -134 239 -353 -52 119 -62 -101 193 -142 -107 59 -165
3351 -165 -42 166 -28 -235 147 -96 193 40 33 49 18 -113 179 77 -101 -38 -127 82 18 -127 69 8 24
3374 24 99 -264 -75 101 58 211 -94 160 183 -108 87 262 174 -328 -43 89 -218 -173 -160 19 -108 -27 460
3397 460 -17 -83 225 -73 -231 -148 89 -71 308 61 283 134 105 27 188 -196 -97 -94 341 -420 9 69 17
3420 17 -18 84 126 -48 66 -220 -92 -342 0 -54 4 68 -46 -208 -24 -42 208 19 39 328 -151 238 449
3443 449 149 379 49 -117 122 -70 -31 -195 -38 146 -100 -130 -90 124 -270 -79 -81 306 -107 -209 76 -59
3465 -59 -123 86 -45 35 358 -191 -271 -34 194 -242 152 166 109 -101 -195 147 102 107 -59 -137 168 353 106 113
$$ packed form
3307f7k0j68J34o3L83l79p2K99J4K42k05P2j36m16L31K56j94k88L43j08J6j46
3329a72K92J54k18p3L9J34j12L09l49j24j4L73n92L01J71j81l9K94l35L5J66k24
3351a65J23K08j94k07L82k43K89j53pJ6l1j31K92j02j78O3q9K09o4j45J96o1J6
3374B4P5l63J89J76m3J53l05K54K3k91J95J75q8n02K85J32l07M5J3J79j27Q1M87
3397D60m77o6L08k98j58Q3K37j60L79k47K22j49k9p8J61l84R9LM35p61M29O0n2
3420A7l5J02M2j74J14k86J28k50L42n4N8O4j14j62J84j8K50j89K0K89m79L89K11
3443D49l00K30l30j66K39j92L9j64J57J84k46l0M0K14l94J91kL87m13j02K85j35
3465e9o4K09j31Q0L23n49q0K37K28m36L94J4n7k10r4L42m5Nj66p8L05J85k47P
$$ plain form
3489 113 72 259 -325 11 39 94 55 -59 -59 145 21 16 -30 -140 -100 -127 255 38 -82 40 -153 -22 196 -144
3513 -144 -3 146 96 -29 -293 290 -15 138 -191 8 -220 -200 -207 -567 -131 96 -266 96 -163 -291 44
3534 44 -90 -4 -213 -39 100 -132 -232 120 -7 -27 67 -73 95 97 90 -126 108 70 16 244 35 -145 -158 -235
3558 -235 -156 126 -12 112 -55 123 272 -115 -220 -46 111 -117 101 182 9 98 -41 -92 174 -36 9 32
3580 32 -19 -110 11 -157 50 155 -269 -248 129 64 74 73 90 82 -237 118 -86 -166 -102 -47 114 -118 16 315 75
3605 75 184 243 105 -31 -350 235 123 -149 202 -67 132 201 187 -257 46 -17 103 99 -157 -127 346 101 83
3628 83 -81 144 176 -11 -221 -14 67 -343 11 -149 36 68 -66 -77 -108 -22 -19 -203 -14 123 -272 -59 -40
3651 -40 177 100 299 -122 -187 39 112 25 44 71 97 -23 248 171 204 -231 49 441 -166 -154 -193 40 57 -340
$$ packed form
3489A13m1J87n84L36K8N5l9j14%K04j24nm6j10M0k7L82k17j20J22j93J31K18l40
3513a44J41J49n0j25k64N83l05J53l29J99k28K0pl60M36K27l62L62k59j28L35
3534D4j34Q6k09J74J39k32j00L52j27k0R4j40J68Kpk16K34l8n4K28k09j80j3p7
3558b35P9K82j38J24j67J78J49l87j05J74J57k28K18Q1j73Q9j39n1K66k10M5K3
3580C2n1r1J21j68K07J05m24K1L77o5J0jJ7ql19L55k04q0O4N5J61k32J34K99k40
3605G5J09N9j38j36l19N85j12k72L51k69J99O9j4m44L03o3J20mk56L0M73k45j8
3628H3j64K25L2j87k10K07Q1m10L54j60J85L2j34j1l1Q6Lj84J89J37l95K13J9
3651d0K17p7J99m21o5K26P3q7J9K7K6j20K71p7L3m35K80L92o07J2l9K33J7l97
$$ plain form
3675 -340 -19 -60 -27 -130 -42 -48 241 116 203 -71 15 -220 482 87 -134 -4 159 193 -110 86 -234 165 -84
3698 -84 -92 -71 246 82 39 -90 -113 -78 273 -195 50 123 124 139 -224 140 36 -1 -7 -162 -257 -62 182 74 -76
3723 -76 -203 -164 110 31 -259 -286 -196 32 423 -193 -59 44 -44 -75 -75 26 -167 6 182 46 -259 -141 185
3746 185 205 -12 -79 161 234 121 -136 -263 23 1 62 -184 -11 -23 -153 63 19 -29 -144 98 74 82 -53 141
3770 141 -76 82 -133 -281 -149 -171 22 -306 83 62 213 -6 -240 -163 -124 -22 262 77 57 52 -86 70
3792 70 -21 102 -336 -107 -352 -124 -37 113 -62 129 139 -143 -48 -186 32 -32 -94 246 91 -393 337 -107
3814 -107 71 -154 222 34 71 -279 -158 -125 19 237 -231 -114 -43 192 68 65 55 98 127 -110 -98 110 -23
3837 -23 -37 -78 36 -26 -190 -284 107 -147 193 122 191 154 252 63 -182 128 236 -83 178 -224 -43 100 280
$$ packed form
3675c40L21m1L3j03Q8oK89j25Q7k74Q6k35P02l95k21J30J63L4l03J96l20L99k49
3698h4qK1L17j64m3j29k3L5L51m68K45P3JJ5l63L64j04l7oj55r5J95K44j08j50
3723g6j27L9K74p9k90k7R0K28L91o16J34J03q8l1%J01j93J73J76j36l05J18L26
3746A85K0k17o7K40P3j13k57j27K86k2O1k46J73j2j30K16m4m8j15K42k4Qj35J94
3770A41k17J58k15j48J32k2J93l28L89k1J51k19k34P7L9J02K84j85k0nj38J56
3792G0r1J23m38K29k45K28Q7J50j75J91J0k82R5j38K18o4o2L40j55m84P30m44
3814a07J78k25L76j88L7l50J21L3J44K18m68J17P1K35j24lj0M3K9k37J2K08j33
3837b3j4m1J14o2j64r4L91k54L40p1O9l7R8j89k45L10J08l19K61m02J81J43J80
$$ plain form
3860 280 86 14 107 153 29 136 -21 -7 33 -296 -2 0 -181 -282 127 -68 -28 44 -277 -117 -263 -219 -195 98
3884 98 75 193 -81 88 -157 -6 191 -193 -35 -67 126 -22 -94 -212 -117 -68 -220 145 106 -148 -88 35 26
3907 26 265 -208 -52 186 96 -264 -85 50 -89 38 -40 -129 95 -67 -23 -151 51 -7 -212 0 -332 -154
3929 -154 -291 38 4 -112 21 -70 76 -80 -169 186 -68 -205 260 188 137 243 97 -176 -188 51 66 69 95
3952 95 236 30 69 79 191 -149 -6 411 152 -131 100 -42 104 -84 -160 -43 -88 94 -12 203 93 -75
3974 -75 11 -34 41 74 -38 96 -135 -6 344 58 114 370 46 -83 206 133 -52 -87 -50 -298 49 -25 83
3997 83 -80 244 61 -289 -323 -147 129 73 -241 199 80 -1 206 103 -190 -120 -106 111 81 42 -163 3 335
4020 335 -6 -141 -234 -171 -205 54 -8 5 89 -72 59 -253 -39 -58 12 -107 -245 -180 71 91 -131 117 178 -120
$$ packed form
3860B80j94p2R3M6j24J07j57J4M0l29K94Kj81j01M09j95M0P2l21J60j46M4K4K93
3884I8k3J18k74J69k45J51J97l84J58l2J93j48p2j18R5M9j52L65l9k54O0J23r
3907B6K39m73J56K38r0l60J79J35j39J27p8q9K24j62M4j28K02n8k05K12l32J78
3929a54j37L29l4j16J33r1J46j56q9L55k54j37M65p2n1J06j46k73j2K39J5LK6
3952I5J41k06L9J0J12l40J43M17k59k83K31j42J46j88p6J17m5J82j06K15j10j68
3974g5Q6m5P5L3j12J34k31J29L50k86N6K56l24j29K89p3j85l5L7k48L47p4J08
3997H3j63L24j83l50l4J76K76n6l14M40j19q1K07j03k93P0J4K17l0l9k05J66L32
4020C35l41j35r3O3l4K59o2J3Q4j61J31l12K14j9P0j19j38O5K51K0k22K48O1k98
$$ plain form
4044 -120 -328 117 -177 112 -353 252 -214 -63 -138 109 -13 52 -194 138 344 -43 -138 105 171 -25 172
4065 172 124 -314 -250 267 89 -250 -176 56 135 -98 143 230 -125 -317 -24 20 -116 114 27 214 -38 -248
4087 -248 -155 7 212 179 -176 -229 147 366 290 -17 42 193 188 271 -58 -141 -244 -209 -87 -124 -95 174 34 302
4111 302 -63 -26 -59 -622 -10 172 -79 -345 -77 149 -63 -10 -233 -34 -16 -43 407 -227 -8 52 24 88 -78
4134 -78 -196 -85 258 -102 -222 -92 80 -7 101 -79 39 33 -347 -66 3 -3 -175 37 13 -81 -273 2 27
4157 27 75 96 -75 171 77 -262 -20 342 43 -107 -205 -84 -120 246 -68 245 153 -192 -181 -171 17 279 245
4180 245 75 -54 -264 167 115 -124 85 100 51 -70 -64 -122 123 -77 -111 -233 -23 97 241 38 -18 150 249
4203 249 18 -265 93 -136 158 9 188 -97 5 -213 13 74 -78 -124 4 -208 91 -57 94 -82 -252
$$ packed form
4044a20k08M45k94K89m65O05m66J51p5K47j22O5k46L32K06l87r5K43O6j96J97
4065A72m8m38O4N17j78l39P4K32P9k33K41Q7l55j92K93M4j36K30q7J87k52k10
4087b48R3J62K05l3l55n3L76K19p6l07N9J51nQ3l29q3j03L5J22l7K9K69j40K68
4111C02l65L7l3n63O12J82k51k66K68K26k12N3k23J99J8k7M50o34K19O0k8O4j66
4134g8j18J11L43l60j20J30J72q7J08j80J18ol80K81O9oj72K12k4r4j92K75K5
4157B7M8K1j71K46r4l39K42L62k99j50r8J21l6L66l14L13r2l45J1J0J88K62l4
4180B45j70j29k10M31n2k39K09J5m9j21On8K45k00l4j22K10J20J44k03n6J68R9
4203B49k31k83L58k29K94j49J79k85J02k18K26O1j52m6J28k12K99j48J51j76j70
$$ plain form
4224 -252 246 78 -79 -304 239 -338 434 -169 130 264 353 166 125 278 -32 -83 74 63 -69 -296 13
4245 13 267 -33 198 66 -398 -47 325 -114 32 18 81 313 221 27 -257 169 -88 -90 128 -262 -160 -119
4267 -119 147 -259 -175 -240 182 178 -83 -8 39 -245 -246 102 -117 220 90 37 -62 -28 -189 146 -18 -21 41 -16 -279
4292 -279 7 -149 -224 132 -180 18 -220 137 -25 -51 -52 -133 -98 -118 -123 -143 1 -5 -173 54 377 -109 -82 -190
4316 -190 -314 35 48 -72 80 -70 215 -122 -101 22 81 95 -108 -150 5 38 5 -24 90 -53 52 -46 -97
4339 -97 -444 52 -112 -129 203 -58 5 50 290 -181 -56 122 35 -68 117 133 -19 177 52 252 -14 5
4361 5 378 125 -234 213 -71 -79 5 86 36 -151 -44 -81 33 -24 135 -133 -156 -32 109 169 -442 38 16 -99
4385 -99 30 25 128 77 -47 -131 78 192 185 90 302 -178 -123 -123 138 74 33 -76 -142 125 -6 84 -7 261 -193
$$ packed form
4224b52M98j68j57k25N43n77P72o03K99J34Q9j87m1J53l10n1J57j1j32k27L09
4245A3K54l00K31j32m64L51L72m39J46j4O3K32r2j94k84M26k57kK18l90J02M1
4267a19K66m06Q4o5M22mk61P5M7k84jL48k19L37j30n3r9L4j61L35j64lO2n7k63
4292b79K86j56p5L56l12J98k38L57j62k6jq1L5k0nk0J44oj68K27L23m86K7j08
4316a90j24L49J3j20J52j50K85l37K1J23N9J4k03m2J55L3l3k9J14j43J05r8n1
4339i7l47M96j64j7L32k61O3M5K40m71J25J78q7j03J85J6j52J96j25K00k66J9
4361EL73k53l59M47k84qQ4Q1n0j87J07l7J14n7J59k68k3J24J41O0o11M80k2j15
4385i9J29nJ03n1j24q4K09J14pr5K12m80N5%K61o4m1j09o6K67j31R0r1K68m54
$$ plain form
4410 -193 129 -23 -152 107 5 56 -217 -6 -31 69 -316 -149 195 -86 -341 149 -133 -161 180 299 -80
4431 -80 -15 -119 117 28 268 -108 -281 148 190 -182 -291 -133 -182 -34 40 83 129 317 174 17 165 72 13
4454 13 141 -213 -58 -32 -55 23 -176 -71 221 -203 -123 142 177 321 249 -152 -59 -231 -158 -18 109 -7 -187
4477 -187 -47 48 273 -218 -13 82 195 -221 -27 -1 48 148 -140 47 -251 -97 30 325 272 43 37 -301
4499 -301 71 119 127 7 186 93 50 -151 -216 155 30 -16 -235 -107 -39 33 -347 200 61 339 -28 93 25
4522 25 104 -238 -86 127 22 -150 58 -25 115 -112 58 98 -170 -195 372 -104 -207 116 -203 295 137 165
4544 165 352 -92 -132 178 147 156 136 -10 62 132 95 -72 -108 -14 -9 127 -152 173 -24 169 87 15 -141 -134 -11
4569 -11 -52 194 50 3 -261 -70 119 170 -297 227 120 146 -81 244 -55 -207 -271 -18 295 -97 30 -54
$$ packed form
4410a93L22j52j29K59j02N1k73K11k5J00l85J67L44k81k55M90k82k8L41J19l79
4431h0O5j04K36q9K40l76j73M29M2l72j09J58m9J48P4M3M6J88j43j57J48r3n9
4454A3J28l54J55K6k3P8j99J05K92m24Q0K65L5J44p2m01R3j72P3J40J27j16j80
4477a87J40R5K25m91K05R5J13m16J94K6M9J00k88J87k98J54J27K95n3k29ol38
4499c01L72M8Qj20J79r3m3k01o5L71j25m6k19J28O8P2l80N47j39K78l67J21o8
4522B5P9l42J52K13j05j72K08q3J40k27J70M0k68k5N67m76j03L23l19M98j58K8
4544A65J87m44m0L10l1Rk0j46P2P0l7j67l6R4NJ36k79L25j97J93q2p2j56PJ23
4569a1m1K46j44m7k64J91J89N1m67N24j07K6k27L25k99j52o4K53L13l92J27q4
$$ plain form
4591 -54 -62 135 305 20 6 -20 156 -188 62 -157 -119 46 14 269 218 -30 -45 -26 -135 219 -295 83 113 93
4615 93 33 122 130 -4 -3 -34 -76 177 309 98 77 -77 203 -22 71 -181 143 -191 122 -322 83 337 277 218
4639 218 -114 11 -166 96 -47 324 -111 141 23 -43 98 -46 -77 101 157 -64 108 -234 120 182 63
4660 63 140 114 -57 -28 -174 100 -178 42 377 -12 225 237 -108 173 165 -19 -324 90 38 24 -1 -161 -77 -197
4684 -197 30 155 183 -80 -27 8 -39 52 -8 -35 213 -168 -131 191 33 -15 115 5 -144 169 -56 4 8 10 -52
4709 -52 -90 153 -174 -218 -205 -200 -147 232 63 29 -254 -341 143 -229 219 -94 101 -310 287 69 84 111 -407 -52
4733 -52 198 158 173 -10 128 241 -72 -263 82 -167 20 230 124 -107 20 161 -102 -92 84 132 -41 -61
4755 -61 51 108 33 320 -156 31 90 86 -129 138 166 -109 220 -35 -236 -142 -496 154 -27 -148 5 -190 295
$$ packed form
4591e4qJ97J70k85j4k6J76l44K50k19L8J65l2K55n1k48j5J9j09L54n14L78L0k0
4615I3o0Q9Qj34Jl1m2K53J32k11k1j54K80k25R3k52L24l34L13m44M05K54o0n9
4639B18l32J25j77K62j43L71m35K52j18o6J41j44l1J78N6k21J72l42L54O2j19
4660F3P7k6j71K9j46K74k78K20L35l89K37J2l45K81qj84l05M14n2j4k5j60Q4j20
4684a97K27J25K8k63N3L5m7R1o0k7K48l81L7L22j58m8J30j10j49L13k25O0MKo2
4709e2l8K43l27m4J3NN3L79j69l4k83q7M84l72M48l13J95m11N97k18J5K7n18L55
4733e2K50m0J5j83J38J13l13j91L45k49J87K10j06k31J27J41k63J0J76M8j73k0
4755f1J12N7p5K87m76J87N9mk15K67K8k75L29k55k01R4l54O50j81j21J53j95M85
$$ plain form
4778 295 30 69 -123 -99 -9 -195 166 -93 58 -134 -71 147 -87 -162 -103 -32 28 -27 226 1 -51 200 -17
4801 -17 -16 26 -68 -194 356 -14 36 -68 37 41 -99 212 -246 -63 103 -160 -290 62 3 100 48 230 222 -110
4825 -110 149 -60 161 168 -86 67 -249 160 -238 -168 51 -249 -24 -163 -2 -3 -134 172 -96 -40 -43 -188 -101
4848 -101 -202 -118 -198 299 -176 130 -150 2 -128 -81 243 13 44 242 -199 171 73 245 -113 -51 -102 -96 -140
4871 -140 19 197 70 120 130 78 145 271 -158 284 -63 -232 -266 207 -231 -56 -18 220 -16 -263 -198 179
4893 179 68 -217 -17 -76 186 -103 -83 156 56 74 31 -120 27 143 -153 79 -162 94 -151 -255 -3
4914 -3 -288 284 -165 258 -36 -195 -179 114 -41 126 105 -14 -159 -82 184 57 -329 -117 -85 -50 -73 -140 62
4937 62 -124 10 -333 -91 -164 51 145 96 -98 -154 304 -126 92 203 60 73 -25 18 -115 -9 120 177 83
$$ packed form
4778B95k65L9j92K4R0j86L61k59J51j92O3K18k34p5N9P1O0n5K53k25n2K51k17
4801a7JM2r4j26N50l70N0j04J05Mj40L11m58J83J66k63j30L52n9R7n2J82ql32
4825a10K59k09K21Pk54J53l16M09l98P0K19l00K25j39J61jj31L06k68N6lj45Q7
4848a01j01Q4q0M97m75L06k80J52j30M7L24k30L1J98m41L70r8J72l58O2n1Om4
4871a40J59J78j27N0J0n2O7J26m29M42l47j69l4M73m38J75L8K38k36k47O5L77
4893A79j11k85K00n9K62k89K0K39j00J8m3j51J47J16k96K32k41K56k45j04K52
4914ck85N72m49M23k94j59J6K93j55J67k1j19j45P7K66j27l86K12L2L5k3o7K02
4937F2j86J34l43K42p3K15R4m9j94n6M58m30K18J11j43J3r8M3j33J06J29N7r4
$$ plain form
4960 83 -161 -7 -515 22 86 227 49 -96 -19 207 -298 2 11 139 344 405 4 -3 -137 -276 -165 171 221
4983 221 -89 -1 -282 178 57 -38 -85 -61 -254 212 -44 5 105 371 -47 114 55 132 263 -136 199 -35
5005 -35 -71 -169 116 -58 -142 -93 -139 -141 203 240 -196 199 162 -208 -136 -90 33 -206 -77 -2 -83 -37 69 284 -20
5030 -20 -7 -127 180 -130 -144 334 390 124 401 129 -67 43 -64 112 59 253 58 -182 88 -62 256 -121
5052 -121 -47 -133 3 -122 15 -248 -26 -35 58 29 -115 100 42 167 153 -98 25 16 33 -75 -75 -69 184 -147 112
5077 112 -20 -303 -78 -310 -34 -139 -97 -13 56 88 145 -17 -43 -37 -28 -47 -70 157 -178 -395 149 336 -182 -328
5101 -328 -97 87 207 -26 256 -63 97 26 -161 -245 184 -32 -242 -201 -154 48 123 -57 -16 -109 288 -91
5123 -91 -203 76 133 -78 42 138 -205 233 -116 277 -165 66 -62 79 209 108 149 1 -47 -42 121 -268
$$ packed form
4960H3k44J54n08N37O4J41j78j45P7K26n05L00RJ28K05O1m01pj34j39J11L36N0
4983B21l10Q8k81M60j21r5m7K4j93M66k56M9J00K66m18J61n9P7J31l99L35k34
5005c5l6r8K85j74q4M9m6kL44L7m36L95l7l70P2M6J23k39J29P5q1M6J06K15l04
5030b0J3j20L07l10j4M78N6k66K77k72j96J10j07J76n3J94j95k40K70j50L18l77
5052a21P4q6J36j25J37k63K22rR3k9j44K15n8J25j4k51J23rJ7j08%OK53l31K59
5077A12j32k83K25k32K76j05M2Q4O9L2N7j62k6ORj9k3K27l35k17N44J87n18j46
5101c28K31J84J20k33K82l19J60p1j87q4M29k16k10M1M7K02P5j80M1r3L97l79
5123i1j12K79N7k11J20R6l43M38l49L93m42K31j28J41J30j01M1j48m8NJ63l89
$$ plain form
5145 -268 -43 -227 -34 439 -154 -58 192 46 -71 4 -73 128 -69 166 -151 145 257 -266 -211 -254 -66 4
5167 4 51 278 -351 -244 115 -114 -35 -40 176 66 -32 -62 -252 -96 -121 -100 -132 -193 139 110 -35 316 111 -51
5191 -51 -73 306 -52 -8 82 -132 331 -31 95 -163 149 -148 -117 -208 357 11 -37 -25 -61 103 22 -397 119
5214 119 12 110 -6 111 -46 -163 66 -122 -25 -127 239 228 158 31 32 74 262 162 7 3 228 47 126
5237 126 76 -95 172 -87 -317 104 215 -175 -27 -19 149 -163 26 64 107 11 18 -192 70 -352 -74 69 8
5260 8 130 112 -122 -27 -156 -33 -249 -305 321 -203 -42 13 -120 -125 99 -140 -15 9 290 -305 344 15 34
5283 34 194 -28 173 390 35 -340 43 -15 48 -33 186 94 84 -39 -174 56 -498 -27 80 92 14 -323 88
5306 88 -158 63 -55 71 66 254 28 55 -218 -12 59 251 -160 164 98 61 -27 239 73 -351 -154 -159 -303
$$ packed form
5145b68K25j84J93M73n93R6K50j46j17P5p7K01j97K35l17K96J12n23N5m3J88P0
5167DM7K27o29J07L59k29P9nK16j10r8l0j90J56k5K1l2o1L32k9j45L51k05j62
5191e1k2L79l58M4R0k14M63l62J26k58L12k97L1r1N65l46m8J2l6J64q1m19N16
5214A19j07R8j16J17j57j17K29j88R7j02L66j1p0j27JM2J88j00j55mK25j81P9
5237A26n0j71K67k59k30M21J11l90J48QJ68l12J89L8M3r6Pk10K62m22K78J43o1
5260HJ22j8k34R5j29J23k16n6O26n24J61N5j33nK24k39J25K4K81n95O49l29J9
5283C4J60k22K01K17l55l75L83n8O3q1K19r2j0j23j35K30n54M71J07J2p8l37M11
5306H8k46K21j18J26nJ88k26K7k73K06P1J92m11L24o6l7q8K66j66m24J97nj44
$$ plain form
5329 -303 -132 94 152 54 70 77 113 -67 171 14 -109 109 182 18 68 289 21 -65 -182 301 191 -183 84
5352 84 90 26 53 -9 71 -26 156 84 -182 -75 125 198 117 211 -232 -37 230 4 1 178 203 -73 238 -61 -33
5377 -33 27 193 -133 4 -43 151 -92 24 234 -57 217 281 234 -40 -47 9 -74 21 -11 158 -82 7 -142 -232
5401 -232 49 157 193 -118 170 -72 -87 -2 -254 -26 -205 -164 -58 -190 11 118 174 -167 52 -27 120 175
5423 175 -124 -177 5 -74 311 -35 -67 51 -7 161 77 29 53 -308 87 268 -167 -395 233 176 40 -91 -211
5446 -211 12 -298 -63 -32 -61 -94 -125 -113 26 -293 34 6 -44 -169 39 -189 24 -195 7 89 246 72 -63
5469 -63 179 -173 174 217 157 -24 177 -228 24 134 3 94 51 91 -414 -44 264 -233 66 110 -31 263
5491 263 264 -224 313 143 212 67 457 63 150 -199 -62 40 -38 -81 396 -12 75 168 -172 -34 57 213 54
$$ packed form
5329c03J71K26N8r8J6PL6j80K38j57j23K18P3j64N0K21k68q6j17M83j10l74K67
5352H4Oo4K7o2Q0r7J82p2k66J07K00P3q1R4m43J95K67k26lJ77K5k76L11k99K8
5377c3O0J66l26J37m7J94k43J16K10k91K74O4m7k74pN6q3R5l2J69k40Q9j49r0
5401b32K81J08L6l11K88k42j5Q5k52K28j79M1J06j32K01J07N6l41K19p9J47N5
5423A75k99n3J82p9L85l46l2J18n8J68q4m8K4l61L95J81m35k28O28n7j36j31j20
5446b11K23l10K35L1k9l3l1J2J39l19L27k8n0j25K08k28K13k19K02Q2J57j74j35
5469f3K42l52L47M3o0j81K01m05K52J10j31R1m3M0n05L70L08m97K99M4j41K94
5491B63Jm88N37j70O9j45L90l94Q7l49J37J02p8m3M77m08Q7R3l40J38R1J56j59
$$ plain form
5514 54 57 -148 -194 61 99 96 -183 -110 103 -280 -103 89 -180 97 -221 -123 240 -230 -88 -179 -126 206 106 -266
5538 -266 161 304 182 121 -299 -207 -95 -58 56 -88 -260 -72 1 -122 -161 -158 128 -34 200 -30 37 -29 -17
5561 -17 255 -195 -42 228 178 -225 -190 180 -69 138 -176 127 -146 -366 -108 -204 7 339 -229 18 6 -139
5583 -139 11 204 -141 -69 -160 -353 -136 11 -159 -92 124 -144 142 -56 11 -26 210 23 301 -159 -5 42
5605 42 -25 124 -2 98 84 -196 -49 71 -404 191 -146 153 -188 -169 274 -32 -187 73 105 68 269 22
5627 22 119 -20 -256 -226 135 -281 -283 339 11 -19 50 195 298 -57 187 87 -311 52 12 -64 -104 92 136 97
5651 97 434 167 58 95 178 -201 126 -456 86 -86 57 244 166 73 273 150 -121 -25 125 13 297 62
5673 62 162 -89 -371 67 51 -96 43 -14 75 -186 -72 182 248 347 -116 33 9 -6 32 -112 239 301 106
$$ packed form
5514E4Lk05m6K55L8lk79P3K13l83J77J92k69K77l18R8L63m70J42r1N3L32j00l72
5538b66M27J43j22o1m20R2J12L7J14j44j72J88P3j23l9LK86j62K34k30O7o6J2
5561a7K72m50J53K70n0m03L5L70k49K07l14L03k73k20K58r6K11L32n68K47j2j45
5583a39J50J93l45P2r1j93K17J47j70O7K16k68K86j98O7l7K36j87K78m60J54M7
5605D2o7J49j26J00j4k80J47J20m75N95l37K99l41J9M43l06j55K60L2l7K01k47
5627B2R7j39k36L0L61m16kO22l28l0O9J45J03l55K44j00l98L63m0p6m0J96M4l9
5651I7L37k67j09L7Q3l79L27n82N42j72J43J87p8r3K00j23k71R6J50j12K84k35
5673F2J00k51k82M38j6j47J39n7Q9k61J14K54O6R9m63J49k4j5L8j44L51O2j95
$$ plain form
5696 106 197 -244 87 180 254 -104 -168 -146 -76 111 103 105 71 62 3 29 -254 -46 -46 1 -33 124 -45 123 -154 -117 -149
5723 -149 51 101 129 -186 -110 90 -85 93 115 -6 -243 -116 2 -42 170 18 6 -46 29 67 198 -100 -18
5746 -18 136 172 196 58 -217 316 -79 41 -27 -15 -109 -245 -48 -30 203 -215 -9 -7 -114 -35 39 98 -310 6
5770 6 209 37 -365 -214 37 -216 2 -14 249 -184 19 -328 -162 285 63 -23 -29 220 -77 -132 97 0 -378
5793 -378 122 -66 -48 71 -110 -412 -335 -89 -106 -104 108 235 -77 -152 -36 -31 -154 267 -144 184 -194 106 26
5816 26 206 343 68 152 -133 -115 341 14 32 106 229 -59 -41 -207 -244 140 -277 112 67 120 -42 161 143
5839 143 -281 167 5 189 157 -264 6 134 -31 126 -51 9 79 -109 406 -164 -164 199 54 108 -173 -57
5861 -57 377 -9 47 -334 -59 58 -162 168 -23 20 -194 -78 -117 -125 -91 199 -264 276 -60 -140 -14 -106 393
$$ packed form
5696A06R1m41L31R3P4l58o4K2P0J87qKl4rn9K6k83K08%M7l4J57j69J68k77L7l2
5723a49K00N0K8l15P6K00j75J78K2j21k37J27J18m4K12j52j2n2P5L8J31k98Q2
5746a8J54L6K4j38k75N33l95J20o8J2r4j36J97J8K33m18K06Kj07P9P4N9m08L16
5770FK03j72m02J51K51k53K18j6K63m33K03l47J66M47k22q6oK49k97n5K29r7l78
5793c78N00j88J8J19j81l02P7K46j7KK12J27l12p5J16Nj23M21m11L28l78L00q0
5816B6J80J37k75Q4k85J8M56l27J8P4J23k88J8j66l7L84m17L89m5N3j62K03j8
5839A43m24M48j62J84l2m21K70J28j65J57j77O0P0j88N15n70%L63j45N4k81J16
5861e7M34l86N6l81K75J17k20L30j91M3k14J16l9qL4K90m63N40l36q0J26r2M99
$$ plain form
5884 393 221 -217 -232 -137 167 -124 -223 112 -183 106 84 -63 -2 78 -127 -87 117 -35 57 -162 143 -19 -177
5907 -177 323 -260 174 50 -242 361 173 -9 -172 74 -231 93 -14 -147 18 193 32 -126 16 -119
5927 -119 290 43 92 69 -157 -370 164 -175 -26 -135 -270 -362 -40 135 -15 14 231 48 -81 -167 67 27
5949 27 -3 56 62 -473 -68 102 -134 174 56 93 -107 172 -242 -92 -161 149 85 110 -101 -380 39 -175 -30
5972 -30 -69 -7 -93 120 186 -18 -84 -44 -236 2 277 127 -61 39 122 255 62 31 172 305 -351 -21 48
5995 48 -187 -71 -194 -5 -109 309 -116 26 -69 -148 245 -75 147 -85 -168 78 150 138 -6 118 -28 -378
6017 -378 57 -124 -89 13 162 -29 -224 177 -111 -131 -152 -227 -106 260 -134 51 279 90 -166 436 -200
6038 -200 -46 -24 -175 -85 119 -202 -37 84 78 -223 92 341 -20 144 72 23 -98 284 22 162 -21 -157
$$ packed form
5884C93j72m38j5R5L04k91r9L35k95K89k2j47O1Q0k05M0K04j52R2k19L05j62j58
5907a77N00n83M34j24k92O03j88j82j63K46l05L24j07j33J65J75j61j58J42j35
5927a19M09k47M9k3k26k13N34l39J49j09j35r2L22J75j50K9K17j83j29q6K34m0
5949B7l0N9On35M05J70k36L08j18L7k00K79m14J50o9L10o4K5k11k79M19k14J45
5972c0l9O2q6K13O6k04o6M0j92K38K75j50j88J00Q3J33j93l1J41J33o56L30O9
5995D8k35J16j23J89j04M18m25J42r5p9L93l20K22k32q3K46P2j2j44J24j46l50
6017c78M35j81L5J02J49j91j95M01k88k0k1p5J21L66l94J85K28j89k56O02o36
6038b00J54K2j51R0K04l21J65J21ol01L15K49l61J64p2m9j21L82k62J40j83j36
$$ plain form
6060 -157 -26 -31 -258 209 -139 64 -10 -52 -160 -27 125 233 -104 -83 -129 -40 31 -215 27 -328 -140 -85 230
6083 230 -158 157 118 274 -49 -174 107 40 56 -127 432 160 -244 -68 111 297 -79 -137 -102 -93 4 239 -260
6106 -260 76 -404 88 -83 -126 271 -152 274 130 -222 -187 -97 -101 101 -14 178 446 133 -138 -106 6 94
6128 94 -166 399 5 -226 -125 189 -77 125 105 194 -50 -9 253 200 213 -100 -179 39 2 -137 36 -66 176
6151 176 185 83 -18 136 -114 -187 -47 272 257 304 -165 -47 -23 -47 185 -35 85 -49 -311 -14 165 -14
6173 -14 -15 -253 -188 13 249 150 -12 -25 35 145 -48 177 79 -207 -23 194 160 11 -92 -179 109 197 24 -44
6197 -44 66 -111 -47 -36 122 149 59 -73 20 -1 -184 -195 -64 167 -323 101 -3 -181 43 173 -185 -37 167
6220 167 207 154 208 6 17 -51 157 -103 -31 11 190 -162 -188 -40 -164 -141 -243 291 -22 10 27 -11 194 -59
$$ packed form
6060a57J31nk27M67l48K03p4m2j08J33J52J08l37K1m6Q9P1k46K42l55J88N5L15
6083B30l88L15l9J56l23j25K81o7J6j83N59k72m04J76J79J86l76n8L5RR7K35m99
6106b60L36m80M92j71m3L97m23M26j44l52L5R0mK02j15J92K68l13k71L2J12Q8
6128I4k60N65l94k31J01L14k66K02k0Q9k44M1K62n3J3l13p9K18l7j39J73j02K42
6151A76Rj02j01J54k50p3J40L19j5M7m69J18K4k4K32k20J20j34k62K97J79j79
6173a4jk38O5K01K36r9j62j3O0J10j93K25r8k86J84K17l4j49j03q7K88Q8j73o8
6197d4J10j77O4J1J58K7r0j32R3k1j83j1J31K31m90M24j04j78K24J30l58J48K04
6220A67M0n3N4k02J1o8K08k60P2M2J79l52k6J48j24K3j02N34l13L2J7l8K05k53
$$ plain form
6244 -59 -15 -129 -269 126 105 148 -176 343 -60 189 67 25 17 -147 212 -257 139 161 20 -81 236 290 -224
6267 -224 -125 279 163 -138 95 34 -162 -14 293 -8 -209 1 -89 -39 51 259 -264 129 -191 -23 -165 268
6289 268 -17 -237 -129 -72 32 -2 -14 -48 46 -55 -5 193 184 -66 280 -250 -81 -158 12 26 71 -239 68 -220
6313 -220 -14 -195 74 323 195 119 -9 85 66 -70 -91 -10 -240 -69 -85 -9 139 251 137 -232 -480 89
6335 89 -37 35 -150 -183 200 -34 35 187 122 -5 64 -126 43 -89 32 -84 8 -156 -296 97 256 139
6357 139 131 2 199 -276 -106 153 -165 276 85 -61 13 -285 -206 -206 -82 -40 -80 -198 19 -55 -98 -30 162 -53
6381 -53 85 45 -218 78 -86 24 -111 178 -116 12 17 145 -60 171 -70 59 0 32 -290 94 -8 119
6403 119 -6 37 205 -196 -157 -56 213 281 -61 -144 155 28 -51 26 189 -95 -71 -47 132 -214 -100 37 180
$$ packed form
6244e9M4j14j40L95k1M3l24N19m03K49j22m2qj64L59m69L96K2j41j01L17N4n14
6267b24R9M04j16l01K33o1j96J48L07l01k01K10r0N0R0K08n23L93l20J68j42M33
6289B68k85k20J08N7J04l4j2l4R4j01N0J98rk50L46n30J69p7J70J4M5l10L07k88
6313b20K06j81K69K49j28p6j28R4j9j36k1Q1k30J71j6P6J48J12j14l69k48N69
6335H9j26P2j85l3L83k34O9J52o5j27O9j90J69j32J21j16R2j64j40L93J59j17
6357A39qj29J97m75J70K59l18M41j91j46P4k98P9%J24M2m0j18K17p4m3O8J92k15
6381e3J38m0k63K96j64J10j35K89k94J28NJ28k05K31k41J29n9L2l22L84j02J27
6403A19j25M3J68m01L9J01K69O8l42q3K99j27p9P7J63k84K4K4J79l46J14J37J43
$$ plain form
6426 180 135 27 58 236 170 -28 109 -96 218 222 124 107 26 -28 63 72 -52 147 278 52 -17 178 315 239 107
6451 107 123 -196 -75 194 -69 57 -78 -103 18 54 102 -133 -176 6 108 24 -139 200 12 -69 116 188 54
6474 54 106 170 49 -37 -116 -34 -280 -51 -204 100 -327 -202 92 118 186 -64 -26 -250 -67 -206 158 163 49 110
6498 110 -114 -71 -156 246 -88 -29 -19 -324 77 351 -32 28 64 -69 -194 133 -298 264 61 -83 -234 104
6520 104 -88 264 272 -181 298 -37 -33 77 -14 -15 -2 -120 25 8 -43 37 14 39 26 55 -49 -172 -43 -184 -51
6545 -51 -389 -6 116 -19 136 92 107 95 -60 151 -318 -296 -13 286 131 -31 -281 41 -207 145 17 198
6567 198 -3 23 260 229 -54 98 -60 -44 189 -121 220 -40 -12 -129 91 -179 268 150 179 -20 137 53
6589 53 -164 -319 198 -11 -91 -264 26 -24 136 -56 -122 153 207 96 69 -12 139 95 -157 -44 -125 46 -204
$$ packed form
6426A80m5j08L1J78o6j98J37k05L14Mr8j7q1n4R1Rj24J99J31k26o9J95J37p6j32
6451A07J6l19J21K69k63J26j35k5J21L6M8k35m3J82J02q4j63L39j88q1J85P2j34
6474E4N2O4j21q6p9Q2k46K29j53L04m27J25K94K6O8k50L8k24J83j39L64Nj14O1
6498A10k24M3q5M02l34N9J0l05M01K74l83O0L6j33j25L27m31N62k03j44j51L38
6520A04j92L52Qm53M79l35MJ10r1jJ3j18J45j7n1Q0k3K5j3K9j04j23J29j41J33
6545e1l38L83J22j35J55m4J5j2j55K11m69K2K83K99j55j62k50L22k48L52j28J81
6567A98k01K6K37l1k83J52j58J6K33l10L41k60K8j17K20k70M47j18K9j99J57q4
6589E3k17j55N17k09q0j73K90n0J60j92o6K75N4j11k7q1J51m4k52J13q1J71k50
$$ plain form
6612 -204 107 -14 81 113 -53 -117 -70 188 79 317 -45 23 112 -345 248 352 315 -143 145 -21 217 0
6634 0 -291 -256 164 84 -103 59 -61 187 163 129 3 -127 -282 -299 -39 -255 57 438 -14 -27 -41 38 9 -55
6658 -55 318 -163 -12 -278 281 326 -38 -74 124 -222 -141 -123 179 -11 -61 19 132 -75 209 -68 2 115 66
6681 66 257 39 74 -114 224 -33 -1 37 -98 155 3 -138 -203 167 -45 -253 -157 63 -105 -10 419 137
6703 137 77 130 -73 129 173 -258 -216 264 -72 -217 127 -25 -140 141 121 1 220 -172 41 221 -61 -49
6725 -49 22 41 271 79 -66 38 -220 25 138 -101 389 42 330 187 92 -176 -11 -55 -29 148 -239 -301
6747 -301 -56 -102 -16 143 -159 17 57 152 -23 78 -226 48 -45 1 -66 73 102 20 88 86 90 -29 -183 -278 0
6772 0 -420 -357 -28 -4 -74 33 -165 60 350 6 -62 62 221 119 122 -27 150 -35 159 189 36 4 -144
$$ packed form
6612b04L11j21R5L2j66o4M7K58j09K38l62O8Q9m57N93J04l7m58K88j66K38k17
6634@k91L5M20q0j87J62j20K48k4l4j26j30j55j7K60k16L12L81m52j3j4P9k9o4
6658e5L73m81J51k66N59M5l64l6J98l46Q1J8L02j90n0Q0J13k07K84k77P0J13m9
6681F6J91k18L5j88L38k57L2L8j35K53j52j41o5L70k12k08R6K20j68R5M29k82
6703A37o0N3k03K02M4m31M2M80l36j45L44j52j15K81k0j20K19l92K13J80k82J2
6725d9P1J9K30j92j45J04k58K45J13k39M90l47K88j43r5k68J65m4K6J77l87o2
6747c01K45m6Q6J59l02J76M0R5j75J01l04K74r3M6o7J39K9q2O8kMj19j54r5K78
6772@m20O3L29K4p0J07j98K25K90l44o8J24J59j02Lj49J77j85J94L0j53l2j48
$$ plain form
6795 -144 80 157 -107 49 -107 -73 -195 123 -235 -7 250 76 108 105 394 3 -304 131 -62 26 237 -191
6817 -191 151 -120 -366 89 270 179 -45 129 -103 143 184 58 322 21 -31 388 26 142 65 -56 114
6838 114 -260 -309 -291 -110 -45 333 -121 -91 23 -31 45 186 -77 10 -228 -89 -24 -169 -355 20 202 -69 242
6861 242 -213 41 75 233 38 -172 96 26 23 -103 126 152 -385 -151 134 143 -271 232 21 -127 235 109
6883 109 -202 -72 -208 -304 262 100 31 21 26 187 51 -414 -37 144 -34 149 330 -21 6 129 -14 -326
6905 -326 -73 92 -60 323 35 194 -69 75 182 67 -136 9 155 149 -345 212 17 -45 121 -48 20
6926 20 121 -35 -78 182 -80 109 338 176 179 191 -99 -41 30 35 -25 81 -61 -405 -42 99 235 102 198 -97
6950 -97 -173 92 -37 -5 230 -135 322 -104 -3 -8 188 236 191 -365 -103 128 47 30 -488 46 -15 45 -118 -32
$$ packed form
6795a44K24P7k64J56j56L4j22L18l58K28K57j74L2lK89l91l07M35j93Q8K11m28
6817a91L42k71k46M55J81r1k24J74k32K46M1j26K64l01n2M19l62J16p7j21J70
6838A14l74m9J8J81O5L78m54L0J14n4P6J41k63Q7k38J39O5j45j86L75J82k71L11
6861B42m55K54L4J58j95k10K68p0lj26K29K6n37K34K85Rm14N03k11j48L62j26
6883A09l11J30j36r6N66j62o9j0NJ61j36m65L77J81j78J83J81l51K7J23j43l12
6905c26K53J65j52L83k88J59k63J44J07j15k03J45J46om94N57j95o2J66j69O8
6926B0J01j56m3K60k62J89K29j62LJ2k90N8P1No0J06j42l44L63J41J36j33R6k95
6950i7p6K65j29L2K35l65M57m26J01nJ96M8m5n56K62K31q1j7n18N34o1O0j63Q6
$$ plain form
6974 -32 -12 -385 -195 -108 -165 52 -82 114 4 -180 -25 284 -1 -34 -62 -88 4 -77 79 88 249 -126 -279 214
6998 214 20 -108 149 -220 41 -218 -322 85 -22 86 102 -274 -61 -211 45 30 26 19 -56 -80 -102 -26 -146
7021 -146 -45 134 -254 306 -73 21 -194 271 183 -64 -203 -170 -21 -284 -108 -146 159 -109 -324 -165 144
7042 144 -104 120 80 -93 -40 -20 373 167 86 -5 -284 -218 86 -108 -72 -225 -63 -74 -118 -232 132 3 102
7065 102 -229 -115 -119 -91 -57 -69 189 -109 79 -160 -22 61 -185 -150 135 144 -21 105 -195 7 7 -160 -97 -34
7089 -34 -89 2 -52 -114 -14 303 -50 89 116 -87 -15 -246 -8 1 151 -159 23 -133 -123 280 -133 -135 -149 -77 7
7114 7 196 165 213 -143 276 -68 -87 392 -152 109 -197 224 139 78 -130 233 218 283 68 71 -30 21 267 -150
7138 -150 28 235 100 165 -74 -217 -92 -58 -355 87 -335 -84 -305 -52 -98 -320 240 -168 187 -136 -108
$$ packed form
6974c2K0l73J90Q7n7K17j34J96j10j84J55L09k85l3k8k6R2q1J56RJ61l75j53M93
6998B14j94j28K57l69K61k59j04M07j07J08J6l76K13j50K56j5mpp5k4k2P6j20
7021a46J01J79l88N60l79R4k15M65q8k47j39L3J49k63J76l8L05k68k15J59L09
7042A44k48K24m0j73N3K0L93k06q1r1k79O6L04j94L6j53J62j1m4j14L64j29R9
7065A02l31J14mK8L4j2K58k98J88k39J38Q3k46L5K85Rj65J26l00K02%j67O3O3
7089c4n5R1n4o2J00L17l53J39K7k03P2k31K38RJ50l10J82j56J0M03m13kj4P2Q4
7114GJ89l1M8l56M19l44j9M79n44K61l06M21q5o1k08L63j5O5k15Lj01N1K46m17
7138a50J78K07j35O5k39j43J25L4k97M42m22K51k21K53m6k22N60m08L55l23K8
$$ plain form
7159 -108 -33 7 -73 -149 108 350 -204 138 -119 100 237 27 -181 -28 103 -124 157 7 226 -470 13
7180 13 -179 3 21 102 -396 -94 -44 220 116 25 36 -8 -30 -30 -76 -54 194 351 -57 -9 96 152 -383 -96 49
7205 49 36 -229 332 157 -359 -141 158 72 -292 -34 52 -232 76 120 -47 -41 -202 49 -85 193 258 168 -107
7228 -107 -83 182 5 55 116 -165 72 235 -114 427 -206 180 -71 73 127 78 -193 -48 58 126 134 293 -31
7251 -31 247 37 71 -4 -151 191 -34 71 12 -88 71 109 34 265 -105 -144 -5 5 -103 282 95 -111 -30
7274 -30 -119 117 142 347 -159 96 141 30 -244 -17 74 -23 78 -125 54 55 79 -74 234 -61 5 116 -64
7297 -64 -216 218 -285 -31 412 -16 148 39 78 16 -63 -91 69 292 163 31 -10 -413 24 -64 -155 82 140
7320 140 -100 65 -81 122 -103 -177 -37 55 -28 -120 -162 256 41 -227 -291 -32 35 119 -43 48 115 -63 -37 12
$$ packed form
7159a08P5M0q0p6K57K42n54L42k57K19J37k10k08J53J31k27K81j50K19o96M83
7180A3j92J82J8Q1m98L02N0K64j04r1J1m4k2%m6K2K48J57m08M8J05N6n35K87J45
7205D9j3k65N61j75n16K18K99q6l64K58Q6k84L08M4j67Oj61K51j34K78O5r0k75
7228a07K4K65j77N0O1k81K37J63l49N41o33L86k51J44N4m9k71J45J06O8QJ59l24
7251c1K78k10L4p5j47L42k25J05n9j00J59L8p5K31l70l9J39J0j08L85j87k06Q1
7274c0q9K36K5K05n06K55M5j11k74K27R1r7J01k03J79JK4j53L08k95O6J11j80
7297f4j52M34n03K54M43m28J64j09L9o2p9k8J60K23j29j32m1m03M37q8r1K37N8
7320A40k40J65j46K03k25p4J40R2q3r2m2M18k15k68o4K59O7Q4j62R1O7j78K6M9
$$ plain form
7344 12 -359 42 -297 223 -37 109 -10 -106 168 -35 206 30 -52 -222 -42 125 -16 -175 58 -111 10
7365 10 33 -317 31 -179 -54 -101 60 -19 299 -75 214 -82 77 -13 -359 -163 117 263 14 85 -204 84
7387 84 -15 35 39 16 291 143 85 38 -145 36 -93 303 -177 21 95 182 -242 44 262 -359 -30 126 168 176
7411 176 121 -242 -149 -147 -93 -31 -126 -88 37 -59 50 150 -80 -10 -209 47 11 3 166 284 -74 250 -19 380
7435 380 375 89 105 67 -9 235 -198 -141 -132 89 150 3 -63 -134 40 140 286 -102 2 -61 -50 269 203 206 81
7460 81 -271 92 -160 -83 -69 75 -2 -141 26 -244 56 -213 20 211 245 -86 -137 96 -267 -53 174 7
7482 7 0 -469 -177 -61 -122 33 -284 -132 31 282 189 231 50 74 324 191 169 85 199 307 -114 188 -19
7505 -19 7 102 -121 -65 166 65 158 194 149 -11 86 1 158 190 140 32 -81 113 -258 -35 263 251 -140 306
$$ packed form
7344A2l71M01l39N20k60J46j19r6K74k03K41j76q2j70J80J67j41j59K33j69J21
7365A0K3l50L48k10J25m7J61p9L18l74K89k96J59r0l46J96K80J46k49P1k89K88
7387H4r9N0Mk3K75j48n8m7j83J81j29L96m80J98P4Q7m24K86K18o21L29J56M2Q
7411A76n5l63R3KN4O2r5L8J25r6J09J00k30P0j99K56l6qJ63J18l58L24k69L99
7435C80nk86J6l8p6K44m33N7RK21O1j47o6p1J74J00J46l88J04o3J1L19o6Lj25
7460H1l52L63k52P7J4J44p7j39J67k70L00k69K33J91L4l31n1K33l63K14K27j67
7482Gpm69K92J16o1J55l17J52J63K51r3M2j81K4K50j33k2q4J14J08m21L02k07
7505a9K6R5k23N6K31j01R3L6m5j60R7q5J57L2n0j08j13J94l71K23K98j2l91M46
$$ plain form
7529 306 28 238 55 -50 -14 133 128 -189 214 158 38 223 282 -46 253 -189 119 -88 -23 98 -200 -244
7551 -244 116 -135 104 15 12 -209 300 -83 -70 14 157 70 -89 161 -35 -48 86 18 226 -50 -81 155 -98
7574 -98 4 259 -1 -39 130 -78 95 68 -34 46 -46 -71 192 25 71 242 182 -351 91 10 -64 -117 124 118
7598 118 -136 -65 94 -107 14 101 222 75 84 43 163 -142 247 188 -105 -155 109 139 312 -9 82 -8 16 -265
7622 -265 39 91 -77 33 5 19 4 -47 49 158 -190 95 -316 15 0 157 75 -91 -10 166 145 8 255
7645 255 316 -115 -246 -100 138 -42 22 1 116 43 44 -106 -20 135 -319 100 238 88 63 164 -134 -21 198
7668 198 293 336 287 186 -63 -5 113 48 -142 -63 105 182 26 41 -70 -12 139 59 -163 39 42 102 331 220
7692 220 212 -250 -226 -81 122 -134 -108 -143 -380 61 -250 -391 -153 -178 91 -19 -4 68 -229 -241 -135 -347 -346 124
$$ packed form
7529C06k78K10j83j05L6J47nl17M03n6j20J85N9l28K99m42L08k07O5J21k98m4
7551b44L60k51K39q9lk21N09l83J3Q4J43q7j59K50j96j3J34o8K08k76l1K36k53
7574i8J02K55k60l8J69k08J73k7j02Q0r2k5K63j67M6J71o0n33M42q1p4n3K41o
7598A18k54P1J59k01J21Q7J21j47Rm1J20l05L89n9k93n0K64L0J73l21R1r0K4k81
7622b65L04N2j68J10k8J4j5n1R6J09l48K85m11L31j5J57q2j66Q1J76k1j37K47
7645B55O1m31j31J46K38j80O4k1J15p3Jj50Q6J55m54M19J38j50k5J01k98J13K19
7668A98R5M3m9j01k49N8J18o5j90P9J68P7j56J5j11N8J51q0k22K02LO0K29j11
7692B20qm62K4J45K03k56K6l5k37M41l11j41K38k5K69j10J5P2k97j2J06k12JM70
$$ plain form
7716 124 -36 23 -70 -45 -250 -104 93 109 34 -48 78 -159 -179 14 23 208 226 115 159 89 207 43 281 136
7740 136 -67 -246 160 -159 -95 155 42 88 41 -43 -46 -51 33 106 -122 72 -199 -241 -7 316 63 94 21 112 146
7765 146 -16 11 38 -153 32 335 28 126 195 -41 94 87 248 -263 -212 -79 29 77 -8 77 101 -139 113 115
7789 115 165 260 138 13 -67 -91 -73 -24 -311 -21 -119 -193 15 -303 -112 -121 158 136 25 12 -52 1 82 29 115 -178
7815 -178 194 -163 -34 133 45 4 142 201 110 227 96 147 75 67 214 142 -76 -4 -19 43 86 -238 366 125
7839 125 -73 147 -11 33 -109 10 294 -28 -91 -52 -160 264 -169 -165 159 126 17 82 201 63 -59 -36 -119
7862 -119 264 32 75 154 -141 140 -276 -130 -59 -147 -262 -35 -101 63 54 124 144 83 -167 91 322 -129 -20
7885 -20 -108 -316 188 213 -66 81 -192 -79 389 -105 14 -204 64 80 10 -107 -60 15 -39 299 352 -218 -66
$$ packed form
7716A24j60N9r3K5k05J46J97J6p5q2J26k37k0J93RJ85J8j11M4p0J18j64K38j45
7740A36k03j79M06l19O4K50j13M6m7q4lnQ4P3k28J94k71m2K34L23k53L1p3R1L4
7765A46j62K7K7j91J85L03l07R8O9k36J35pJ61n11N1J33J08M8q5Q5K4k40K52K
7789A15N0R5j22j25q0k4J8M9k87K90r8p4K08l18J91rK79k2j11j3o4N3Q1n3Q6k93
7815a78L72l57J29J67q8m1J38N9r1J17j31N1p2qJ47p2k18P2j5O2M3l24O04k41
7839A25j98K20j58M4j42J19K84l22o3L9j08M24m33ML24l3j09O5J19j38j22K3q3
7862a19L83k32M3P9k95K81m16J46P1q8j15K27o6J64rP0K0o1k50K58K31m51J09
7885b0q8k08N04K5k79J47k73J13M68m94J19k18K68J6p0j17M7P5n4L38N3n70J52
$$ plain form
7908 -66 -450 -22 -19 -206 -83 -74 29 -314 -34 -174 -29 -13 -22 -96 219 -142 -24 105 -528 -72 20 -220 26
7931 26 69 -117 -216 60 143 32 106 106 70 -126 33 -148 -12 -70 -77 -185 99 -128 -160 81 103 149 222 97 -17
7956 -17 301 -10 45 156 19 -16 -64 -146 -3 114 -252 -60 -63 -165 -133 104 162 261 -189 31 -86 266 277 -43
7980 -43 -151 -15 107 71 -63 -220 183 -89 -82 -168 45 -39 211 -105 178 -103 -21 -185 55 147 -55 116 -172
8003 -172 110 192 57 -167 359 47 181 -192 69 20 -178 65 -68 157 -6 -365 -236 84 330 18 88
8024 88 10 12 68 130 91 51 96 310 220 171 -11 22 336 -175 -31 31 -105 90 -71 0 -92 -78 339 -89 -203
8049 -203 -130 -134 -112 127 58 221 102 -162 265 -220 -87 -215 83 65 -4 38 42 237 322 -255 -182 -49 -54 77 154
8074 154 132 157 -170 -75 35 -179 -192 -112 59 215 176 211 116 242 -338 50 -151 -271 15 -67 -136 43 -65
$$ packed form
7908f6l84M28Lj87J23RJ03l43K80j40J45J6rp4L15l61J18J29o33M56R2k40K46
7931B6M3j86r9K76Q3j11P4%l6j96J59j81J36n8pj08K84k27l2K41K2M6P3j25j14
7956a7L18l11N5J11j37l5m8q2J43J17l66J92lj02L2K37N8R9m50K20j17L52J1l20
7980d3j08J36J22l6j34j57M03k72Pq6K13q4K50l16K83k81Q2j64K40R2k02J71k88
8003a72K82Q2j35k24N26l12J34l73K61m9j98K43j33K25j63l59J29L20K46l12P0
8024H8p8KN6O2l9m0M5K14r0m9j82L3L14n11J44O2j36J95j61P1r2J4M17m28j14
8049b03P3mK2K39o9J63j19k64M27m85J33j28K98j8o9M2MJ95Q5n77P3J33nJ31P7
8074A54k2K5l27R5J10k14j3Q0J71J56l9L5r5J26n80L88k01j20K86q2o9J79j08
$$ plain form
8097 -65 102 -248 143 270 238 142 -161 78 -196 -300 -308 -171 100 -67 -157 -76 -271 2 386 88 -53 237
8119 237 -177 -70 105 63 -79 185 82 -15 -209 82 -90 37 -357 -198 -26 103 105 -44 -253 123 -126
8140 -126 -72 9 -167 66 -234 -263 52 -165 174 63 327 88 146 231 -53 6 -104 23 244 -5 -264 59
8162 59 -261 -75 46 242 47 -399 76 -296 -131 51 139 -123 257 185 -20 144 98 307 32 -132 119
8183 119 -140 33 -64 -115 -10 24 -12 -145
$$ packed form
8097f5J67l50L91J27l2r6l03K39k74j04qJ37K71j67r0Q1j95K73L84k98j41K90
8119B37m14J07J75m2j42K64j03r7j94K91j72J27l94J59J72J29Kj49k09L76k49
8140a26N4Q1j76K33l00k9L15k17L39j11K64k39N8Q5k84N9j10J27K21k49k59L23
8162E9l20J86J21J96j95m46M75l72J65J82Q8k62L80p2k05J64m6K09k75j64K51
8183A19k59J73r7n1J05L4l6j33
8191a45
$$ Imaginary data points
##PAGE= N=2
##DATA TABLE= (X++(I..I)), XYDATA
$$ plain form
0 0 0 0 0 0 4 0 8 -8 8 -16 16 -19 24 -32 40 -48 56 -64 80 -91 107 -123 146 -166 192 -219 251 -283 321
29 321 -363 409 -459 514 -578 644 -717 797 -884 981 -1087 1205 -1332 1476 -1634 1812 -2009
46 -2009 2233 -2489 2782 -3124 3528 -4016 4614 -5371 6368 -7739 9760 -13047 19310 -35598
60 -35598 168326 357200 23793 -134588 -74968 125734 185746 142252 52046 16002 1834
71 1834 35676 80817 104240 39175 -32453 -15186 90570 129536 48075 -60483 -64666 9937
83 9937 69753 69982 54318 27477 -29382 -84339 -45011 70021 128131 55217 -50490 -69413
95 -69413 -8861 34735 29061 22718 40330 31224 -22260 -46757 9701 76525 59548 -18945 -50217
108 -50217 9497 82609 75434 -3884 -62440 -44079 28562 96551 104386 22615 -89501 -107310
$$ packed form
0@%%%%MmQj6J6k4L2l5M3n6P2q8J04j20J44j71J98k30K69l12L58m11M70n34O04
29C21o84P72q68R73j092J222j361J514j681J865k068K292k537K808l110L446l821
46b009M242m722N271n906O652p544Q630r985J1739j4107J7499k2807L2357n4908
60c5598K03924J88874l33407j58381N9620K00702O0012m3494r0206l6044j4168
71A834L3842M5141K3423o5065p1628J7267J05756L8966q1461j08558m183P4603
83I937N9816K29j5664k6841n6859n4957L9328J15032N8110p2914j05707j8923
95f9413O0552M3596n674o343J7612r106n3484k4497N6458O6824j6977p8493l1272
108e0217N9714P3112p175p9318n8556J8361P2641O7989P835q1771j12116j7809
$$ plain form
120 -107310 9106 136599 127583 -7838 -113259 -76826 41880 97138 42217 -33242 -49236
131 -49236 -19930 11202 33647 36471 -3512 -63586 -70574 6021 85724 60569 -50502 -113617
143 -113617 -58401 37904 67642 21684 -37632 -61521 -45605 -6686 27696 27136 -11259 -49348
155 -49348 -40490 4260 23678 -5400 -33082 -19269 4285 -1219 -17691 -6191 20339 10459 -40245
168 -40245 -59695 -3261 67074 57997 -23196 -79678 -51745 23713 70410 50848 -9724 -52202
180 -52202 -41918 9482 57534 55993 1961 -46263 -30966 30964 66937 40461 -12856 -37916
192 -37916 -12251 38088 69842 55543 1303 -49503 -42897 30857 100302 83033 -7242 -69516
204 -69516 -36729 48723 91010 49990 -16842 -35304 1080 40536 44784 20282 -7081 -14168
$$ packed form
120a07310J16416J27493r016j35421j05421L6433J18706N5258n4921p5459j5994
131d9236K9306L1132K2445K824l9983o0074o988P6595P9703k5155j11071o3115
143a13617N5216R6305K9738m5958n9316k3889J5916L8919L4382n60l8395l8089
155d9348Q858M4750J9418k9078k7682J3813K3554n504j6472J1500K6530r880n0704
168d0245j9450N6434P0335r077q1193n6482K7933P5458M6697j9562o0572m2478
180e2202J0284N1400M8052j541n4032m8224J5297O1930L5973k6476n3317k5060
192c7916K5665N0339L1754j4299n4240n0806O606P3754O9445j7269r0275o2274
204f9516L2787Q5452M2287m1020o6832j8462L6384L9456M248k4502k7363p087
$$ plain form
216 -14168 6383 33767 38158 13789 -13257 -16562 4277 25214 27768 18598 8811 -6273 -22321
229 -22321 -15530 20928 50412 34443 -13235 -42557 -20672 25457 45382 23928 -6164 -17235
241 -17235 -10712 5255 25067 31398 11050 -19672 -24800 10012 50022 44982 -7908 -48572 -28702
254 -28702 32592 70150 44839 -19567 -61433 -34809 34533 75991 45021 -25756 -63433 -27714
266 -27714 40160 62840 17840 -37699 -42060 -1457 33492 28180 -4640 -28446 -24431 -2736 15905
279 15905 19776 4755 -20880 -32750 -17716 9465 22390 11251 -13529 -31137 -26394 -2864
291 -2864 17541 18121 -2061 -24626 -26734 -5977 14516 12661 -2272 -13040 -14489 -8970 1486
304 1486 12561 13619 -1994 -23873 -25623 5127 38378 30067 -15723 -48079 -28082 25001 53344
$$ packed form
216a4168K0551K7384M391k4369k7046l305K0839K0937K554r170r787j5084j6048
229b2321O791L6458K9484j5969m7678k9322K1885M6129J9925k1454l0092j1071
241a7235O523J5967J9812O331k0348l0722n128L4812M0010n040n2890m0664J9870
254b8702O1294L7558k5311o4406m1866K6624O9342M1458l0970p0777l7677L5719
266b7714O7874K2680m5000n5539m361M0603L4949n312l2820k3806M015K1695J8641
279A5905L871j5021k5635j1870J5034K7181J2925j1139k4780j7608M743K3530
291b864K0405N80k0182k2565k108K0757K0493j855j4933j0768j449N519J0456
304A486J1075J058j5613k1879j750L0750L3251q311m5790l2356J9997N3083K8343
$$ plain form
317 53344 25223 -28545 -50428 -18965 30115 48015 19092 -28721 -45529 -13437 32656 42304
329 42304 6805 -33413 -37218 -2831 31025 30331 -292 -27063 -27543 -5760 20429 27693 7878
342 7878 -21388 -31298 -11819 18216 28374 8277 -21604 -27398 -5341 16971 17771 1229 -13630
355 -13630 -13641 -2912 6299 7537 4063 -636 -7746 -10704 -4971 8166 16621 10785 -9400 -25359
369 -25359 -15585 15458 33404 15548 -20726 -36457 -12993 25391 36456 8124 -26490 -31525
381 -31525 -4798 25606 29468 4224 -24460 -27644 -2578 23805 27143 4301 -24123 -28255 -3791
394 -3791 24838 28474 5739 -22364 -29019 -6665 23898 31073 8079 -22686 -30269 -5787 26433
407 26433 30819 2400 -25579 -21768 5782 25347 18153 -4070 -17122 -8953 6935 13293 10042
$$ packed form
317E3344k8121n3768k1883L1463M9080J7900k8923m7813j6808L2092M6093R648
329D2304l5499m0218l805L4387L3856o94l0623k6771m80K1783K6189P264j9815
342G878k9266r910J9479L0035J0158k0097k9881n794K2057K2312Q00j6542j4859
355a3630j1J0729R211J238l474m699p110k958N733J3137Q455n836k0185j5959
369b5359R774L1043J7946j7856l6274j5731K3464L8384J1065k8332l4614n035
381c1525K6727L0404L862k5244k8684l184K5066K6383L338k2842k8424m132K4464
394c791K8629L636k2735k8103o655K2354L0563P175k2994l0765p583K4482L2220
407B6433M386k8419k7979L811K7550J9565p194k2223j3052Q169J5888O358l251
$$ plain form
420 10042 2616 -3771 -6725 -3133 4687 12858 13873 3252 -11739 -13675 918 17649 19543 4090
434 4090 -14502 -18165 -1074 18834 21074 3460 -15991 -19157 -2066 17922 20241 1800 -18265
447 -18265 -21616 -3980 17956 23204 2971 -22516 -26442 -4721 21800 25888 1229 -27079 -29124
460 -29124 -2521 24841 24806 -2114 -28546 -25510 3503 26032 19132 -8159 -24480 -15302 7919
473 7919 20862 11621 -7431 -16275 -8312 4521 12348 10301 559 -8826 -10096 -1975 9735 13965
487 13965 5939 -7690 -12759 -3607 8438 12812 6617 -4804 -10961 -5963 3887 10539 8320 -924
501 -924 -10715 -11815 -1048 10541 12315 926 -14274 -17920 -4373 14102 17398 936 -19653
514 -19653 -23897 -4211 19103 21455 -2440 -26474 -24495 1584 24090 19380 -8274 -28218 -18953
$$ packed form
420A0042p426o387k954L592P820Q171J015j0621j4991j936J4593J6731J894j5453
434D090j8592l663J7091J9908K240j7614j9451l166J7091J9988K319j8441k0065
447a8265l351J7636K1936N248k0233k5487l926K1721K6521M088k4659k8308k045
460b9124K6603K7362l5k6920k6432L036K9013K2529o900k7291j6321R178K3221
473G919J2943r241j9052q844P963J2833P827k047r742r385j270Q121J1710M230
487A3965q026j3629n069R152J2045M374o195j1421o157M998R850O652k219r244
501i24r791j100J0767J1589J774j1389j5200l646J3547J8475L296j6462k0589
514a9653m244J9686K3314K352k3895k4034J979K6079K2506m710k7654j9944R265
$$ plain form
527 -18953 8722 23568 13106 -10940 -23176 -12223 9417 18997 8548 -8345 -16384 -8841 6022
540 6022 15311 9723 -4179 -12928 -8899 3409 12968 9738 -2462 -10615 -7520 2353 8962 7573
554 7573 535 -5704 -6165 -1520 4261 7849 6097 -2136 -9089 -7184 2581 11386 10538 -1036 -12301
569 -12301 -11254 2338 15802 14317 -1109 -16077 -14349 4040 19719 15391 -4325 -19102 -12733
582 -12733 8183 21482 12929 -7760 -18146 -8607 9530 18605 10453 -6919 -16389 -8702 8154
595 8154 17299 11240 -5450 -16140 -9422 7967 17518 10332 -6094 -15466 -8255 8178 15935 7219
609 7219 -7098 -11850 -4241 6937 10924 4845 -4412 -7204 -3233 2977 6819 6318 372 -4694 -5421
624 -5421 -1514 5000 9159 5639 -3360 -8858 -5254 4805 11778 8563 -3615 -12777 -8177 5919
$$ packed form
527a8953K7675J4846j0462k4046j2236J0953K1640R580j0449j6893q039P543J4863
540F022R289n588j3902q749M029J2308R559l230j2200q153L095R873O609j389
554G573p038o239m61M645N781L588j752q233o953J905R765Q805q48j1574j1265
569a2301J047J3592J3464j485j5426j4968J728J8389J5679m328j9716j4777O369
582a2733K0916J3299q553k0689j0386R539J8137R075q152j7372r470P687J6856
595H154R145o059j6690j0690O718J7389R551p186j6426r372P211J6433P757q716
609G219j4317m752P609J1178L987o079r257k792L971O210L842n01n946n066p27
624e421L907O514M159l520q999n498L604J0059O973l215j2178r162M600J4096
$$ plain form
638 5919 14771 8741 -6007 -15372 -7759 8233 14925 5924 -8560 -14399 -7145 6939 13570 6482
652 6482 -8455 -15544 -8410 6297 14834 7707 -8591 -16470 -8585 7920 15059 6330 -9279 -15016
666 -15016 -4953 9227 13199 4623 -6843 -10323 -3149 8253 12287 5213 -4639 -7800 -2065 7271
680 7271 11416 6469 -1851 -5467 -2093 4962 9450 7574 651 -4342 -3385 1680 7564 8531 3258 -4170
696 -4170 -6072 -1062 6158 9053 3937 -4488 -8459 -3147 5396 9120 4484 -5541 -11172 -6932 4794
711 4794 11231 6017 -6910 -14348 -8098 6469 13948 5566 -10207 -15946 -5712 9602 14020 2713
725 2713 -11165 -12760 -1963 10597 12017 2553 -8830 -10216 -85 10098 10974 2601 -6755 -8056
739 -8056 320 9239 10133 3097 -4052 -5042 260 6379 7814 4345 -692 -3357 -1945 2826 7188 6020
$$ packed form
638E919Q852o030j4748r365P613J5992O692r001j4484n839P254J4084O631p088
652F482j4937p089P134J4707Q537p127j6298p879P885J6505P139q729j5609n737
666a5016J0063J4180L972q576j1466l480P174J1402M034p074r852l161N735R336
680G271M145m947q320l616L374P055M488j876o923m993R57N065N884R67n273p428
696d170j902N010P220K895n116q425l971N312Q543L724m636j0025n631M240J1726
711D794O437n214j2927p438O250J4567P479q382j5773n739J0234J5314M418j1307
725B713j3878j595J0797J2560J420r464j1383j386J0131J0183Q76q373r356j301
739h056Q376Q919Q94p036p149r90N302O119J435l469n037k665J412M771M362j168
$$ plain form
755 6020 69 -4239 -3259 2080 6946 6316 631 -4938 -5195 -145 5826 7902 2785 -5087 -8204 -2275
771 -2275 7035 9920 3918 -6824 -10208 -2438 7912 10555 2432 -8255 -10277 -1382 9021 10233
785 10233 1217 -8556 -9125 -112 9450 10293 997 -8471 -8801 320 9510 10055 1322 -8224 -7740 1375
801 1375 8960 7854 602 -5923 -5422 1073 6737 6242 1026 -3237 -3917 -157 5072 6068 2553 -1721
817 -1721 -3565 -807 3887 6164 3757 -663 -3819 -2562 1365 6250 7121 1672 -4290 -5613 689
832 689 7959 8970 1482 -6498 -6067 1912 8895 7779 382 -6438 -5769 2225 8933 7594 189 -6670
848 -6670 -6083 1981 9053 7425 -1098 -7631 -6198 1743 8511 7104 -662 -6795 -5045 1488 7055
863 7055 6275 -210 -5981 -5202 1085 5912 5860 303 -5155 -5057 967 5830 5643 551 -4484 -4352 542
$$ packed form
755F020n951m308R80N339M866o30n685n569k57N050N971K076n117p872l117N929
771b275R310K885o002j0742l384P770J0350K643q123j0687k022Q895J0403J212
785A0233r016r773n69R013R562Q43r296r468l30R121R190N45q733r546M84R115
801A375P585j106p252o525N01O495N664m95n216m263o80L760N229R96l515m274
817a721j844K758M694K277k407m420l156J257L927M885Q71n449n962j323O302
832F89P270J011p488p980M31P979O983j116p397o820O69P994O708j339p405o859
848f670N87Q064P072j628q523o533J433P941O768j407p766o133J750O533N567
863G055p80o485n771P79O287M827n2n557n458R8O024M863j87n092n035J32M894
$$ plain form
880 542 5136 5073 1068 -2894 -3818 -863 3611 5294 2846 -1923 -3952 -2725 2352 6083 3981 -2000
896 -2000 -5289 -3262 2217 6010 4081 -1700 -5486 -3921 1354 5838 5317 -1102 -7154 -5908 1468
911 1468 7277 5314 -2110 -7975 -5490 2206 7519 4462 -2663 -6971 -4602 2084 6778 3920 -2649
926 -2649 -6735 -4036 2221 6087 4407 -2129 -5963 -3490 2507 5591 3745 -1347 -4618 -3161 1804
941 1804 4374 3576 87 -3046 -3238 270 4231 4002 1036 -3004 -3702 -798 3372 4270 1115 -3018
957 -3018 -3967 -1689 2790 4295 1789 -2476 -4591 -2733 1891 5213 3003 -2708 -6038 -3868 1971
972 1971 5580 3267 -2742 -6197 -3653 2718 5650 3265 -2898 -6131 -3659 2451 5915 2974 -3174
987 -3174 -6425 -3409 3056 6890 2745 -3768 -6312 -2166 3407 5671 1541 -3522 -4894 -1461 2618
$$ packed form
880E42M594o3m005l962r24K955M474J683k448m769k029J227N077L731k102n981
896b000l289K027N479L793j929n781l786J565N275M484n21o419o052J246P376
911A468N809j963p424n865K485P696N313l057p125m308K369O686M694k858o569
926b649m086K699O257L866j680o536l834K473N997L084j846n092l271J457M965
941A804K570p98l489l133j92L508L961k29k966m040o98K904M170Q98l155m133
957c018r49K278M479J505k506m265k115J858M624L322k210n711l330K170N839
972A971L609k313o009l455K544O371K932k385o163l233K472O110L464k941o148
987c174l251L016O465L834m145o513k544M146N573K264m130n063j372L433M079
$$ plain form
1002 2618 3976 1553 -1946 -3520 -1891 1564 2763 1709 -858 -2832 -2603 852 2497 2258 -25
1017 -25 -1927 -2951 -768 2017 3547 1538 -2210 -4548 -2044 2727 4947 1682 -3091 -5229 -1620
1032 -1620 3253 5207 1636 -3719 -5249 -1530 3182 5301 1882 -3993 -5227 -1198 4162 5114 1150
1047 1150 -3441 -5292 -885 4271 5100 584 -3821 -4533 -799 3742 4163 820 -3080 -3395 -1009 2423
1063 2423 3860 1485 -2423 -3764 -1400 1897 3654 1099 -2094 -3485 -1312 1695 2674 1594 -1043
1078 -1043 -2623 -1940 746 2690 2749 109 -2936 -2763 181 2701 3191 166 -2841 -3228 -223 3190
1094 3190 3525 856 -2865 -3393 -457 3297 4433 969 -3377 -3849 -431 3966 5013 958 -3882 -3697
1110 -3697 688 4641 4443 402 -3288 -3321 759 3961 3744 706 -2681 -2878 189 3452 3569 376
$$ packed form
1002B618J358k423l499j574J629L455J199j054k567j974K29L455J645k39k283
1017b5j902j024K183K785J530k009l748k338K504M771K220l265m773k138L609
1032a620M873J954l571n355j530L719M712K119l419n875j234M029N360R52l964
1047A150m591j851M407N156Q29m516m405p12L734M541M21l343l900l15K386L432
1063B423J437k375l908j341K364L297J757k555l193j391K173L007R79j080k637
1078a043j580O83K686J944N9k640l045J73K944K520M90l025l007l87L005L413
1094C190L35k669l721n28K936L754J136l464m346m72L418M397J047m055m840J85
1110c697M385L953j98m041l690l3M080L202k17l038l387j97L067L263J17l193
$$ plain form
1126 376 -2645 -2559 59 3273 2881 387 -2342 -2130 -209 2038 2815 932 -1443 -2647 -1420 980
1142 980 2589 1388 -1359 -2881 -1639 1497 2658 1228 -1340 -2986 -2013 983 2499 1540 -729 -3053
1158 -3053 -2621 108 2976 2501 -405 -3294 -2899 49 3360 2833 -377 -3222 -2779 225 2771 3160
1174 3160 3 -3291 -3269 -81 3217 3350 -370 -3560 -3524 614 3502 3142 -827 -3659 -2969 535 3725
1191 3725 2543 -830 -3156 -2519 353 2298 1644 -487 -2469 -2230 -61 1870 1645 -114 -2230 -2120
1207 -2120 -345 1172 1600 178 -1379 -2131 -1160 763 1362 1386 -724 -2574 -2090 544 2512 2066 -411
1224 -411 -2817 -2027 1075 2874 1925 -833 -2794 -2243 952 2919 2409 -872 -3041 -1925 916 3835
1240 3835 2542 -1001 -3644 -2019 1721 3571 2373 -1424 -2992 -1181 1826 3067 1978 -872 -2238
$$ packed form
1126C76l021Q6K618L214l92k494k729K12J921K247P77j883k375j204J227K400
1142I80J609j201k747j522J242L136J161j430k568j646R73K996J516r59k269k324
1158c053M32K729K868m75k906k889L95K948L311n27l210k845M43L004K546L89
1174C160l157l294K2L188L298J33l720l190L6M138K888l60l969k832O90L504L190
1191C725j182l373k326O37K872J945o54k131j982K39K169J931k25j759k116J10
1207b120J775J517M28j422j557p52R71J923N99K4k110j850M84K634J968m46k477
1224d11k406P90L102J799r49k758j961N51L195J967n10l281k169J116K841K919
1240C835j293l543k643J625L740J850j198l797j568J811L007J241j089k850j366
$$ plain form
1255 -2238 -1321 1430 2845 1765 -742 -2082 -1167 1216 2774 1922 -590 -1796 -706 684 1847 1647
1271 1647 -94 -1270 -826 100 1260 1548 632 -971 -1545 -89 1179 2039 1153 -769 -1790 -1020 1058
1288 1058 2602 1888 -470 -2178 -1464 1401 3051 2342 -957 -2761 -1369 2017 3858 1884 -1734 -2556
1304 -2556 -663 2547 3472 1317 -1769 -2321 -245 2064 3108 1229 -1119 -1821 -617 1890 2379 943
1320 943 -1204 -1844 -829 1505 2279 872 -930 -1417 -908 883 1094 718 -487 -1409 -1448 211 1241
1337 1241 1236 -278 -1849 -1816 -525 1136 1115 -241 -1983 -2226 -670 709 1401 -135 -1944 -2749 -1157
1354 -1157 852 1769 96 -2145 -2573 -688 1305 2092 53 -2132 -2340 -494 1746 2162 650 -1329
1370 -1329 -1970 -735 1411 1938 809 -1607 -2253 -437 1850 2580 405 -1820 -1899 -236 1885 1718 520
$$ packed form
1255b238R17K751J415j080k507j340R15K383J558q52k512j206J090J390J163k00
1271A647j741j176M44R26J160K88r16j603n74J456J268Q60q86j922j021P70K078
1288A058J544p14k358j708P14K865J650p09l299j804J392L386J841j974l618q22
1304b556J893L210R25k155l086n52K076K309J044j879k348p02J204K507M89j436
1320I43k147o40J015K334P74j407j802m87N09J791K11l76j205r22l9J659J030
1337A241nj514j571L3J291J661k1j356j742k43J556J379O92j536j809q05J592
1354a157K009R17j673k241m28J885J993P87k039k185k08J846K240M16j512j979
1370a329o41J235K146N27j129k416o46J816K287P30k175k225p9J663K121j67j198
$$ plain form
1387 520 -1437 -1724 -83 1337 1454 127 -833 -1724 -614 1021 1426 399 -918 -1619 -928 526 923
1404 923 620 -725 -1312 -1150 -132 1259 1115 186 -1278 -1228 -333 1324 1261 -409 -1645 -1739 -124 1722
1422 1722 1591 -37 -1656 -1750 87 1631 1884 521 -1222 -1775 -291 2102 2233 384 -1643 -1504 371
1439 371 2262 2230 304 -1465 -1383 549 2062 1797 493 -1375 -1345 516 1770 1891 439 -1047 -1108 666
1457 666 1890 1749 412 -1033 -920 388 917 1094 -103 -352 -522 24 934 1279 646 -396 -841 -539
1475 -539 412 995 804 -553 -1221 -788 60 1027 989 170 -1235 -1603 -308 1053 1572 -19 -1795 -1614
1493 -1614 10 2001 1721 -515 -2189 -1423 368 2219 1440 -966 -1887 -1505 790 1418 996 -681 -2053
1510 -2053 -1144 549 1715 1471 -798 -1394 -754 741 1215 730 -595 -1388 -650 569 931 594 -66 -854
$$ packed form
1387E20j957k87J641J420J17j327r60q91J110J635M05j027j317p01O91J454L97
1404I23l03j345n87J62J018J391j44r29j464N0Q95J657o3j670j236r4J615J846
1422A722j31j628j619r4J837J544K53j363j743n53J484K393J31j849k027J39J875
1439C71J891l2j926j769Q2J932J513k65j304j868L0J861J254J21j452j486o1J774
1457F66J224j41j337j445J13J308N29J77j197k49j70N46R10L45o33j042m45L02
1475e39R51N83j91j357o68M33Q48R67l8q19j405l68J295J361N19j591j776J81
1493a614J624J991k80k236j674P66J791J851p79k406r21L82K295O28m22j677j372
1510b053R09J693J166k44k269n96O40J495M74m85j325p93P38J219L62l37o60p88
$$ plain form
1528 -854 -607 191 845 800 -30 -906 -1021 -207 741 967 330 -820 -971 -716 540 1171 456 -348 -1120 -641
1548 -641 318 1167 873 -539 -1409 -894 589 1387 860 -719 -1487 -832 835 1485 692 -391 -1664 -1005
1566 -1005 523 1594 734 -682 -1476 -906 550 1900 901 -735 -1555 -441 918 1451 461 -745 -1073
1583 -1073 -322 696 1294 758 -552 -977 -417 631 1114 549 -354 -799 -309 101 743 360 114 -369 -462
1602 -462 -538 632 1094 238 -392 -912 -228 440 992 76 -831 -1430 -326 794 813 344 -894 -1209 -586
1621 -586 794 1147 795 -499 -1446 -388 1067 1227 568 -916 -1460 -375 904 1307 310 -615 -1053 30
1639 30 1041 1120 568 -759 -1092 -467 663 1132 236 -615 -1026 -201 645 989 322 -648 -1127 -329 380 559
1659 559 121 -377 -760 -83 253 479 612 -220 -551 -717 117 500 687 -135 -755 -727 -170 196 512 169
$$ packed form
1528h54K47P98O54m5q30q76j15Q14R48K26o37j150j51K55J256O31p15q04p72M79
1548f41R59Q49k94j412q70N15J483P98n27j579p68O55J667O50p93j083j273O59
1566a005J528J071q60j416p94N70J456J350r99j636q20J114J359N33r90j206l28
1583a073P51J018N98n36j310m25N60J048M83n65r03m45M90M10O42l83k46m83r3
1602d62p6J170M62q56o30n20O84O68N52r16r07n99J104J120J9m69j238l15O23
1621e86J380L53l52j294r47J058J455J60o59j484n44J085J279M03r97r25m38J083
1639C0J011P9n52j327l33O25J130M69q96q51m11Q25Q46L44o67r70m79P98P09J79
1659E59m38m98l83O77L36K26J33q32l31j66Q34L83J87q22o20K8N57L66L16l43
$$ plain form
1679 169 -312 -951 -100 255 1034 426 -578 -820 -213 591 1218 587 -876 -1256 -214 666 1196 331 -1076
1698 -1076 -878 -548 1080 1167 231 -793 -1241 -326 1027 1052 -6 -1083 -992 -133 859 701 132 -1031 -826
1717 -826 387 441 629 295 -462 -819 -87 243 754 285 -630 -342 -167 48 664 235 -248 -50 -316 51
1737 51 464 395 -63 -412 -906 -33 580 887 452 -431 -677 -370 559 650 -66 -496 -715 -332 544 1132 120
1758 120 -519 -1158 -137 866 1066 95 -1455 -932 -392 717 969 13 -1036 -501 205 823 704 -34
1776 -34 -816 -538 225 535 674 -202 -649 -597 135 468 298 3 -464 -292 251 505 342 -63 -251 -110 -140
1797 -140 252 56 222 29 -454 -460 -309 262 332 -47 -475 -718 278 722 275 150 -525 -615 99 751 793 -122
1819 -122 -926 -554 205 686 713 -348 -870 -743 -31 606 453 -6 -694 -471 343 826 429 -149 -751 -565
$$ packed form
1679A69m81o39Q51L55P79o08j004k42O07Q04O27o31j463l80J042Q80N30q65j407
1698a076J98L30J628Q7r36j024m48R15J353K5j058j077R1Q59R92j58n69j163K05
1717h26J213N4J88l34p57l57P32L30N11m69r15K88J75K15O16m29m83J98k66L67
1737E1M13o9m58l49m94Q73O13L07m35q83k46L07R29R1p16m30k19L83Q76N88j012
1758A20o39o39J021J003K00r71j550N23N40J109K52r56j049N35P06O18j19p38
1776c4p82K78P63L10J39q76m47N2P32L33j70k95m67J72N43K54j63m05j88J41l0
1797a40L92j96J66j93m83oJ51N71P0l79m28k43R96M44m47j25o75r0P14O52M2r15
1819a22q04L72P59M81K7j061n22J27P12O37j53m59o88K23Q14M83l97n78o02J86
$$ plain form
1839 -565 298 679 528 -284 -927 -546 274 609 267 -612 -526 -273 -16 492 269 -381 -605 -37 44 338 467
1860 467 -217 -477 -492 -17 113 204 57 93 -379 15 76 314 388 220 -279 -316 -54 310 283 -54 -389 -441 -202
1883 -202 468 644 -348 -584 -362 452 840 350 12 -565 -350 -61 1066 592 -273 -546 -318 39 768 370
1903 370 -738 -757 -88 536 705 176 -336 -468 -265 162 349 91 -161 -420 71 157 411 446 -204 -376 -254
1924 -254 185 334 275 -74 -325 -283 -44 263 397 156 -348 -190 -292 110 519 306 -135 -381 -339 71 490
1945 490 -65 11 -366 -270 10 400 431 -165 -510 -564 314 556 206 -517 -521 -349 427 387 148 -206 -591 -68
1967 -68 517 552 322 -648 -547 -314 487 711 -121 -630 -451 -252 268 171 304 -364 -706 188 137 252 -197
1988 -197 -26 -279 -309 -36 233 384 -246 -299 -158 -113 185 235 248 15 -526 -35 534 734 393 -27 -378 -252
$$ packed form
1839e65Q63L81j51q12o43L81Q20L35l42q79Q6K53K57N08k23o50k24N68Q1K94J29
1860D67o84k60j5M75J30R1j47L6m72L94O1K38P4j68m99l7K62L64k7l37l35n2K39
1883b02O70J76r92k36K22Q14L88m90l38n77K15K89J127m74q65k73K28L57P29l98
1903C70j108j9O69O24J69n29n12j32K03M27J87k58k52k59M91Q6K54L5o50j72J22
1924b54M39J49n9l49k51M2K39L07J34k41n04J58j02M02M09k13m41k46M2M10M19
1945D90n55P6l77R6K80L90L1n96l45n4Q78K42l50p23mJ72P76m0k39l54l85N23
1967f8N85L5k30r70J01K33Q01K24q32n09J79J99N20r7J33o68l42Q94n1J15m49
1988a97J71k53l0K73K69J51o30n3J41M5K98N0J3k33n41M91N69K00l41m20l51J26
$$ plain form
2010 -252 360 560 110 -311 -474 -63 337 353 41 -493 -324 120 187 404 146 -438 -572 -238 116 329 156
2031 156 -368 -443 -119 312 405 -179 -550 -284 37 333 450 16 -562 -393 105 -95 595 -86 -154 -422 123
2052 123 505 196 -85 -441 -104 -44 -6 95 95 -21 -247 -259 -71 -21 -107 27 -159 -71 -148 -83 252 108 -54
2075 -54 -437 -99 196 23 -69 -107 -675 33 16 411 -66 -260 -146 -235 306 455 -47 -526 -193 51 438 199
2097 199 105 -500 -117 -177 29 -20 -50 -468 -499 16 -14 233 280 -362 -306 271 507 276 -29 -61 301 122 86
2120 86 376 -43 -105 -279 -84 106 224 -47 -159 -42 -368 139 123 4 32 -262 -70 302 338 165 -118 -225
2142 -225 -157 -128 223 473 103 -360 -238 -30 233 16 -274 -16 -293 67 -3 200 -385 -267 -529 112 540
2163 540 336 144 -340 -165 144 374 66 63 -87 -176 142 293 -9 -306 -118 -103 189 314 143 -152 -62 -156
$$ packed form
2010b52O12K00m50m21j63M11M00J6l12n34J69M44O7K17k58n84j34L34L54K13j73
2031A56n24p5L24M31R3n84l71K66L21K96J17m34n78J69M98k00O90o81o8k68N45
2052A23L82l09k81l56L37O0L8J01%j16k26j2J88N0q6J34j86Q8p7O5L35j44j62
2075e4l83L38K95j73r2l8n68P08j7L95m77j94J14q9N41J49n02m79L33K44L87k39
2097A99r4o05L83o0K06m9l0m18l1N15l0K47M7o42N6N77K36k31l05l2L62j79l6
2120H6K90m19o2j74J95J90J18k71j12J17l26N07j6j19K8k94J92L72L6j73k83j07
2142b25O8K9L51K50l70m63J22K08K63k17k90K58k77L60p0K03n85J18k62O41M28
2163E40k04j92m84J75L09K30l08lj50q9L18J51l02k97J88J5K92J25j71k95R0r4
$$ plain form
2185 -156 0 240 175 2 -201 -90 29 497 0 -68 -284 -244 -221 283 30 -165 -326 -183 -203 -56 287 292
2207 292 205 -394 83 11 329 -45 28 -139 -300 321 232 171 -11 -369 -94 4 182 415 9 -447 250 149
2229 149 525 268 206 -439 -258 -19 295 176 -250 -282 43 229 199 -90 -269 -110 357 71 -117 231 489
2250 489 114 -47 -121 101 172 -28 -150 128 -261 62 209 -94 140 -133 115 -135 -109 -57 -74 -377 -63 159
2272 159 238 49 -1 -164 54 194 -89 165 -133 -51 179 84 198 209 -42 -170 -115 107 23 71 -57 -150 -236
2295 -236 238 367 175 -312 -375 -78 -137 -91 42 -240 -122 -93 -82 293 32 -78 128 183 7 171 -189 -156
2317 -156 -65 -211 -184 222 -301 56 -160 -189 72 -29 90 62 -29 19 127 -12 -72 -72 -29 298 -331 62 259
2340 259 10 -97 5 -307 85 141 45 11 -147 -30 -3 -71 130 -516 -376 -331 259 68 77 -422 -294 -77 163
$$ packed form
2185a56J56K40o5j73k03J11J19M68m97o8k16M0K3N04k53j95j61J43k0J47L43N
2207B92q7n99M77p2L18l74P3j67j61O21q9o1j82l58K75R8J78K33m06m56O97j01
2229A49L76k57o2o45J81K39L14j19m26l2L25J86l0k89j79J59M67k86j88L48K58
2250D89l75j61p4K22P1k00j22K78l89L23J47l03K34k73K48k50K6N2j7l03L14K22
2272A59P9j89n0j63K18J40k83K54k98Q2K30r5J14J1k51j28N5K22q4M8j28r3q6
2295b36M74J29j92m87o3K97n9M6J33k82J18K9J1L75k61j10K06N5j76J64l60L3
2317a56R1j46K7M06n23L57k16k9K61j01J19k8r1M8J08j39o0%M3L27o29L93J97
2340B59k49j07J02l12L92N6r6l4j58J17K7o8K01o46J40M5N90j91Rm99J28K17K40
$$ plain form
2363 163 -12 -35 170 -213 -295 2 302 4 -297 -60 138 -102 60 -27 -60 220 78 203 101 -343 33
2384 33 -167 -29 12 25 297 67 -48 47 -32 -96 -163 -336 -237 -159 160 -89 -181 113 -362 -71 18 136 269 160
2408 160 -8 -123 -71 -12 268 114 -135 -122 1 156 -108 81 -248 2 -296 133 240 426 -242 -31 190
2429 190 -126 329 -20 95 -262 268 187 117 190 -103 -221 128 -23 261 238 -171 -162 32 30 -92 -266 -208 -122
2452 -122 171 71 146 182 -94 101 71 92 99 13 239 30 -176 -61 77 -60 315 -229 2 31 268 19 2
2475 2 -177 -6 344 49 -171 -256 65 -23 14 139 195 233 101 -172 119 -97 149 -45 -422 297 222 117 -9
2498 -9 -133 -228 104 -67 108 219 -23 -332 130 325 -88 83 -78 32 -63 -14 82 28 -60 -148 138 243 -56
2521 -56 222 -221 -113 35 90 60 302 123 -54 14 -323 207 -3 -167 -28 -451 260 25 58 160 49 -45
$$ packed form
2363A63j75k3K05l83q2K97L00k98l01K37J98k40J62q7l3K80j42J25j02m44L76
2384C3k00J38M1J3K72k30j15R5p9o4o7j73R9P8L19k49r2K94m75K91Q9J18J33j09
2408A60j68j15N2N9K80j54k49J3J23J55k64J89l29K50k98M29J07J86o68K11K21
2429A90l16M55l49J15l57N30q1p0P3k93j18L49j51K84k3m09RJ94kj22j74N8Q6
2452a22K93j00P5L6k76J95l0K1Pq6K26k09k06J15J38j37L75n44K31K9K37k49j7
2475Bj79J71L50k95k20q5L21q8L7J25N6L8j32k73K91k16K46j94l77P19p5j05j26
2498ij24r5L32j71J75J11k42l09M62J95m13J71j61J10r5M9R6n4q8q8K86J05k99
2521e6K78m43J08J48N5l0K42j79j77O8l37N30k10j64J39m23P11k35L3J02j11r4
$$ plain form
2543 -45 -27 -99 521 112 7 -169 -149 254 54 135 -394 -289 145 65 118 -204 -275 -139 120 97 137 13 -164
2566 -164 38 129 250 -114 -48 -48 13 -9 45 156 136 148 327 256 172 195 -126 102 -128 -260 -51 211 -2 -121
2590 -121 -105 290 -63 154 -102 -132 -164 37 30 211 95 -62 -40 18 89 136 183 -73 -216 -9 -381 55 -59
2613 -59 104 127 97 402 159 222 -102 281 -304 -331 84 203 -144 -124 -48 -25 11 68 -225 -371 181 -231 -228 7
2637 7 65 16 -190 -235 98 80 -255 -224 -120 -222 175 -57 -159 -88 -72 4 15 -135 50 49 -258 -85 123 84 -227
2662 -227 -31 -54 340 -29 141 95 155 22 -260 60 57 15 62 -140 -304 52 148 165 -216 2 77 62 39 221
2686 221 -161 -331 87 430 35 -1 -262 -207 122 96 307 -20 78 25 -250 91 -55 -44 98 -39 125 228
2708 228 -56 135 61 -169 -216 -156 -194 353 -219 -85 -119 -25 -122 173 230 -84 -15 83 130 148 -104 131 -163 -104
$$ packed form
2543d5J8p2O20m09j05j76K0M03k00Q1n29J05M34q0N3l22p1J36K59k3M0j24j77
2566a64K02R1J21l64O6%O1k2N4J11k0J2J79p1q4K3l21K28k30j32K09K62k13j19
2590a21J6L95l53K17k56l0l2K01pJ81j16j57K2N8P1M7M7k56j43K07l72M36j14
2613e9J63K3l0L05k43O3l24L83n85k7M15J19l47K0P6K3L6N7k93j46N52m12LK35
2637GN8m9k06m5L33j8l35L1J04j02L97k32j02P1J6P6J1j50J85jl07J73K08l9l11
2662b27J96k3L94l69J70m6O0j33k82L20lm2M7k02j64L56R6J7l81K18P5j5k3J82
2686B21l82j70M18L43l95l6k61N5L29k6K11l27R8n3k75L41j46J1J42j37J64J03
2708B28k84J91p4k30m7O0l8N47n72J34l4R4r7K95N7l14O9R8M7J8k52K35k94N9
$$ plain form
2732 -104 92 -2 306 -88 -167 -135 -114 40 -254 -99 -195 -190 200 -117 165 -9 -23 60 -49 -18 -490 131 101 253
2756 253 335 37 40 -21 -27 -234 180 167 109 305 64 -246 -133 295 -50 -11 -139 -18 68 58 364 -234 -243 168
2780 168 196 137 -153 62 126 -84 -195 277 123 -14 61 -147 283 -13 -129 33 -21 77 -40 -16 97 -119
2802 -119 -160 -163 151 523 -128 100 241 -35 3 119 329 -85 -65 -181 291 113 202 181 -180 -97 -26 378 377 111
2826 111 237 259 135 -171 124 61 -124 9 177 -53 -38 8 -11 -96 112 162 32 250 202 -203 -159 -92 -331
2849 -331 -13 105 56 241 -199 15 -209 -87 100 133 12 -179 -163 -56 -257 16 -24 -6 -111 89 -147 -210
2871 -210 252 27 103 4 106 14 8 47 283 293 249 115 -109 284 69 108 182 -345 151 41 -151 84 20 -46
2895 -46 -34 190 46 228 -272 -198 198 -240 69 -159 22 -113 165 64 127 419 -5 262 198 -6 77 -146
$$ packed form
2732a04J96r4L08l94p9L2K1J54k94J55r6NL90l17K82j74j4Q3j09L1m72O21l0J52
2756B53Q2k98Lo1ok07M14j3n8J96k41l10J13M28l45L9j28J21Q6j0L06n98rM11
2780A68K8n9k90K15O4k10j11M72j54j37P5k08M30k96j16J62n4R8j17K4J13k16
2802a19m1lL14L72o51K28J41k76L8J16K10m14K0j16M72j78Q9k1l61Q3P1M04jk66
2826A11J26K2j24l06K95o3j85J33J68k30J5M6j9q5K08N0j30K18m8m05M4O7k39
2849c31L18J18m9J85m40K14k24J22J87L3j21j91J6J07k01K73m0J8j05K00k36o3
2871b10M62k25P6r9J02r2oL9K36J0m4j34k24L93k15L9P4n27M96j10j92K35o4o6
2895d6J2K24j44J82n00P4L96m38L09k28J81j35K78j01O3K92m24K67o4k04Q3k23
$$ plain form
2917 -146 -256 -142 -72 -14 -39 -74 -156 -88 -190 148 12 -210 321 299 -132 -13 -22 297 -206 255 116 -14 -287
2940 -287 121 57 31 -91 -433 129 135 -193 -170 280 281 121 -101 -35 -268 -116 34 283 250 157 68 -323 123 94
2964 94 -194 -148 -14 16 -14 55 166 -18 -121 -214 348 -95 195 101 80 -61 -216 86 38 129 -201 145 69 -35
2988 -35 169 -21 66 -18 -68 -80 12 100 -129 6 261 188 -194 148 225 -111 224 -245 -199 -98 49 179 170 469
3012 469 160 215 -277 -24 -128 216 35 54 -10 -301 -37 254 -207 -135 5 -568 141 -168 -164 112 232 -153
3034 -153 247 -127 139 -131 -180 -33 131 179 -84 171 -123 50 -150 163 -30 -27 424 -7 -134 -203 10 -122
3056 -122 -7 -9 312 161 -28 -146 -79 164 -119 -186 148 -120 -119 -273 -345 145 261 86 109 -78 93 -132 -138
3079 -138 9 -114 -289 -10 -22 216 200 139 105 168 -40 20 29 -38 210 -247 -208 81 194 16 -107 -285 -27
$$ packed form
2917a46j10J14P0N8k5l5q2O8j02L38j36k22N31k2m31J19rL19n03M61j39j30k73
2940b87M08o4k6j22l42N62Ol28K3M50Jj60k22O6k33J52J50K49l3r3q9l91M46k9
2964I4k88M6J34L0l0O9J11j84j03r3N62m43K90r4k1j41j55L02m8R1l30L46p6j04
2988c5K04j90Q7q4n0j2R2Q8k29J35K55p3l82L42P7l36L35m69M6J01J47J30rK99
3012D69l09N5m92K53j04L44j81J9o4k91K64K91m61P2J40n73P09l09MK76J20l85
3034a53M00l74K66k70m9J47J64M8k63K55k94J73k00L13j93LM51m31j27o9K13j32
3056a22J15kL21j51j89j18O7K43k83o7L34k68Jj54p2M90J16j75K3j87J71k25o
3079a38J47j23j75K79j2K38j6o1l4O3k08O0Ro7K48m57L9K89J13j78j23j78K58
$$ plain form
3102 -27 -194 -61 -222 -167 111 -72 324 -52 -119 -161 -65 -36 58 42 -5 72 -242 -147 90 -219 -102 -119 -197 155
3126 155 123 -124 78 6 -171 84 -128 -1 19 -197 401 -136 41 339 207 45 -264 -32 21 176 113 -289
3148 -289 -60 -242 -38 194 32 24 230 -31 21 168 191 308 -103 -27 84 48 -44 -19 -117 -55 -250 163 -21
3171 -21 -4 -237 51 161 40 93 408 85 -405 -7 144 -112 -319 111 141 -156 335 35 118 135 -176 266
3193 266 -306 -71 -58 -218 -330 89 27 -54 -267 123 -7 7 -116 124 36 49 225 14 -218 119 -29 -202
3215 -202 -52 96 -5 356 -3 -43 132 129 -16 -305 241 -173 87 1 273 254 77 106 -2 -171 269 -161
3237 -161 352 1 201 -12 102 35 0 13 -147 133 -147 -137 15 136 52 280 -6 103 216 -283 249 -28
3259 -28 -227 -11 26 45 -157 -139 250 -50 121 309 -134 -295 -11 355 -102 103 -21 10 -303 -399 -288 -31
$$ packed form
3102b7j67J33j61N5K78j83L96l76o7m2R6K9R4j6m7P7l14R5K37l09J17j7p8L52
3126A55l2k47K02p2j77K55k12J27K0k16N98n37J77K98j32j62l09K32N3J55o3m02
3148b89K29j82K04K32j62qK06k61N2J47K3J17m11P6J11l6r2K5r8O2j95M13j84
3171b1J7k33K88J10j21N3L15l23m90L98J51k56k07M30L0k97M91l00Q3J7l11M42
3193B66n72K35J3j60j12M19o2q1k13L90j30J4j23K40q8J3J76k11k32L37j48j73
3215b02J50J48j01L61l59m0J75lj45k89N46m14K60q6K72j9j77K9j08j69M40m30
3237a61N13l51K00k13J14o7l5J3j60K80k80J0J52J21q4K28k86J09J13m99N32k77
3259b8j99K16L7J9k02J8L89l00J71J88m43j61K84L66m57K05j24L1l13r6J11K57
$$ plain form
3281 -31 -27 26 16 -382 19 92 -103 119 175 223 -123 -3 125 -177 61 186 137 -3 142 -122 -29 -287 108
3304 108 -1 -71 317 -246 53 31 -63 156 -159 206 116 176 -222 -160 365 -158 -78 -82 118 90 155 195 21 517
3328 517 113 129 44 47 184 308 16 -155 -30 -42 238 -48 56 203 408 -273 -83 -18 247 175 -236 134
3350 134 65 192 -142 -99 -131 110 -8 133 211 4 -320 -107 216 16 117 -79 -96 175 107 -136 -61 -147 -240
3373 -240 -166 -201 248 170 -25 -42 126 -15 -101 28 -231 139 -159 -352 -409 -247 -39 168 131 -331 -23 -131
3395 -131 71 290 41 -417 -34 -6 327 -237 -77 11 -61 58 -45 346 -148 -123 14 369 -249 426 -50
3416 -50 95 -79 152 -85 -144 264 170 191 177 -87 85 20 30 28 -51 -195 -55 -255 106 333 -54 205 12
3439 12 -52 -26 -50 -85 -149 103 -87 -76 -65 -56 190 -134 -31 68 -290 29 208 -286 184 108 -44 38 35 -190 254
$$ packed form
3281c1MN3j0l98M01P3j95K22N6M8l46J20J28l02K38J25m9j40J45k64R3k58L95
3304A08j09p0L88n63K99k2r4K19l15L65r0O0l98O2N25n23Q0mK00k8O5M0j74M96
3328E17m04J6q5LJ37J24k92j71J25j2K80k86J04J47K05o81J90O5K65p2m11L70
3350A34o9J27l34M3l2K41j18J41P8k07l24K13L23k00J01j96j7K71o8k43P5q6r3
3373b40P4l5M49p8j95j7J68j41q6J29k59L70k98j93n7J62K08K07l7m62L08j08
3395a31K02K19k49m58L83K8L33n64J60Q8p2J19j03L91m94K5J37L55o18O75m76
3416e0J45j74K31k37n9M08r4K1j4k64J72o5J0kp9j44J40k00L61K27l87K59j93
3439A2o4K6k4l5o4K52j90J1J1RK46l24J03R9l58L19J79m94M70p6j52Q2lk25M44
$$ plain form
3464 254 92 -109 121 92 -195 -144 -184 -230 -61 -122 28 98 117 -4 186 249 144 57 -201 1 146 -234 15
3487 15 80 -242 39 -212 -151 -27 -140 50 19 -142 -150 -214 -154 -244 111 2 -135 -30 166 45 68 112 -29 24
3511 24 178 -111 -232 -53 28 -163 186 112 21 -45 194 -104 198 115 29 38 229 48 -166 -25 99 -224 76
3534 76 207 256 -196 -259 90 80 136 -30 -185 -59 253 -127 -65 -162 -12 -113 -213 27 81 209 -93 -9 235
3557 235 -85 -141 -118 50 -59 -131 -189 -25 -56 -190 314 -217 108 39 130 70 -43 14 148 136 15 -104 212
3580 212 69 -109 50 148 -95 -142 240 7 -164 -23 -23 -150 -74 138 29 197 -283 40 -137 -127 63 32
3602 32 355 -161 206 291 139 -41 60 -238 -64 -120 -123 182 9 -4 23 197 -17 -6 26 -251 16 -184 269
3625 269 -23 -34 15 94 -44 -221 -67 -16 -22 -3 -127 92 174 -6 135 80 101 -152 131 -53 -6 -139 -212 50
$$ packed form
3464B54j62k01K30k9k87N1m0m6J69o1J50P0J9j21J90O3j05q7k58K02J45l80K49
3487A5O5l22K81k51O1J24j13J90l1j61qo4O0r0L55j09j37J05J96j21K3M4j41N3
3511B4J54k89j21J79Q1j91L49p4r1o6K39k98L02q3q6RJ91j81k14J41J24l23L00
3534G6J31M9m52o3L49j0N6j66j55J26L12l80O2r7J50j01j00K40N4J28l02Q4K44
3557B35l20n6K3J68j09p2n8J64l1j34N04n31L25o9R1o0j13N7J34j2j21j19L16
3580B12j43j78J59R8k43m7L82k33j71J41%j27P6K12j09J68m80L23j77J0J90l1
3602C2L23n16L67Q5j52j80J01k98J74n6lL05j73j3K7J74k14J1L2k77K67k00M53
3625B69k92j1M9P9j38j77J54N1oJ9j24K19Q2j80J41n5K1k53K83j84M7j33p3K62
$$ plain form
3649 50 112 199 -85 -16 -24 235 278 -93 -240 6 80 -51 9 92 -261 -31 -135 173 19 64 19 94 -44 196
3673 196 110 -83 127 98 -362 -72 46 -41 1 127 167 22 -108 -292 191 51 143 -98 -210 6 278 -278
3695 -278 82 255 259 -82 -116 -123 -70 3 94 21 67 -362 3 63 -106 1 222 216 65 -281 -48 -166 128 -56
3719 -56 -83 30 -152 56 152 95 141 76 191 158 157 167 -131 179 49 -82 51 -195 -43 -116 -180 19 67 -44
3743 -44 -73 183 -133 208 3 263 -95 -74 -146 -132 7 87 150 -109 276 -103 -142 -97 8 108 -61 -106 -210
3766 -210 -90 -141 -200 25 -216 212 10 -149 -172 218 -190 156 189 -137 34 -95 143 60 168 84 91 -65 -136
3789 -136 165 -25 87 10 122 -96 39 3 -202 -173 37 -24 168 267 -10 -392 -266 -263 66 102 -61 156 -74
3812 -74 -129 3 90 157 -87 271 -81 82 168 114 79 86 20 62 46 127 -31 -24 162 -177 144 135 378 -221 -50 402
$$ packed form
3649E0O2Q7k84O9qK59M3l71j47K46P4j31O0Q3l53K30j04L08j54M5m5P5j38K40
3673A96q6j93K10k9m60K90J18q7M2J26M0j45j30j84M83j40R2k41j12K16K72n56
3695b78L60J73Ml41l4pN3P3R1p3M6m29L65O0j69J07K21oj51l46K33j18K94j84
3719e6k7J13j82K08R6n7M6o5J15l3jJ0k98L10j30j31J33k46J52p3o4J99M8j11
3743d4k9K56l16L41k05K60l58K1p2J4J39Q0O3k59L85l79l9M5J05J00j69m5j04
3766b10J20n1n9K25k41M28k02j59k3L90m08L46L3l26J71j29K38q3J08q4Pj56p1
3789a36L01j90J12p7J12k18J35l6k05K9K10o1J92R9k77l82J26LL29L6j63K17k30
3812g4n5J32Q7O7k44L58l52J63Q6n4l5Po6M2j6Q1j58PJ86l39L21rK43n99J71M52
$$ plain form
3838 402 -185 -190 -340 -34 62 -88 342 -125 -121 451 -98 -205 -72 51 66 -144 -257 -14 108 195 208 187 -16
3861 -16 -114 188 19 -52 -17 -309 -40 227 -42 82 -85 -163 171 -76 56 88 -417 108 163 -9 -9 -248 -79
3884 -79 -21 23 -31 -53 -178 36 114 124 -159 217 -184 -68 135 -69 -140 161 -138 -151 81 13 -61 162 248 -226
3908 -226 5 125 54 -112 -46 21 94 -91 -35 -160 82 181 333 194 67 -41 -40 -88 -150 -290 -151 21 -59 -68
3932 -68 140 242 221 -21 125 218 28 164 254 465 -152 77 15 -131 -128 55 81 31 -64 -336 7 -54 -102 64
3956 64 -103 205 37 70 174 -184 -190 -197 154 -192 -15 -16 104 32 105 -37 -364 -171 -176 11 138 233 -147 5
3980 5 185 -144 250 96 -230 58 -63 249 158 31 147 -242 147 253 -391 -15 178 -65 267 -67 107
4001 107 139 40 255 -38 -165 -280 -72 360 -18 -111 -250 -178 60 105 122 167 -244 -126 -162 -21 5 -57 49
$$ packed form
3838D02n87nj50L06R6j50M30m67MN72n49j07J33J23J5k10j13K43J22Q7J3k1k03
3861a6r8L02j69p1L5k92K69K67k69J24j67p8L34k47J32L2n05N25N5j72%k39J69
3884g9N8M4n4k2j25K14P8J0k83L76m01J16K03k04p1L01k99j3K32o8p4K23Q6m74
3908b26K31J20p1j66O6O7P3j85N6j25K42R9J52j39j27j08Jm8o2j40J39J72q0r
3932f8K08J02k1k42J46R3j90J36R0K11o17K29o2j46LJ83K6n0r5k72L43o1m8J66
3956F4j67L08j68L3J04l58opL51l46J77jJ20p2P3j42l27J93nJ87J27R5l80J52
3980EJ80l29L94j54l26K88j21L12r1j27J16l89L89J06o44L76J93k43L32l34J74
4001A07L2r9K15k93j27j15K08M32l78r3j39P2K38M5J7M5m11J18l6J41K6o2J06
$$ plain form
4024 49 -149 106 161 -148 181 50 -148 89 33 165 -191 -21 -101 84 -4 -15 217 -171 -76 53 -4 -496 -149
4047 -149 -99 -51 -76 27 251 131 -120 -278 282 62 -205 -153 100 12 -26 326 138 -332 -81 73 -399 -145
4069 -145 50 4 -211 -257 -141 170 -100 -65 3 135 -27 118 61 -154 8 161 107 250 55 -210 -64 -41
4091 -41 -37 -72 57 14 247 -166 200 155 -180 -52 -59 -394 118 281 -21 -259 45 132 300 181 -134 -186 -68
4114 -68 153 182 186 -96 138 -166 87 -141 15 -127 125 100 127 287 -75 22 -42 -61 334 356 -282 -401 -55
4137 -55 -110 -160 -50 58 -138 -76 -123 -154 -92 -361 -79 -288 49 -68 -11 221 -99 142 178 -47 87 -38 54
4160 54 -161 -101 45 -38 249 74 -6 7 -87 -153 -144 77 -281 135 219 75 134 46 -55 37 -37 164 -95 88 49
4185 49 186 -112 -149 -60 195 -72 -168 -13 -126 -203 -134 244 62 41 -338 82 -109 -242 87 -9 137 113 33
$$ packed form
4024D9j98K55N5l09L29j31j98K37n6J32l56J70q0J85q8j1K32l88R5J29n7m92L47
4047a49N0M8k5J03K24j20k51j58N60k20k67N2K53q8l8L52j88m70K51J54m72K54
4069a45J95m6k15m6J16L11k70L5O8J32j62J45n7k15J62J53n4J43j95k65J46K3
4091d1Ml5J29m3K33m13L66m5l35J28pl35N12J63l02k38L04Q7J68j19l15n2J18
4114f8K21K9Mk82K34l04K53k28J56j42K52k5K7J60l62R7o4j9L95K2o38j19L46
4137e5n5n0J10J08j96O2m7l1O2k69K82k09L37j17N7K32l20K41L6k25J34j25R2
4160E4k15O0J46q3K87j75q0J3r4o6RK21l58M16Q4j44N9q8j01R2p4K01k59J83l9
4185D9J37k98l7Q9K55k67r6J55j13p7O9L78j82k1l79M20j91j33L29r6J46k4q0
$$ plain form
4208 33 54 26 -186 -69 -50 -168 -185 131 95 -91 -162 -69 75 -82 -51 326 56 -48 -178 142 426 78 -183
4231 -183 -125 246 -63 -6 223 -189 -2 219 -109 -100 39 -47 21 121 85 41 -107 -230 -162 -160 133 268 -103 316
4255 316 235 244 -309 116 50 90 -30 1 -70 9 428 -83 -127 51 33 -6 156 241 7 -69 -10 100 168 131 69 -329
4281 -329 -235 3 162 -98 -75 109 86 -76 -136 -10 39 -79 242 61 -84 -194 86 164 38 312 20 32
4303 32 -173 40 91 47 -157 6 18 -41 97 0 393 -51 -103 229 -191 2 116 43 -93 -274 -5 -32 -205
4326 -205 -28 218 74 -107 -24 144 101 38 -4 -8 -240 -39 96 114 27 -11 -135 -95 4 215 -32 7 266 -159
4350 -159 -23 -353 78 89 -99 -12 268 -211 -138 -194 -49 8 141 -187 -261 -142 -109 158 114 -104 -142 -8 79
4373 79 -76 27 176 -254 22 -248 169 71 -106 -110 -200 -220 30 98 -111 183 251 18 23 -309 209 110 110 -145
$$ packed form
4208C3K1k8k12J17J9j18j7L16l6j86p1R3J44j57L1L77k70j04j30L20K84l48k61
4231a83N8L71l09N7K29m12J87K21l28RJ39q6O8J00l6m4j48j23O8KK93J35l71M19
4255C16q1Rn53M25o6M0j20L1p1P9M19n11m4J78j8l9J62Q5k34p6N9J10O8l7o2l98
4281c29R4K38J59k60K3J84k3j62o0J26M9j18L21j81j45j10K80P8j26K74k92J2
4303C2k05K13N1m4k04J63J2n9J38r7L93m44n2L32m20J93J14p3j36j81K69k7j73
4326b05J77K46j44j81Q3J68m3o3m2mk32K01J35J8q7l8j24M0R9K11k47L9K59m25
4350a59J36l30M31J1j88Q7K80m79P3n6J45N7J33l28p4J19L3K67m4k18l8J34Q7
4373G9j55J03J49m30K76k70M17r8j77mr0k0K50O8k09K94O8k33Nl32N18r9%k55
$$ plain form
4397 -145 231 65 -6 -3 -154 -52 -253 136 57 -88 369 -106 13 331 27 -105 -310 -156 -167 55 -72 91
4419 91 -9 70 -115 -110 -240 177 -188 -67 -136 -90 159 127 40 -207 267 -65 48 -66 229 -131 -50 2 -199
4442 -199 -149 -80 62 40 26 121 -70 -103 -24 -260 62 23 -107 -199 33 21 -106 -16 14 -229 109 70 -425 -60
4466 -60 -296 516 -85 179 255 -276 -101 -300 62 -29 219 -109 -275 -73 11 -17 -237 148 -31 382 76 -205
4488 -205 3 51 6 228 -20 -237 -59 36 -108 143 298 -78 45 -158 87 -8 244 -269 4 83 -88 33
4510 33 -115 50 89 -104 -88 49 -152 -227 216 -48 -108 -269 145 -73 -183 70 -230 80 48 62 -185 -230 -67
4533 -67 217 113 -154 100 -4 76 -251 192 182 146 27 141 28 129 133 164 149 207 -273 -134 110 360 -56
4556 -56 -171 -23 64 336 88 209 120 44 -41 -200 37 -115 -154 34 -103 -442 95 72 69 -35 -355 155 -11
$$ packed form
4397a45L76j66p1Lj51J02k01L89p9j45M57m75J19L18l04j32k05J54j1K22j27J63
4419I1j00P9j85Nj30M17l65J21o9M6K49l2q7k47M74l32J13j14K95l60Q1N2k01
4442a99N0O9J42k2j4R5j91l3P9k36L22l9j30r2K32j2j27R0L0k43L38l9m95L65
4466f0k36Q12o01K64P6n31J75j99L62r1K48l28j66K02Q4k8k20L85j79M13l06k81
4488b05K08M8m5K22k48k17J78R5j44K51J55l76J23k03K45r5K52n13K73P9j71J21
4510C3j48J65L9j93J6J37k01p5M43k64o0j61M14k18j10K53l00L10l2J4k47m5J63
4533f7K84j04k67K54j04Q0l27M43j0l6j19J14j13J01ML1j5N8m80J39K44K50m16
4556e6j15J48Q7K72k48J21q9p6q5j59K37j52l9J88j37l39N37k3lj04l20N10j66
$$ plain form
4579 -11 -19 82 -204 -140 211 59 91 -83 -44 -166 -212 200 217 184 187 136 -89 156 -269 -19 19 7 27 164 64
4604 64 -29 75 48 -21 -147 81 1 24 -306 -150 68 -88 -62 129 114 136 55 147 -202 -315 76 343 -236 109
4628 109 -32 -213 -181 -163 9 -244 -130 78 -57 319 -231 165 -117 215 -29 -155 96 -220 -174 39 178
4649 178 45 124 -307 24 98 300 235 -14 -21 -154 -161 -91 324 -116 -167 108 146 3 -119 64 -151 178 121 -64
4673 -64 162 -14 -153 -461 -176 -70 -193 13 384 -164 -176 164 78 39 -510 102 -59 78 123 -69 -12 61
4695 61 -9 -8 51 -166 163 -70 75 187 -239 48 -2 153 -69 -170 259 45 179 -132 155 -150 -66 -7 -36
4718 -36 73 -44 -95 -13 -103 328 -124 -352 -275 -239 -114 144 176 23 24 186 11 -23 226 90 -185 194 25
4741 25 -13 85 25 119 86 -60 -34 -168 65 131 47 -95 -32 10 161 189 -111 -11 42 82 -15 -139 63 1 22 -294
$$ packed form
4579a1qJ01k86O4L51j52L2j74L9j22m6M12J7l3Ln1k25K45m25K50L8j2K0J37j00
4604F4r3J04k7o9j26K28q0K3l30J56K18j56K6J91j5K2q1R2l49j13L91K67n79L45
4628A09j41j81L2J8J72k53J14K08j35L76n50L96k82L32k44j26K51l16M6K13J39
4649A78j33P9m31L31P4K02o5k49pj33pP0M15m40n1K75L8j43j22J83k15L29n7j85
4673f4K26j76j39l08K85J06j23K06L71n48j2L40q6l9n49O12j61J37M5j92N7P3
4695F1p0JN9k17L29k33J45J12m26K87n0J55k22j01M29k14J34l11K87l05Q4N9k9
4718c6J09j17n1Q2r0M31m52k28P7L6J25K58L2j53JJ62j75l4K49j36k75L79j69
4741B5l8R8o0R4l3j46K6j34K33O6q4j42O3M2J51K8l00J00N3M0r7j24K02o2K1l16
$$ plain form
4767 -294 64 -203 -71 141 27 51 233 -184 -227 -270 136 -99 310 -79 -136 101 -67 146 -231 -69 -35 -25
4789 -25 109 -36 167 173 -140 1 -19 -7 -34 -67 -308 423 120 -71 -1 -156 232 59 -128 179 49 255 26
4812 26 -183 59 48 -130 -126 409 72 -25 268 198 141 -73 -105 54 -87 61 96 36 39 156 105 70 -123 -11 174
4837 174 -33 -135 -70 -158 215 -199 -68 47 42 9 -446 -121 14 -35 23 30 34 6 -36 -67 -273 -22 273 -97 -68
4862 -68 -4 -63 62 -40 378 36 -235 -187 -22 103 59 56 -133 -77 72 -81 -348 46 17 149 -148 -21 135
4885 135 193 131 81 42 65 -28 -33 -187 156 16 8 -4 -344 110 131 4 -59 -34 -72 39 -41 163 195 276 179 -39
4911 -39 80 -298 -18 -95 -7 -152 33 274 91 145 144 -123 -20 -180 -326 83 -364 24 -323 230 181 -5
4933 -5 271 42 -90 61 -17 94 -104 -33 29 -219 164 157 -108 97 -94 -26 -351 273 -140 76 -161 28 21
$$ packed form
4767b94L58k67J32K12j14K4J82m17m3m3M06k35M09l89n7K37j68K13l77J62L4J0
4789b5J34j45K03Ol13J41k0J2k7l3k41P31l03j91P0j55L88j73j87L07j30K06k29
4812B6k09K42j1j78MN35l37r7K93p0n7k14l2J59j41J48L5o0LJ17n1l5j93J12J85
4837A74k07j02O5q8L73m14J31J15nl3m55L25J35m9N8PMk8m2l1k06K51K95l70K9
4862f8O4n9J25j02M18l42k71M8J65J25m4lj89N6J49j53k67L94k9J32k97J27J56
4885A35N8o2n0l9K3r3nj54L43j40qj2l40M54K1j27o3K5l8J11q0K04L2Q1r7k18
4911c9J19l78K80p7Q8j45J85K41j83N4jk67J03j60j46M09m47L88l47N53m9j86
4933eK76k29j32J51p8J11j98P1O2k48L83pk65K05j91O8l25O24m13K16k37J89p
$$ plain form
4956 21 440 -84 71 -43 -259 37 192 121 -43 -249 -66 162 -112 173 -66 -54 -90 -49 93 293 -154 -233
4978 -233 -148 -82 -184 159 6 99 -43 393 71 -5 -68 -75 163 -155 -102 18 -30 -149 410 -121 94 -103 268
5001 268 45 -101 57 -167 -233 36 21 160 -232 -18 -1 59 310 123 296 392 -127 -107 68 -39 -113 -25 -41
5024 -41 138 169 284 9 -146 236 82 -233 224 -236 234 -128 -46 118 -93 91 -167 77 -176 -22 262
5045 262 -224 -457 452 -193 -1 88 -213 -5 219 318 4 -29 184 -261 -220 42 156 225 -4 219 116 245
5067 245 30 158 178 -95 -29 -132 -295 168 -93 -71 57 44 178 -196 349 -44 63 9 272 -170 -221 -42
5089 -42 -37 -33 -241 190 14 99 240 259 133 77 32 112 -157 56 -145 208 -1 87 279 -38 -319 266 187 -242
5113 -242 161 52 -116 326 218 138 63 86 -40 -38 -56 -70 117 -141 344 -169 72 200 -42 167 228 199 -85
$$ packed form
4956B1M19n24J55j14k16K96J55p1j64k06J83K28k74K85k39J2l6M1J42K00m47p9
4978b33Q5O6j02L43j53R3j42M36l22p6o3pK38l18N3J20m8j19N59n31K15j97L71
5001B68k23j46J58k24o6K69j5J39l92K14J7O0K51j87J73R6n19K0J75j07p4Q8j6
5024d1J79L1J15k75j55L82j54l15M57m60M70l62Q2J64k11J84k58K44k53J54K84
5045B62m86k33R09o45J92Q9l01K08K24R9l14l3K13m45M1K62J14O9k29K23j03J29
5067B45k15J28K0k73O6j03j63M63k61K2J28j3J34l74N45l93J07n4K63m42n1J79
5089d2NMk08M31j76Q5J41J9j26n6m5Q0k69K13k01L53k09Q8J92l17k81N85p9m29
5113b42M03j09j68M42j08q0p5K3j26Kj8j4J87k58M85n13K41J28k42K09O1k9k84
$$ plain form
5136 -85 -92 -257 -57 -167 251 -23 -59 43 -132 51 119 -1 -145 -56 300 -246 60 144 94 -148 216 275 113
5159 113 -1 -138 251 -102 103 1 46 72 -115 228 -139 -232 143 -1 1 199 300 26 48 46 48 96 20 86
5183 86 65 136 96 29 213 28 48 -120 -119 -123 -178 195 -221 5 -66 144 -263 -191 335 14 92 -15 350 -150 -112
5208 -112 48 -50 -34 175 97 -57 76 115 188 39 39 292 44 -22 244 152 -205 -278 99 -149 -130 281 204 48
5232 48 15 181 -134 25 -6 118 -63 167 234 292 7 -105 522 -88 -237 205 153 -177 -88 65 -56 432
5254 432 35 132 -36 -68 5 -282 -152 30 -51 55 -235 -161 68 -317 32 -56 359 -217 -70 47 143 6
5276 6 -56 311 -39 -10 94 -180 249 81 -21 -108 114 117 58 262 -71 -30 -57 -21 45 -284 174 -188 165 -29
5300 -29 -134 340 66 -145 321 236 -155 -24 168 38 105 164 -372 -118 19 -17 130 39 163 138 -3 -310
$$ packed form
5136h5pj65K00j10M18k74l6J02j75J83O8j20j44Q9L56n46L06Q4n0k42L64N9j62
5159A13j14j37L89l53K05j02M5K6j87L43l67r3L75j44KJ98J01k74K2kKM8p6O6
5183H6k1P1m0o7J84j85K0j68Jmn5L73m16K26p1K10m07P2N26l21P8j07L65n00L8
5208a12J60r8J6K09p8j54J33L9P3j49%K53k48o6K66r2l57p3L77k48J9M11p7j56
5232D8l3J66l15J59l1J24j81K30O7N8k85j12O27o10j49M42n2l30Q9J53j21M88
5254D32l97R7j68l2P3k87J30J82q1J06k90P4K29l85L49q8M15n76J47J17R6j37
5276Fo2L67l50K9J04k74M29j68j02q7K22Ln9K04l33M1k7L6O6l29M58l62L53j94
5300b9j05M74k74k11M66q5l91J31J92j30O7N9n36K54J37l6J47r1J24k5j41l07
$$ plain form
5322 -310 -152 -280 38 -119 62 56 16 315 126 8 258 -15 81 -67 -169 -95 117 -44 427 -97 201 1
5344 1 61 -35 75 -31 -164 -229 103 -5 29 -66 -99 -43 417 166 -291 -113 343 226 43 -205 163 -198 38
5367 38 169 208 88 -153 -2 53 -61 16 103 -91 34 -174 90 228 -160 -68 -104 -151 281 198 250 -106 79
5390 79 77 -195 -37 -127 125 -216 10 190 -86 118 231 279 -167 -285 66 102 -34 46 -195 154 -191 -184 -118
5413 -118 189 121 -189 13 210 96 -122 -65 -210 75 44 74 1 -279 66 -34 -248 -193 -397 96 -9 -58
5435 -58 97 -224 -80 -136 47 24 -135 67 -12 -295 -315 -116 106 255 22 -82 -7 123 25 216 175 -156 48
5458 48 231 124 -192 -136 152 -36 82 144 94 -125 -18 115 -279 -116 -189 -79 106 -92 -279 230 18 151
5480 151 60 -132 -26 -74 -114 -18 -178 -358 38 101 -133 -24 23 -185 -186 91 -347 58 178 -58 112 -11 -82
$$ packed form
5322c10J58j28L18j57J81om0K99j89j18K50k73R6j48j02P4K12j61M71n24K98k00
5344AO0r6J10j06j33o5L32j08L4r5l3N6M60k51m57J78M56j17j83k48L68l61K36
5367C8J31L9j20k41J51N5j14P7Q7j94J25k08K64J38l88R2l6m7M32q3N2l56J85
5390G9kk72J58r0K52l41K26J80k76K04J13M8m46j18L51L6j36Q0k41L49l45PO6
5413a18L07o8l10K02J97j14k18N7j45K85l1L0p3k80L45j00k14N5k04M93j05m9
5435e8J55l21J44n6J83k3j59K02p9k83k0J99K22J49k33j04P5J30r8J91m1l31K04
5458D8J83j07l16N6K88j88J18O2n0k19J07J33l94J63p3J10J85j98j87N09k12J33
5480A51r1j92J06m8m0R6j60j80L96O3k34J09M7k08jK77m38M05J20k36J70j23p1
$$ plain form
5503 -82 -155 99 171 -203 -68 -425 -129 141 -206 -7 -244 -73 -62 -48 129 275 55 160 -154 169 62 162
5525 162 -119 97 12 -307 22 -80 114 58 -75 -134 17 396 200 190 517 261 202 -210 166 0 192 30
5547 30 -159 -350 -60 59 88 -72 119 -33 240 107 8 77 155 -12 62 113 133 139 -133 -51 65 -118 197 0
5571 0 -208 -37 -135 121 -35 90 40 120 135 -38 -35 -45 -300 -232 175 213 32 -192 -82 -159 -85 129 167 -67 65
5596 65 -109 324 -77 -371 181 -209 254 -130 -6 366 91 -35 -126 -98 -104 2 -93 99 -110 209 -128 174
5618 174 -120 72 280 79 287 88 15 67 240 70 -280 -180 40 33 -134 -179 319 -68 220 -118 -102 -191
5640 -191 -28 -9 -25 260 155 -144 267 319 91 -74 119 57 -313 117 -50 -101 4 87 -209 133 -87 -94 94
5663 94 -96 -181 130 119 118 258 46 -140 139 298 61 -128 -194 -174 -10 -143 96 19 307 -16 216 29 14
$$ packed form
5503h2p3K54P2l74J35l57K96K70l47J99k37J71J1J4J77J46k20J05l14L23j07J00
5525A62k81K16q5l19L29j02J94n6j33n9J51L79j96j0L27k56n9m12L76j66J92j62
5547C0j89j91K90J19K9j60J91j52K73j33r9O9P8j67P4N1K0Ok72Q2J16j83L15j97
5571@k08J71r8K56j56J25n0Q0J5j73Lj0k55O8M07L8j81k24J10p7P4K14L8k34J32
5596F5j74M33m01k94N52l90M63l84J24L72k75j26r1K8oJ06r5J92k09L19l37L02
5618A74k94J92K08k01K08j99p3N2J73j70l50J00K20pj67m5M98l87K88l38J6q9
5640a91J63J9j6K85j05k99M11N2k28j65J93o2l70M30j67n1J05Q3k96L42k20pJ88
5663I4j90q5L11j1jJ40k12j86K79J59k37j89o6K0J64j33K39p7K88l23K32j87j5
$$ plain form
5686 14 3 81 -88 -192 -105 -219 -167 3 11 61 -261 -30 26 -151 176 -242 -330 -57 -141 304 -48 -96 82 -2
5710 -2 -149 -68 50 -8 56 -70 -30 -20 -123 -191 261 -43 -2 -72 -149 -75 -160 206 6 -404 120 193 -97 -29 80
5735 80 72 125 -193 375 37 -106 93 -127 -36 51 196 160 -372 386 185 563 6 210 19 69 -22 13 52 -63
5759 -63 179 -191 75 123 132 -224 95 -70 -23 -74 -287 286 161 73 -204 107 -212 -147 -169 1 245 183 -164
5782 -164 -213 80 -4 42 5 219 -78 -100 202 130 131 196 -334 471 46 -51 20 -1 -173 6 -128 -155 25 325
5806 325 -78 116 -30 -109 159 -142 13 -45 78 -442 -140 69 -281 -159 -12 55 72 58 150 -249 190 42
$$ packed form
5686A4j1P8j69j04Q7j14N2J70QN0l22K31N6j77L27m18q8K73q4M45l52m8J78q4
5710bj47Q1J18n8O4j26M0J0j03o8M52l04M1p0p7P4q5L66k00m10N24P3k90O8J09
5735H0qN3l18N68l38j43J99k20R1Q7J45l6n32P58k01L78n57K04j91N0r1L5L9j15
5759f3K42l70K66M8Rl56L19j65M7n1k13N73j25q8k77L11l19O5k2J70K44o2l47
5782a64m9K93q4M6l7K14k97k2L02p2JO5n30Q05m25r7P1k1j72J79j34k7J80L00
5806C25m03J94j46p9K68l01J55n8J23n20L02K09l50J22J47O7J7j4R2l99M39j48
$$ [...]
8191A15
##END NTUPLES=NMR FID
##END=
