##TITLE=1H_EC-3229(2)
 DMSO, 8 sc, 
 30.6.2020
##JCAMPDX= 6.0         $$ Bruker NMR JCAMP-DX V2.0
##DATA TYPE= NMR FID
##DATA CLASS= NTUPLES
##ORIGIN= UXNMR, Bruker Analytische Messtechnik GmbH
##OWNER= root
$$ XWIN-NMR		Version 3.5
$$ Tue Jun 30 10:40:27 2020 Russian Standard Time (UT+4h)  she@DPX200
##.OBSERVE FREQUENCY= 200.1315
##.OBSERVE NUCLEUS= ^1H
##.DELAY= (6, 6)
##.ACQUISITION MODE= SIMULTANEOUS
##.ACQUISITION SCHEME= undefined
##.AVERAGES= 8
##.DIGITISER RES= 18
##SPECTROMETER/DATA SYSTEM= spect
##.PULSE SEQUENCE= zg30
##.SOLVENT NAME= DMSO
##.SHIFT REFERENCE= (INTERNAL, DMSO, 0, 15.7039)
##AUDIT TRAIL= $$ (NUMBER, WHEN, WHO, WHERE, WHAT)
$$ ##TITLE= Audit trail, XWIN-NMR		Version 3.5
$$ ##JCAMPDX= 5.01
$$ ##ORIGIN= Bruker BioSpin GmbH
$$ ##OWNER= she
$$ F:/spectra/data/she/nmr/H-F/1/audita.txt
$$ ##AUDIT TRAIL=  $$ (NUMBER, WHEN, WHO, WHERE, WHAT)
(   1,<2020-06-30 10:39:24.53 +0400>,<she>,<DPX200>,
      <created by zg, POWCHK disabled, PULCHK disabled
       configuration hash MD5:
       00 E9 B6 7A A2 85 ED C7 34 08 36 98 17 FE 4E 26
       data hash MD5: 16K
       4B 06 55 9B 1A 11 A3 F9 AB 14 98 5A 33 3F B7 67>)
$$ ##END=
$$ 
$$ hash MD5
$$ F7 51 3C 9C 37 04 4A A9 04 1E 08 4A E5 27 38 AE
##$RELAX= 
##$RELAX= 
##$RELAX= 
##$RELAX= 
##$RELAX= 
##$RELAX= 
$$ Bruker specific parameters
$$ --------------------------
##$DU= <F:/spectra>
##$EXPNO= 1
##$NAME= <H-F>
##$PROCNO= 1
##$TYPE= <nmr>
##$USER= <she>
##$AMP= (0..31)
100 100 100 100 100 100 100 100 100 100 100 100 100 100 100 100 100 100 
100 100 100 100 100 100 100 100 100 100 100 100 100 100 
##$AQSEQ= 0
##$AQ_mod= 1
##$AUNM= <au_zg>
##$AUTOPOS= <>
##$BF1= 200.13
##$BF2= 200.13
##$BF3= 200.13
##$BF4= 200.13
##$BF5= 200.13
##$BF6= 200.13
##$BF7= 200.13
##$BF8= 200.13
##$BYTORDA= 1
##$CFDGTYP= 0
##$CFRGTYP= 5
##$CHEMSTR= <none>
##$CNST= (0..31)
1 1 145 1 1 1 1 1 1 1 1 1 1 1 1 1 1 1 1 1 1 1 1 1 1 1 1 1 1 1 1 1 
##$CPDPRG= <>
##$CPDPRG1= <>
##$CPDPRG2= <>
##$CPDPRG3= <>
##$CPDPRG4= <mlev>
##$CPDPRG5= <mlev>
##$CPDPRG6= <mlev>
##$CPDPRG7= <mlev>
##$CPDPRG8= <mlev>
##$CPDPRGB= <>
##$CPDPRGT= <>
##$D= (0..31)
0 1.2 0 0 0 0 0 0 0 0.06 0 0.03 0 0 0 0 0.0002 0 0 0 0 0 0 0 0 0 0 0 0 
0 0 0 
##$DATE= 1593499164
##$DBL= (0..7)
120 120 120 120 120 120 120 120 
##$DBP= (0..7)
150 150 150 150 150 150 150 150 
##$DBP07= 0
##$DBPNAM0= <>
##$DBPNAM1= <>
##$DBPNAM2= <>
##$DBPNAM3= <>
##$DBPNAM4= <>
##$DBPNAM5= <>
##$DBPNAM6= <>
##$DBPNAM7= <>
##$DBPOAL= (0..7)
0.5 0.5 0.5 0.5 0.5 0.5 0.5 0.5 
##$DBPOFFS= (0..7)
0 0 0 0 0 0 0 0 
##$DE= 6
##$DECBNUC= <off>
##$DECIM= 24
##$DECNUC= <off>
##$DECSTAT= 4
##$DIGMOD= 1
##$DIGTYP= 9
##$DL= (0..7)
0 120 120 120 120 120 120 120 
##$DP= (0..7)
150 150 150 150 150 150 150 150 
##$DP07= 0
##$DPNAME0= <>
##$DPNAME1= <>
##$DPNAME2= <>
##$DPNAME3= <>
##$DPNAME4= <>
##$DPNAME5= <>
##$DPNAME6= <>
##$DPNAME7= <>
##$DPOAL= (0..7)
0.5 0.5 0.5 0.5 0.5 0.5 0.5 0.5 
##$DPOFFS= (0..7)
0 0 0 0 0 0 0 0 
##$DQDMODE= 0
##$DR= 18
##$DS= 0
##$DSLIST= <SSSSSSSSSSSSSSS>
$$ [...]
##$SUBNAM2= <"">
##$SUBNAM3= <"">
##$SUBNAM4= <"">
##$SUBNAM5= <"">
##$SUBNAM6= <"">
##$SUBNAM7= <"">
##$SUBNAM8= <"">
##$SUBNAM9= <"">
##$SW= 24.9337058887773
##$SWIBOX= (0..15)
0 0 2 0 0 0 0 0 0 0 0 0 0 0 0 0 
##$SW_h= 4990.01996007984
##$TD= 16384
##$TD0= 1
##$TE= 0
##$TE2= 300
##$TE3= 300
##$TEG= 300
##$TL= (0..7)
0 120 120 120 120 120 120 120 
##$TP= (0..7)
150 150 150 150 150 150 150 150 
##$TP07= 0
##$TPNAME0= <>
##$TPNAME1= <>
##$TPNAME2= <>
##$TPNAME3= <>
##$TPNAME4= <>
##$TPNAME5= <>
##$TPNAME6= <>
##$TPNAME7= <>
##$TPOAL= (0..7)
0.5 0.5 0.5 0.5 0.5 0.5 0.5 0.5 
##$TPOFFS= (0..7)
0 0 0 0 0 0 0 0 
##$TUNHIN= 0
##$TUNHOUT= 0
##$TUNXOUT= 0
##$USERA1= <user>
##$USERA2= <user>
##$USERA3= <user>
##$USERA4= <user>
##$USERA5= <user>
##$V9= 5
##$VALIST= <valist>
##$VCLIST= <CCCCCCCCCCCCCCC>
##$VD= 0
##$VDLIST= <DDDDDDDDDDDDDDD>
##$VPLIST= <PPPPPPPPPPPPPPP>
##$VTLIST= <TTTTTTTTTTTTTTT>
##$WBST= 1024
##$WBSW= 4
##$XGAIN= (0..3)
0 0 0 0 
##$XL= 0
##$YL= 0
##$YMAX_a= 155581
##$YMIN_a= -115270
##$ZGOPTNS= <>
##$ZL1= 120
##$ZL2= 120
##$ZL3= 120
##$ZL4= 120
##$ABSF1= 10
##$ABSF2= 0
##$ABSG= 5
##$ABSL= 3
##$ALPHA= 0
##$AQORDER= 0
##$ASSFAC= 0
##$ASSFACI= 0
##$ASSFACX= 0
##$ASSWID= 0
##$AUNMP= <proc_1d>
##$AZFE= 0.1
##$AZFW= 0.1
##$BCFW= 1
##$BC_mod= 2
##$BYTORDP= 1
##$COROFFS= 0
##$CY= 11.3945322036743
##$DATMOD= 1
##$DC= 2
##$DFILT= <>
##$DTYPP= 0
##$F1P= 16.9975609425685
##$F2P= -3.02152046262296
##$FCOR= 0.5
##$FTSIZE= 0
##$FT_mod= 4
##$GAMMA= 1
##$GB= 0.15
##$INTBC= 1
##$INTSCL= 1
##$ISEN= 128
##$LB= 0.24
##$LEV0= 0
##$LPBIN= 0
##$MAXI= 10000
##$MC2= 0
##$MEAN= 0
##$ME_mod= 0
##$MI= 1.114404
##$NCOEF= 0
##$NC_proc= 0
##$NLEV= 6
##$NOISF1= 3.799351
##$NOISF2= 2.8
##$NSP= 1
##$NTH_PI= 0
##$NZP= 0
##$OFFSET= 15.70392
##$PC= 1
##$PHC0= -9793.102
##$PHC1= 16.00087
##$PH_mod= 1
##$PKNL= yes
##$PPARMOD= 0
##$PSCAL= 0
##$PSIGN= 0
##$REVERSE= no
##$SF= 200.130013532006
##$SI= 16384
##$SIGF1= 3
##$SIGF2= 2
##$SINO= 400
##$SIOLD= 16384
##$SREGLST= <1H.CDCl3>
##$SSB= 0
##$STSI= 0
##$STSR= 0
##$SW_p= 3612.71676300578
##$SYMM= 0
##$S_DEV= 0
##$TDeff= 0
##$TDoff= 0
##$TI= <>
##$TILT= no
##$TM1= 0
##$TM2= 0
##$TOPLEV= 0
##$USERP1= <user>
##$USERP2= <user>
##$USERP3= <user>
##$USERP4= <user>
##$USERP5= <user>
##$WDW= 1
##$XDIM= 8192
##$YMAX_p= 0
##$YMIN_p= 0
$$ End of Bruker specific parameters
$$ ---------------------------------
##NTUPLES= NMR FID
##VAR_NAME=  TIME,          FID/REAL,        FID/IMAG
##SYMBOL=    X,             R,               I
##VAR_TYPE=  INDEPENDENT,   DEPENDENT,       DEPENDENT
##VAR_FORM=  AFFN,          ASDF,            ASDF
##VAR_DIM=   8192,          8192,            8192
##UNITS=     SECONDS,       ARBITRARY UNITS, ARBITRARY UNITS
##FACTOR=    0.0002004,     1,               1
##FIRST=     0,             0,               0
##LAST=      1.6414764,     0,               0
##MIN=       0,             -115270,         0
##MAX=       1.6414764,     155581,          0
$$ Real data points
##PAGE= N=1
##DATA TABLE= (X++(R..R)), XYDATA
0 0 0 0 0 0 0 0 0 0 0 0 -8 8 -8 8 -8 10 -16 16 -19 24 -27 32 -40 43 -50 58 -66 75 -85 96 -109 124 -135 152
34 152 -172 191 -212 235 -261 291 -323 358 -393 437 -485 536 -596 664 -742 830 -936 1062
52 1062 -1216 1405 -1654 1992 -2471 3224 -4581 7803 -35443 22756 98698 23115 -77029 -115270
66 -115270 -42726 42454 54079 -19216 -73899 -58207 -356 29328 16575 -17343 -34428 -31390
78 -31390 -17800 -163 27033 32659 -2371 -44092 -37891 10019 48482 38702 -6646 -36400 -12952
91 -12952 33753 47261 19398 -10002 -11813 10981 33771 32778 17094 12580 17558 12808 4047 13831
105 13831 38286 50648 31033 -9350 -25413 14201 70492 72050 11303 -41799 -26356 43732
117 43732 90344 53745 -25692 -52239 667 65243 71928 22241 -29526 -34215 7048 45883
129 45883 45745 18591 -10060 -23453 -11160 20674 41204 28387 -8221 -36702 -25979 21048
141 21048 53804 28742 -27927 -52979 -21516 31287 50288 12975 -39583 -45431 -2473 32781
153 32781 23043 -12680 -32361 -17277 9781 14235 -4810 -12899 -2569 1878 -10665 -19363 -6543
166 -6543 17516 24298 -4892 -38587 -30149 13807 39929 17808 -25140 -40463 -10356 32744 38707
179 38707 1496 -31942 -27447 1627 27151 29195 8156 -15018 -20660 -8075 12016 28320 24393
192 24393 -4051 -30221 -21743 15994 43957 30412 -17645 -49683 -22344 36796 57353 16512
204 16512 -39575 -49567 -3893 46139 41952 -8278 -42143 -24064 14993 29747 10727 -16770
216 -16770 -21927 -4722 8299 3131 -3373 -1184 -1594 -10021 -15509 -9035 6096 14583 626 -24354
230 -24354 -27602 -4799 15556 12489 -7401 -24534 -20008 -35 10610 2359 -9698 -12735 -12075
243 -12075 -8461 -472 7306 5851 -6461 -23264 -25791 -802 28529 24085 -13603 -42742 -29789
256 -29789 14612 43422 19633 -31992 -47771 -9398 37137 39643 -1316 -40628 -35433 8394
268 8394 39262 26074 -9102 -26792 -16110 7621 21660 14587 -976 -9432 -7631 -757 11043
281 11043 18519 9005 -9883 -17520 -4749 17107 27110 10606 -16292 -22032 585 21345 18965
294 18965 -17 -14104 -8033 9768 13828 1047 -6554 383 6382 1762 -5173 -3134 8760 15831
308 15831 2546 -19283 -18869 8565 29758 17981 -14554 -32283 -12938 23660 33805 4353
320 4353 -27647 -25954 2949 26609 22617 -4629 -24793 -16390 6971 19635 14892 184 -13785
333 -13785 -16120 -2732 13206 19595 10124 -10632 -23754 -9170 18763 26839 6109 -20723 -24103
346 -24103 619 27946 24719 -6220 -27107 -14868 11972 23156 10185 -10460 -14244 -189
358 -189 10279 4221 -4039 -1552 4344 3583 -2355 -6117 159 10852 8534 -8414 -16856 -4212 15349
373 15349 19124 2662 -18078 -19889 1063 19535 14896 -3422 -14991 -11250 2506 13484 10079
386 10079 -3355 -11565 -10101 -2028 10497 16293 5000 -14227 -21349 -7537 15293 24992 7256
399 7256 -21773 -26708 -1520 24359 22205 -4989 -28174 -20487 10660 28288 11442 -16333 -23791
412 -23791 -7423 12436 16085 1516 -12950 -10202 214 3702 907 -1263 -1745 -1733 -3435 -5306
426 -5306 -2931 4164 5416 -4147 -11908 -7738 2681 8098 3964 -6807 -12558 -5689 3169 4458 1523
441 1523 -1705 -4892 -7204 -4504 1558 6451 6150 -3354 -15024 -10222 8492 18771 7046 -14577
455 -14577 -23029 -6124 21138 26321 733 -25064 -21576 5134 26062 19328 -7969 -24169 -10805
468 -10805 14398 21971 8114 -10495 -16077 -4459 12492 16163 6150 -4719 -9088 -5781 3910
481 3910 12339 9885 -397 -7961 -6272 2988 12446 9560 -3959 -11138 -3268 8615 11753 4530
495 4530 -5603 -7814 461 6516 3041 -1554 -98 3431 2418 -2722 -6017 -1669 7981 8941 -2863
510 -2863 -12531 -6018 8011 14170 4151 -12732 -17185 -526 16898 14672 -3178 -16658 -13303
523 -13303 3784 16573 10874 -6687 -15530 -8333 5055 12854 8453 -5358 -13714 -8271 4899
536 4899 12428 9867 -3242 -14603 -11679 5455 16296 10111 -5292 -14897 -8582 8519 16536 5276
550 5276 -10277 -11816 -595 10617 10485 -1236 -9881 -5542 4465 6407 1172 -2226 -1622 1140
564 1140 974 -3150 -5144 1204 6445 2800 -6057 -8558 -3256 5136 6969 -1803 -11183 -9037 1657
579 1657 7649 4565 -4437 -12202 -10255 390 7841 5312 -3240 -11097 -11947 -2747 8130 8112 -3615
594 -3615 -14192 -12831 465 13482 10428 -8164 -20112 -11952 7146 17054 8208 -10916 -18811
607 -18811 -5827 12422 14856 1301 -11270 -10961 2133 13489 10244 -2619 -8549 -2853 5309
620 5309 9059 6649 858 -1580 1522 4322 4227 4713 4386 3468 3118 3874 3705 3416 5063 5386 3898 3387
638 3387 2646 2469 5234 7829 5889 525 -2011 731 7005 11445 6796 -4839 -8953 -419 10827
653 10827 12638 2301 -10784 -11991 1497 14095 9903 -6527 -16893 -11579 4493 14156 4981
666 4981 -13313 -19639 -9207 5146 9196 -455 -14558 -18319 -7014 4208 4038 -5398 -14915 -15774
680 -15774 -6426 3350 2947 -6328 -13958 -14114 -6509 1783 2136 -6779 -12703 -9498 -2668 288 -2105 -7821
696 -7821 -10074 -4424 1577 -140 -5102 -6654 -4133 -624 -269 -4315 -6651 -1141 4837 2338 -4726
711 -4726 -8085 -4423 4129 8478 2251 -8021 -8606 1042 8643 6688 -2163 -10151 -6717 4894 11846
726 11846 6039 -4552 -10465 -6499 4774 12072 6090 -5804 -10314 -4706 5441 10262 4236 -7589
740 -7589 -11772 -2481 8594 10257 1563 -10050 -11880 -765 9640 7969 -1943 -9256 -7770 708
754 708 7221 3642 -5117 -6964 -1831 2580 3100 -367 -4651 -4182 299 2267 31 -1638 -676 -184
770 -184 434 -198 -2642 -1860 2851 5504 1845 -2257 -3673 -739 5091 7391 2486 -3506 -2872 3178
786 3178 8051 7698 880 -6030 -3308 7143 12637 8336 -952 -7114 -2699 8612 14446 7646 -3454
801 -3454 -6232 1014 11325 14208 5049 -6191 -5905 4482 13201 12232 2635 -5877 -4447 6194 12457
816 12457 8432 295 -3903 -866 6247 9680 4934 -1718 -2203 1738 5530 6511 3288 -1106 -643 3268
832 3268 4337 2319 923 970 1999 3903 3001 -340 -1519 2200 4472 3459 57 -2569 -1530 4206
848 4206 6797 2075 -4146 -4871 916 6914 7503 -8 -7812 -5556 3640 8970 5596 -3316 -9227 -4631
864 -4631 6176 9943 2600 -6953 -9120 -1694 7621 9709 570 -9480 -8622 256 7496 7397 -1409
879 -1409 -9183 -7216 1223 7083 3742 -3875 -8413 -5464 3101 6592 1382 -6017 -7672 -3103 1814
894 1814 3231 -902 -5604 -4866 -644 316 -1502 -3396 -4222 -2190 643 -55 -4092 -4797 -2656 -742
910 -742 -937 -2768 -5077 -3741 459 1737 -2414 -6375 -6576 -2379 2651 3208 -2709 -8460 -6470 72
926 72 3833 1876 -4747 -8961 -4355 3880 6002 -170 -7041 -8660 -2699 5663 6962 -895 -7965 -7138
942 -7138 44 5890 5698 -1839 -7400 -4694 3182 6664 3544 -2727 -6526 -2940 3763 6689 1871
957 1871 -3260 -3948 -711 3369 4255 253 -2555 -1170 2120 2112 1309 -669 -1401 844 2784 1587 -770
974 -770 -295 1229 1818 815 -402 -2023 557 3890 3555 -485 -2991 -2582 1463 5075 4376 -1416 -4750
991 -4750 -1810 3468 5734 2552 -3072 -5890 -612 6758 6804 776 -5124 -5649 620 7562 6363 -862
1007 -862 -5919 -3924 2636 6581 4922 -2623 -6599 -1968 4648 6358 2651 -2968 -5187 -1286 4893
1022 4893 4868 578 -2762 -2413 973 4125 3211 -1364 -3082 -172 2643 2429 1235 -1653 -1621 1048 2700
1039 2700 161 -1969 -783 1085 2476 1241 -1741 -3512 -560 2848 2855 -75 -2552 -2631 804 4429
1055 4429 2926 -2723 -4798 -1899 2846 5358 2366 -4101 -6309 -817 5147 5313 540 -4906 -5668
1070 -5668 392 6390 4751 -2484 -6413 -3785 2341 6715 3884 -3858 -6939 -2388 3668 5352 2027
1085 2027 -3617 -5792 -1275 4177 3806 -160 -3581 -3522 292 3697 2027 -2364 -3984 -1441 1200 1972
1101 1972 498 -2461 -2587 166 1244 -668 -2520 -2008 -330 1548 1067 -1969 -3840 -1344 1706 1470
1117 1470 -867 -2930 -2820 463 3060 1161 -3461 -4439 -1746 1621 3426 1035 -4078 -5310 -801
1132 -801 3236 3049 -314 -4634 -4478 1293 5107 3262 -2545 -5270 -3075 2364 5948 2818 -3721 -4775
1148 -4775 -1049 3563 4715 1464 -3007 -3467 1100 4571 3189 -361 -2688 -1314 1768 4306 2252
1163 2252 -1076 -1708 1 1750 1889 486 -790 -245 2074 2355 -525 -1060 -444 1198 2540 1288
1179 1288 -1439 -1833 629 2487 1334 -765 -2816 -1804 2097 3645 1039 -2943 -3652 -886 2833
1194 2833 3840 -18 -4116 -3679 551 3496 2747 -1952 -5369 -3588 2005 5115 1795 -3848 -5284
1209 -5284 -2294 2798 4818 796 -4382 -4003 164 3593 3153 -1070 -4625 -2980 2127 4337 1744
1224 1744 -1471 -3296 -1582 2238 3487 789 -1671 -1374 475 2268 2055 -340 -2143 161 3025
1239 3025 3236 661 -1054 -1145 1298 3423 2391 -746 -1490 694 3075 3199 743 -2669 -2108 2541
1255 2541 5123 2387 -1993 -3145 -630 3698 4709 792 -3861 -3070 1492 4258 3146 -1577 -4990
1270 -4990 -2825 2508 5010 1944 -2623 -4844 -2299 2949 4525 503 -4426 -4134 -477 3265 3696
1285 3696 -1112 -4815 -3545 1256 3715 1595 -2172 -4627 -2716 1988 2945 -259 -2820 -2691 -196
1300 -196 2306 2045 -1278 -3158 -864 1619 1897 209 -1592 -2012 427 2525 960 -2029 -1659 319
1316 319 2376 2266 -63 -2848 -2037 1626 3299 1383 -1449 -2684 -871 2861 3458 -126 -3594 -2464
1332 -2464 682 3276 2821 -1107 -4336 -2630 2104 3686 1433 -2431 -4234 -2015 2770 3646 -401
1347 -401 -4019 -3944 -401 3389 2804 -1554 -4874 -2919 1159 2956 587 -2377 -3685 -1535 2155 1862
1363 1862 -1646 -3604 -2338 -464 1559 1138 -1994 -2828 -888 828 109 -851 -1897 -1898 455 1671 -408
1380 -408 -2382 -1848 -119 1610 1563 -286 -2393 -1447 1127 2098 704 -1518 -2436 -542 2963 3139 -347
1397 -347 -3491 -2526 836 3675 2832 -1412 -4041 -1562 2849 3679 582 -2916 -3747 48 3929 3270
1413 3270 -1039 -3903 -2701 929 3686 2543 -1772 -3811 -1250 1778 2781 695 -2580 -3339 -265
1428 -265 3010 2161 -1023 -2806 -2578 234 2295 1086 -2074 -2750 -161 1243 1138 -562 -2428 -1732
1444 -1732 1392 2837 679 -2330 -2033 -351 2325 2480 -358 -2538 -1126 1684 2804 1268 -1784
1459 -1784 -3019 -553 3793 3363 -100 -2625 -2006 1019 3901 3336 -1074 -2952 -197 3276 4228 1818
1475 1818 -1881 -2999 551 4257 4000 422 -2186 -2293 1283 4440 3448 -363 -2699 -425 2368 4252
1491 4252 2546 -1567 -2912 301 3937 3683 837 -1412 -1811 1101 3572 2231 -996 -1570 300 2208
1507 2208 2259 312 -1808 -1390 1805 2498 446 -1008 -1191 -169 1701 1950 -412 -2004 -926 1066
1523 1066 1893 879 -1311 -2806 -431 1908 1553 -264 -1902 -1841 188 2541 1684 -1543 -3063 -954
1539 -954 1495 2877 897 -2642 -3319 -399 2597 2138 -578 -2616 -2580 547 2728 1288 -1946 -3229
1555 -3229 -1081 1308 2486 383 -2736 -2948 -30 1834 1558 -128 -2220 -1764 637 1582 558 -1738
1571 -1738 -2038 -423 954 787 -562 -2358 -1341 462 1165 -437 -1144 -1420 -806 1279 961 -1800 -2307
1588 -2307 -910 458 1344 506 -2016 -2513 -363 1587 1105 -1108 -2522 -1844 397 2423 750 -2192
1604 -2192 -2906 -480 1496 1962 -77 -2962 -2953 292 2370 1052 -1258 -2942 -1522 1083 2742 400
1620 400 -2172 -2772 -625 1463 2158 216 -2419 -2148 401 2167 1065 -321 -2053 -1229 1244 2269
1636 2269 -104 -1260 -1407 147 1597 2105 -205 -1658 -769 1249 1579 785 -937 -1488 431 2656
1652 2656 1770 -956 -1723 -712 1461 2297 1088 -1583 -1335 928 2529 1595 -291 -1734 -1427 1343
1668 1343 2751 1384 -1408 -1714 -283 1790 2819 618 -1946 -1493 1032 2168 1839 -309 -1968 -1437
1684 -1437 1824 3285 910 -1366 -2210 -220 2127 2453 515 -1529 -1582 439 2101 1520 -519 -2099
1700 -2099 -743 1740 2252 278 -1032 -1562 -133 1513 1818 -363 -1484 -366 973 1377 364 -1225
1716 -1225 -1503 307 1787 1066 -549 -1163 -931 582 1752 278 -1617 -1409 434 1429 972 -590 -1662
1733 -1662 -1505 1172 1829 174 -1307 -1684 -469 1022 1948 -70 -1848 -1694 564 1816 946 -821
1749 -821 -2227 -1201 1502 2096 106 -1310 -1702 -298 1320 1870 -565 -1844 -983 604 1848 839
1765 839 -752 -1926 -681 1228 1032 2 -1139 -1037 67 1425 1195 -1002 -1082 37 693 1036 303
1782 303 -1095 -1206 440 1641 353 -981 -994 -337 636 1125 21 -1846 -1112 621 1578 960 -774
1799 -774 -2139 -951 1591 1504 -253 -1647 -1498 -7 1586 1374 -821 -2325 -1006 1261 1477 785 -1342
1816 -1342 -2232 -662 1764 1408 -421 -1769 -1695 264 1862 1464 -1231 -2194 -887 809 1529 560 -1388
1833 -1388 -2007 -36 1399 999 -194 -1318 -1088 365 1491 165 -1431 -1375 -223 564 1139 -196 -1668
1850 -1668 -938 661 1351 207 -1024 -985 -381 1285 1598 -488 -2013 -1134 693 1232 755 -1127 -2047
1867 -2047 -612 1346 1560 -576 -1690 -1793 3 1823 1245 -911 -2435 -1140 577 1553 866 -1557
1883 -1557 -2216 -497 1947 986 -111 -1490 -1923 206 1880 1014 -1057 -1992 -1044 949 1725 496 -1561
1900 -1561 -1816 184 1606 1151 -130 -1189 -1021 686 1809 706 -875 -805 -192 864 1171 246 -878
1917 -878 -694 741 1159 370 -551 -1124 -221 1186 1688 -81 -1058 -561 467 1912 1256 -756 -1242 -191
1935 -191 1674 1488 120 -881 -1035 465 1966 1332 -322 -1224 -284 795 1976 1136 -1008 -1080 319
1952 319 1734 1250 210 -1516 -1116 901 2050 1220 -629 -1111 -363 1022 1577 412 -1490 -1029 767
1969 767 1600 1375 -277 -1165 -922 765 1705 -20 -730 -608 298 969 882 -430 -1383 -186 911 1058
1987 1058 216 -981 -1458 -145 1460 870 -606 -1038 -749 399 1444 470 -1387 -1878 54 1105 813
2004 813 -280 -2038 -1216 344 1822 343 -1427 -1758 -659 991 1430 26 -1815 -1246 58 1415
2020 1415 976 -656 -1568 -1027 673 1332 240 -1072 -1791 -761 723 1054 -275 -1665 -1232 404 1161
2037 1161 917 -814 -1788 -1163 906 1206 -85 -1287 -1214 -79 1467 1021 -1052 -2106 -552 718 1350
2054 1350 45 -1360 -1384 -225 1533 875 -739 -1363 -509 587 1729 720 -1396 -1556 -68 1407
2070 1407 967 54 -1379 -1201 591 1506 753 -859 -1404 -380 981 2040 469 -1511 -2019 -2 1146
2087 1146 968 -147 -1914 -1201 710 1805 482 -1219 -1784 -679 1189 1432 143 -1545 -1449 372
2103 372 986 926 -521 -1765 -897 827 1112 59 -911 -1226 73 1161 1150 -865 -1605 -358 203 853
2121 853 333 -1033 -1333 -58 676 759 73 -836 -842 469 1237 480 -563 -1108 -228 833 1476 511 -1086
2140 -1086 -1215 323 1190 1300 -454 -1091 -584 1242 1973 258 -1002 -1233 343 1614 1318 -128 -1336
2157 -1336 -286 1538 1801 408 -699 -978 67 1799 1321 -292 -835 -186 605 1267 863 -258 -718
2174 -718 -78 1017 891 431 -77 -772 192 929 1265 -52 -496 -343 456 1266 597 -722 -973 -140 1240
2193 1240 933 -681 -1165 -703 909 1666 371 -1013 -978 -393 1000 1177 -307 -1392 -519 1058 1677
2210 1677 188 -922 -1433 -463 1047 925 -388 -1296 -542 451 1087 266 -627 -1134 -439 471 861 115
2228 115 -941 -1524 -677 804 712 -384 -1387 -858 -51 665 410 -823 -1659 -795 1023 1045 187 -1083
2246 -1083 -1605 -94 1124 578 -826 -1443 -613 860 1304 -334 -1781 -1118 539 931 269 -853 -1540
2263 -1540 -549 806 850 -235 -1277 -567 266 555 777 -666 -1404 -579 243 393 558 -501 -1310 -525
2281 -525 761 1154 -151 -855 -1324 -536 1143 1257 -389 -1650 -1321 789 1008 649 -598 -1618 -393
2298 -393 1368 1382 -657 -1228 -941 1003 1760 477 -1343 -1098 175 808 1055 -249 -721 -661 725 930
2316 930 36 -403 -428 -102 424 614 -10 -320 -312 -3 447 379 211 -442 -680 539 905 518 -265 -743 -392
2337 -392 745 1432 32 -984 -949 451 1152 984 -383 -1132 -399 1261 1274 -190 -1148 -634 475 1299
2355 1299 680 -971 -943 185 1132 758 -158 -927 -689 150 1014 73 -648 -362 -303 303 657 28 -592 -559
2375 -559 -278 -90 512 176 -384 -756 -109 492 393 -138 -684 -697 367 825 -13 -747 -1081 -164 862 646
2395 646 -377 -1127 -405 1080 1285 -271 -1458 -863 560 1400 789 -786 -1258 -18 1023 712 -356
2412 -356 -1169 -313 610 1085 218 -748 -296 -425 234 660 210 -138 -15 105 423 953 311 -420 -895 -119
2432 -119 468 673 445 -886 -333 392 1690 1131 -476 -949 -258 967 1288 265 -1334 -1120 1256 1542
2450 1542 1 -826 -1208 334 1645 858 -743 -1159 -159 898 745 277 -654 -789 460 898 263
2467 263 -340 -558 -103 -26 658 94 -321 -588 77 63 458 587 -345 -570 -542 768 799 258 -585 -1111 -33
2488 -33 1398 602 -311 -1216 -685 1031 1339 260 -1498 -1214 439 1213 696 -915 -1158 -368 1223 1086
2506 1086 -298 -1307 -441 561 718 246 -589 -572 -100 491 -58 -460 -189 -261 -141 7 -77 29 -305 -35
2526 -35 -181 -19 297 -188 -776 -264 -57 656 401 -504 -1008 -502 918 675 -310 -1392 -640 241 1196 482
2546 482 -1321 -1212 -178 1030 209 -320 -1327 -372 994 1098 -188 -1090 -269 676 868 24 -822 -806
2564 -806 207 726 137 -290 -337 -47 232 -13 221 -494 -271 -177 -742 -211 485 110 -662 -276 -31 694
2584 694 611 -85 -806 -285 855 608 -64 -746 -1086 198 1379 659 -1051 -1062 186 1207 573 -708
2602 -708 -986 -605 891 1132 -202 -1225 -755 325 1074 437 -566 -1056 -65 831 539 -298 -673 -434
2620 -434 264 332 316 -313 -18 -103 23 552 691 170 -654 -623 144 504 932 310 -872 -291 1006 1300 -116
2641 -116 -683 -837 439 1355 978 -343 -1185 -195 1176 1183 -88 -1090 -707 1093 1456 364 -854 -536
2659 -536 406 651 797 -287 -583 -52 696 510 241 -357 -100 343 584 77 39 20 -68 -56 329 701 155
2680 155 -335 -445 -92 965 926 495 -487 -808 550 1223 621 -895 -1277 -41 1294 925 -224 -1197
2698 -1197 -371 952 1301 96 -1072 -675 530 1196 549 -573 -834 -325 600 1156 -48 -991 -59 404
2716 404 238 143 56 -318 10 220 -53 38 73 -52 -443 -101 272 621 -42 -583 -702 227 801 202 -951
2737 -951 -1267 -171 320 429 -652 -1429 -786 706 949 -204 -1553 -1102 202 813 106 -1134 -1466 -327
2755 -327 680 217 -912 -1288 -656 234 424 -141 -1150 -761 -100 -71 -206 -511 -613 -424 274 -4 -302
2774 -302 -163 -550 -727 -284 206 423 -149 -495 -570 -221 456 391 -513 -1023 -146 802 731 -93 -997 -361 1258
2795 1258 1513 -123 -1156 -679 245 1101 1128 -586 -939 180 1537 945 -88 -717 -319 741 1115 582
2813 582 -620 -486 511 440 506 271 70 -56 277 417 430 179 300 -360 -45 383 506 191 -236 -497 172
2834 172 1089 822 -313 -1182 -3 786 872 152 -989 -871 604 1495 357 -872 -863 122 1096 1047 -213
2853 -213 -1207 -304 561 606 -40 -717 -806 250 575 219 -396 -342 -28 325 377 442 -531 -428 172 437 95
2874 95 262 82 -567 -441 695 767 385 -226 -584 34 733 1233 -412 -1242 -300 355 793 448 -734 -722
2894 -722 349 1234 634 -561 -753 -142 802 1059 -49 -1150 -390 641 809 89 -126 -885 -407 588
2912 588 680 -79 -389 191 319 394 292 -221 -338 -292 176 222 300 114 -508 -527 24 553 399 -10 -472 -494
2934 -494 572 797 -129 -715 -650 -53 727 492 -639 -1112 -297 906 324 -345 -781 -497 572 668 88
2953 88 -688 -574 377 441 58 -520 -610 -432 40 257 -133 -491 -371 -153 122 176 -38 -151 -131 -120 220 552
2975 552 68 -229 -338 -85 228 10 -261 -603 -760 307 506 142 -701 -414 191 633 544 -598 -1271 -706
2995 -706 693 598 -190 -452 -827 417 567 281 -879 -419 310 235 240 -171 -513 -434 227 233 12 -428 -569
3016 -569 -198 -35 312 -288 -362 -198 -66 -52 -51 18 -149 -399 -36 -134 173 -410 -575 -460 224 347 -146 -502
3038 -502 -401 -248 201 364 -259 -1076 -543 434 797 38 -462 -453 217 686 261 -86 -477 142 651 624 -66
3059 -66 -379 -391 664 370 8 -201 -40 84 118 538 63 118 17 480 307 888 214 -157 -96 73 553
3080 553 302 -167 -206 -280 361 1181 678 -286 -552 -38 343 575 43 -291 -71 634 835 502 -103 -340 -152
3101 -152 460 401 -548 -303 -29 332 198 141 -242 -295 42 -93 -249 -312 -79 -96 134 415 300 -192 -82 -269
3123 -269 -220 43 263 -13 -639 -333 145 484 -414 -130 -578 61 388 119 -445 -618 -235 -91 501 70
3143 70 -673 -390 234 215 466 -461 -417 -131 701 626 -347 -474 -135 270 491 132 -194 -361 159 353 5
3164 5 51 -168 53 96 737 417 -249 -24 98 190 452 40 140 -1 202 313 501 328 30 -482 80 340
3186 340 159 -20 25 -201 556 672 414 -291 -385 423 453 501 -369 -708 -292 459 454 -114 -414 -145 216 670
3208 670 187 -252 -276 300 325 159 -66 -322 -317 -9 -56 -22 -184 -219 232 -136 27 211 -284 -491 -426 152 192
3231 192 385 -410 -379 -67 195 194 -50 -301 -280 -17 671 74 -793 -518 -40 361 47 -335 -789 -567 297
3252 297 311 80 -124 -266 113 267 235 -48 -413 -311 199 428 48 -523 -379 113 -86 389 25 -173 -92
3273 -92 -198 442 219 -141 -277 -233 -243 207 177 -544 -386 -159 62 606 -121 -273 -165 241 745 210 -629
3294 -629 -430 -213 221 402 206 -531 -487 155 581 58 -282 -90 -276 308 177 307 -92 -65 -27 496 750
3315 750 45 -238 -132 227 322 189 -120 -186 -181 288 605 -95 210 264 369 231 355 130 -108 -227 304 580
3337 580 236 -117 -183 167 323 534 -149 -335 -203 489 242 63 -490 -272 146 427 112 152 -260 -68 274
3358 274 280 120 -247 -80 11 124 66 65 -495 11 -42 234 386 -332 122 -311 -90 66 -126 -312 -243 -329 -28
3381 -28 47 -277 -436 -76 72 108 -158 -322 -579 -37 366 -93 -106 -226 -461 110 -42 46 -320 -396 244 134
3403 134 21 -225 -483 17 161 600 -184 -489 -93 -83 444 128 -80 -429 -342 260 334 22 -190 -404 -222
3424 -222 265 161 -12 -379 -445 -26 259 282 195 -381 -473 129 367 -277 -340 -324 -318 200 75 -51 -379 -425 -175
3447 -175 270 317 -196 -528 -222 57 220 92 14 -327 285 269 78 -182 -303 -292 99 660 -49 -415 -373 -97
3469 -97 206 263 108 -93 -307 214 133 -96 -29 -221 -49 225 -98 78 -337 -48 44 598 249 -106 -513 -471
3491 -471 366 558 115 -369 -485 143 239 120 18 -476 19 57 -136 220 -37 -404 -77 442 354 -229 255
3512 255 -376 92 287 348 -106 -420 74 368 400 -137 -182 -288 -46 503 322 72 -216 -285 116 472 61
3533 61 -225 -398 175 543 377 536 -288 -126 202 224 -67 125 -197 97 390 146 476 -399 -411 -139 450
3554 450 426 149 -24 -253 410 415 172 -66 -55 52 482 608 21 -300 -340 103 392 267 -236 -259 -180 546
3576 546 261 -61 -152 -129 66 455 481 -354 -186 71 95 111 185 -262 -145 104 375 186 -59 -6 -214 247
3598 247 516 83 -113 -359 -25 88 332 -106 -490 -246 228 237 -80 -216 -531 29 215 336 -357 -458 -277
3619 -277 8 7 306 -405 -448 -172 66 75 -293 -341 -784 -23 242 361 -273 -744 -301 -203 29 44 -616 -421 -29
3642 -29 214 113 -14 -227 -400 -352 -116 -89 -622 -389 -43 -228 273 15 -264 -202 159 -127 -34 136 -315 -258
3664 -258 -348 148 -117 -513 -102 -356 -90 124 116 -328 -474 -202 129 -85 -15 -613 -156 -106 52 -163 -450 -454
3686 -454 -282 84 200 -191 -417 -146 183 53 76 -397 -266 -56 636 76 -243 -303 -328 126 -27 78 -62
3707 -62 21 -63 218 132 287 -220 -274 82 148 294 -247 -414 54 -95 242 -44 59 138 283 36 90 12 -192
3730 -192 -134 128 552 307 35 -252 129 172 -139 -89 -48 158 524 176 -120 -140 -455 -43 298 223 151 51
3752 51 -67 114 123 251 -108 -107 102 142 298 -59 -165 -70 228 29 -27 -67 40 191 304 150 -94 -48 118
3775 118 68 35 182 -175 -218 50 192 43 252 30 63 -61 -9 258 238 -140 100 277 -49 232 -132 -293
3797 -293 10 228 164 48 -62 -49 25 275 167 -286 245 200 162 102 374 -34 68 21 263 -29 415 -299
3819 -299 -242 263 356 174 76 -32 124 565 305 266 91 -214 128 420 281 -13 -33 276 86 289 -52 -347
3841 -347 66 54 319 -16 -367 -259 -138 -104 294 -184 230 -285 -19 356 -17 -126 -178 -112 -153 262 136 -341
3863 -341 -146 -2 -2 -16 -108 2 -20 -68 206 92 -283 -201 -104 109 120 -168 -297 -251 135 -64 63 -378 -403 -326
3887 -326 0 149 -49 -328 -296 -84 448 -61 -264 -391 -354 189 179 -254 -14 -109 -147 13 -109 -20 -404 -96
3909 -96 -34 -7 -49 -130 4 -196 -89 543 -28 -28 -121 -179 126 105 -14 181 -36 248 -97 325 -255 -205 406 313
3933 313 -8 53 -75 -232 222 49 288 -91 -93 53 243 58 192 -217 -73 157 389 101 -167 -30 -176
3954 -176 -338 255 -70 -167 76 -56 313 25 -29 2 214 399 229 45 -264 -392 31 117 190 155 -6 -13 -149
3977 -149 6 217 -35 -260 5 292 49 222 -281 -201 137 108 377 -79 -235 382 240 593 87 55 19
3998 19 94 117 262 -77 -169 -9 51 302 3 -351 -255 -234 58 389 11 -117 -55 375 122 185 -159 -161 85 328
4022 328 -90 -116 -34 -136 66 272 76 -252 -186 60 -179 47 -96 -84 -178 182 162 146 16 54 97 -13 276
4045 276 184 -32 -154 236 430 20 326 -114 -277 265 -75 -269 -155 -50 97 26 109 117 -57 -9 65 151 29
4068 29 -80 -203 216 -137 3 -80 -130 66 -108 281 71 -149 -101 -353 11 27 230 157 -308 -63 9 237
4090 237 -339 -166 -89 148 -24 215 -92 -465 42 -144 166 290 -155 -169 -25 213 -254 -151 12 -301 -101
4111 -101 224 162 -191 -196 -208 241 -80 -40 -480 -318 -15 273 38 -160 -125 -282 141 -231 -178 -80 -96 189 -9
4134 -9 30 238 56 -165 -329 232 -71 -3 -251 6 200 113 -29 -399 119 108 -132 118 -113 -89 -51 149 -119
4157 -119 83 -218 -511 -20 213 115 -241 -177 121 18 90 97 -316 -353 73 102 -377 -375 -192 167 54 -81 206
4180 206 190 -164 -6 411 -171 149 -115 -119 400 25 -108 34 10 -9 230 325 394 52 -255 -37 3 130 -136
4203 -136 55 198 149 119 19 1 -159 22 263 -63 -190 -348 9 371 130 23 102 -364 -208 272 209 77
4225 77 -80 47 165 422 58 62 -105 193 292 53 198 -167 -85 -19 678 -112 -135 -39 216 273 -22 166 -61
4248 -61 -99 95 177 -45 -97 -131 206 -56 5 218 69 -201 221 -6 45 165 -137 -135 -40 113 -265 -82 -255
4271 -255 -61 118 -113 -258 -255 -77 -191 336 163 -137 -78 -63 142 112 -16 167 245 -320 154 131 -132 -183 -284
4294 -284 -18 -101 227 -432 -288 93 99 -216 155 -202 -466 -192 175 195 31 -194 119 -15 193 240 -423 -91
4316 -91 -143 -167 429 -14 -264 17 -190 171 -164 -245 -298 87 37 -177 -114 -448 -220 73 -125 -247 -272 -302 -217
4339 -217 59 185 -237 -243 -139 -226 75 -93 -85 59 -358 66 54 135 -22 -220 -64 239 32 -95 42 -22 239
4362 239 7 -104 -40 -97 149 28 139 243 -99 -207 -244 224 175 114 102 -129 48 76 -252 -50 -245 232
4384 232 107 155 -210 -363 4 161 16 -137 4 62 159 23 -114 -75 -66 128 85 -78 52 -456 -28 42 156
4407 156 89 -110 -9 117 -103 -270 473 149 -141 -131 2 274 16 348 -101 -175 430 -34 -30 58 6 -37 239
4430 239 2 58 3 -133 310 -67 -44 -228 -241 197 -198 136 117 -102 322 70 166 -66 68 4 167 352
4452 352 -175 164 -43 -187 265 113 -202 -163 -324 332 334 -2 -30 16 270 244 48 -238 205 -19 22 -74 148
4475 148 135 33 -263 -49 72 -37 -95 110 -10 83 227 -73 -121 349 119 -11 233 -268 -39 -19 39 -98
4497 -98 -35 -88 -48 75 78 242 -146 -294 2 23 61 94 145 63 13 46 187 4 -10 64 2 -169 133 163 -64 -338
4523 -338 23 -95 -171 -199 51 101 -104 -56 -162 208 -257 -112 269 -18 173 -15 -178 -266 -266 -105 -379 155
4545 155 215 205 -205 13 -399 18 -111 51 -308 -207 182 -215 -14 -221 -211 71 122 5 60 -173 -343 85
4567 85 -101 228 -79 -183 103 -67 101 -422 -216 -36 -69 5 110 55 -72 -144 110 26 2 34 212 100 89
4590 89 -85 189 192 -150 -40 -48 125 131 -166 -278 -55 -39 125 -2 -81 303 -179 182 -183 -71 107 -1 -160
4613 -160 182 113 -262 72 372 -178 59 -362 -184 47 -45 -126 -121 -227 -217 -98 3 178 -59 -51 -232 68 112
4636 112 -21 -80 -76 61 51 347 -173 -115 -77 258 -12 155 -113 -199 254 390 -165 416 -190 -93 145 -125 107
4659 107 -193 -205 -242 -101 62 0 28 143 60 -15 315 223 -10 195 -19 139 360 152 -67 136 205 54 -14
4682 -14 -139 -129 100 232 255 -89 13 -35 43 167 -68 -61 -180 -95 -198 -160 56 20 15 -23 34 -56 -14 -342 110
4707 110 222 43 19 22 103 -384 32 140 -16 -102 72 4 51 214 58 -86 -34 11 -140 -19 95 -242 125
4730 125 375 -221 -107 -259 117 35 45 52 -144 75 114 -187 -323 53 -156 97 37 283 288 84 -124 102 -118
4753 -118 209 -63 77 -149 165 86 261 49 -41 -115 143 -252 -118 -22 92 -58 -190 -54 -45 -468 110 36
4775 36 171 -49 -254 245 -308 60 26 -162 179 140 -83 362 281 -65 -310 -165 341 -64 110 -72 24 -70
4797 -70 -153 218 154 143 -134 76 143 -84 181 238 333 108 -146 154 253 -175 168 135 92 -171 -4 127 -70
4820 -70 14 -305 99 -93 -81 16 47 -212 233 229 272 81 -132 -275 -219 -81 -32 203 230 146 149 123 29 175 -3
4845 -3 205 -111 114 59 248 153 -92 283 56 -39 -381 -113 154 14 289 39 71 -73 67 251 15 135
4867 135 -110 44 98 67 -18 59 -31 70 13 177 -242 -205 -398 -41 119 -191 59 -50 -19 -96 -163 -315 109
4890 109 -194 407 176 249 -115 -120 175 50 167 166 -98 -21 61 93 60 -62 -30 -40 85 361 262 -71 -84 -86 17
4915 17 22 -159 218 -20 -68 140 -67 -16 218 109 63 419 -150 149 -411 73 258 -62 -221 -102 80 -15
4937 -15 -106 45 -127 -284 -206 138 377 -63 -114 127 146 20 276 61 132 495 32 211 -90 -284 280 221
4959 221 -84 189 88 -177 -137 -126 -119 247 -273 -112 -20 -65 -207 76 115 -174 258 91 87 -70 -190 -215 441
4982 441 63 -19 16 28 191 -323 212 -61 -68 -157 30 -73 -469 -189 114 -95 -47 349 -154 -85 5 -34 255
5005 255 -391 -87 -74 -117 79 -100 95 -145 4 116 154 65 31 304 132 26 -94 112 163 -64 57 -98
5027 -98 141 -1 -10 216 91 187 145 8 177 -150 -84 21 95 -126 -35 276 -254 -124 -8 -64 -168 321 -90
5050 -90 -120 -99 55 47 48 -163 -35 251 188 -194 51 265 -170 -21 258 262 153 -19 -471 22 189 -373 -168
5073 -168 -288 -165 88 224 -90 258 267 50 119 -157 74 41 187 37 -218 14 -23 -233 184 181 375 -93
5095 -93 -175 51 -67 -139 375 115 -217 48 -138 176 1 -36 154 56 214 149 208 102 90 288 168 155 187
5118 187 51 77 -212 -25 35 -215 32 -136 -170 428 -99 2 -105 -41 90 46 -8 -74 -42 36 -58 171 -32
5141 -32 -223 243 441 -81 65 -198 -119 132 14 -50 112 -170 227 129 37 4 -162 -60 114 261 -120 -18
5163 -18 200 -98 223 46 4 -191 -300 134 -91 143 -230 -109 104 -25 -120 -21 -10 -242 -98 -25 46 -133
5185 -133 -327 -251 -64 135 -85 -503 61 272 -338 -152 -315 -117 -141 -64 -117 -134 145 73 -52 80 -116 -32
5207 -32 -193 339 211 -40 -159 -122 -70 -60 4 80 29 -326 -608 -6 -113 -69 112 -164 -283 -68 -110 -245 62
5230 62 -237 -73 -195 -16 33 -19 91 73 -220 81 -68 134 208 46 66 -219 -217 -68 -126 -328 -196 -174 -144 132
5254 132 -67 92 -155 -317 69 378 56 224 -51 77 -136 -27 -332 -115 -48 196 283 -63 143 -237 -265
5275 -265 32 508 129 0 99 26 156 375 249 41 -16 -182 -73 458 278 22 -28 -29 -186 -167 47 -185
5297 -185 36 78 -138 -289 -45 -234 -143 117 118 115 119 -37 201 -69 -137 91 -181 -23 -157 177 -4 255 328
5320 328 265 363 -360 195 -151 58 -143 -156 -39 -155 21 77 82 76 238 -42 307 -88 175 18 -371 100 114
5343 114 236 40 78 137 56 159 89 28 107 213 32 50 -56 -44 -134 11 130 165 -142 130 4 49 170 48
5367 48 199 -121 -84 114 178 131 -87 -242 -335 157 304 185 -76 -68 -25 -40 6 -110 149 -52 -328 -110 -110 234
5391 234 -31 71 108 -207 -116 -6 -422 491 17 81 100 84 -129 -27 280 -188 -193 -140 -235 67 21 -68 -148 -172
5415 -172 256 234 -62 -286 192 26 96 41 -236 -287 49 -165 74 -90 -176 196 9 -47 20 27 81 -57 20 227
5439 227 117 -493 35 -33 -11 59 -8 164 90 212 44 -161 -136 109 -169 51 356 58 17 -90 -428 -43
5461 -43 -48 21 28 0 -309 -216 -233 -307 137 89 221 87 182 -124 60 -13 93 117 99 -81 -121 86 232 -32 122
5486 122 -71 74 -27 31 -101 -245 -78 200 246 72 122 -40 -107 85 -49 -189 182 331 229 458 -256
5507 -256 -120 -26 110 38 5 165 125 172 -79 46 167 117 -60 -24 99 216 87 -185 -56 -143 -142 221 125 -18
5531 -18 219 -121 -76 139 54 -268 15 85 -97 -73 -325 23 -44 37 112 -1 43 320 -99 176 78 133 -148 243
5555 243 -25 -158 -22 -151 -75 -235 -145 -203 -55 -275 28 -81 -21 218 -63 -319 -127 -50 75 30 -296 -152
5577 -152 116 326 -149 -98 -92 -93 25 18 151 8 -58 23 102 11 -66 86 239 165 204 24 -130 -127 -230 -122 219
5602 219 115 37 -143 62 92 118 14 -110 -84 -38 -204 -253 -214 80 15 -105 266 46 -175 253 47 -36 147
5625 147 -45 225 -374 438 -313 13 22 67 139 164 -235 -98 4 -198 120 -116 -19 220 49 -84 76 -163
5647 -163 -17 -102 -89 341 40 -74 -69 -56 -146 -121 -433 -117 231 37 319 -15 -67 8 -111 148 -214 -273 -61
5670 -61 -120 186 -96 -56 97 -33 -470 170 120 70 -133 -151 434 49 -32 79 27 -101 91 78 65 -6 -9 -122
5694 -122 -247 124 260 135 144 -488 84 -215 -38 -54 20 -96 75 113 -69 -79 214 -15 63 -14 -45 118 -338
5717 -338 -115 -213 39 -77 -300 89 -11 123 -147 178 -304 68 96 -201 -61 -120 162 201 42 -58 -388
5738 -388 -155 -133 -74 -115 -423 -95 182 124 -92 154 -53 157 154 330 -182 -323 -102 -34 219 -86 459 191
5760 191 55 -57 83 -178 -84 -87 13 -39 51 190 264 155 181 -61 -228 -44 -24 110 80 -27 77 -256 137
5783 137 175 -147 14 166 -73 46 -100 49 74 56 -144 227 105 133 2 -55 129 192 74 426 -35 54
5805 54 -172 8 -155 -98 176 56 -28 199 -58 115 -270 -262 113 -512 -39 -40 -12 -240 -231 -28 -171 -84 -204 37
5829 37 70 130 -84 -87 -67 11 123 -89 -72 154 -139 176 28 -3 17 132 -146 8 4 -113 34 -192 124 19
5853 19 -138 -306 25 148 129 235 -82 -122 109 37 -65 -40 -52 256 387 200 -14 -239 -227 -2 -110 -29 -100
5876 -100 45 15 -104 110 94 175 -88 259 -23 5 192 -136 -109 -49 270 66 38 33 180 140 314 -30 -152
5899 -152 120 225 -211 -201 43 -124 -33 -74 -69 7 -160 -164 -167 -356 75 164 227 -117 0 -177 -40 61 -46 -148
5923 -148 124 -57 -171 43 -192 29 -123 106 -2 -101 113 -25 -99 -184 65 -39 -153 14 50 38 94 -274
5945 -274 -73 8 319 73 223 18 352 -20 291 323 83 -9 -100 -227 106 -195 21 -2 142 -193 0 -125
5967 -125 8 3 183 48 -200 -108 49 192 164 14 -15 164 147 -80 -218 138 -5 -179 -105 126 -42 -156
5989 -156 305 10 -28 -341 -73 196 -95 -41 -219 -287 -462 -5 223 -207 4 34 106 -27 103 17 -103 -42
6011 -42 57 93 265 96 -286 28 -41 48 -25 -83 20 -112 -242 -224 4 64 -71 -212 271 136 20 44 -20 121
6035 121 -229 -28 -153 -41 74 167 91 171 -191 135 158 9 -133 157 138 -145 151 -2 -22 -208 221 -163
6057 -163 118 65 -93 -22 183 -4 -143 15 21 -86 -41 -85 366 175 -150 -171 -100 -116 106 -33 -140 -26 -8
6080 -8 219 -232 -56 61 166 -71 25 -156 22 71 -31 -144 -64 15 -177 -45 -123 294 -64 302 106 -210
6102 -210 43 -279 74 212 151 303 109 107 110 126 70 -150 28 175 106 63 40 -50 110 -228 -126 37 -88 -94
6126 -94 29 444 231 98 131 -4 -201 -292 -195 63 36 -253 261 -106 60 239 -299 -150 40 -101 30 134
6148 134 -282 -93 -168 -237 -73 -81 192 104 -146 148 -79 247 232 -9 -3 -131 -208 -96 -1 99 -134 -21 -77 55
6172 55 -122 50 63 138 -150 219 -92 223 266 4 404 -96 136 320 -15 -169 -100 125 -27 131 -8 -188
6194 -188 122 145 42 -49 41 92 -208 -24 228 -85 191 22 -60 -102 -139 -108 -171 177 42 22 120 30 -111 -203
6218 -203 -14 2 -21 -143 69 52 83 -172 -244 18 -6 75 149 66 -46 303 -297 238 -86 92 76 -253 -29
6241 -29 -230 315 -91 220 144 -43 126 141 171 -63 26 -58 92 51 -28 -3 15 31 -38 194 173 -139 35 -15 -16
6266 -16 238 53 -127 248 362 126 223 163 130 12 91 -21 -20 41 12 -114 184 -101 186 -215 68 121 59 82
6290 82 121 7 -21 -18 -24 -180 -244 -120 260 69 -374 173 -76 42 -21 -83 175 34 55 137 -31 123 -324 -2
6314 -2 -155 -256 42 100 -237 28 7 -104 -21 129 -29 13 134 -62 -237 -148 27 121 113 146 -253 -161 56 -138
6338 -138 64 -202 147 -22 82 492 -168 -29 103 164 -17 112 178 -72 -40 402 141 59 -133 -34 -166 196
6360 196 125 -94 -1 -203 -205 42 -24 -88 80 -52 -13 47 150 -30 -138 -57 156 151 105 9 -79 -194 -194 -421 -37
6385 -37 -45 -89 -183 89 57 108 55 156 -173 40 -16 18 -63 -34 183 33 -138 -134 60 -31 -45 -119 25 93 82 -142
6411 -142 -32 -86 50 40 32 -145 113 347 -32 140 -12 56 30 -89 -116 35 9 157 -12 -231 131 -17 99
6434 99 -15 -134 126 -11 -25 -132 -271 -95 187 65 72 182 108 107 139 -115 -20 -221 -254 118 221 163 31 -74
6458 -74 -195 -7 -136 174 41 -35 -28 240 127 -127 45 -243 4 -6 252 -133 -206 -133 102 27 140 52 172
6481 172 -57 70 98 211 140 3 335 -113 159 -231 13 21 241 -81 216 79 -104 -144 92 -258 -65 -19
6503 -19 -173 -331 2 -221 -190 -8 -25 13 -327 -17 -40 -192 -151 -143 -234 22 -101 53 62 -61 -263 30 88 -187
6527 -187 102 172 -31 40 -134 110 -364 23 -189 224 269 -158 -132 -91 -80 -147 -47 -112 -410 -51 130 -186 -182
6550 -182 -68 -1 196 -56 116 -75 -85 202 128 290 -264 61 101 32 -51 214 -32 156 1 -90 79 -13 96
6573 96 60 -12 167 4 -114 69 3 49 170 -52 -9 47 98 -53 53 -37 -29 7 122 98 -57 139 -57 -112 -172
6598 -172 261 78 12 -37 11 -159 -85 -126 80 -25 -278 281 -55 150 70 5 180 -65 117 15 -196 -57
6620 -57 133 265 -233 -3 102 73 185 48 -35 -115 -97 1 173 11 -245 -126 -71 21 2 -257 -54 -99 239
6643 239 45 30 49 100 -12 -174 347 -99 66 93 -65 -69 66 45 192 326 42 119 133 -132 174 -201 -17
6666 -17 -156 -175 -179 -105 -103 -129 119 -108 -172 78 256 344 12 188 76 74 -345 127 252 -90 0 -176 201 -87
6690 -87 22 179 124 -115 139 86 38 70 26 -60 232 96 28 -1 83 -433 44 260 -36 -305 -69 499 24
6713 24 -135 222 65 275 95 160 -206 11 12 30 -8 -74 6 32 268 124 -235 -295 -98 436 382 -80 -68 -64 -60
6738 -60 -43 -133 285 6 161 -82 195 -118 137 172 -125 -18 -205 -16 74 -346 145 26 -215 -153 17 -56
6760 -56 -85 -60 75 -32 -156 70 53 -1 -87 -174 -314 56 123 30 -383 13 100 123 -243 -121 -32 -255 -130 207
6784 207 -65 -140 64 -100 39 44 -116 -145 77 128 -184 -126 -225 242 -38 9 -18 139 157 92 63 -16 -178 266
6808 266 -117 102 -190 268 315 -24 -194 -108 -157 -204 -6 30 -336 -120 24 205 -44 106 -89 88 -170 -122
6830 -122 84 -226 226 144 -25 146 -376 -124 189 51 -227 -140 -83 -190 -144 156 144 106 -16 -34 -59 268 -163
6853 -163 157 -114 -121 241 -71 132 -1 -63 -26 10 64 -45 438 -103 -83 69 -224 56 -42 255 263 185 68 -34
6877 -34 62 -33 -19 -126 -109 116 -10 -74 -303 227 -329 -61 -18 -256 -95 8 -57 -183 385 13 53 32 30 -332
6901 -332 99 -170 170 -149 -11 -23 100 173 36 -192 67 -82 13 -8 -480 167 -131 14 -45 51 357 -67
6923 -67 -193 119 186 -26 -152 -114 183 -223 169 -164 292 67 100 77 -14 219 -83 140 -185 112 181 -246
6945 -246 125 -135 -383 28 -190 -202 0 65 117 237 62 139 118 -47 78 0 123 -128 -17 127 12 208
6967 208 35 -251 -196 -12 -264 49 -172 -216 37 22 -323 -47 93 3 227 -94 17 -36 -134 95 64 -174
6989 -174 125 -204 -88 130 147 155 380 187 0 35 -33 -48 -4 -123 139 59 -41 47 -91 -188 366 38 -122
7012 -122 101 299 -206 347 6 104 -288 4 135 -37 455 -136 -268 -23 172 101 299 -309 -328 -145 -141 -181
7034 -181 115 -46 82 174 15 -93 535 -283 -20 -102 -68 131 -392 -169 -45 293 -75 156 -76 138 161
7055 161 108 -215 58 -204 93 27 119 19 -20 -76 -41 220 203 189 -190 -136 -341 247 -349 141 -275 123 -63
7078 -63 -170 32 20 -61 150 -68 13 149 -55 -11 25 -41 -110 -122 131 -209 19 117 -31 10 -207 -98 262 -142
7102 -142 83 95 -63 -95 57 -186 141 -280 -96 -166 29 -25 62 -119 -179 238 74 -41 44 -179 -259 -171 325
7125 325 -129 197 8 116 -98 -151 230 17 131 35 -91 -47 213 326 41 66 154 57 281 -348 277 27
7147 27 200 -209 143 125 -146 -34 -127 -24 -23 39 -235 -125 -24 148 82 87 -95 302 -157 -363 431 -83 -79 170
7171 170 -56 -2 -58 29 -219 -286 -152 -170 -275 -200 -115 -129 224 137 -65 -208 -181 165 168 8 87 49 346 33 60
7196 60 277 -397 -89 -238 -55 206 -63 -294 -44 141 -318 174 57 -53 -137 247 286 -180 77 -289 55
7217 55 -63 -119 243 -259 -25 -8 -98 111 -149 -60 -35 -95 -82 -45 -212 -135 21 344 38 103 -229 84 -276 42
7241 42 85 79 7 80 75 220 -121 -136 57 190 288 34 -32 -97 202 273 -98 -46 251 -58 153 391 -100 56 59
7266 59 -128 183 -57 21 180 -110 -153 -149 146 -114 -231 115 279 286 27 141 -16 -57 450 -58 -128 -103 109
7289 109 307 178 179 -146 53 293 -115 -6 -40 -74 49 -149 127 156 -213 14 -9 76 -148 300 158 -159
7311 -159 146 217 -192 52 -70 -288 -99 78 32 29 -190 65 -49 -111 27 3 -65 -23 80 -16 72 -21 8 69
7335 69 -21 3 62 -130 -179 188 224 2 -8 164 34 -106 -47 496 -218 84 90 -161 203 213 80 -57 271 -101
7359 -101 -45 88 127 -110 274 -134 183 34 -126 81 -100 -54 -272 195 238 -24 -81 -179 -464 102 -193 428
7381 428 -62 -11 175 328 188 97 249 -202 -56 254 129 -30 329 -100 51 82 -147 231 -29 135 174
7402 174 0 49 102 -194 -88 17 -33 -215 -84 -125 51 59 -303 188 -49 239 -59 29 -342 250 244 -105 252
7425 252 -405 -51 -443 201 -143 -45 35 -150 24 58 -14 220 409 -106 -82 -271 65 124 222 -230 227 -23
7447 -23 -275 -44 16 188 13 -71 -72 -221 -7 -199 144 -80 51 -50 96 225 28 108 281 185 6 193
7469 193 87 21 244 -11 -28 245 31 160 -35 69 -37 98 280 228 123 -30 117 -37 -123 -155 65 -63
7491 -63 -11 -178 -147 58 -157 28 319 -274 -25 -149 -174 293 -141 -160 251 -74 352 -34 253 35 158 -62
7513 -62 -278 138 42 -53 -60 -133 191 96 139 160 183 -86 350 -151 36 71 -425 -123 38 127 -172 -17 251 225
7537 225 -293 -171 17 -194 -8 122 -146 129 4 45 -10 -39 10 -36 265 -77 -42 161 -41 -158 155 -177
7559 -177 36 214 358 320 -74 -298 -180 138 5 18 -62 247 -101 -7 77 -71 427 52 -30 -157 44 92
7581 92 -197 -74 -20 -116 -73 -81 -86 84 285 1 -182 129 346 -122 440 157 -89 -140 -155 -138 220 14 -126 -46
7605 -46 -74 -85 -117 9 134 -14 395 -105 128 42 -93 -6 77 31 -36 83 -161 174 -109 18 -188 107 -519
7628 -519 67 88 202 -11 166 58 1 -103 171 96 -97 21 206 13 120 -147 -188 -400 45 12 -80 -52
7650 -52 -85 133 -14 54 376 132 77 -31 27 -25 -20 236 112 180 20 -91 65 -88 -93 311 -121 245 216 144
7674 144 -30 -120 -136 223 -79 -8 -221 -311 492 164 -137 263 138 -95 -166 -24 200 -259 -99 31 -127 -193
7696 -193 23 -143 -21 62 -205 18 44 -273 43 80 -318 120 228 -145 -26 313 -27 72 148 130 -201 -183
7718 -183 260 29 171 242 176 -226 -49 -286 257 -132 58 277 -7 -90 -41 267 126 -138 365 -29 -123 105
7740 105 29 180 130 167 54 188 90 154 8 -42 46 -159 -11 -39 -74 19 -93 32 136 203 -147 66 -2 96
7764 96 -130 73 -101 189 -25 -80 41 -7 204 236 212 -9 -82 -65 85 -35 -1 -24 -149 -98 -45 -165 116 34
7788 34 -302 -127 -161 80 -104 11 -37 -23 -126 133 -73 51 -68 -182 -39 280 291 -59 -125 9 182 -66
7810 -66 -127 91 -291 63 99 -175 -100 -93 -53 -58 116 92 -152 182 -135 -166 -200 -140 -31 -34 42 -356 164 153 142 113
7836 113 13 161 8 -45 -73 67 36 169 -42 -57 -152 144 390 -148 11 26 269 -232 -116 125 -205 -137
7858 -137 47 -187 3 94 7 135 435 -51 199 43 216 37 -197 81 2 -28 -26 -116 193 -128 -316 -44
7880 -44 -149 -99 -147 234 41 34 -179 -208 24 -182 -75 167 -100 103 55 -3 -48 283 127 -217 -142 -38 242
7903 242 161 198 -394 -228 119 -73 -275 19 -179 104 43 -138 -93 392 -94 80 364 -247 -75 141 144 -169
7925 -169 207 57 -181 -22 -187 -305 193 0 112 -253 1 110 -143 -307 -71 -9 146 -1 107 -120
7945 -120 35 -146 118 204 167 69 50 -68 -500 -126 168 -345 51 -124 26 130 60 -34 -77 106 95 -114 88
7968 88 113 194 65 -48 351 -212 36 180 153 226 148 -220 -64 -24 -148 106 -152 -139 -258 -129 -40 79 -33
7991 -33 -179 -126 109 111 214 -300 61 8 -54 22 -188 -205 13 2 290 168 24 -213 -29 -36 189 -62 237 -106
8015 -106 232 110 -52 -100 -71 -276 216 141 -291 191 88 -186 -160 72 -194 139 15 -234 -293 333 -49 -163
8037 -163 83 -23 -240 -312 -101 -184 37 -88 57 128 -293 -14 95 -244 61 -190 -156 246 -236 -150 -260 -35
8059 -35 -47 -75 -11 -259 -294 84 -152 -35 -152 122 12 73 21 128 -86 117 18 47 124 -141 -58 100 -65 92
8083 92 -184 245 171 -109 -236 -203 60 147 -352 116 -49 83 -210 -88 157 -197 -181 25 44 314 82 -25
8105 -25 8 -36 -139 -46 -163 151 91 -76 33 26 75 142 238 -52 -292 70 64 -21 83 12 132 -42 225 254 -151
8130 -151 124 12 148 -317 28 -13 2 141 122 43 158 48 140 -10 -112 -22 50 171 -81 -120 -8 46 91
8153 91 -66 -163 18 115 326 78 -318 55 290 -15 -229 289 166 -43 -258 -13 75 65 90 160 246 55 -14
8176 -14 -129 -192 -125 -254 201 66 -180 -238 43 199 91 -65 -178 54 -92
8191i2
$$ Imaginary data points
##PAGE= N=2
##DATA TABLE= (X++(I..I)), XYDATA
0 0 0 0 0 0 0 0 0 0 8 -8 8 -8 10 -16 16 -24 24 -32 35 -41 49 -57 66 -75 89 -99 115 -131 148 -168 188 -210
32 -210 235 -266 295 -331 366 -407 452 -501 552 -612 679 -752 833 -925 1026 -1143 1278 -1434
50 -1434 1621 -1843 2117 -2465 2920 -3544 4465 -5957 8796 -16173 77833 155581 14117 -56712
64 -56712 -39911 58606 107764 82956 3696 -27975 2202 58851 73170 48300 2885 -14051
76 -14051 3061 36219 50443 47741 26624 -3744 -21155 518 39314 56639 32602 -10337
88 -10337 -31312 -1036 45307 49305 5878 -28287 -17554 19528 38286 20278 -8686 -9931 6187
101 6187 6045 -6099 2326 25629 27653 -3884 -37690 -30567 21780 59922 30477 -36441 -60159
114 -60159 -13526 50564 61882 4543 -59141 -54017 13850 62930 43026 -17816 -55727 -36344
126 -36344 18331 49723 28233 -15324 -36566 -25931 2386 27281 26959 1312 -28076 -35635 -11647
139 -11647 29172 43281 4288 -48037 -51473 -1036 46374 40355 -14035 -56286 -37175 17332
151 17332 39539 8613 -30136 -34382 -7698 15866 9986 -12503 -19008 -6303 -3290 -14223 -16198
164 -16198 -1198 12365 5145 -22496 -41068 -20552 19662 28968 -5422 -42431 -40569 -1531 32632
177 32632 21409 -23792 -48281 -25665 12909 27430 11220 -17723 -32461 -21741 -28 14794
189 14794 16952 3674 -21601 -34637 -12929 24084 35321 5812 -38302 -46739 -1998 49415
201 49415 44049 -13395 -55089 -36574 20201 52519 25982 -28004 -44936 -9927 30047 30856 792
214 792 -23233 -18655 5273 17485 7547 -3863 -2829 -756 -5084 -5924 1943 12537 12816 -3542
228 -3542 -22076 -16546 10008 24012 9991 -14123 -22651 -8864 12249 15775 147 -12932 -10520
241 -10520 -3500 915 5686 7403 829 -11583 -19461 -12265 12981 29202 10530 -27308 -39295
254 -39295 -9578 31049 38023 71 -43057 -38579 11080 45348 26151 -22440 -46138 -20600
266 -20600 25897 41933 11019 -27214 -31283 -5856 19062 22873 5998 -11754 -13153 -2904 6310
279 6310 12508 12563 99 -14609 -13135 5917 22601 20713 -1792 -22452 -15867 11984 27202 13555
293 13555 -8722 -15326 -2171 14639 14051 -1234 -7764 1420 8270 2553 -3423 863 9413 10654
307 10654 -3285 -17788 -9281 17185 27340 5111 -24098 -27244 826 30924 26353 -10713 -34590
320 -34590 -17997 15726 28745 10703 -18569 -28102 -8121 16657 19604 3839 -12450 -18941 -11732
333 -11732 4792 16319 11591 -4125 -19920 -21031 -449 22643 18639 -8971 -28154 -18045 10388
346 10388 27593 11793 -20117 -30190 -6863 20079 20422 -1089 -18781 -15590 3114 11837 2458
359 2458 -6970 -3804 2561 1711 -4050 -5142 1311 8397 3305 -11247 -14148 2771 17705 12334 -7883
374 -7883 -21938 -13137 10461 21933 7976 -12769 -17385 -5331 8820 13509 4015 -9579 -12761
387 -12761 -4165 5822 12545 10313 -4476 -18467 -14862 4616 21342 18557 -5174 -26345 -18796
400 -18796 11712 29095 13372 -15795 -27366 -7985 21794 27787 1614 -23333 -19571 4889
412 4889 21102 15424 -4255 -15017 -6722 7430 8686 2520 -755 -675 -33 -210 -549 1484 6308
427 6308 5144 -4281 -8801 -556 8935 9562 1398 -8028 -8762 908 9312 6506 -367 -3664 -4680 -3463
443 -3463 1213 5300 5817 1850 -6143 -12076 -3203 13011 15737 -1881 -19285 -16488 5059 24809
457 24809 17282 -11646 -29013 -12782 16730 27103 8353 -18109 -23932 -1822 21554 19026 -2871
470 -2871 -17364 -13292 4214 17182 13127 -2256 -11182 -8347 653 9204 12368 5252 -5650 -8596
484 -8596 -1970 8035 12279 5462 -7225 -9744 2200 12670 10487 -95 -8150 -5705 4545 9557
498 9557 3831 -2268 -57 3521 2075 -2442 -3202 1914 8454 6033 -5883 -11014 -1163 11309 10467
513 10467 -2831 -15476 -12117 6362 18174 7596 -12725 -19234 -7311 9700 15400 2401 -15403
526 -15403 -16874 -3422 8935 9571 -797 -13221 -16115 -4784 7589 9063 -137 -12683 -17717
539 -17717 -7555 8604 12223 -933 -15729 -17725 -5138 10356 11576 -4242 -16931 -11891 2762
552 2762 10655 4944 -7749 -13239 -3861 6870 5871 -1531 -4226 -1868 1497 1808 -1205 -1916 3839
567 3839 7881 2091 -5153 -4304 3519 9736 7741 -1413 -7443 -1456 10346 12275 4380 -4365 -7090
582 -7090 -337 10575 13622 5761 -3678 -6894 -2313 7335 13991 8285 -4680 -10071 -2639 10084
596 10084 16510 6854 -11313 -15904 -550 16528 17504 1030 -15634 -15693 2129 16952 11065 -6536
610 -6536 -15603 -8336 5918 11687 2710 -10487 -12456 -2792 4767 4728 -1373 -7437 -8000 -2989 -367
625 -367 -1164 -3045 -3101 -4108 -4572 -3601 -3216 -3661 -2334 -2355 -4426 -4572 -3730 -3111 -1585 -669 -3101 -7584 -7290
644 -7290 -2187 2454 3091 -3080 -11678 -10805 427 9105 5149 -6556 -14339 -9555 5750 13069 3142
659 3142 -12934 -16356 -3878 10866 13137 -810 -17153 -15384 500 12626 9215 -4732 -15341
672 -15341 -12310 2214 10383 4475 -7781 -13112 -8738 2079 8863 3245 -8055 -12683 -7417 1594
686 1594 6576 2640 -7007 -10983 -4242 2735 2812 -1582 -6748 -6073 175 4194 655 -5127 -5096 -739
702 -739 1920 1299 -2337 -3331 1929 6064 1811 -5122 -5156 1498 8308 8655 905 -6956 -3716 7389
718 7389 11961 6140 -2852 -6124 1359 12405 14015 4481 -5118 -5304 3134 13192 15034 5344 -5270
733 -5270 -4880 5390 13359 13045 3908 -5802 -4420 7122 15269 11205 -187 -7652 -3878 9115 15680
748 15680 8591 -3024 -6526 -450 8028 11135 4608 -4029 -3647 3367 7543 4957 -142 -2980 -1021
763 -1021 3875 4764 952 -1620 187 798 518 35 -1575 -304 3346 3586 -1053 -4785 -3578 1000
779 1000 4626 4217 -1313 -5963 -2781 3750 6211 2342 -3766 -6947 -1717 7709 9638 1301 -7469
794 -7469 -7648 140 10158 10995 736 -8537 -6183 3937 11613 9008 -1881 -9663 -4373 7800
808 7800 12673 6687 -3822 -8450 -2616 8367 11555 3295 -4907 -5220 1077 7106 7375 351 -5119
823 -5119 -2882 2774 5389 3356 -863 -3708 -1996 1820 2624 -849 -2206 -1664 -434 68 -627 -3778
839 -3778 -3921 -506 1033 -1259 -4477 -5601 -3221 948 1751 -4093 -8843 -6601 -301 3231 353 -7385
855 -7385 -11989 -6627 2940 4737 -2597 -10668 -11607 -3946 5015 4231 -5716 -13103 -9808 -419 5897 3060
871 3060 -7212 -13646 -8109 2317 6521 1451 -7349 -11652 -6076 3838 6078 -595 -7585 -8434 -2391
886 -2391 5068 5494 -1886 -7671 -5526 910 4596 3758 -1614 -4790 -2337 2438 3110 238 -1571 -1105
902 -1105 1282 2956 1788 -1742 -1704 1417 2843 1883 -90 -1202 852 3929 3582 -846 -3973 -1152
918 -1152 3507 6304 4171 -2062 -5594 -948 5562 6548 1804 -3850 -5140 1166 7765 6609 -1762
933 -1762 -6995 -4277 3336 8873 6065 -3043 -7712 -3186 4989 7850 3859 -3484 -6818 -1091 6710
948 6710 6948 894 -4542 -4868 659 6835 6312 -116 -4741 -2308 2150 4998 3746 -432 -2673 -136
964 -136 3402 2364 421 -564 47 1617 3347 1316 -1147 -69 1998 1857 773 -445 -571 1756
980 1756 3578 2299 -1651 -3017 -461 3052 4945 2326 -2819 -4451 613 5064 4458 -8 -4292
995 -4292 -4003 2240 7487 4395 -3066 -6348 -3432 3526 7975 3599 -4499 -6855 -1279 4672 6006
1010 6006 1367 -5223 -6249 303 6117 4527 -1436 -5496 -4608 624 5679 3437 -2179 -4503 -2421
1025 -2421 1565 3315 1099 -3062 -3751 329 2471 1195 -1228 -2692 -1901 580 1788 -1091 -2629
1040 -2629 -832 671 1035 -429 -2839 -3143 -339 2786 1219 -2775 -3882 -2569 1220 3118 -134
1055 -134 -4637 -5178 -574 3555 2918 -1431 -6087 -5617 1168 5537 2931 -3593 -6482 -4267 2509 5887
1071 5887 1707 -5636 -6750 -1534 4804 5101 -16 -6206 -6389 627 5833 4051 -1212 -5568 -4592 1480
1087 1480 5447 2579 -2253 -4193 -1941 2374 4065 1025 -3172 -3432 443 3268 2267 205 -2212
1102 -2212 -1483 1576 2000 -88 -1951 -226 1402 1900 940 -2012 -2611 642 2951 1790 -1360 -2064
1118 -2064 -955 2120 3212 368 -3725 -3070 755 3831 3049 -854 -4564 -3710 1725 4618 1903 -2328
1134 -2328 -4641 -2346 2710 4900 797 -4951 -4952 -366 4135 4964 -217 -5489 -4649 980 4349 2991
1150 2991 -1372 -4379 -2779 2367 4260 1214 -2696 -3295 -728 2650 3591 454 -2779 -1708 976
1165 976 2406 1557 239 -1450 62 2293 1245 -811 -1249 449 2035 2179 536 -1639 -1303 1826
1181 1826 3228 1477 -1462 -1729 301 3060 3551 -252 -3416 -2165 1880 3818 2917 -880 -4258 -1966
1197 -1966 2912 4132 1154 -2874 -4199 -920 4175 5015 -755 -5216 -4084 430 4626 4013 -1604
1212 -1604 -5449 -3035 2061 3996 1129 -2722 -4760 -2182 3163 3751 -729 -3806 -3484 -485 2498
1227 2498 2591 -1117 -3288 -1647 837 1369 170 -1680 -2497 -265 2160 1424 -1547 -2254 -1109 966
1243 966 2127 703 -2552 -2062 1132 3125 1284 -1598 -2920 -916 3218 4265 296 -3627 -2934 1240
1259 1240 4536 3494 -1184 -4427 -1259 3755 5001 1304 -2783 -4159 -277 4722 4734 -178 -4133
1274 -4133 -3644 634 4134 3566 -1202 -4892 -2501 1647 3776 1880 -2992 -5333 -2249 2932 3408 -394
1290 -394 -4185 -4667 -1307 2443 2212 -2025 -4483 -2440 415 1245 -91 -2968 -4059 -1073 1639 383
1306 383 -1945 -3089 -2524 110 1424 -461 -3012 -2511 609 1419 261 -1804 -3579 -1593 2228 2701
1322 2701 -406 -3017 -2197 144 2870 2340 -1521 -3512 -969 2703 3801 1573 -2216 -3320 -402
1337 -402 4037 4102 164 -2646 -2333 1195 4555 3553 -1295 -3786 -1186 2729 4522 2616 -2092 -4107
1353 -4107 -295 3806 3833 623 -2310 -2455 1039 3960 2072 -1872 -2507 -415 1514 2615 340 -2068
1369 -2068 -2004 738 2052 549 -1093 -1225 -473 980 1272 -540 -2473 -1374 756 1160 845 -1335 -2602
1386 -2602 -1021 1845 1818 -718 -2418 -2092 347 3132 1925 -2241 -3395 -1035 2559 3591 1074 -3096
1402 -3096 -3674 396 3952 3058 -494 -3218 -2270 2192 4920 2364 -2620 -3524 -261 3377 4486 1851
1418 1851 -2235 -2613 1242 4094 3545 89 -1656 -1421 1954 4383 2408 -757 -1627 -183 2772 3490
1434 3490 1163 -1485 -1088 1402 2622 1229 -478 -1369 130 2900 3300 400 -1751 -641 1706 2741
1450 2741 1909 -792 -2362 -1 3249 2567 353 -1982 -1838 1556 3902 2151 -1958 -3174 -843 2223
1466 2223 3553 959 -2568 -3257 573 3287 2622 -718 -3273 -2148 1151 4078 1686 -2246 -3194 -1168
1482 -1168 2300 3429 1075 -3009 -3482 49 2843 2576 121 -3239 -2956 1049 3895 1629 -2085 -3217
1498 -3217 -1490 1363 2883 465 -2684 -2150 628 1748 934 -1110 -2593 -1042 1740 1808 -791 -2256
1514 -2256 -1340 159 1338 737 -1813 -2507 -656 857 647 -726 -2398 -2626 -380 1838 637 -2087
1530 -2087 -3001 -1954 675 1652 65 -2988 -3312 -160 1732 1133 -1168 -3787 -3294 387 2602 652
1546 652 -2656 -3454 -2011 1035 2331 -235 -3397 -3148 53 1751 1318 -1055 -3195 -2366 957 2141
1562 2141 680 -1560 -2123 -1186 966 1951 -528 -2210 -1315 526 1259 660 -739 -1977 -313 1197
1578 1197 1445 -460 -1122 -878 143 1453 865 -1361 -1758 590 1926 1365 -108 -1790 -1629 1251 2631
1595 2631 970 -1113 -1721 -518 2153 2575 345 -2172 -1840 1150 2528 1988 -510 -2462 -1163 2131
1611 2131 3268 572 -1999 -1787 138 2744 2918 -333 -2383 -1040 1156 2661 1893 -521 -2545 -804
1627 -804 1915 2241 738 -892 -1269 187 1938 1879 -322 -1858 -606 1176 1902 1645 -471 -1748 34
1644 34 1937 1639 -42 -1332 -635 976 2204 742 -1778 -1185 298 1904 1667 -76 -2037 -1171 1635
1661 1635 1950 765 -1572 -1814 -476 2079 2079 -103 -2001 -1648 877 2453 1879 -635 -2475 -1224 1406
1678 1406 2258 577 -1686 -2267 -594 2255 2376 -663 -2412 -1422 826 2132 1570 -695 -2534 -916
1694 -916 1277 1867 246 -1396 -2017 -405 1726 1987 -570 -2062 -1472 293 1466 827 -815 -1959
1710 -1959 -110 1022 936 -355 -1144 -1202 799 1633 208 -1512 -1105 -36 996 1082 -449 -1716 -1121
1727 -1121 824 1693 527 -1288 -1901 -580 1720 1825 -444 -2057 -1394 132 1120 1315 -656 -2368
1743 -2368 -771 1104 1609 160 -1443 -2359 -399 1910 1655 -744 -1992 -1289 236 1560 1001 -1422
1759 -1422 -2188 -19 1255 1416 201 -1490 -1759 131 1544 1022 -702 -909 -501 613 773 425 -1129
1776 -1129 -1060 563 1132 534 -87 -885 -640 859 1417 -40 -1129 -668 152 1609 957 -639 -1863 -647
1794 -647 1503 1497 113 -1471 -1504 141 1838 1175 -873 -1731 -985 639 1817 748 -1557 -1951 -271
1811 -271 1855 1482 -363 -1742 -1800 182 1935 1095 -1271 -1961 -841 601 1876 697 -1735 -1961 75
1828 75 1720 1189 115 -1526 -1552 505 1776 288 -992 -1313 -71 877 1483 -350 -1611 -1170 760
1845 760 1444 455 -857 -1341 -396 1194 1211 -404 -1149 -441 304 1374 1116 -693 -1657 -280 2057 1618
1863 1618 472 -836 -1128 296 2523 1630 -768 -1559 -425 1066 2071 845 -1201 -1643 188 1924
1879 1924 1832 476 -1600 -1351 649 2443 959 -681 -1395 -616 1183 2227 1007 -1625 -1631 155 1808
1896 1808 1496 292 -1480 -1006 970 2080 788 -572 -1103 -15 1395 1661 337 -1100 -670 683
1912 683 1038 1003 -551 -1326 -185 1461 1381 155 -666 -692 344 1616 1313 -612 -1201 -87 1188 1106
1930 1106 612 -798 -1316 214 1740 1091 -454 -1214 -969 1216 1948 746 -1376 -1237 -101 1085 1330
1947 1330 -429 -1476 -1179 621 1795 289 -1067 -1809 -859 1082 1759 -78 -1782 -1199 -9 777
1963 777 699 -307 -2033 -987 570 1071 114 -949 -1719 -345 768 886 -609 -1661 -1182 140 694
1980 694 199 -1230 -1680 -380 800 604 -882 -1362 -896 -104 1141 314 -1486 -1668 -467 451 663 -600
1998 -600 -2169 -1574 332 1741 534 -1178 -1913 -793 556 1445 -239 -2228 -1639 426 1292 718 -584
2015 -584 -2128 -680 1329 1757 282 -1084 -1281 -565 1240 1788 -479 -1233 -1057 540 1436 830 -793
2032 -793 -1768 -418 967 1609 454 -901 -1861 -70 1382 1533 -235 -1408 -650 696 1482 647 -1453
2049 -1453 -1564 635 1767 1277 -342 -1737 -823 886 1695 539 -1220 -1062 217 1327 1284 -81 -1967
2066 -1967 -1316 803 1386 826 -589 -1387 -835 740 1441 -166 -1002 -1357 -136 1441 1387 -381 -1865
2083 -1865 -1258 877 1512 588 -802 -1850 -478 1371 1706 -433 -1393 -1079 90 1553 1284 -886 -1636
2100 -1636 -655 1133 1321 664 -1066 -1220 367 1568 1252 -392 -1163 -499 751 1462 675 -1283 -997
2117 -997 330 1465 847 246 -827 -620 709 1694 675 -398 -597 62 1266 1202 205 -625 -660 469
2135 469 1522 1144 295 -872 -250 1378 1611 423 -646 -988 258 1527 1578 -259 -1527 -664 1041
2152 1041 1655 779 -833 -1659 -111 1576 1245 -398 -1098 -486 678 1600 773 -744 -936 -225 553 773
2170 773 -150 -931 -857 131 850 611 -355 -984 -640 223 862 781 -971 -851 -165 201 634 -326 -1604 -1008
2190 -1008 242 1177 62 -1384 -1415 -713 1016 785 -459 -1872 -1032 634 799 318 -1007 -1534 -427
2207 -427 959 1177 -596 -1549 -1039 230 1261 673 -1296 -1609 -293 946 758 -246 -1102 -1062 -238 1061
2225 1061 639 -782 -946 -550 158 943 585 -636 -1186 -354 690 970 595 -1338 -1243 82 1373 1014
2243 1014 -512 -1401 -706 712 1896 298 -938 -1247 88 1232 870 -533 -1272 -397 1271 1345 88
2260 88 -1041 -484 91 1506 1057 -678 -1027 -69 1066 1023 93 -485 -771 77 816 933 58 -344 -711
2279 -711 -2 1043 882 -64 -648 -604 514 1310 946 -769 -1423 -120 1229 1330 261 -1333 -1413 574
2297 574 1838 597 -886 -1455 -231 1294 1408 131 -1329 -622 778 1474 482 -381 -849 -187 799
2314 799 828 86 -535 -89 496 415 502 110 -485 -309 270 364 308 147 -339 -414 419 988 248 -421 -812 -115
2336 -115 887 842 -209 -1389 -603 792 1218 173 -1098 -1125 -17 1478 753 -787 -1117 -448 728
2353 728 1357 -5 -1206 -1067 583 1247 429 -475 -993 -306 517 709 -249 -911 -212 226 396 400 -275 -556
2373 -556 -482 168 345 274 69 -634 -526 -115 498 197 -532 -590 -503 677 920 -97 -936 -551 757 982
2393 982 577 -556 -990 -306 1487 701 -671 -1266 -682 923 1357 -43 -1241 -959 345 1355 217
2410 217 -759 -882 -89 885 813 -184 -1032 -333 439 821 681 0 -405 -102 226 57 548 157 66 -574 368
2431 368 1005 719 -226 -1111 -488 968 1558 149 -1057 -1075 405 1172 881 -657 -1363 -155 1149 1042
2449 1042 -41 -1596 -523 586 1029 298 -1350 -1145 348 1047 3 -413 -1043 -276 452 782 -412
2466 -412 -1176 -763 221 488 110 -352 -775 -270 -24 -175 172 134 -555 -965 -336 549 568 -211 -505 -825 211
2487 211 1174 507 -1046 -1156 56 1061 1057 -639 -1325 -800 1111 1355 -195 -1116 -1075 357 1316 665 -700
2506 -700 -1420 -74 921 686 -88 -863 -615 714 689 101 -513 -315 60 225 415 42 -253 -363 -31 -191
2526 -191 181 187 -404 -172 -240 169 493 147 -308 -1214 423 869 796 -688 -1214 14 821 881 -212 -1378
2546 -1378 -1076 756 1234 62 -805 -792 8 1176 499 -678 -966 -127 939 795 32 -980 -520 363
2564 363 843 -70 -697 -61 367 552 378 -35 35 -47 465 192 167 671 69 -269 -271 559 1000 471 -197 -538
2586 -538 -206 1101 981 -145 -531 -162 754 1116 526 -994 -558 721 1236 346 -580 -590 91 1533 1242
2605 1242 -657 -1263 -15 905 1006 -161 -987 -758 443 959 228 -643 -531 68 410 575 136 -208
2623 -208 -228 174 112 174 303 -128 -726 -363 268 438 270 -459 -915 -331 1130 957 -393 -1248 -765 485
2643 485 921 324 -1161 -1067 242 1410 543 -478 -1015 -489 1260 1161 -83 -1189 -643 739 942 394
2661 394 -606 -1124 95 784 551 -374 -587 -276 -95 624 308 -259 -391 -173 150 -29 704 -86 -472
2680 -472 -416 290 463 687 -313 -1184 -483 926 721 -58 -864 -1054 246 1200 632 -1057 -1560 -218 844
2699 844 493 -481 -1431 -1020 468 1008 -72 -1444 -1071 -154 618 -46 -527 -987 -366 232 262 -380 -553
2718 -553 -338 -570 133 -84 -422 -246 -400 -743 -12 149 58 -644 -595 -608 240 572 -333 -1040 -809 385 680
2739 680 9 -857 -1172 22 1174 792 -749 -1232 19 761 856 -97 -1462 -917 640 1518 366 -506
2757 -506 -813 135 675 670 -335 -532 -50 1134 665 63 -194 -206 76 378 228 65 -142 379 -206 -255 682
2778 682 563 -72 -327 122 369 614 321 -554 -711 448 1176 765 -351 -459 123 1268 1042 309 -915
2797 -915 -150 869 1234 219 -973 -1036 553 1490 366 -786 -680 -30 831 964 -125 -547 -140 366
2815 366 572 -61 -250 -364 -213 335 236 128 -299 -240 -448 40 431 152 -240 -489 -464 270 744 602 -791
2836 -791 -868 286 857 703 -291 -1315 -599 907 1197 -177 -1315 -654 453 1396 588 -665 -1119 57
2854 57 1133 625 -620 -819 -202 436 726 113 -925 -641 169 195 511 -90 -409 -373 96 397 144 234
2874 234 -369 -314 -295 618 371 -531 -824 -409 274 405 118 -635 -887 -266 588 532 -359 -947 -602 453 826
2895 826 33 -960 -681 -129 1034 684 -646 -999 -672 432 896 -148 -694 -666 202 725 -22 -498 -614
2914 -614 -222 153 41 -11 -288 -469 196 -10 -42 -23 -241 -216 -409 -84 322 -261 -391 -485 -57 540 391 -378
2936 -378 -704 -460 485 409 200 -820 -941 276 1004 418 -627 -596 16 303 687 -296 -1232 -536 532
2955 532 333 -186 -441 -487 -43 544 163 -502 -737 103 151 -53 216 -143 -225 -119 266 -22 208 19 -602
2976 -602 -16 357 242 251 -195 -329 -338 571 691 -201 -547 -223 180 527 145 -416 -764 365 778 458 12
2997 12 -587 13 668 842 97 -572 -164 439 649 47 -299 -429 80 392 241 -263 -268 -12 239 266 111
3018 111 -62 -255 207 106 364 408 220 -277 -196 575 308 434 16 -315 -155 603 732 -17 -652 -219 585
3039 585 605 608 -368 -511 -30 899 668 -71 -662 -203 440 947 256 -683 -336 542 874 502 -30 -846 -29
3060 -29 605 916 61 -248 -238 156 215 224 -153 39 -196 -207 408 160 -11 -362 -496 112 345 125 122 -420 29
3083 29 315 799 -38 -409 -575 -88 513 377 -671 -550 -518 467 705 -381 -664 -601 421 903 305 -584
3103 -584 -531 131 431 275 -174 -658 -329 3 309 -120 -443 -322 -345 130 243 11 -55 13 -150 48 39 144
3125 144 -217 -208 -100 380 213 -294 -212 -510 128 511 146 -455 -85 160 510 477 -215 -512 -233 431 351 -67
3147 -67 -396 -104 8 647 652 -189 -496 -120 125 515 247 -377 -274 137 477 85 -185 -495 214 202 546
3168 546 147 -142 -169 -101 -45 154 238 -556 -142 -109 -61 299 -192 -184 -278 348 566 -61 -589 -498 -31 405 666
3191 666 22 -619 -335 220 355 11 -366 -487 -327 565 53 -337 -541 -26 510 116 321 -551 -323 52
3211 52 479 -13 -71 56 -261 301 219 -135 -201 -29 -61 -2 -133 257 -222 -509 5 304 102 -347 -374 -211
3233 -211 -84 376 178 -451 -298 -77 150 706 -281 -366 -425 40 387 223 -57 -274 121 690 466 -81 -575
3254 -575 -257 45 355 344 -205 -627 165 711 380 194 161 23 -208 642 462 -246 -522 144 483 278 630
3275 630 -56 -456 -122 455 419 -70 -17 -825 100 700 531 -227 -227 -344 135 505 207 -369 -116 -3 519
3296 519 578 -64 -593 65 281 516 38 -358 -335 -307 434 517 -200 -380 -283 456 16 293 103 -301 -260 484
3318 484 434 -213 -388 36 -134 141 134 64 -344 39 200 178 137 -326 -299 -66 332 188 -197 -180 94 79 512
3341 512 216 -302 -408 -144 390 13 -255 -467 -648 52 243 7 -217 -598 -286 -19 333 141 -373 -381 -117
3362 -117 -87 -377 -488 -507 -362 44 444 -233 -387 -428 -387 -18 192 -176 -388 -418 44 330 51 -298 -589 -239
3384 -239 344 28 -337 -453 -734 -89 162 345 -177 -256 37 45 434 -193 -423 -588 339 409 -67 -306 -353 -275
3406 -275 396 327 -145 -598 -139 77 185 -53 271 -486 -248 563 49 -66 -249 -148 33 140 430 59
3426 59 1 122 173 205 401 -368 -79 123 308 578 5 -224 -204 92 466 205 -611 -117 -195 441 495 225
3448 225 -417 -175 175 418 107 -396 -250 -93 4 715 450 -273 -457 243 253 410 233 -577 -543 97 174
3469 174 349 21 -215 -20 287 505 219 -244 -289 376 207 89 -72 -190 -183 272 172 12 13 -135 -121 264
3491 264 131 -42 -74 185 -172 225 38 -62 -463 -79 476 130 131 -286 -262 81 561 296 84 -78 -137 196
3513 196 231 300 -83 -48 75 41 193 436 -96 -267 451 515 347 -392 -171 -91 327 599 114 -573 -128 205
3535 205 119 300 -195 -576 -387 107 385 -252 -114 -282 -125 304 184 35 -431 -327 238 -50 -308 -124
3555 -124 -176 55 262 89 -245 -559 -517 114 94 224 -482 -461 -384 178 -209 -104 -235 -514 -7 109 -2 -404
3577 -404 -100 -182 -239 103 -115 -461 -398 -54 393 183 36 -494 -391 0 215 92 -339 -535 -256 155 296
3598 296 -101 -653 -229 68 77 -75 -498 -471 -59 245 -41 -334 -57 -62 -250 44 -78 -678 -134 -80 25 38
3620 38 -187 -127 -458 70 256 -64 -278 -148 -173 89 72 117 -42 -391 223 274 67 133 -342 -315 307 96 125
3643 125 -299 -478 -321 86 469 70 -283 -136 21 117 -47 -132 -189 -256 268 331 303 -260 -244 76 222 411
3665 411 -14 -292 -89 478 275 474 131 -537 260 277 87 176 -209 -207 29 541 150 -259 -155 325 237 162
3687 162 218 -138 -257 93 602 575 44 -44 101 380 457 260 -71 -47 235 568 372 196 -197 89 -82 135
3709 135 65 -174 -219 -305 122 277 -99 222 -168 305 92 363 -8 28 -84 34 562 226 -94 -446 -74
3730 -74 327 491 -80 -117 -36 42 326 -30 -21 -110 -45 55 294 155 -14 -147 -178 325 238 -354 -92 -197 -43
3753 -43 379 -17 -23 -289 283 10 218 164 -120 -106 -62 360 134 -109 148 83 249 9 106 -237 -18 246 162
3776 162 399 53 -118 119 179 97 36 -475 -30 90 446 56 37 -479 148 125 29 -21 -24 -299 125 393 274
3799 274 -19 -46 -46 -26 258 162 -239 -114 -53 408 43 119 -117 -78 149 155 124 -365 -247 -279 277 211 -321 -194
3823 -194 -244 38 69 -70 -242 -241 -156 -184 49 -114 -5 -229 151 438 239 -266 -371 -145 36 90 -83 -251
3845 -251 -349 -172 167 -35 -107 -307 8 206 75 125 -239 -519 -208 173 -295 180 -220 -308 -66 269 230 -73
3867 -73 -357 -27 114 140 -128 -279 -264 -114 72 -11 -177 -372 -265 -7 187 171 -224 -276 -102 28 -64 158
3889 158 50 -222 -132 4 -58 -134 -444 200 107 -2 247 -64 -311 22 59 303 -184 -575 43 86 -24 140
3911 140 -196 -81 270 184 161 180 -229 -219 217 274 -110 -265 -319 -22 4 168 79 106 -244 86 25 -101 -188 -94
3935 -94 8 35 309 -61 -200 -105 271 152 58 -247 -413 -273 150 161 -173 108 -128 -448 -84 210 103 -308
3957 -308 -6 42 123 -291 -220 -204 145 165 351 -122 142 4 -64 -98 -54 181 -13 188 -11 52 28 -6 -178 -77
3981 -77 -113 197 141 -254 -299 97 311 45 -175 -218 -25 20 208 -322 -445 -42 -91 519 251 -182 -190 13 39
4004 39 -121 263 -53 -390 144 368 87 94 96 -66 375 -40 -95 -90 -55 260 -6 216 -274 -151 -322 -18 295
4027 295 4 -87 -83 94 72 68 93 -176 -150 172 379 366 -335 -163 -234 -16 109 -56 126 -287 134 -97 164
4050 164 -207 -219 -116 -136 316 225 -300 -138 220 294 64 -50 -144 -257 171 108 -100 23 65 -439 350 173
4072 173 -137 -418 -116 93 32 47 43 -156 180 125 240 -142 276 -427 -98 284 202 -55 50 132 293 464
4094 464 65 -84 -188 -10 -8 105 -140 -276 104 92 452 64 -278 -24 -11 -30 41 -32 -2 -229 49 85 152
4117 152 -99 280 -32 -29 238 126 -146 -9 -252 108 187 -66 -195 -93 70 246 377 -232 -163 159 -125
4138 -125 -65 87 -110 -372 10 -127 268 -82 -173 -46 388 160 -83 -168 -148 -67 108 325 -250 56 -251 -27
4160 -27 242 -217 -257 -23 -163 179 -50 422 32 -205 -127 416 38 -56 8 -23 147 271 264 -374 -238 -7 112
4183 112 176 -254 -348 -35 156 -173 -189 -90 -192 -447 87 137 -254 -100 -60 -111 137 -19 87 -43 -109 -77 -141
4206 -141 -107 -178 -206 50 355 -166 -208 -21 -271 217 441 99 -91 -186 -48 -72 50 -139 115 32 18 -40 -178
4229 -178 -424 221 -207 -136 -49 -191 -224 -72 223 -138 -201 -157 -394 -156 -82 97 -190 -238 -19 -116 148 182 -108
4252 -108 -111 -477 27 -101 -191 -119 44 -239 61 255 -173 -38 -274 253 -177 72 -63 -571 253 -242 -101
4273 -101 -162 -91 -165 -35 -1 192 -468 -60 78 136 -184 -241 -55 -142 -124 8 -91 54 -59 -256 71 -213 -221 -315
4297 -315 89 -102 -117 247 -125 -241 -18 124 -153 112 -164 -70 -220 10 155 -96 -166 -71 237 124 -219
4318 -219 -216 -319 19 28 313 30 -170 -7 144 253 181 -171 -316 -205 85 -312 5 -185 53 315 303 -46
4340 -46 123 85 11 -145 -44 -27 125 -326 -251 35 -84 67 11 -260 -11 306 -126 76 46 204 -109 -89 71
4363 71 -288 -171 329 121 140 423 247 483 -50 182 -40 135 -220 240 223 350 9 37 6 77 53 -18 91
4386 91 32 -161 90 117 56 15 -16 249 341 39 55 90 -125 264 -99 135 -116 1 162 2 -172 202 232
4409 232 83 -22 -40 17 -382 43 -150 287 236 18 -231 47 228 42 223 -65 11 114 89 244 169 127
4431 127 -29 -200 -107 -138 162 3 188 110 176 -245 -46 -155 247 60 43 -131 88 15 4 100 48 -52 41
4454 41 -110 36 241 -111 249 114 -89 247 -360 -377 91 209 140 -68 -24 -202 -87 261 202 -121 129 -150
4476 -150 -97 -62 323 -91 -5 -99 -36 -98 240 93 -241 -105 146 -298 -79 -158 -273 262 114 -100 38 -67
4498 -67 -10 -51 97 -491 -252 -300 -22 259 23 49 -392 -179 15 -72 114 142 -66 -218 97 146 32 73 -110
4521 -110 -95 -283 83 66 -230 -193 213 -114 -79 -228 -204 -109 117 72 -119 -260 -200 86 -197 -140 53 187 -91
4544 -91 256 -96 -192 -193 105 -225 123 41 -220 -287 147 -135 -101 117 2 -135 -371 -46 218 -7 -22 159 61
4567 61 256 -75 -199 -108 252 231 -65 151 58 -125 12 164 422 -171 61 133 50 75 126 -76 40 126 292
4590 292 287 71 86 -215 -8 -26 -171 15 -90 -35 31 29 101 84 372 -126 -49 12 -94 183 -282 67 -32 97
4614 97 -112 -100 3 134 184 -81 143 -108 24 -11 292 0 357 -74 104 200 12 82 14 -20 55 3 255
4637 255 -4 -113 134 -16 55 -251 89 -96 322 147 -308 -22 109 93 297 48 -401 245 70 21 91
4658 91 217 -200 -70 52 -288 135 -85 -5 -7 75 -159 52 93 0 -11 183 -4 -123 -31 135 122 173 -33 -68
4682 -68 178 148 268 -87 19 -162 18 31 13 95 23 63 37 173 205 313 -47 -178 258 -154 -35 102 85
4705 85 -73 163 -112 338 -81 -72 143 -203 -15 -68 -191 60 -8 131 183 -301 3 -435 94 -167 -167 -7 150
4728 150 238 131 -240 30 -67 -179 289 -15 -276 -141 -294 -147 187 103 35 -123 167 -21 -109 -88 -128 -442
4750 -442 202 166 -259 -318 -278 59 -106 140 -17 140 -211 21 496 256 -24 60 -98 325 266 -469 -178 -5
4772 -5 2 -81 361 119 335 228 135 -100 -140 -5 -207 -161 112 118 -116 -126 60 -100 -66 196 -156 -135 -66 178 97
4797 97 23 -25 62 200 110 -66 61 178 112 -174 38 35 -155 89 -54 -128 233 439 -107 86 210 291 17
4820 17 -2 250 44 40 -57 94 -293 -124 44 314 131 -204 -34 -82 50 -18 -68 -153 -127 38 390 -130 -143 -233
4844 -233 -70 93 -121 -260 -176 -318 10 270 201 -373 -275 -137 42 163 192 81 -379 -193 -69 252 137
4865 137 26 -94 -75 58 29 -256 -257 -117 -133 -192 -30 -72 -317 66 44 284 -278 -88 -72 74 187 38 -42
4888 -42 -153 -4 -84 -34 -9 -46 83 -84 45 -17 -126 -474 -74 204 -147 -42 -54 -108 -36 -93 -122 8 -441 231
4912 231 -125 66 130 -98 -34 -37 -15 144 58 97 171 105 142 201 35 -110 149 68 -38 -51 120 -105 -99 135 39
4937 39 -374 -3 -138 54 307 -47 146 99 50 4 -73 -78 -242 -203 -252 -231 156 46 -19 113 113 -27 66 -146 -82
4962 -82 -26 78 304 117 -307 88 589 -51 -25 -483 -150 89 -160 196 -122 -104 129 74 16 244 185 97 274
4985 274 244 84 48 173 -175 56 62 -4 8 353 -3 70 117 20 -278 -22 75 -33 90 -276 57 28 -88 43
5009 43 91 -81 163 252 -40 -84 -273 -87 63 -117 68 -314 6 128 144 33 39 121 -130 155 -99 118 17
5032 17 -363 269 -263 192 89 107 -55 32 99 -50 291 261 267 74 404 59 -87 -51 -8 8 25 76 100 94 -108
5057 -108 209 39 184 -124 -160 89 -91 67 28 66 -456 59 30 133 161 261 64 -111 -92 213 -184 150
5079 150 353 -119 205 -63 63 218 330 55 -75 -199 25 36 12 -7 149 -264 265 12 -111 148 -73
5100 -73 -60 147 -87 -24 -284 -83 -79 -1 11 15 -12 28 -109 -118 164 109 99 107 46 -80 234 -137 -248 64 415 116
5126 116 -26 97 -127 -196 -21 -54 86 -155 -380 250 12 -70 121 -119 35 102 212 -174 -74 51 34 134
5148 134 -87 80 31 -58 -110 111 183 -226 -17 4 24 33 -283 381 158 91 -93 187 82 60 -168 -11 61 -22
5172 -22 127 -109 -144 -230 -19 142 -154 -251 -36 -284 -174 47 15 -351 317 -26 -54 -2 184 -17 -269 7
5194 7 -237 -139 -149 174 184 -327 10 94 -68 -39 88 -128 -74 -89 264 92 -70 -158 -167 -262 324 113 144 193 -37
5219 -37 120 49 94 -49 -203 143 184 -56 -138 -165 -286 160 199 149 -179 27 -51 -34 154 182 -260 396 -111 83
5243 83 -173 -177 -141 97 32 252 -119 45 139 -57 -9 209 137 -28 171 -1 -106 226 -124 -106 280 -69 106
5266 106 128 193 170 17 105 89 -125 15 4 71 343 196 86 45 65 -165 152 -215 -50 -188 56 510 22
5289 22 -8 66 329 -108 45 11 -72 110 64 -80 224 85 32 -7 -36 16 86 114 2 43 79 -67 300 28 209
5314 209 25 185 37 -84 146 26 210 141 42 173 64 55 -132 100 -162 -215 138 25 -17 -146 -284 22
5336 22 258 -76 -23 59 -98 117 62 -81 16 -233 -59 158 40 -69 121 -44 79 119 -32 -23 -94 109 -47
5359 -47 7 -98 331 177 -61 -75 17 -160 -72 78 -56 -26 -61 85 -184 191 -184 353 183 4 163 9
5381 9 -83 75 -393 -78 -117 -52 -155 50 47 365 -22 76 154 -205 289 109 -7 56 31 -291 21 202 204 -4
5405 -4 125 -152 46 -134 -179 -24 113 -115 -65 64 322 74 222 -191 -182 128 166 -128 -54 -173 230 198 78
5428 78 -192 -304 -269 111 122 10 -305 232 -115 197 115 -182 -150 -112 -98 94 150 -36 -154 135 55 -92 177
5451 177 110 83 -71 88 11 -39 -19 -179 510 23 300 37 -118 380 -198 109 106 -248 181 49 -69 -107 -100
5474 -100 18 -220 -179 322 100 -185 -110 -31 67 19 169 -320 -22 158 93 31 104 -550 -181 135 156 126 -121
5497 -121 140 128 314 -214 -25 -83 -53 129 216 -128 4 224 -115 59 72 -87 211 288 179 -196 193 -58
5519 -58 243 -120 -131 75 268 -240 38 203 -90 365 0 22 140 52 -132 -129 -23 -290 -145 499 100 -275
5541 -275 156 -63 278 -37 -162 107 -58 424 15 33 -2 -156 -315 212 326 -66 58 359 -94 -50 4
5562 4 60 -37 -33 190 -117 -239 -55 -157 40 139 13 134 -353 177 -3 71 171 156 -106 -32 244 13 -56 -232
5586 -232 -44 16 86 116 -287 -91 -6 -27 -87 -275 -99 22 1 45 -83 -160 -58 79 168 -247 -19 43 208 -111
5610 -111 18 286 -112 -48 -54 -57 44 43 87 156 -4 303 81 142 14 128 190 -26 165 -156 -89 249 -56 9
5634 9 -108 -250 197 92 -29 -42 84 -89 -113 12 49 -78 8 175 45 9 -28 191 -158 -144 -55 90 314
5657 314 -122 324 -53 69 127 109 -245 3 -41 331 214 95 -185 19 288 257 -254 37 118 235 104 -93
5679 -93 -24 70 269 -172 192 124 45 119 -162 122 137 -220 -124 -21 41 293 -8 -163 113 -44 -85 -209 -209 81
5703 81 86 -104 -275 -210 -156 -222 154 71 -311 -25 223 -262 224 189 -203 -191 -77 196 -19 236 112 166 34
5726 34 10 214 -25 8 -87 -189 -318 46 121 -155 -285 123 -5 -97 11 -61 79 117 8 -30 -10 51 -21 -32
5750 -32 85 -222 10 -228 96 377 -205 126 -20 156 17 21 -382 -35 289 -26 297 129 88 -108 51
5771 51 256 95 63 -188 -301 2 -300 -185 -434 -182 181 107 135 143 -160 -335 -91 229 3 -314 125 -149
5793 -149 106 -125 36 -112 -34 122 -8 -8 275 -163 25 289 -31 96 -97 -62 -44 57 -102 -93 -335 170
5815 170 -295 -373 -109 101 81 -293 43 28 53 197 -53 -71 87 -81 -137 14 -290 -298 -38 -136 -70 -391 -41
5838 -41 113 -91 -50 -64 -42 -203 59 13 -256 -64 14 -52 27 201 -169 98 -163 244 323 -148 -270 42 56
5861 56 69 139 -224 604 79 239 169 275 195 -285 -225 -74 -26 -116 108 -334 4 68 221 -197 -25 -403 32
5884 32 -80 14 78 -34 30 -66 36 85 -83 -61 -40 47 16 -357 152 48 77 224 -278 -71 -19 11 132 124 -196
5909 -196 -315 233 39 -146 211 -50 235 53 161 246 -39 -150 -60 -287 -94 168 0 123 -105 -211 -162
5930 -162 1 27 158 -62 47 151 -17 39 -352 238 81 58 37 -54 129 -77 -82 -112 -58 167 -179 -18 -43
5953 -43 -3 100 -308 227 0 -244 -255 142 131 -163 -213 -144 153 176 70 -63 1 -40 302 -92 17 201 -39
5976 -39 211 -53 -17 -193 42 322 145 122 -232 14 518 53 104 71 -219 -21 196 207 144 88 -225 37 55
5999 55 270 -202 -237 -21 -65 63 39 -408 142 -114 -149 -143 -299 267 122 251 -108 87 103 -9 -169 -4 19
6022 19 -417 -151 -21 -192 -149 266 -47 -210 -26 31 -45 132 -381 79 -10 19 -128 365 74 -27 -61 -105 45
6045 45 308 398 -5 59 81 -185 198 241 228 28 80 53 113 -153 -263 3 52 -221 -109 -113 -67 -30 76 -180 -20
6070 -20 -18 -55 115 105 -105 154 -129 92 -34 52 -409 -53 471 -54 -135 127 196 -146 -169 -181 28 -50 -98 94
6094 94 -147 -54 370 3 -83 -10 4 271 52 45 -102 -82 -12 -37 -14 42 269 66 271 -215 -36 -133 -60 91 46
6119 46 53 154 -157 -102 3 227 128 -239 249 -71 -146 -232 25 1 -18 135 214 -214 0 138 -118 124 -92
6142 -92 87 -160 159 -96 -74 76 -156 -93 258 -77 -169 -307 -190 82 -210 433 -17 166 -41 41 1 -385
6164 -385 6 252 -189 304 -52 68 -172 -275 182 159 -205 -101 -74 -151 189 -29 -156 -71 -82 -255 108 -147
6186 -147 220 154 -182 -156 177 -299 -25 -3 112 144 -60 39 -118 143 -20 166 193 -57 67 47 -170 -199 -208
6209 -208 -85 148 153 115 -196 -107 108 -15 137 -316 278 222 96 -394 -46 164 -91 -45 232 223 -102 -141 -26
6232 -26 86 -106 -109 3 39 26 87 -11 151 -368 -106 -160 -220 142 213 176 -71 28 -336 -155 133 -145 -53 -178
6256 -178 103 308 54 -35 191 76 -211 41 71 187 121 136 164 -113 52 -56 -46 268 82 -70 -188 44
6278 44 -124 159 -112 29 28 8 -13 -212 -80 -117 23 -96 29 126 -118 296 60 -38 297 106 -18 -55 480
6301 480 134 -9 -144 92 -84 -93 -73 286 -52 6 -65 102 4 -15 -92 15 34 141 -5 -1 151 -216 73 57
6325 57 318 53 277 201 -92 -39 -338 -92 -214 65 -314 138 -182 -39 91 312 -107 -254 -7 -148 18
6346 18 -161 63 -40 -55 -49 -113 130 -177 -251 88 -197 359 -102 92 -267 -171 87 -76 167 -158 58 312
6368 312 62 39 -73 10 -116 -218 37 -57 -46 -120 -3 -66 210 -82 115 -250 215 -116 -40 -95 -54 -19 -3 326
6392 326 125 -129 -498 264 223 303 314 288 165 199 107 -36 359 165 -30 -318 256 366 225 -56 222 66
6414 66 -160 355 -248 -8 147 86 -7 -82 -73 3 6 -296 -79 -10 -79 -118 148 25 -42 -68 185 154 -284 56 56 45
6440 45 -50 100 48 -64 -136 119 81 -192 -20 -144 127 -76 220 311 -213 143 143 -63 -157 19 149 81 -58
6463 -58 34 138 23 112 61 -79 -194 150 43 108 448 2 127 -96 65 -382 135 17 -246 571 -78 -36
6485 -36 96 112 -156 21 23 68 -237 -85 -289 147 51 -1 164 -41 -203 -194 4 -156 -84 12 218 -61 -130 199
6509 199 190 -91 -110 -69 77 234 -91 -40 -194 -182 -166 207 111 -211 -202 202 -45 -69 -253 -52 -113 -20 -34 23 -105
6534 -105 52 -16 86 65 -184 43 245 186 125 125 17 -248 -93 32 304 -175 -309 36 -195 46 119 -360
6556 -360 -237 113 136 -345 77 152 0 228 -124 93 3 140 111 -143 104 37 321 -96 -340 -23 -452 118
6578 118 44 -192 159 99 -83 39 -160 162 -25 -173 205 202 48 -319 117 36 113 -82 -34 -275 344 177
6600 177 -434 26 -31 36 -27 155 168 66 95 9 182 -131 -164 140 122 144 -153 -25 191 185 20 5 199 -325
6624 -325 157 146 -12 -131 -28 -261 67 -20 210 -135 17 85 -237 -120 -208 -40 164 -163 84 412 61
6645 61 45 -142 58 202 -43 196 -315 63 90 105 -196 -144 291 87 -101 256 -101 39 121 -225 -129 92
6667 92 -168 -64 -16 67 -33 21 43 -161 110 -211 111 -89 83 126 15 -95 150 -221 -142 -132 175 155 100
6690 100 30 293 285 218 32 -210 -306 118 -125 -253 90 84 320 133 183 -183 -173 101 98 -282 234 -139 67 -90
6714 -90 209 -90 145 -301 108 -123 -277 -12 125 151 70 82 -170 -81 -24 -119 -278 -27 -46 -79 -273 -210 79
6737 79 -114 335 -231 -138 -120 -183 -46 43 -68 -311 -137 159 -62 11 -141 -41 355 33 -84 230 -186 -188 28
6760 28 254 -151 -98 -92 49 270 -7 -190 -173 77 -58 83 85 -148 -340 25 149 -142 -190 190 -67 -154 337
6783 337 -74 74 224 172 -170 -342 -293 -22 184 134 -90 -134 159 107 -277 -330 153 412 66 155 34 -15 7
6806 7 325 -99 37 76 -7 55 14 6 90 70 -204 70 5 -15 117 349 -319 -13 120 57 -196 133 -83 209
6830 209 106 -195 11 -48 -8 -47 -148 65 -66 -111 83 -6 -50 496 60 103 -146 -7 263 244 193 194 179 -166
6854 -166 -12 10 -170 195 -104 -21 -65 95 -62 129 -124 10 282 25 39 -121 151 -2 92 -371 9 92
6876 92 -134 52 -188 -237 143 -107 88 -23 164 -389 -136 -80 189 -85 119 -110 184 -26 -32 -213 204 16
6898 16 -30 99 88 -95 -24 -156 -150 70 26 -81 -64 36 68 24 -314 -201 62 -109 -202 -163 -229 115 211 129 -169
6923 -169 112 -97 90 -58 -72 -302 141 175 -89 269 -15 73 261 27 12 84 44 -69 67 62 81 65 -20 255
6947 255 -128 163 99 -141 179 -318 -51 -201 30 -163 -131 -26 228 209 -175 -193 139 126 448 319 -1 -134
6969 -134 289 214 -41 -275 271 135 71 79 328 3 -119 290 -147 -183 -42 -210 80 157 112 53 -38 43 115 124
6993 124 -13 -25 -5 -84 111 48 75 -244 -159 303 14 72 -384 79 83 108 -230 -61 16 155 -120 -11 -297 105
7017 105 -96 212 -271 -57 -19 -150 80 -128 -270 -159 -204 -149 -435 -167 -57 -148 87 -148 -24 -123 -185 -290
7039 -290 -152 -36 144 142 36 33 -91 452 -20 -34 21 293 190 23 194 37 69 65 -16 44 32 -25 6 -34 21
7064 21 86 -143 23 -97 -113 -226 -128 -87 -181 7 -3 -96 14 69 -4 -155 -258 22 180 49 -241 296 -9
7087 -9 353 -73 389 68 -24 -110 31 86 -46 -371 190 -212 -74 -155 51 268 78 24 241 -108 -180 -112 15
7110 15 154 -12 133 102 -16 -35 -120 65 2 79 49 -9 194 -53 113 147 68 38 60 -346 96 20 106 309 -38
7135 -38 -92 74 266 119 -50 -2 -126 -146 168 93 -294 -216 110 133 -468 18 147 -287 -354 44 285 121 -273
7158 -273 -222 23 80 156 -202 171 175 -167 54 -278 -185 131 -79 6 -40 -105 -177 -49 -256 -125 56 -293 -250 138
7182 138 54 63 -205 3 157 7 -225 -156 -124 64 153 -56 64 -128 63 168 39 62 -17 136 60 61 26 -158
7206 -158 -54 111 91 -131 333 9 -94 -160 -43 -167 36 236 98 36 237 44 132 -178 152 -191 12
7227 12 166 -26 123 -15 234 26 -23 -130 -218 287 -80 -103 58 -141 92 8 136 116 53 301 -259 205
7249 205 -69 -218 -182 -137 85 84 234 -208 231 64 -65 -208 115 44 36 -253 -129 -93 18 233 110 30 -53
7272 -53 159 -135 106 96 204 -96 219 49 -22 -204 37 72 -12 54 80 96 35 -70 -308 201 -56 106 361
7295 361 -295 -49 -207 21 -108 -104 171 -80 4 -252 67 203 12 50 22 228 -23 72 -164 -21 334 -56
7317 -56 79 -259 -194 -19 -481 -33 137 -293 -50 99 152 -92 -158 216 39 28 -352 108 80 50 194 458
7339 458 43 -26 168 -130 171 -92 139 -32 217 52 -81 -114 -150 -61 59 196 -67 52 -208 182 -135
7360 -135 -64 255 120 -9 97 -111 129 263 24 -176 -277 -91 26 -119 -183 -55 152 -121 12 -109 -4
7381 -4 160 -24 -16 -62 -77 16 -53 308 193 -31 -269 191 113 -70 -42 96 10 175 104 -157 -118 -39 52 -102 62
7406 62 -55 -209 -55 -96 253 -129 -74 45 59 -63 -180 117 141 46 -213 -135 79 -200 73 172 -76 -111 43
7429 43 -217 -196 144 45 339 148 60 -84 207 104 -34 194 91 -202 -52 84 -362 -158 -85 -20 102 91
7451 91 136 220 121 -184 -20 -28 -32 45 -150 305 24 -170 -235 -1 3 -264 -201 15 -340 118 -252 -144 95 -50
7475 -50 124 -170 -126 35 -142 -164 119 -184 -30 -23 295 -87 -68 -199 67 -110 22 110 -240 -305 -90 -245 -241
7498 -241 227 -48 -122 222 153 -61 -205 6 -184 115 -130 -183 131 25 153 333 192 130 182 12 266 -36
7520 -36 16 -90 -122 19 259 -100 -326 -12 -78 6 18 66 6 -66 64 -14 248 6 -245 173 13 -35 -353 49
7544 49 172 146 -83 46 -77 -242 361 49 43 375 -3 262 -244 -86 -77 1 -15 -36 -44 294 287 -47 197 -92
7568 -92 145 -73 170 330 212 129 170 81 -167 240 288 146 -266 -126 4 53 36 18 -176 141 -112 80 44
7591 44 175 -240 -68 182 114 36 41 -7 7 -39 -140 31 27 58 -29 -141 -50 139 116 189 -155 -279 -430 41 -163
7616 -163 -24 165 52 -169 5 157 -207 -157 -43 -68 47 -112 -22 -271 92 -254 -189 -109 -40 362 206 55
7638 55 174 -297 -152 -131 122 188 -52 -179 293 86 -127 -87 185 -74 -203 125 -40 -68 77 -75 -86 -132
7660 -132 -22 -164 -15 41 0 -4 -365 -212 171 -264 -47 267 -57 399 72 -164 11 115 -131 222 135 133
7682 133 -28 -142 -326 -96 -136 -271 -126 125 228 -37 -226 -67 279 -125 -175 -44 312 35 126 -58 128
7703 128 143 -124 211 -177 32 38 -315 -104 45 56 4 -112 97 127 327 339 7 -184 82 -5 -92 140 -44
7726 -44 61 79 -391 -194 66 277 -41 130 -190 -220 -68 149 -31 -118 25 -217 -78 92 -455 -109 218
7747 218 -62 69 -68 122 236 -224 -55 8 255 -106 254 -233 163 -49 -28 73 279 143 142 -1 -37 -201
7769 -201 -28 -80 -30 -80 110 -302 157 -284 -123 10 -159 -83 -83 3 102 156 -190 149 -169 -140 233 -159 16
7792 16 283 115 50 -76 8 7 -5 -199 -274 -20 -116 -28 227 -1 -10 117 -82 208 -6 -4 278 -198 175 -94
7816 -94 105 168 -242 -103 -151 -273 -7 111 79 -18 -19 -86 60 -70 -137 277 314 -111 -71 -106 -207 59 246 -109
7840 -109 -34 -121 301 65 -219 -41 27 26 10 -356 -65 148 -47 19 239 310 55 -31 -86 123 -53 48 220
7863 220 -254 -48 85 -126 8 194 -206 76 -61 -253 126 167 -123 49 56 75 185 -72 -226 -127 169 99
7885 99 -97 -234 -181 -34 297 351 -169 240 -115 -99 -109 -428 -102 86 -481 75 -114 63 88 57 43 -182 -93
7908 -93 -89 -29 -469 44 54 -68 82 105 32 58 59 -52 -145 217 -12 -230 -23 156 -106 -103 -171 41 107 145 -84
7933 -84 156 68 -272 -55 232 -89 10 182 -107 -160 97 -88 -237 121 -55 -44 11 -102 11 19 -37 -1 -243
7956 -243 -39 315 -272 1 -137 129 197 -14 0 -16 -85 -296 -23 -60 -242 -15 -86 -243 172 -22 -140 -96
7978 -96 -66 2 -139 -112 -214 73 -92 -384 -51 -68 254 148 60 -94 62 71 -110 228 85 188 -128 4 -18
8001 -18 -103 -253 207 -155 5 96 -21 -5 13 71 -120 -228 -18 -305 66 54 -63 -39 -1 -203 -41 212 -109
8024 -109 -189 399 104 -95 -76 22 -115 97 -57 122 -89 -180 -342 221 279 -83 166 -377 -62 22 222 -10
8046 -10 -102 -282 26 -197 71 -18 92 70 100 147 -302 -168 -198 91 -258 -26 -171 83 -42 -114 -196 -79 -11
8069 -11 63 243 95 -257 -20 157 -72 50 323 301 -78 191 -13 -161 35 -98 15 11 41 37 -99 -82 -101
8092 -101 -238 -79 25 -50 31 11 69 40 -108 -200 -307 -26 -147 77 -178 145 231 137 -148 225 112 18 -111
8115 -111 -52 -77 268 27 -136 -93 -57 344 -34 82 -151 177 -201 -237 -83 -342 -116 -21 12 71 -30 51 -105
8138 -105 48 183 131 225 -185 100 -95 -74 -69 -121 26 441 69 -138 171 -126 -80 87 3 -112 -55 292 -22
8161 -22 -69 64 -207 -67 156 -210 87 -110 128 -149 174 55 -3 -50 46 278 -99 39 -24 -62 102 -126
8183 -126 86 -95 107 159 -242 -83 22 -74
8191g4
##END NTUPLES=NMR FID
##END=
