##TITLE=1H_EC-3229(1)
 DMSO, 8 sc, 
 30.6.2020
##JCAMPDX= 6.0         $$ Bruker NMR JCAMP-DX V2.0
##DATA TYPE= NMR FID
##DATA CLASS= NTUPLES
##ORIGIN= UXNMR, Bruker Analytische Messtechnik GmbH
##OWNER= root
$$ XWIN-NMR		Version 3.5
$$ Tue Jun 30 10:46:40 2020 Russian Standard Time (UT+4h)  she@DPX200
##.OBSERVE FREQUENCY= 200.1315
##.OBSERVE NUCLEUS= ^1H
##.DELAY= (6, 6)
##.ACQUISITION MODE= SIMULTANEOUS
##.ACQUISITION SCHEME= undefined
##.AVERAGES= 8
##.DIGITISER RES= 18
##SPECTROMETER/DATA SYSTEM= spect
##.PULSE SEQUENCE= zg30
##.SOLVENT NAME= DMSO
##.SHIFT REFERENCE= (INTERNAL, DMSO, 0, 15.7039)
##AUDIT TRAIL= $$ (NUMBER, WHEN, WHO, WHERE, WHAT)
$$ ##TITLE= Audit trail, XWIN-NMR		Version 3.5
$$ ##JCAMPDX= 5.01
$$ ##ORIGIN= Bruker BioSpin GmbH
$$ ##OWNER= she
$$ F:/spectra/data/she/nmr/H-F/1/audita.txt
$$ ##AUDIT TRAIL=  $$ (NUMBER, WHEN, WHO, WHERE, WHAT)
(   1,<2020-06-30 10:45:43.31 +0400>,<she>,<DPX200>,
      <created by zg, POWCHK disabled, PULCHK disabled
       configuration hash MD5:
       00 E9 B6 7A A2 85 ED C7 34 08 36 98 17 FE 4E 26
       data hash MD5: 16K
       94 F4 1A 6C 9E 6D 07 88 9B 0F 34 FB BA FC F9 0D>)
$$ ##END=
$$ 
$$ hash MD5
$$ FB 12 58 33 BC 27 ED CA FA 88 3C 9B EB 96 FE 21
##$RELAX= 
##$RELAX= 
##$RELAX= 
##$RELAX= 
##$RELAX= 
##$RELAX= 
$$ Bruker specific parameters
$$ --------------------------
##$DU= <F:/spectra>
##$EXPNO= 1
##$NAME= <H-F>
##$PROCNO= 1
##$TYPE= <nmr>
##$USER= <she>
##$AMP= (0..31)
100 100 100 100 100 100 100 100 100 100 100 100 100 100 100 100 100 100 
100 100 100 100 100 100 100 100 100 100 100 100 100 100 
##$AQSEQ= 0
##$AQ_mod= 1
##$AUNM= <au_zg>
##$AUTOPOS= <>
##$BF1= 200.13
##$BF2= 200.13
##$BF3= 200.13
##$BF4= 200.13
##$BF5= 200.13
##$BF6= 200.13
##$BF7= 200.13
##$BF8= 200.13
##$BYTORDA= 1
##$CFDGTYP= 0
##$CFRGTYP= 5
##$CHEMSTR= <none>
##$CNST= (0..31)
1 1 145 1 1 1 1 1 1 1 1 1 1 1 1 1 1 1 1 1 1 1 1 1 1 1 1 1 1 1 1 1 
##$CPDPRG= <>
##$CPDPRG1= <>
##$CPDPRG2= <>
##$CPDPRG3= <>
##$CPDPRG4= <mlev>
##$CPDPRG5= <mlev>
##$CPDPRG6= <mlev>
##$CPDPRG7= <mlev>
##$CPDPRG8= <mlev>
##$CPDPRGB= <>
##$CPDPRGT= <>
##$D= (0..31)
0 1.2 0 0 0 0 0 0 0 0.06 0 0.03 0 0 0 0 0.0002 0 0 0 0 0 0 0 0 0 0 0 0 
0 0 0 
##$DATE= 1593499542
##$DBL= (0..7)
120 120 120 120 120 120 120 120 
##$DBP= (0..7)
150 150 150 150 150 150 150 150 
##$DBP07= 0
##$DBPNAM0= <>
##$DBPNAM1= <>
##$DBPNAM2= <>
##$DBPNAM3= <>
##$DBPNAM4= <>
##$DBPNAM5= <>
##$DBPNAM6= <>
##$DBPNAM7= <>
##$DBPOAL= (0..7)
0.5 0.5 0.5 0.5 0.5 0.5 0.5 0.5 
##$DBPOFFS= (0..7)
0 0 0 0 0 0 0 0 
##$DE= 6
##$DECBNUC= <off>
##$DECIM= 24
##$DECNUC= <off>
##$DECSTAT= 4
##$DIGMOD= 1
##$DIGTYP= 9
##$DL= (0..7)
0 120 120 120 120 120 120 120 
##$DP= (0..7)
150 150 150 150 150 150 150 150 
##$DP07= 0
##$DPNAME0= <>
##$DPNAME1= <>
##$DPNAME2= <>
##$DPNAME3= <>
##$DPNAME4= <>
##$DPNAME5= <>
##$DPNAME6= <>
##$DPNAME7= <>
##$DPOAL= (0..7)
0.5 0.5 0.5 0.5 0.5 0.5 0.5 0.5 
##$DPOFFS= (0..7)
0 0 0 0 0 0 0 0 
##$DQDMODE= 0
##$DR= 18
##$DS= 0
##$DSLIST= <SSSSSSSSSSSSSSS>
$$ [...]
##$SUBNAM2= <"">
##$SUBNAM3= <"">
##$SUBNAM4= <"">
##$SUBNAM5= <"">
##$SUBNAM6= <"">
##$SUBNAM7= <"">
##$SUBNAM8= <"">
##$SUBNAM9= <"">
##$SW= 24.9337058887773
##$SWIBOX= (0..15)
0 0 2 0 0 0 0 0 0 0 0 0 0 0 0 0 
##$SW_h= 4990.01996007984
##$TD= 16384
##$TD0= 1
##$TE= 0
##$TE2= 300
##$TE3= 300
##$TEG= 300
##$TL= (0..7)
0 120 120 120 120 120 120 120 
##$TP= (0..7)
150 150 150 150 150 150 150 150 
##$TP07= 0
##$TPNAME0= <>
##$TPNAME1= <>
##$TPNAME2= <>
##$TPNAME3= <>
##$TPNAME4= <>
##$TPNAME5= <>
##$TPNAME6= <>
##$TPNAME7= <>
##$TPOAL= (0..7)
0.5 0.5 0.5 0.5 0.5 0.5 0.5 0.5 
##$TPOFFS= (0..7)
0 0 0 0 0 0 0 0 
##$TUNHIN= 0
##$TUNHOUT= 0
##$TUNXOUT= 0
##$USERA1= <user>
##$USERA2= <user>
##$USERA3= <user>
##$USERA4= <user>
##$USERA5= <user>
##$V9= 5
##$VALIST= <valist>
##$VCLIST= <CCCCCCCCCCCCCCC>
##$VD= 0
##$VDLIST= <DDDDDDDDDDDDDDD>
##$VPLIST= <PPPPPPPPPPPPPPP>
##$VTLIST= <TTTTTTTTTTTTTTT>
##$WBST= 1024
##$WBSW= 4
##$XGAIN= (0..3)
0 0 0 0 
##$XL= 0
##$YL= 0
##$YMAX_a= 164973
##$YMIN_a= -103344
##$ZGOPTNS= <>
##$ZL1= 120
##$ZL2= 120
##$ZL3= 120
##$ZL4= 120
##$ABSF1= 10
##$ABSF2= 0
##$ABSG= 5
##$ABSL= 3
##$ALPHA= 0
##$AQORDER= 0
##$ASSFAC= 0
##$ASSFACI= 0
##$ASSFACX= 0
##$ASSWID= 0
##$AUNMP= <proc_1d>
##$AZFE= 0.1
##$AZFW= 0.1
##$BCFW= 1
##$BC_mod= 2
##$BYTORDP= 1
##$COROFFS= 0
##$CY= 11.3945322036743
##$DATMOD= 1
##$DC= 2
##$DFILT= <>
##$DTYPP= 0
##$F1P= 16.9975609425685
##$F2P= -3.02152046262296
##$FCOR= 0.5
##$FTSIZE= 0
##$FT_mod= 4
##$GAMMA= 1
##$GB= 0.15
##$INTBC= 1
##$INTSCL= 1
##$ISEN= 128
##$LB= 0.24
##$LEV0= 0
##$LPBIN= 0
##$MAXI= 10000
##$MC2= 0
##$MEAN= 0
##$ME_mod= 0
##$MI= 1.114404
##$NCOEF= 0
##$NC_proc= 0
##$NLEV= 6
##$NOISF1= 3.799351
##$NOISF2= 2.8
##$NSP= 1
##$NTH_PI= 0
##$NZP= 0
##$OFFSET= 15.70392
##$PC= 1
##$PHC0= -9797.917
##$PHC1= 22.20087
##$PH_mod= 1
##$PKNL= yes
##$PPARMOD= 0
##$PSCAL= 0
##$PSIGN= 0
##$REVERSE= no
##$SF= 200.130013532006
##$SI= 16384
##$SIGF1= 3
##$SIGF2= 2
##$SINO= 400
##$SIOLD= 16384
##$SREGLST= <1H.CDCl3>
##$SSB= 0
##$STSI= 0
##$STSR= 0
##$SW_p= 3612.71676300578
##$SYMM= 0
##$S_DEV= 0
##$TDeff= 0
##$TDoff= 0
##$TI= <>
##$TILT= no
##$TM1= 0
##$TM2= 0
##$TOPLEV= 0
##$USERP1= <user>
##$USERP2= <user>
##$USERP3= <user>
##$USERP4= <user>
##$USERP5= <user>
##$WDW= 1
##$XDIM= 8192
##$YMAX_p= 0
##$YMIN_p= 0
$$ End of Bruker specific parameters
$$ ---------------------------------
##NTUPLES= NMR FID
##VAR_NAME=  TIME,          FID/REAL,        FID/IMAG
##SYMBOL=    X,             R,               I
##VAR_TYPE=  INDEPENDENT,   DEPENDENT,       DEPENDENT
##VAR_FORM=  AFFN,          ASDF,            ASDF
##VAR_DIM=   8192,          8192,            8192
##UNITS=     SECONDS,       ARBITRARY UNITS, ARBITRARY UNITS
##FACTOR=    0.0002004,     1,               1
##FIRST=     0,             0,               0
##LAST=      1.6414764,     0,               0
##MIN=       0,             -103344,         0
##MAX=       1.6414764,     164973,          0
$$ Real data points
##PAGE= N=1
##DATA TABLE= (X++(R..R)), XYDATA
$$ plain form
0 0 0 0 0 0 0 0 0 0 0 0 -8 8 -8 8 -8 12 -16 16 -23 24 -31 35 -41 46 -53 60 -69 80 -92 102 -117 132 -148 164
34 164 -183 206 -228 253 -282 311 -345 381 -423 467 -519 575 -639 710 -793 888 -1001 1134
52 1134 -1297 1502 -1763 2119 -2623 3410 -4808 8081 -35115 34681 106659 16174 -73929 -103344
66 -103344 -47828 23408 48507 -11955 -71381 -60301 14 24295 8957 -14190 -22595 -31355
78 -31355 -33833 -16422 21947 40237 12147 -33655 -43275 -8464 32270 35620 710 -29456 -14754
91 -14754 23596 38015 17826 -5259 -8843 4026 16368 18366 17111 23197 27087 13264 -7653
104 -7653 -6293 25626 57676 44924 -8402 -35430 5567 66151 73871 22534 -35428 -41404 20762
117 20762 86180 69088 -12799 -51331 -8219 46183 55362 28765 -7306 -29269 -15671 20720
$$ packed form
0@%%%%%%%%%%qJ6j6J6j6K0k8L2l9M7n5O6p6Q7r9J13j29J49j72J94k19K49k80L12
34A64l47L89m34M81n35N93o56P26q04Q90r86J094j214J349j503J681j889K135
52A134k431K799l265L882m742O033q218J2889m3196O9796P1978r0485r0103k9415
66a03344N5516P1236K5099o0462n9426J1080O0315K4281j5338k3147q405q760
78c1355k478J7411L8369J8290k8090m5802r620L4811M0734L350l4910l0166J4702
91a4754L8350J4419k0189k3085l584J2869J2342J998j255O086L890j3823k0917
104g653J360L1919L2050j2752n3326k7028M0997O0584P720n1337n7962n976O2166
117B0762O5418j7092q1887l8532M3112N4402R179k6597l6071k1963J3598L6391
$$ plain form
129 20720 40654 31386 8597 -15951 -27993 -12297 23683 42621 19342 -25217 -39688 -3985
141 -3985 39780 39508 -2673 -39239 -35591 3093 37179 30394 -5843 -26422 -14356 2610 1851
154 1851 -5376 -2814 7944 9766 -7396 -24308 -11873 16809 20727 -10228 -38712 -26099 20546
167 20546 48214 18719 -35820 -50062 -12646 29692 36140 5398 -27610 -25985 8424 29028
179 29028 12414 -10270 -16192 -11102 -487 17743 26380 12196 -12401 -25904 -17285 10479 33689
192 33689 24365 -11211 -33926 -16218 24293 40758 9676 -33850 -35545 4951 37984 29571 -4583
205 -4583 -26912 -16111 11477 19971 2982 -8272 486 8592 636 -11331 -7922 10709 20897
218 20897 2636 -26404 -27345 4491 29496 19319 -13586 -34947 -21768 11060 24318 5167
$$ packed form
129B0720J9934r268k2789k4548j2042J5696L5980J8938k3279m4559j4471L5703
141c985M3765k72m2181l6566L648L8684L4086o785l6237k0579J2066J6966p59
154A851p227K562J0758J822j7162j6912J2435K8682L918l0955k8484J2613M6645
167B0546K7668k9495n4539j4242L7416M2338O448l0742l3008J625L4409K0604
179B9028j6614k2684n922N090J0615J8230Q637j4184k4597j3503Q619K7764K3210
192C3689r324l5576k2715J7708M0511J6465l1082m3526j695M0496L3033q413l4154
205d583k2329J0801K7588Q494j6989j1254Q758Q106p956j1967L409J8631J0188
218B0897j8261k9040r41L1836K5005j0177l2905k1361J3179L2828J3258j9151
$$ plain form
230 5167 -20028 -25656 -12247 7085 14772 4555 -12671 -20339 -18198 -8738 9086 19947 4742
243 4742 -23233 -29975 -8085 18272 20999 -5927 -34773 -28043 11199 36411 17274 -24711 -43329
256 -43329 -16953 23240 30248 87 -24337 -16411 5561 15021 5533 -10585 -13113 -224 10106
269 10106 6287 807 4242 6148 -1259 -10841 -10012 5754 22680 18991 -3289 -16780 -7707 8715
283 8715 14790 7900 -3546 -7446 1154 9832 8949 4824 1619 -4038 -9814 -6395 7395 21792 19955
298 19955 -4930 -28690 -19427 15438 33321 14339 -18624 -29515 -5862 27069 30154 -2178
310 -2178 -30068 -21821 8727 26373 15021 -10311 -19239 -4689 9677 8400 118 -3389 -4121 -3004
324 -3004 -428 1765 3689 5344 673 -9676 -10152 2741 12708 7273 -6387 -13426 -3883 11795
$$ packed form
230E167k5195n628J3409J9332P687j0217j7226p668K141R460J7824J0861j5205
243D742k7975o742K1890K6357K727k6926k8846O730L9242K5212j9137m1985j8618
256d3329K6376M0193P008l0161k4424P926K1972R460r488j6118k528J2889J0330
269A0106l819n480L435J906p407r582Q29J5766J6926l689k2280j3491R073J6422
283H715O075o890j1446l900Q600Q678q83m125l205n657n776L419J3790J4397j837
298A9955k4885k3760R263L4865J7883j8982l2963j0891K3653L2931L085l2332
310b178k7890Q247L0548J7646j1352k5332q928J4550J4366j277q282l507p32J117
324c004K576K193J924J655m671j0349m76J2893R967n435j3660p039R543J5678
$$ plain form
338 11795 13566 -1742 -13009 -7720 2683 7308 5470 864 -496 1034 -2048 -8553 -5232 8666
352 8666 14362 2273 -13498 -14078 4420 21596 12871 -15442 -27633 -8076 19986 27107 7404
365 7404 -19687 -25898 -4761 16998 15691 -1874 -12217 -7771 2559 8363 3842 -3481 -6249 -5636
379 -5636 -4366 1680 10428 9407 -838 -10488 -12816 -3979 9461 11692 -676 -9967 -5045 4715
393 4715 6368 -961 -8521 -6276 3199 6255 -17 -3382 616 2601 -1865 -7399 -7679 1374 12158
408 12158 9424 -7867 -17073 -5135 12161 13807 -2276 -18549 -14245 7802 20346 7813 -13575
421 -13575 -19908 -7641 10905 16225 2456 -13975 -13926 -1632 7265 7768 1500 -6325 -10815 -7709
435 -7709 479 7711 8059 -1784 -13402 -12081 2216 11728 7332 -6169 -14832 -8399 7745 14304
$$ packed form
338A1795J771j5308j1267N289J0403M625j838m606j360J530l082o505L321J3898
352H666N696j2089j5771n80J8498J7176q725k8313j2191J9557K8062P121j9703
365G404k7091o211K1137K1759j307j7565j0343M446J0330N804m521p323k768O13
379e636J270O046Q748j021j0245r650k328Q837J3440K231j2368r291M922R760
393D715J653p329p560K245R475L056o272l365L998J985m466n534k80R053J0784
408A2158k734j7291r206J1938J7296J646j6083j6273M304K2047J2544j2533k1388
421a3575o333J2267J8546N320j3769j6431M9J2294Q897N03o268p825m490L106
435g709Q188P232L48r843j1618J321J4297R512m396j3501q663O433J6144O559
$$ plain form
449 14304 2953 -10008 -8728 425 5334 1957 -3051 -1013 6781 7498 -2887 -9390 -3258 7556
463 7556 10925 3112 -8016 -7780 6766 16459 6898 -9819 -13747 -2309 12663 16192 4961 -7597
477 -7597 -7791 1492 7470 7012 2154 -3367 -2751 3990 8741 7014 2021 -5105 -9249 -2344 10805 14794
493 14794 5001 -8141 -12351 -2219 12384 12465 -2996 -13901 -7341 7441 14384 7038 -8407 -14844
507 -14844 -4484 9025 9572 927 -4634 -2911 1418 2411 -1231 -2792 1748 5427 1422 -3897 -3851
522 -3851 1370 6278 5720 -2417 -8898 -3853 6078 8665 3363 -3829 -7125 -4112 3252 6456 3868
537 3868 -1637 -5553 -6069 343 7910 7477 -420 -7622 -7866 82 10132 9379 -2723 -11033 -4824 6952
553 6952 11285 2943 -9505 -11917 75 11282 8731 -2678 -8959 -5976 2291 6726 775 -7117
$$ packed form
449A4304j1351j2961J280R153M909l377n008K038P794P17j0385o503O132J0814
463G556L369p813j1128K36J4546R693r561j6717l928J1438J4972L529j1231j2558
477g597j94R283N978m58m858n521O16O741M751j727m993p126m144O905J3149L989
493A4794r793j3142m210J0132J4603Q1j5461j0905O560J4782O943p346j5445o437
507a4844J0360J3509N47q645n561J723M329R93l642j561M540L679m005n319M6
522c851N221M908n58q137o481N045R931K587n302p192l296L013P364L204k588
537C868n505l916n16O412P567m33p897p202k44P948J0050p53j2102q310O209J1776
553F952M333q342j2448k412J1992J1207k551j1409o281K983Q267M435n951p892
$$ plain form
567 -7117 -5909 1728 4306 1383 -2724 -4491 -3247 -893 -1155 -1757 764 3246 639 -3338 -5622 -4903
583 -4903 -1272 3576 2351 -2626 -3805 -3054 -1787 -822 746 -2002 -6379 -6881 -2700 4185 7027 -161
599 -161 -11561 -14602 -4659 7681 9924 916 -11970 -13415 -405 10851 6573 -6510 -12384 -5644
613 -5644 6690 12150 4103 -7673 -9227 -874 6918 7432 1713 -3455 -1932 4265 6293 2742 -661
628 -661 -656 1308 4233 5934 3665 528 22 2301 4360 5562 3602 159 1028 4414 6193 4199 1902
645 1902 446 2637 6995 6072 23 -3995 930 7297 8202 1401 -5925 -6318 2349 9441 4439 -5985
661 -5985 -10842 -5088 5803 10148 324 -13573 -14945 -3896 6093 6613 -2208 -12152 -12535 -3713 3540
676 3540 1391 -5770 -11325 -9890 -2416 3739 1119 -6408 -11233 -9694 -4089 1774 1151 -5015 -8418
$$ packed form
567g117J208P637K578k923m107j767J244K354k62o02K521K482k607l977k284P19
583d903L631M848j225m977j179P51J267R65J568k748m377n02M181O885K842p188
599a61j1400l041R943J2340K243r008j2886j445J3010J1256m278j3083n874O740
613e644J2334N460q047j1776j554Q353P792N14n719n168J523O197K028l551l403
628f61NJ964K925J701k269l137n06K279K059J202j960l443Q69L386J779j994k297
645A902j456K191M358r23o049m018M925O367R05o801p326l93Q667P092n002j0424
661e985m857N754J0891M345r824j3897j372J1049R989N20q821r944l83Q822P253
676C540k149p161n555J435P474O155k620p527m825J539N605N863o23o166l403
$$ plain form
691 -8418 -5556 -788 -918 -4819 -7848 -6500 22 3285 -762 -6389 -7134 -3192 1649 1787 -3481 -6388
707 -6388 -1090 5472 4223 -2063 -6072 -4711 1673 6723 4306 -3043 -4752 191 5078 4632 -858
722 -858 -5910 -3650 3914 7545 3673 -2389 -5964 -4138 2617 7367 3940 -3890 -6446 -2304 3899
737 3899 7014 2795 -5381 -7874 -1774 5797 7005 2108 -5640 -7728 -644 6126 4796 -1371 -4705
752 -4705 -3644 583 3125 1402 -2917 -2908 157 1190 -738 -2962 -3317 -257 3354 1259 -3410 -4274
768 -4274 -827 2136 2269 -371 -4146 -3561 2177 5852 3652 -2099 -5295 -3382 2503 6688 3897 -1234
784 -1234 -3209 -324 3353 4791 1473 -4549 -3629 3379 8085 6165 -82 -5066 -3797 3351 8685
799 8685 5131 -1265 -3499 403 6734 8087 2604 -4073 -3496 3286 8524 7748 2802 -2398 -1861 3371
$$ packed form
691h418K862M768j30l901l029J348O522L263m047n627p45L942M841J38n268k907
707f388N298O562j249o286m009J361O384N050k417p349j709M943M887m46n490
722h58n052K260P564L631l872o062l575J826O755M750l427p830k556M142O203
737C899L115m219q176k493O100P571J208m897p748k088P084O770j330o167l334
752d705J061M227K542j723m319RL065J033j928k224l55L060L611k095m669q64
768d274L447K963J33k640l775N85N738L675k200n751l196J913N885M185k791n131
784a234j975K885L677J438l318o022R20P008M706j920o247m984J269P148N334
799H685l554o396k234L902O331J353n483o677N77O782N238p76m946n200N37N232
$$ plain form
815 3371 5868 3981 839 886 2250 4498 4299 821 -994 1243 3785 3346 1660 109 -155 2779
831 2779 5026 2449 -2667 -3123 791 5042 6067 1976 -3925 -4645 657 6456 6021 956 -5140 -4821
847 -4821 1844 7187 4351 -2979 -5794 -3043 3256 6456 2259 -5367 -6103 -247 5105 4930 -696 -5866
863 -5866 -4662 1713 5498 2377 -2916 -4549 -1835 3005 5022 438 -5024 -4712 76 4116 4197 63
879 63 -4099 -3797 297 2604 1025 -1491 -2392 -1208 1634 1849 -1907 -4440 -2436 795 1344 252 -2245
896 -2245 -3142 -172 2349 -208 -4220 -5508 -2620 2397 4892 663 -6011 -6898 -2207 2243 3228 -4
912 -4 -4984 -5555 -399 4080 1945 -2974 -6557 -5058 570 4706 2146 -3142 -5118 -3198 438 2520
928 2520 181 -3747 -3637 762 2890 594 -1886 -3708 -2194 1193 3212 855 -2070 -2383 -586 1656
$$ packed form
815C371K497j887l142M7J364K248j99l478j815K237K542m39j686j551k64K934
831B779K247k577n116m56L914M251J025m091n901p20N302N799m35n065o096L19
847d821O665N343k836p330k815K751O299L200m197p626p36N856N352j75n626n170
863e866J204O375L785l121n293j633K714M840K017m584n462L12M788M040Q1m134
879F3m162L02M094K307j579k516r01J184K842K15l756k533K004L231N49j092k497
896b245q97K970K521k557m012j288K888N017K495m229o674q87M691M450R85l232
912dm980n71N156M479k135m919l583J499N628M136k560n288j976J920L636K082
928B520k339l928J10M399K128k296k480j822J514L387K019k357k925l13J797K242
$$ plain form
944 1656 2123 -466 -2460 -930 1876 1907 548 -491 -1137 -247 2098 1755 -519 -942 462 1998 2042
961 2042 -121 -1661 -969 2400 3561 1070 -1864 -2440 -477 3579 4896 1425 -3113 -3174 494 3529
977 3529 3928 594 -2662 -2082 1677 3931 2511 -921 -3324 -2178 1981 4414 2052 -758 -1792 -536
993 -536 1055 1712 548 -1462 -311 2292 2337 127 -1811 -1849 -56 2454 2108 -829 -969 650 1734
1010 1734 1671 77 -2383 -2434 1052 3918 2273 -724 -2323 -1395 1026 2400 659 -1649 -1265 1097
1026 1097 2664 2095 -1089 -4102 -2439 2557 4271 1662 -2103 -3768 -1471 2796 3499 -130 -4092
1041 -4092 -3345 398 3453 3589 -1114 -4447 -3282 1241 3596 2428 -533 -3290 -2489 1389 2795 515
1057 515 -1843 -1754 -147 1791 1328 -821 -2021 -566 1532 1465 -380 -1843 -1929 743 2615 1135 -2034
$$ packed form
944A656M67k589j994J530K806L1j359j039o46Q90K345l43k274m23J404J536M4
961B042k163j540O92L369J161k491k934n76J963M056J317l471m538o1L668L035
977C529L99l334l256N80L759K254j420l432k403J146M159K433k362k810j034J256
993e36J591O57j164k010J151K603M5k210j938l8J793K510l46k937j40J619J084
1010A734o3j594k460n1L486K866j645k997j599R28K421J374j741k308L84K362
1026A097J567n69l184l013J663M996J714k609l765j665K297M267P03l629l962
1041d092P47L743L055J36m703l333J165M523K355j168k961k757Q01L878J406k280
1057E15k358Q9J607J938m63k149j200J455K098o7j845j463q6K672J872j480l169
$$ plain form
1074 -2034 -2539 -216 2073 2559 167 -2904 -3053 392 3198 2353 -175 -3341 -2464 907 2869 1178
1090 1178 -1920 -2180 -249 1763 2464 -342 -3735 -3130 643 2670 1422 -1379 -3321 -2233 1560 2339
1106 2339 -364 -3170 -3101 -259 2741 2976 -913 -4227 -3220 260 2330 1825 -588 -2441 -1798 479
1122 479 1380 -395 -977 -1488 -170 1373 1517 -837 -1587 -129 287 61 -174 -876 -335 1224 2114 104
1140 104 -2392 -2046 -54 2396 2706 311 -2316 -2025 1076 2999 1733 -387 -2021 -1026 2342 3648
1156 3648 917 -1461 -1661 40 2417 2538 89 -1596 -449 1370 1888 1318 -603 -1686 221 2583
1172 2583 2194 -575 -1671 -1037 1468 2906 2184 -697 -2174 -213 1777 2325 927 -608 -1194 808
1188 808 2046 954 -824 -1233 -424 790 1558 696 -1639 -946 814 1215 116 -1601 -2073 -318 2358
$$ packed form
1074b034n05K323K289M86k392l071j49L445K806q45k528l166Q77L371J962j691
1090A178l098k60J931K012P01k806l393O05L773K027j248k801j942J088L793P79
1106B339k703k806O9K842L000K35l889l314J007L480K070n05k413j853O43K277
1122D79R01j775n82n11J318J543J44k354p50J458M16k26k35p02N41J559Q90k010
1140A04k496L46J992K450L10k395k627K91L101J923j266k120j634R95L368J306
1156C648k731k378k00J701K377J21k449j685J147J819N18n70j921j083J907K362
1172B583l89k769j096O34K505J438p22k881j477J961J990N48j398j535n86K002
1188H08J238j092j778m09Q09J214P68q62k335O93J760M01j099j717m72J755K676
$$ plain form
1205 2358 2246 -1080 -3605 -2948 -151 2544 2653 -1068 -3844 -2074 1788 2781 804 -2327 -3397 -595
1221 -595 2599 2974 -128 -2580 -2482 -513 2248 1876 -770 -2026 -446 1291 1704 -126 -1693 -1858 246
1238 246 3141 2335 -321 -1759 -1406 1179 3139 2142 -1266 -1785 775 2768 2823 726 -2057 -2152 1472
1255 1472 3775 1929 -677 -1561 -357 1823 2633 127 -2388 -1427 1104 2481 1069 -1518 -3390 -871
1271 -871 2054 2445 -522 -2978 -2521 118 2538 2375 -1028 -3581 -2176 933 2769 2037 -1974 -4252
1287 -4252 -2228 1391 2422 425 -2208 -3263 -1674 1611 1975 -741 -2857 -1537 672 1728 379
1302 379 -2276 -2891 -361 1822 1487 -425 -1980 -1730 827 2479 745 -1778 -1382 537 2218 2357
1318 2357 -36 -2447 -1993 855 2496 1495 -399 -1800 -930 1033 1847 43 -1932 -1067 719 2131
$$ packed form
1205B358j12l326k525O57K797K695J09l721k776J770L862R93j977l131j070K802
1221e95L194L75l102k452R8J969K761l72k646j256J580J737M13j830j567j65K104
1238B46K895q06k656j438L53K585J960r97l408n19K560J993N5k097k783r5L624
1255A472K303j846k606q84J204K180Q10k506k515R61K531J377j412k587j872K519
1271h71K925L91k967k456M57K639K420j63l403k553J405L109J836p32m011k278
1287d252K024L619J031j997k633j055J589L285L64k716k116J320K209J056j349
1302C79k655o15K530K183l35j912j555K50K557J652j734k523L96J919J681J39
1318B357k393k411M54K848J641j001j894j401Q70J963Q14j804j975Q65J786J412
$$ plain form
1334 2131 1588 -781 -2692 -1164 1623 1653 519 -1366 -2347 -173 2273 1830 -1195 -3180 -1760 732
1350 732 2863 1897 -1301 -3049 -1250 1467 1575 204 -1751 -2082 -125 1726 707 -1289 -2014 -908
1366 -908 375 1072 219 -1636 -1502 540 945 -96 -1077 -1234 -454 1482 1838 -396 -2246 -1382 365
1383 365 1884 1638 -508 -2540 -1084 989 2150 738 -847 -2200 -721 2131 2185 -528 -2411 -1245
1399 -1245 788 2398 1440 -1034 -2490 -149 1914 1892 59 -1882 -1400 1042 3441 1580 -1644 -2462
1415 -2462 -847 1674 3288 1399 -1839 -2497 -370 1879 1460 -76 -2037 -1518 578 2127 552 -1511
1431 -1511 -1797 -688 999 1878 103 -1942 -1231 882 1865 453 -1475 -2379 -434 2088 2671 -130
1447 -130 -2362 -2280 -89 2708 2608 -1136 -3085 -1483 1615 2615 1121 -1625 -2917 -767 2507 3084
$$ packed form
1334B131n43k369j911J528K787L0j134j885r81K174K446m43l025j985J420K492
1350G32K131r66l198j748J799K717J08j371j955l31J957J851j019j996p25J106
1366i08J283O97q53j855J34K042M05j041r81j57P80J936L56k234j850Q64J747
1383C65J519k46k146k032J456K073J161j412j585j353J479K852N4k713j883J166
1399a245K033J610r58k474j456K341K063k2j833j941M82K442K399j861l224q18
1415b462J615K521J614j889l238o58K127K249m19j536j961N19K096J549j575k063
1431a511k86J109J687Q79j775k045P11K113R83j412j928r04J945K522N83k801
1447a30k232Q2K191K797j00l744j949J602L098J000j494k746j292K150L274N77
$$ plain form
1463 3084 317 -2121 -1582 601 2484 1815 -781 -1541 118 2071 2078 599 -1099 -1786 860 3309 2569
1480 2569 -209 -1662 -1190 1500 3241 1734 -782 -1904 -206 2057 2725 1135 -1378 -1574 917 2658
1496 2658 1816 33 -1449 -1003 1327 2333 1075 -1517 -1085 798 2177 1103 -1357 -1905 -563 2148
1512 2148 2468 193 -1746 -1716 -170 2175 1797 -497 -2490 -1289 917 1958 1286 -1173 -2334 -1122
1528 -1122 993 1949 382 -797 -1827 -803 1184 1180 -713 -1410 -690 683 1488 513 -1486 -2168 -255
1545 -255 1407 732 -387 -1423 -1154 348 1602 118 -1743 -1885 12 1263 1255 191 -1940 -1970 287
1562 287 1437 745 -600 -1209 -737 620 879 -383 -1561 -920 383 769 390 -1136 -1789 -371 1329
1579 1329 1031 -434 -1412 -1199 -26 1453 955 -1234 -2482 -671 521 1513 926 -1648 -2243 -870 1257
$$ packed form
1463C084k767k438N39K183J883o69k596p60J659J953Pj479j698o87K646K449p40
1480B569k778j453M72K690J741j507k516j122J698K263O68j590k513j96K491J741
1496B658q42j783j482M46K330J006j258k592M32J883J379j074k460n48J342K711
1512B148L20k275j939L0J546K345l78k294j993J201K206J041o72k459j161J212
1528a122K115R56j567j179j030J024J987mj893o97P20J373Q05r75j999o82J913
1545b55J662o75j119j036K69J502J254j484j861j42J897J251qj064k131l0K257
1562B87J150o92j345o09M72J357K59j262j178O41J303L86l79j526o53J418J700
1579A329k98j465r78K13J173J479m98k189j248J811J192R92n87k574n95J373K127
$$ plain form
1596 1257 899 -318 -1205 -1366 -190 1417 678 -1135 -1402 -534 1034 860 132 -1806 -1220 753 1642
1613 1642 242 -1102 -1213 -535 1278 1836 -311 -2077 -1403 411 1659 1497 -438 -1756 -1187 671
1629 671 1642 558 -659 -1273 -241 1506 1867 -228 -1738 -881 550 1515 1226 -710 -1862 8 1733
1646 1733 1386 -307 -1348 -1420 572 2702 1379 -943 -1961 -759 942 2089 1121 -1167 -1806 184
1662 184 1844 1347 146 -1246 -1158 685 1981 1063 -797 -958 -601 708 1652 410 -903 -669 947
1679 947 1284 729 -531 -1311 -370 1345 2077 387 -1329 -1382 -10 1689 1622 -172 -1856 -1047 910 1470
1697 1470 679 -846 -1560 -488 1291 1327 -197 -855 -1298 -114 1012 941 -592 -1516 -121 921 861 -46
1715 -46 -1070 -1271 299 1757 875 -720 -1523 -1043 258 1456 860 -884 -1167 58 582 553 66 -1504
$$ packed form
1596A257l58j217q87j61J176J607p39j813k67Q68J568j74p28j938N86J973Q89
1613A642j400j344j11O78J813N58k147j766O74J814J248j62j935j318N69J858
1629F71R71j084j217o14J032J747L61k095j510Q57J431R65k89j936j152J870J725
1646A733l47j693j041p2J992K130j323k322j018J202J701J147r68k288o39J990
1662A84J660m97j201j392Q8J843J296r18j860j61L57J309R44j242j313K34J616
1679I47L37n55j260p80R41J715P32j690j716n3J372J699o7j794j684Q09J957N60
1697A470p91j525p14J072J779L6j524o58m43J184J126p1j533r24J395J042o0r07
1715d6j024k01J570J458q82j595q03M80J301J198n96j744k83J225N24k9m87j570
$$ plain form
1733 -1504 -1254 161 1037 233 -280 -614 -392 62 689 -95 -1109 -473 470 583 361 -774 -1208 -290 1137
1752 1137 1111 -361 -773 -799 396 1052 965 -625 -1300 -116 685 1244 484 -820 -1273 -99 876 616 9
1771 9 -171 -341 414 702 224 -771 -535 415 662 793 -58 -913 -873 534 1333 283 -1000 -258 -256 856
1791 856 1370 298 -1412 -879 649 1179 833 -23 -1218 -708 929 982 -18 -586 -653 32 726 524 -1170
1810 -1170 -1224 419 996 1043 -156 -1179 -1207 120 1509 865 -795 -1216 -405 734 1614 657 -1706 -1397
1828 -1397 -27 1196 1088 335 -992 -1313 304 986 305 -782 -645 -613 475 953 -316 -1375 -836
1845 -836 775 1011 696 -87 -1181 -782 1042 1266 -342 -1064 -1038 -70 1494 1437 -536 -1731 -821 427
1863 427 1327 639 -655 -1624 -783 828 980 -342 -1110 -624 -227 1114 778 -943 -1365 -63 568 907
$$ packed form
1733a504K50J415Q76q04n13l34K22M54O27p84j014O36R43J13k22j135m34R18J427
1752A137k6j472m12k6J195O56q7j590o75J184Q01N59p60j304m53J174R75k60o07
1771Ij80j70P55K88m78r95K36R50K47J31q51q55M0J407P99j050j283P42KJ112
1791H56N14j072j710N33J528N30l46q56j195N10J637N3j000n68o7O85O94k02j694
1810a170n4J643N77M7j199j023k8J327J389o44j660m21Q11J139Q80r57k363L09
1828a397J370J223j08p53j327l21J617O82o81j087J37L2J088M78j269j059N39
1845h36J611K36l15p83j094L99J824K24j608p22K6R68J564n7j973j195R10J248
1863D27R00o88j294r69Q41J611J52j322p68M86L97J341l36j721m22J302O31L39
$$ plain form
1881 907 140 -1100 -1127 121 1068 726 -773 -1672 -832 681 1644 779 -1348 -1557 -674 871 1259 62
1899 62 -1500 -1299 451 1278 643 -98 -1431 -765 554 1137 195 -763 -829 225 876 748 -349 -854 -234
1918 -234 701 960 -224 -529 -831 65 1492 1000 -372 -1304 -758 393 1209 737 -576 -851 -34 922
1936 922 766 520 -431 -684 64 1068 689 -90 -750 229 961 1039 300 -452 -642 864 1020 616 -534
1955 -534 -1212 -573 782 1747 285 -1018 -773 -108 899 936 -137 -990 -373 545 1157 384 -356 -783 -348
1974 -348 702 1013 -43 -589 -15 454 499 200 -896 -1259 -27 1046 792 -275 -941 -1116 263 1229
1992 1229 782 -785 -1307 -69 468 1364 620 -1273 -1259 102 1071 800 -277 -1337 -783 379 1373 166
2010 166 -1158 -1325 149 889 643 -323 -1622 -691 845 937 437 -808 -1405 -222 801 1602 -97 -1043
$$ packed form
1881I07p67j240k7J248R47l42j499q99Q40J513R63q65k127k09Q83J545L88j197
1899F2j562K01J750Q27o35p41j333O66J319N83r42r58o6J054O51j28j097n05O20
1918b34R35K59j184l05l02Q96J427m92j372r32N46J151Q16m72j313k75Q17R56
1936I22j56k46r51k53P48J004l79p79o60R79P32P8p39p52j90J506J56m04j150
1955e34o78O39J355R65j462j303K45O65J007L7j073q53O17R18O12p73p40m27M35
1974c48J050L11j056n46N74M69M5k99j096l63J232J073k54j067o66j75J379R66
1992A229m47j567n22J238N37Q96p44j893J4J361R69k71j077j060N54J162R94j207
2010A66j324j67J474P40k46r66j299R31J536R2n00j245n97J183J023Q01j699r46
$$ plain form
2028 -1043 -709 -113 972 794 -465 -1297 -557 815 1011 385 -754 -1456 -578 930 966 -195 -863 -661
2046 -661 421 884 693 -882 -1396 502 1581 1226 104 -1656 -1130 563 1421 734 -1091 -1307 -371
2063 -371 941 1368 254 -1532 -1454 1 1531 1280 -14 -1211 -772 697 1203 546 -489 -937 -325
2080 -325 890 1269 -124 -1141 -956 115 899 693 -94 -1055 -1079 1012 1292 -217 -1263 -1469 -233 1107
2098 1107 1542 -148 -1636 -1237 391 984 430 -879 -1337 -487 1044 705 -545 -960 -934 365 935 451
2116 451 -875 -864 -175 478 738 -195 -920 -1066 223 1035 629 -387 -1050 -628 613 1202 462 -942 -1100
2135 -1100 -576 533 1286 434 -836 -907 32 1013 332 -645 -859 -540 1024 1272 -156 -1044 -709 392
2153 392 1209 734 -502 -1122 149 1035 914 -208 -1039 -650 238 1502 943 -538 -904 -234 473 1029
$$ packed form
2028a043L34N96J085j78j259q32P40J372J96o26j139p02Q78J508L6j161o68K02
2046f61J082M63j91j575n14J898J079l55j122j760N26J693Q58o87j825k16R36
2063c71J312M27j114j786P8J455J530k51j294j197M39J469N06o57j035m48O12
2080c25J215L79j393j017J85J071P84k06p87r61k4K091K80j509j046k06J236J340
2098A107M35j690j488L99J628N93n54j309m58Q50J531l39j250m15K6J299N70m84
2116D51j326J1O89O53K60r33p25j46J289Q12m06j016o63M22J241N89p40j404j58
2135a100N24J109P53q52j270p1R39R81o81r77k14L19J564K48j428q88L35J101
2153C92Q17m75j236o20J271Q86j21j122q31L89Q88J264n59j481l66O70P07N56
$$ plain form
2171 1029 338 -139 -459 242 842 681 221 -319 -444 252 827 542 -420 -561 31 493 793 161 -1110
2190 -1110 -712 449 1321 538 -486 -862 -519 1033 1598 77 -1315 -963 252 1061 750 -375 -1448
2207 -1448 -550 966 811 -160 -812 -793 -5 704 581 -944 -878 -213 299 660 120 -689 -1269 -15 498
2226 498 432 -395 -712 -794 -67 1155 762 -524 -1052 -797 56 812 376 -1000 -1237 -18 813 1041 -416
2245 -416 -1363 -1095 392 1153 500 -933 -1126 -216 760 892 -547 -1303 -776 783 1443 14 -935 -1148
2263 -1148 -431 1043 940 -387 -952 -711 453 659 449 -265 -793 -687 250 674 568 18 -812 -451 387
2282 387 645 191 -437 -496 -35 798 856 -114 -1192 -424 961 1475 243 -909 -1011 177 1468 916 -799
2301 -799 -1249 -207 785 1626 307 -1023 -984 533 824 412 -7 -448 -404 478 790 -55 -336 -264 -256 633
$$ packed form
2171A029o91m77l20P01O00j61m60n40j25O96N75k85r62j41N92M62L00o32j271
2190a110L98J161Q72p83j024l76L43J552N65j521j392L52J215Q09l11j125j073
2207a448Q98J516j55r71o52J9P88P09j23j525O6O65N12L61n40q09n80J254N13
2226D98o6q27l17q2P27J222l93j286n28K55Q53P56m36j376k37J219Q31K28j457
2245d16r47K68J487P61o53j433j93R10R76J32j439p56N27J559O60j429r49k13
2263a148P17J474j03j327n65K41J164K06k10p14n28J06R37M24j06n50q30L61Q38
2282C87K58m54o28n9M61Q33N8r70j078P68J385N14j232j152j02J188J291n52j715
2301g99m50J042R92Q41j319j330L9J517K91m12m19m41M4Q82L12q45k81P2QQ89
$$ plain form
2321 633 150 -280 -356 -494 128 267 421 266 -229 -761 56 762 278 -467 -478 -315 560 1359 31 -1183
2341 -1183 -635 170 939 1086 -189 -861 -415 884 739 35 -554 -226 536 915 256 -928 -645 372
2359 372 665 312 -453 -563 -369 456 552 -85 -683 -210 242 165 275 72 42 -410 -196 -172 247 225 -199 -678
2381 -678 -168 275 -5 -218 -567 -477 28 702 193 -816 -811 -56 726 328 -353 -1110 -285 913 703 -349
2401 -349 -1215 -1054 643 992 310 -787 -1126 305 641 334 -526 -853 -305 472 541 -480 -617 -101 185
2420 185 89 45 -240 -448 -207 430 -93 -32 182 -258 -210 478 941 87 24 -712 -268 640 1351 379 -876
2441 -876 -859 65 833 1253 -13 -1165 -191 1060 1026 -278 -783 -362 167 1282 534 -860 -811 100 981
2460 981 586 -407 -796 -414 1084 722 336 -472 -405 88 481 710 144 -293 -134 4 -22 179 151 -79 -513
$$ packed form
2321F33m83m30p6j38O22J39J54j55m95n32Q17P06m84p45j1J63Q75P99j328j214
2341a183N48Q05P69J47j275o72M46J299j45p04n89L28P62L79o59j184K83J017
2359C72K93l53p65j10J94Q25R6o37n98M73M52p7J10k03l0m52K14K4M19k2m24m79
2381f78N10M43k80k13l49R0N05O74n09j009NP55P82l98o81p57Q25J198k10j052
2401c49q66J61J697L49o82j097l39J431L36l07q60l27N48P77O9j021j37N16K86
2420A85r6m4k85k08K41O37n23O1K14m40M8O88M63q54o3p36M44R08P11r72j255
2441h76J7R24P68M20j266j152R74J251l4j304n05M21N29J115p48j394M9R11Q81
2460I81l95r93l89L82J498l62l86q08O7M93L93K29n66m37J59J38k6K01k8k30m34
$$ plain form
2481 -513 -59 187 634 177 -262 -899 47 957 211 -339 -595 117 862 776 -197 -1135 -691 994 1571 526
2501 526 -592 -1020 -73 945 809 -448 -1122 -53 545 486 17 -724 -302 215 648 -69 -328 -135 123
2520 123 216 56 -123 -55 124 51 8 -68 92 -1 -84 -216 105 413 313 -582 -976 -74 774 560 -668 -519
2542 -519 -656 299 869 72 -972 -767 252 916 376 -536 -674 -68 652 732 -702 -1024 -335 669 451
2561 451 -89 -1010 -520 485 618 47 -713 -268 -27 47 -320 -145 -62 -95 333 -266 -297 111 -196 -687 -364
2582 -364 -299 330 347 -420 -572 -197 238 779 -104 -569 -294 815 961 46 -1027 -713 233 1113 455 -581
2602 -581 -1067 29 1028 760 -448 -1163 -313 528 945 75 -713 -1001 -27 745 105 -439 -393 139 130 89 -274
2623 -274 -231 -38 136 124 -11 331 30 -413 -267 517 344 231 -293 -878 -150 1095 1082 132 -872 -542
$$ packed form
2481e13M54K46M47m57m39o37R46R10p46n50k56P12P45q6r73r38M44J685N77j045
2501E26j118m28R47J018j36j257o74J069N98n9m69p41M22N17M33p17k59J93K58
2520A23R3j60j79O8J79p3m3p6J60r3q3j32L21L08j00q95l94R02Q48k14j228J49
2542e19j37R55N70p97j044K05J019O64n40r12j38O06P20Q0j434l22O89J004k18
2561D51n40r21M90J005J33n71p60M45K41P4l67J75Q3l3M28n99l1M08l07m91L23
2582c64O5O29J7p67j52L75M35N41q83m65K75J109J46r15j073L14R46Q80o58j036
2602e81m86J096R99k68j208p15Q50Q41M17q70p88k88R74P72o40n44M6N32rm1l63
2623b74M3J93J74j2j35L42l01m43J46P84j73j13n24n85P28J245j3r50j004L30
$$ plain form
2643 -542 305 1296 529 -984 -1023 303 972 743 -277 -1116 -168 1161 1282 -241 -918 -243 739 1080 693
2662 693 -640 -990 162 767 638 -134 -394 -102 491 831 494 -46 -43 -128 -139 168 671 324 -162 -299 -267
2683 -267 469 700 -223 -943 -471 949 893 428 -639 -531 224 1352 829 -742 -974 -228 1437 1008 53
2702 53 -1099 -274 897 1251 211 -859 -828 46 549 640 -123 -409 -100 604 329 -17 -60 -186 153 229
2722 229 -85 12 -13 -202 -222 -66 278 125 -387 -298 31 348 446 243 -946 -693 53 979 343 -746 -1209
2743 -1209 -499 622 682 -474 -1200 -615 85 503 -271 -955 -1106 114 472 161 -723 -844 -146 337 188
2762 188 -417 -809 -45 139 302 -97 -391 -332 -39 361 -106 -448 -243 -56 -213 -514 -127 234 26 -278
2782 -278 -400 80 465 56 -673 -773 76 911 639 -243 -643 -602 797 703 -309 -895 -184 493 887 197
$$ packed form
2643e42Q47R91p67j513l9J326O69k29j020q39R48J329J21j523o77O75R82L41l87
2662F93j333l50J152O05j29p72k60K92N93L40l37n40Lq5j1L07N03l47m86j37L2
2683b67P36K31r23p20M72J420n6m65j067J08P55J128n23j571k32P46J665m29r55
2702E3j152Q25J171L54j040j070L1Q74N03R1p63k86L09P04k75l46m3j26L39P6
2722B29l14R7k5j89k0J56L44j53n12Q9L29L17R8k03j189K53P46R26o36j089m63
2743a209P10J121O0j156p26N85P00M18p74o84j51J220L58l11q84j21O98M83j49
2762A88o05l92P64J84J63l99k94N9K93M00m67l42K05J87j57l01L87L61k08l04
2782b78j22M80L85m09p29j00Q49Q35k72q82m00M1J399r4j012n86P11O77L94o90
$$ plain form
2802 197 -485 -707 614 925 427 -472 -824 -214 1258 907 -215 -620 -157 597 407 313 208 -180 231
2821 231 201 -87 -83 278 149 -328 69 567 381 -284 -216 -248 187 945 422 -715 -556 370 759 647 -102
2842 -102 -905 -724 600 1127 -107 -1064 -792 130 939 277 -528 -953 -234 1023 579 -202 -467 -330 130
2861 130 654 26 -443 -475 -81 423 291 -7 -215 -254 62 577 167 75 28 -464 -85 419 812 65 -703
2882 -703 -549 -123 808 687 -356 -1049 -153 777 732 42 -454 -688 177 828 112 -481 -453 16 559 665
2902 665 -157 -934 -154 666 633 -145 -342 -402 196 577 374 -236 -330 -143 238 167 287 -244 -109 20 8 73
2924 73 313 489 -155 -469 109 266 29 16 -565 -111 414 804 -273 -863 -449 506 483 81 -672 -724 36
2945 36 630 529 -298 -493 -242 631 630 341 -572 -381 159 242 2 -82 -355 -28 163 -423 -344 -680 -81 -273
$$ packed form
2802A97o82k22J321L11m98q99l52O10J472l51j122m05M63P54j90r4j05l88M11
2821B31l0k88ML61j29m77L97M98j86o65O8l2M35P58n23j137J59R26L89j12p49
2842a02q03J81J324N27j234r57K72R22Q09o62q05m25P19J257m44p81k65J37M60
2861A30N24o28m69l2L94N04j32k98k08l9L16N15m10r2m7m92L79N04L93p47p68
2882g03J54M26R31j21j043o93Q96R30m5o90m96k34Q65O51p16n93K8M69N43J06
2902F65q22p77P80Q20l3p78j97o0N98L81k03o10r4J87L81p1J20n31J35J29j2O5
2924G3K40J76o44l14N78J57k37j3n81M54N25L90j077n90M14R55k3m02p53n2P60
2945C6N94j01q27j95K51Q73jk89r13J91N40Q3k40q4k73L27J91n86P9l36N99j92
$$ plain form
2967 -273 130 136 -395 -82 72 49 81 181 32 -58 -87 111 294 203 -207 -458 -314 582 385 32 -590 -243
2989 -243 178 525 228 -144 -620 -90 434 277 -64 -547 -387 384 427 -257 -534 -410 344 517 -112 -328
3009 -328 -529 9 417 249 -344 -552 -352 164 56 88 -68 -311 -181 119 -219 175 -207 -454 -375 -255 346
3030 346 -37 -229 -228 -166 97 339 -134 -664 -83 120 525 251 -261 -615 -19 563 630 -29 -622 -488 368
3051 368 721 -8 -522 -425 -108 638 258 -79 -334 136 342 534 51 -159 -392 108 408 86 -270 -119
3071 -119 -119 -193 243 6 194 -218 23 187 705 304 -118 -587 -3 250 636 180 -228 -314 114 677 623 131
3093 131 -786 -24 599 258 104 16 -505 37 473 56 -339 -531 -17 460 82 109 -412 -43 194 297 170
3114 170 -332 -156 -298 -43 -10 7 131 -375 -175 -7 -76 14 138 -430 37 61 333 154 -76 -373 132 277
$$ packed form
2967b73M03On31L13J54k3L2J00j49r0k9J98J83r1m10k51J44Q96j97l53o22L47
2989b43M21L47k97l72m76N30N24j57l41m83J60P71M3o84k77J24P54J73o29k16
3009c28k01N38M08j68n93k08K00N16j08L2j56k43J30L00l38L94l82k47P9J20O01
3030C46l83j92JO2K63K42m73n30N81K03M05k74n12l54N96N82O7o59n93J34Q56
3051C68L53p29n14R7L17P46l80l37k55M70K06J92m83k10k33N00L00l22l56J51
3071a19%p4M36k37J88m12K41J64N18m01m22m69N84K53L86m56m08q6M28N63n4m92
3093A31r17P62O23l41j54q8n21N42M36m17l95j92N14M77l78K7n21L69K37J03j27
3114A70n02J76j42K55L3J7J24n06K00J68o9R0J24n68M67K4K72j79k30k97N05J45
$$ plain form
3136 277 132 -273 -271 -45 145 313 -58 -251 -140 279 240 -86 -430 -483 -305 577 87 -268 -167 -278 201
3157 201 407 -83 -355 -246 76 281 -76 -353 -116 -254 318 355 -67 -124 166 212 136 -86 42 -4 157 134
3179 134 378 353 -80 -212 -72 304 59 249 -52 -553 68 258 427 321 -13 -4 476 301 47 -108 29
3200 29 2 376 327 -141 -79 65 -43 104 94 -277 -29 332 327 -243 -217 -426 -242 122 38 54 -391 57 -257
3223 -257 100 123 354 50 -293 132 188 -2 -175 -108 -161 99 76 -168 -509 -424 -32 274 481 -39 -611 -228
3245 -228 320 245 74 -120 -538 -202 216 231 149 -343 -353 175 467 -116 -238 -366 91 380 434 135 -250 120
3267 120 168 352 84 -366 -50 -144 214 258 -119 -257 -219 -114 310 95 -40 -301 -497 -24 459 52 110 -492
3289 -492 -47 120 95 170 -430 -260 56 406 -104 76 -403 -197 -87 495 14 -74 -223 29 139 99 -134
$$ packed form
3136B77j45m05KK26J90J68l71j93J11M19l9l26l44n3J78Q82m90l55J01j11M79
3157B01K06m90k72J09L22K05l57k77K37j38N72L7m22n7K90M6p6k22J28m6J61k3
3179A34K44k5m33j32J40L76k45J90l01n01O21J90J69j06l34RM80j75k54j55J37
3200B9k7L74m9m68O2J44j08J47j0l71K48L61nn70K6k09J84L64q4J6m45M48l14
3223b57L57K3K31l04l43M25N6j90j73O7n3K60k3k44l41Q5L92L06K07n20n72L83
3245b28N48p5j71j94m18L36M18J5q2m92j0N28K92n83j22j28M57K89N4k99l85L70
3267A20M8J84k68m50L16r4L58M4l77j38L8J05M24k15j35k61j96M73M83m07N8o02
3289d92M45J67k5P5o00J70L16L50n10J80m79K06J10N82m81q8j49K52J10m0k33
$$ plain form
3310 -134 -170 285 235 166 60 74 -242 -86 362 210 -237 -238 -278 -41 182 129 96 -101 166 8 -81 35 -30 -273
3334 -273 -17 359 33 -60 -84 51 3 486 70 26 -111 348 399 348 130 -496 -90 552 394 242 -289 -107
3356 -107 262 215 281 29 -166 165 428 9 237 -70 -60 -228 278 301 -112 -132 -80 -309 234 32 -183 -301
3378 -301 -398 92 48 41 -50 -309 55 268 91 -382 -405 -392 -51 304 -81 -484 -190 -60 178 85 29 -351 -219
3401 -219 274 190 54 -454 -255 -285 290 286 -105 -132 52 97 176 210 -112 -208 -227 67 335 53 -328 -448 -111
3424 -111 479 261 -141 -416 -34 -182 309 469 44 -412 -138 150 129 -156 -270 -395 139 537 411 -155
3444 -155 -275 -105 274 108 86 -466 -360 35 573 294 -149 -314 -345 397 385 73 -311 -370 -290 230 307 -154
3466 -154 -290 -437 2 302 83 -261 -111 90 21 106 -323 -335 -99 -256 40 201 -251 -237 -193 132 350 281
$$ packed form
3310a34l6M55n0o9j06J4l16J56M48j52m47jm0K37K23n3l3j97K67j58q9J16o5k43
3334b73K56L76l26r3k4J35m8M83m16m4j37M59N1n1k18o26M06O42j58j52n31J82
3356a07L69m7O6k52j95L31K63m19K28l07J0j68N06K3m13k0N2k29N43k02k15j18
3378c01r7M90m4pr1k59L64K13j77m73k3J3L41L55l85m03K94J30K38r3n6l80J32
3401b19M93q4j36n08J99l0N75ml91k7J84M5P9L4l22r6j9K94K68k82l81j20L37
3424a11N90k18m02k75L82j48M91J60m25m56K74K88k1k85j14j25N34L98j26n66
3444a55j20J70L79j66k2n52J06L95N38k79m43j65l1P42j2l12l84n9Q0N20P7m61
3466a54j36j47M39L00k19l44J50K01o9Q5m29j2K36j57K96J61m52J4M4L25K18o9
$$ plain form
3488 281 -270 -384 -117 316 79 -338 -221 -314 81 662 234 60 -450 -5 117 237 22 -36 -29 47 221 -35
3510 -35 -245 -115 -313 108 154 298 -55 -98 102 319 337 -125 -474 -65 249 318 117 35 -35 -60 -44 189 -187
3533 -187 -206 -175 135 84 302 -48 -213 -69 35 379 -192 -162 -260 41 207 278 88 -248 -152 39 78 15 68
3556 68 -237 -91 288 150 201 76 19 171 106 117 -75 -187 -34 138 387 -148 -165 100 328 237 231 85 -442
3579 -442 -86 64 399 24 -310 -261 258 242 207 -264 -235 -234 197 432 74 -73 -185 -123 56 365 -80 -169 -31
3602 -31 57 -97 57 56 -5 -111 246 224 -29 -219 -312 265 199 145 -203 -367 -313 211 16 237 -7 -72 -155 80
3626 80 155 -294 -163 -249 27 24 111 -377 -364 -158 -183 -111 -423 -238 -130 18 281 114 -203 -93 -340 -116 235
3649 235 168 -409 -186 -259 294 25 -330 -487 -163 222 106 -71 -263 -273 -74 126 220 -128 -431 -196 -88
$$ packed form
3488B81n51j14K67M33k37m17J17r3L95N81m28j74n10M45J22J20k15n8PP6J74k56
3510c5k10J30j98M21M6J44l53m3K00K17J8m62l49M09L14O9k01q2p0k5J6K33l76
3533a87j9L1L10n1K18l50j65J44J04L44n71L0r8L01J66P1j90l36R6J91L9o3N3
3556F8l05J46L79j38N1j25n7J52o5J1j92j12J53J72K49n35j7K65K28r1oj46n27
3579d42L56J50L35l75l34M9N19j6l5m71K9JM31K35l58j47j12O2J79L09m45q9J38
3602c1Q8j54J54jo1j06L57k2k53j90r3N77o6n4l48j64N4N24j95K21k44o5q3K35
3626H0P5m49J31q6K76lQ7m88J3K06k5P2l12J85J08J48K63j67l17J10k47K24L51
3649B35o7n77K23p3N53k69l55j57L24L85j16j77j92j0J99K00R4l48l03K35J08
$$ plain form
3670 -88 73 -36 -115 -77 -312 -85 116 28 -152 -187 -10 155 233 -62 -318 -206 -29 193 205 -423 -601 -1
3692 -1 238 -154 398 -308 -256 73 409 525 -157 -137 -156 413 -44 137 -21 -211 -11 357 177 -269 -201 33
3714 33 188 159 141 -265 -124 107 -24 9 -264 -587 -64 111 10 281 -87 -277 110 -136 201 -43 -93 53
3736 53 56 -68 229 -106 -1 32 145 113 -59 -315 -291 -39 187 -30 -285 -132 39 238 151 84 311 34 132
3759 132 206 21 -251 -106 -127 168 118 -112 72 9 -183 -128 135 277 -365 1 31 -16 333 -97 -345 141
3781 141 502 -94 7 192 115 375 162 -231 417 -188 298 159 287 -250 -136 52 361 325 368 193 -190
3802 -190 36 -29 272 -47 49 -213 325 196 283 144 187 29 62 248 328 -163 17 38 -149 243 -77 -89 -175
3825 -175 111 120 104 -15 -122 77 209 166 89 -185 91 339 631 223 102 -91 -291 49 287 25 74 -22
$$ packed form
3670h8J61j09p9L8k35K27K01q8j80l5J77J65P8k95k56J12J77K22J2o28j78O00
3692aK39l92N52p06N2L29L36J16o82K0j9N69m57J81j58j90K00L68j80m46O8K34
3714C3J55k9j8m06J41K31j31L3k73l23N23J75j01K71l68j90L87k46L37k44n0J46
3736E3Lj24K97l35J05L3J13l2j72k56K4K52K26k17k55J53J71J99q7o7K27k77R8
3759A32P4j85k72J45k1K95n0k30J84o3j92N5K63J42o42L66L0m7L49m30k48M86
3781A41L61n96J01J85p7K60k13l93O48o05M86j39J28n37J14J88L09l6M3j75l83
3802a90K26o5L01l19R6k62N38j29Q7j39M3j58L3J86Q0m91J80K1j87L92l20j2q6
3825a75K86Rj6j19j07J99J32m3p7k74K76K48K92m08j21j93k00L40K38k62M9r6
$$ plain form
3847 -22 306 -41 27 116 -231 140 59 -21 -45 68 -157 -68 215 -30 -110 -371 -456 -32 -144 -360 168 -307 62
3870 62 -40 15 208 -419 136 -77 -250 35 -31 -199 -385 37 159 3 11 213 100 297 283 -96 -296 6
3892 6 172 35 79 -51 30 -21 294 249 13 -243 -123 -41 -29 102 -356 -65 -26 254 308 15 -7 56 -125 295
3916 295 121 -297 13 -278 -128 424 87 -110 -183 -240 -25 215 164 -206 -282 -58 -22 -117 -118 41 -160 190 120
3939 120 -151 117 16 238 69 153 -281 154 25 113 -22 325 -171 -93 49 187 527 78 110 -11 526
3960 526 109 499 -193 -147 195 219 106 -16 -98 -106 229 19 -145 25 -30 -196 100 -119 -159 -175 135 -1 128
3983 128 117 -216 -207 -96 99 381 -328 73 -166 102 166 215 -131 -22 -218 324 338 246 -176 -89 338 233 255
4006 255 -49 -458 -55 72 58 63 -160 -380 161 179 13 84 21 250 257 185 -26 92 66 368 89 98 36 35 -284
$$ packed form
3847b2L28l47O8Q9l47L71q1q0k4J13k25Q9K83k45q0k61q5M24j12k16N28m75L69
3870F2j02N5J93o27N55k13j73K85o6j68j86M22J22j56QK02j13J97j4l79k00L02
3892FJ66j37M4j30Q1n1L15m5k36k56J20Q2J2J31m58K91L9K80N4k93k2O3j81M20
3916B95j74m18L10k91J50N52l37j97p3n7K15K40n1l70p6K24L6r5jJ59k01L50p0
3939A20k71K68j01K22j69Q4m34M35j29Q8j35L47m96P8J42J38L40m49L2j21N37
3960E26m17L90o92M6L42K4j13j22q2qL35k10j64J70n5j66K96k19m0j6L10j36J29
3983A28j1l33RJ11J95K82p09M01k39K68O4M9l46J09j96N42J4r2m22Q7M27j05K2
4006B55l04m09M03J27j4Nk23k20N41J8j66P1o3K29Pp2k11J18k6L02k79Ro2jl19
$$ plain form
4031 -284 -207 240 -82 60 -158 61 -8 288 -142 -309 -233 120 34 37 127 -296 -230 175 484 320 65 -78 134
4054 134 -2 304 -348 -119 -119 124 281 279 196 -200 58 96 163 109 -285 44 -133 51 308 -15 -7 -67 -59 133
4078 133 286 -194 -34 -48 54 -8 132 -113 -83 0 123 22 3 -37 -217 111 321 84 -357 -347 69 238
4100 238 52 -140 -298 -110 182 284 -103 -436 -302 -73 305 532 -287 65 -467 26 407 39 -319 39
4120 39 27 170 16 -483 -228 -20 132 177 146 185 -26 -110 -170 335 26 -122 -298 161 -186 -88 0 -283 -107
4143 -107 78 47 272 -154 36 282 17 114 -149 83 -8 -152 -6 296 -110 -12 -107 73 -163 138 -378 305
4165 305 305 -100 -118 -172 43 -249 175 103 271 12 -12 -26 192 167 260 -33 -77 115 98 262 132 -189 197 90
4189 90 308 -198 34 -147 22 228 127 15 -85 50 344 167 -87 47 -25 43 94 493 -148 -32 -191
$$ packed form
4031b84P7M47l22J42k18K19o9K96m30j67P6L53q6LR0m23O6M05L09j64k55j43K12
4054A34j36L06o52K29%K43J57kq3l96K58L8O7n4l94L29j77J84K57l23Qo0QJ92
4078A33J53m80J60j4J02o2J40k45L0Q3J23j01j9m0j80L28K10k37m41J0M16J69
4100B38j86j92j58J88K92J02l87l33J34K29L78K27q19L52n32M93L81l68l58L58
4120C9j2J43j54m99K55K08J52M5l1L9k11q4o0N05l09j48j76M59l47R8Q8k83J76
4143a07J85l1K25m26J90K46k65R7k63K32r1j44J46L02m06R8r5J80k36L01n16O83
4165C05%m05j8n4K15k92M24p2J68k59k4j4K18k5R3k93m4J92j7J64j30l21L86j07
4189I0K18n06K32j81J69K06j01j12j00J35K94j77k54J34p2O8N1L99o41J16j59
$$ plain form
4210 -191 231 466 192 -65 -342 -59 43 52 172 -132 -233 -13 -10 -42 -206 38 -399 158 274 97 -448 -84
4232 -84 140 230 229 -70 137 -87 -274 97 69 -188 14 -23 150 108 155 -224 -97 160 281 -138 28 -343 69
4255 69 89 126 163 9 -56 64 160 -215 -35 -44 -17 -92 332 118 -439 -115 249 285 204 -116 -219 183 162 194 -139
4280 -139 -304 -229 -220 464 -28 -347 -256 -470 176 56 -252 60 -156 344 128 -149 133 -339 -129 -154 279 359
4302 359 76 -284 -242 36 22 -30 -290 -84 -211 -338 135 -142 41 -219 18 -71 171 -61 -79 -259 -350 61
4324 61 -10 252 -200 58 45 -102 -398 -197 -271 -44 -3 -28 -300 -531 46 467 -211 -220 -143 -183 24 196 167 -362
4348 -362 -148 115 63 -52 -291 182 65 180 -87 92 100 -187 232 80 56 -61 114 -288 85 166 72 -108
4370 -108 -98 -63 216 69 209 -30 12 -12 -176 65 -190 35 -66 21 152 295 -6 -19 71 43 285 -82 -291
$$ packed form
4210a91M22K35k74k57k77K83J02RJ20l04j01K20Ll2j64K44m37N57J16j77n45L64
4232h4K24R0jk99K07k24j87L71k8k57K02l7J73m2M7l79J27K57J21m19J66l71M12
4255F9K0L7L7j54o5J20R6l75J80rK7p5M24k14n57L24L64L6q1l20j03M02k1L2l33
4280a39j65P5RO84m92l19R1k14O46j20l08L12k16N00k16k77K82m72K10k5M33Q0
4302C59k83l60M2K78j4n2k60K06j27j27M73k77J83k60K37q9K42k32j8j80r1M11
4324F1p1K62m52K58j3j47k96K01p4K27M1k5k72k31N77M21o78rP7m0K07J72k9n29
4348c62K14K63n2j15k39M73j17J15k67J79Qk87M19j52k4j17J75m02L73Q1r4j80
4370a08J0L5K79j47J40k39M2k4j64K41k55K25j01Q7J31J43l01j3R0k8K42l67k09
$$ plain form
4393 -291 308 -88 234 54 -84 -315 -52 -60 -34 28 9 1 125 179 168 156 -188 -112 303 -11 -186 69 29 34 141
4418 141 -196 52 137 344 -36 -11 -100 -106 -90 -62 421 -135 82 85 116 -52 38 156 -12 -161 140 340 222 1
4442 1 106 71 -136 180 35 -237 -77 144 167 255 -63 99 32 171 261 -271 -66 74 -54 169 170 84 23 237
4466 237 -144 127 20 88 -229 106 -179 23 278 69 -154 -74 88 26 31 146 -135 74 151 343 155 78
4488 78 -18 -114 269 183 44 -156 37 131 150 99 -30 -132 18 153 5 35 -218 -275 127 90 215 213 107 27
4512 27 6 44 -16 -2 -27 243 250 2 -340 106 -173 30 293 209 127 -218 62 131 31 -144 251 40 -113 183
4536 183 88 39 74 -138 152 3 106 -268 -206 49 111 27 -186 45 -85 -111 34 -167 90 -30 -190 312
4558 312 -8 56 174 -71 -50 42 -66 -107 -171 -85 -197 -70 -366 33 -46 22 -162 -290 146 308 -209 348 131
$$ packed form
4393b91N99l96L22j80j38k31K63qK6O2j9qJ24N4j1j2l44P6M15l14j75K55m0NJ07
4418A41l37K48Q5K07l80K5q9oJ6K8M83n56K17LL1j68R0J18j68j49L01K00j18k21
4442AJ05l5k07L16j45k72J60K21K3Q8l18J62o7J39R0n32K05J40j28K23Jq6o1K14
4466B37l81K71j07O8l17L35k85K02K55k09k23Q0J62o2NJ15k81K09P7J92j88p7
4488G8r6r6L83q6j39k00J93R4J9n1j29j02J50J35j48L0k53n7M02l7J25kj06q0
4512B7k1L8o0J4k5K70Pk48l42M46k79K03K63q4q2l45K80O9j00j75L95k11j53K96
4536A83r5m9L5k12K90j49J03l74O2K55O2q4k13K31j30k6J45k01K57j20j60N02
4558C12l20O4J18k45K1R2j08m1o4Q6j12J27k96L99p9O8j84j28M36J62n17N57k17
$$ plain form
4581 131 151 321 -267 74 122 87 -178 -14 331 325 388 -331 237 226 131 10 -225 72 -424 166 93 280 -105
4604 -105 -64 22 225 53 54 87 -48 -47 35 47 -71 -76 95 124 -169 -37 -124 -104 46 -191 138 -146 427 -97 197
4629 197 86 -7 94 -60 39 248 60 -37 -92 134 136 99 -281 199 148 -41 193 -128 77 -33 66 39 212
4652 212 288 -81 -56 -141 98 270 -49 45 -290 277 -125 110 -102 -209 -290 94 146 353 -159 -132 20 88 -26
4675 -26 -75 -263 -225 150 -42 148 -437 -43 -197 271 205 191 -19 -147 -213 152 116 -26 -152 -215 12 -118 -164
4698 -164 22 -391 109 -87 -18 -169 -163 -77 64 -205 25 57 66 -202 198 -217 293 193 -93 -76 141 252 -68
4721 -68 -223 46 -57 100 -143 -96 133 -218 124 -200 231 -110 -25 -450 -68 -162 -21 58 -87 235 23 169
4743 169 -37 -219 453 71 146 -50 -318 -195 -86 -223 260 -45 214 65 231 308 22 -199 217 131 -42
$$ packed form
4581A31K0J70n88L41M8l5k65J64L45oO3p19N68j1r5j21k35K97m96N90p3J87l85
4604a05M1Q6K03j72JL3j35JQ2J2j18nJ71K9k93J32q7K0J50k37L29k84N73n24K94
4629A97j11r3J01j54R9K09j88r7n5K26Kl7l80M80n1j89K34l21K05j10R9k7J73
4652B12P6l69K5q5K39J72l19R4l35N67m02K35k12j07q1L84N2K07n12K7J52O8j14
4675b6m9j88L8L75j92J90n85L94j54M68o6j4k10j28o6L65l6j42j26o3K27j30m6
4698a64J86m13N00j96O9j51OQ6J41k69K30L2Rk68M00m15N10j00k86J7K17J11l20
4721f8j55K69j03J57k43M7K29l51L42l24M31l41Q5m25L82r4J41P9j45L22k12J46
4743A69k06j82O72l82P5j96k68J23J09j37M83l05K59j49J66P7k86k21M16q6j73
$$ plain form
4764 -42 70 68 171 56 168 166 -149 53 208 271 -106 -7 70 -19 -57 41 164 79 -78 63 -12 -7 188 270 -100
4789 -100 -149 46 10 51 -33 -145 -177 62 -70 -255 -214 190 181 -83 264 -5 154 275 -69 -390 -133 322 -31
4812 -31 -48 136 6 -138 -206 247 330 8 -268 -204 46 96 -385 -41 -207 -6 56 -49 37 -16 -146 -58 -110 198
4836 198 -30 -219 -20 32 130 -59 -204 266 -140 117 -101 10 99 -216 -183 131 -112 -12 -214 -87 -468
4857 -468 107 368 -264 124 37 -175 112 35 23 -78 -60 -194 -275 -88 -10 145 74 246 224 -72 -336 -159 150
4880 150 35 -16 -180 -281 -173 294 180 -210 -108 -15 144 249 201 160 -47 -197 108 107 -51 -320 -33 -12
4902 -12 -69 230 -9 108 -234 -153 116 -103 -166 -202 -160 -25 115 108 6 -139 -38 -34 85 -262 27 119 -132 162
4926 162 32 184 -20 -24 138 41 -63 -25 19 86 -7 244 187 -257 31 -130 -88 98 -157 -183 22 -112 -57 -364
$$ packed form
4764d2J12kJ03j15J12kl15K02J55O3l77R9P7q9l8R8J23q5j57J41p5NJ95Q2l70
4789a00m9J95l6M1q4j12l2K39j32j85M1M04rk64L47k69J59J21l44l21K57M55l53
4812c1j7J84j30j44o8M53Q3l22k76O4K50N0m81L44j66K01O2j05Q6n3j30Q8n2L08
4836A98k28j89J99N2R8j89j45M70m06K57k18J11Q9l15L3L14k43J00k02J27l81
4857d68N75K61o32L88q7k12K87p7j2j01J8j34q1J87P8J55p1J72k2k96k64J77L09
4880A50j15n1j64j01J08M67j14l90J02R3J59J05m8m1k07j50L05jj58k69K87K1
4902a2n7K99k39J17l42Q1K69k19o3l6M2J35J40pj02j45J01MJ19l47K89R2k51K94
4926A62j30J52k04mJ62r7j04L8M4O7r3K51n7m44K88j61M2J86k55k6K05j34N5l07
$$ plain form
4950 -364 320 -99 91 143 -199 -112 166 -76 -85 142 -97 38 136 400 -100 -101 158 -44 61 -14 -14 11 -167 133
4974 133 -43 59 424 -148 -96 -277 -18 65 8 -122 7 14 -22 -9 -425 149 -345 155 8 109 -105 -163 -141
4997 -141 60 226 1 -111 57 56 150 41 26 125 -283 -160 101 2 125 165 288 -241 -89 -117 275 -7 195
5020 195 -245 130 -231 18 66 -5 -127 -86 171 75 224 -415 -238 -173 -391 -170 149 -103 -88 67 -25 116
5042 116 156 -130 14 -120 129 -63 186 -155 -208 -81 470 -20 203 -52 -61 -61 182 -31 -35 -93 53 322 144
5065 144 -9 -260 45 -363 141 -101 -205 -157 38 -119 392 -222 -121 -76 -196 -155 252 63 128 315 -91
5086 -91 7 68 330 -146 -16 66 136 85 77 -346 83 -112 -97 -245 -49 219 148 -144 -191 -204 127 -117 -73 84
5110 84 -114 199 45 1 62 83 -217 146 -15 -152 -87 -71 175 414 234 -397 237 327 154 125 -55 450 210
$$ packed form
4950c64O84m19J90N2l42Q7K78k42rK27k39J35R8K64n00jK59k02J05p5%K5j78L00
4974A33j76J02L65n72N2j81K59Q3n7j30J29Pl6J3m16N74m94N00j47J01k14n8K2
4997a41K01J66k25j12J68jR4j09j5R9m08J23K61r9J23M0J23n29J52k8L92k82K02
5020A95m40L75l61K49M8p1j22M1K57r6J49o39J77O5k18K21L19k52J5J55r2J41
5042A16M0k86J44j34K49j92K49l41n3J27N51m90K23k55r%K43k13mn8J46K69j78
5065A44j53k51L05m08N04k42j04M8J95j57N11o14J01M5j20M1M07j89O5J87m06
5086i1R8O1K62m76J30Q2P0n1qm23M29j95J5j48J96K68p1k92m7j3L31k44M4J57
5110H4j98L13j54m4O1K1l00L63j61j37O5J6K46K39j80o31O34R0j73k9j80N05k40
$$ plain form
5133 210 27 -214 32 96 235 -119 -94 7 252 223 -67 44 66 -50 -55 -7 -9 129 -115 -254 -123 -106 138
5156 138 174 -135 32 -144 137 242 -164 33 -75 268 140 184 -44 -217 -33 56 193 165 -30 -125 63 -87
5178 -87 104 165 78 136 89 213 -236 -119 252 -84 -356 33 -21 -317 -19 60 -239 169 69 -175 -39 -48 31
5201 31 171 -7 211 180 -154 -61 25 296 -149 -63 230 -29 257 115 -2 130 -25 61 41 -121 76 134 359
5224 359 152 -231 -2 179 -3 80 331 -109 234 -31 -110 133 -199 -53 73 -145 -3 -200 85 112 -233
5245 -233 146 -167 100 -92 102 -168 47 -64 178 77 -72 -290 309 -39 -175 -158 -85 -45 -65 -52 50 -135
5267 -135 187 -166 34 32 96 -135 -214 -102 14 14 70 -373 -257 20 61 178 -294 19 -176 -160 42 367 -263
5290 -263 12 67 84 34 131 -246 108 127 -43 -55 164 208 -38 -150 96 215 -158 22 32 -122 34 252 -102
$$ packed form
5133B10j83k41K46O4J39l54K5J01K45k9k90J11K2j16nM8kJ38k44j39J31J7K44
5156A38L6l09J67j76K81J05m06J97j08L43j28M4k28j73J84Q9J37k8j95r5J88j50
5178h7J91O1q7N8m7J24m49J17L71l36k72L89n4k96K98P9k99M08j00k44J36rP9
5201C1J40j78K18l1l34R3Q6K71m45Q6K93k59K86j42j17J32j55Q6k0j62J97N8K25
5224C59k07l83K29J81j82Q3K51m40L43k65p9K43l32J46J26k18J42j97K85K7l45
5245b33L79l13K67j92J94k70K15j11K42j01j49k18N99l48j36J7P3M0k0J3J02j85
5267a35L22l53K00kO4k31p9J12J16%N6m43J16K77M1J17m72L13j95J6K02L25o30
5290b63K75N5J7n0R7l77L54J9j70j2K19M4k46j12K46J19l73J80J0j54J56K18l54
$$ plain form
5313 -102 122 31 -32 260 -144 -75 104 -61 75 -134 -261 -156 40 -62 223 -60 58 -5 10 204 -28 160
5335 160 -135 -195 122 286 43 -27 45 81 -75 -80 -14 108 -26 -95 -18 -116 -88 -349 332 -154 -61 -146 -150 -61 274
5360 274 -360 -25 -223 -74 -82 -208 -199 -91 204 269 312 105 200 -136 -273 -26 42 161 54 27 -56 145 68 -149
5384 -149 122 -39 -29 -111 15 227 -161 43 297 -25 220 -132 -144 -203 -220 -42 -111 -360 149 -6 201 34
5406 34 68 -92 -292 208 143 -201 -211 84 264 211 161 133 -101 -225 11 -153 -108 282 -2 -200 234 208 -107
5429 -107 -61 202 53 32 30 253 -63 -197 186 -97 -42 68 -67 177 108 -15 183 -92 -11 -213 -254 277 36
5452 36 55 -87 -366 -123 -506 -144 269 121 222 -121 301 181 -12 -121 30 3 -50 79 184 332 153
5473 153 -15 -269 -67 -42 -299 -172 -156 -61 255 -46 231 154 -228 -35 -205 -152 -10 -118 -139 214 -166 19
$$ packed form
5313a02K24r1o3K92m04O9J79j65J36k09j27J05J96j02K85k83J18o3J5J94k32J88
5335A60k95o0L17J64k43p0P2L6j56nO6J22j34o9P7r8K8k61O81m86R3q5mQ9L35
5360B74o34L35j98J49qj26RJ08K95O5M3k07R5l36j37K47O8J19j07k7q3K01p7k17
5384a49K71j61J0q2J26K12l88K04K54l22K45l52j2n9j7J78o9k49N09j55K07j67
5406C4L4j60k00N00o5l44j0K95J80n3n0k8k34j24K36j64M5L90k84j98M34k6l15
5429a07M6K63j49k1kK23l16j34L83k83N5J10j35K44o9j23J98k75Q1k02m1N31k41
5452C6J9j42k79K43l83L62M13j48J01l43M22j20j93j09J51k7n3J29J05J48j79
5473A53j68k54K02K5k57J27J6R5L16l01K77p7l82J93j70N3J42j08k1L53l80J85
$$ plain form
5495 19 72 -216 -62 81 74 -10 -299 -7 147 228 -152 270 -15 -142 247 -133 37 20 -17 -274 -273 -50 -68 -210
5519 -210 -55 139 81 244 260 -396 115 -155 228 148 107 168 320 295 -173 -352 -145 35 -15 46 218 -84 -170
5542 -170 128 -110 187 140 -10 -141 0 99 149 -142 164 -94 -30 -120 -185 266 -60 -177 116 -218 34 201
5564 201 215 110 137 -54 10 -133 -212 -304 -14 -95 164 -109 5 87 106 -300 1 -159 -290 -80 -249 -150 64
5587 64 -50 -47 -78 108 38 181 210 238 80 -176 19 -97 0 -79 116 22 78 197 44 -43 36 -236 120 -68
5611 -68 -104 -117 -106 277 -145 89 -105 -38 8 -85 273 67 -395 116 56 175 136 -16 14 -83 128 -146 -34 -62
5635 -62 48 51 5 240 128 141 122 -78 282 -99 164 -318 288 31 20 58 55 160 -208 -278 -104 -3 -89 -41
5659 -41 -138 138 128 -9 207 -97 -1 -55 22 -150 -201 -34 47 -43 -134 50 -64 198 223 135 122 -72 -78 -157 -28
$$ packed form
5495A9N3k88J54J43pq4k89K92J54Q1l80M22k85j27L89l80J70j7l7k57JK23j8j42
5519b10J55J94n8J63J6o56N11k70L83q0m1O1J52k5m68j79K07J80n0O1J72l02q6
5542a70K98k38K97m7j50j31J41R9N0k91L06k58O4r0o5M51l26j17K93l34K52J67
5564B01J4j05K7j91O4j43p9r2K90q1K59k73J14Q2J9m06L01j60j31K10j69R9K14
5587F4j14Ll1J86p0J43K9K8j58k56J95j16R7p9J95r4N6J19j53q7P9k72L56j88
5611f8l6j3J1L83m22K34j94O7M6r3L58k06m62N11o0J19l9j52L0r7K11k74J12k8
5635f2J10Lm6K35j12J3j9k00L60l81K63m82O06k57j1L8lJ05l68p0J74J01q6M8
5659d1r7K76j0j37K16l04R6n4P7j72n1J67Q1r0r1J84j14K62K5q8j3j94op9J29
$$ plain form
5684 -28 40 42 167 193 33 -312 379 -74 134 162 92 -102 -110 52 -189 -396 20 317 21 -187 20 16 203 -125
5708 -125 -194 -100 -103 -165 349 96 -83 81 -374 27 -215 73 179 44 32 -69 3 -191 -34 -17 118 112 32 -49
5732 -49 -11 -77 48 -117 47 -174 -100 -367 166 298 -161 87 -78 34 -55 -373 -358 76 -89 8 -50 173 -52
5755 -52 282 -153 19 -83 -115 -136 -332 358 -93 139 -218 -138 -4 67 -44 -4 -93 -233 19 -108 -8 153
5777 153 -36 -352 -75 -91 -133 138 265 -104 -95 -38 166 243 -62 165 -1 -56 28 75 -191 61 58 138 -25 48
5801 48 -308 -148 -23 211 -26 25 55 -153 124 357 -128 -442 -132 148 86 -74 -36 171 158 -48 -223 27
5823 27 104 194 -33 31 362 15 201 -75 391 -118 118 -87 -46 1 125 168 -70 146 73 -8 67 -59 -265
5846 -265 454 219 94 198 -35 -101 116 -74 204 166 -2 -213 -102 236 45 -129 -274 21 -290 -237 -255
$$ packed form
5684b8O8KJ25K6j60l45O91m53K08K8p0j94qJ62k41k07M16K97k96k08K07mJ87l28
5708a25o9R4lo2N14k53j79J64m55M01k42K88J06j35j2j01P2j94J57J7J35oq0q1
5732d9L8o6J25j65J64k21P4k67N33J32m59K48j65J12q9l18J5M34j65R7n8K23k25
5755e2L34m35J72j02l2k1j96O90m51K32l57Q0J34P1j11M0q9j40K52j27J00J61
5777A53j89l16K77j6m2K71J27l69RN7K04P7l05K27j66n5Q4M7k66K52lQ0j63P3
5801D8l56J60J25K34k37N1L0k08K77K33m85l14L10K80o2j60L8K07j3k06j75K50
5823B7P7R0k27O4L31l47J86k76M66n09K36k05M1M7J24M3k38K16p3q1P5j26k06
5846b65P19k35j25J04k33o6K17j90K78l8j68k11J11L38j91j74j45K95l11N3j8
$$ plain form
5867 -255 -153 108 -22 122 -12 -71 -291 -13 -130 -492 250 282 11 181 -162 -29 193 -24 52 -66 -96
5888 -96 174 -191 -338 -18 -94 9 -53 238 -125 -79 105 87 8 -192 35 89 -324 -6 99 -100 -51 17 10 -211
5912 -211 12 -96 111 210 -165 -292 -22 36 181 -62 -305 87 -83 -108 -345 145 102 -18 -91 -77 -71 436 -52
5935 -52 52 -157 -113 -270 -270 -131 -80 -74 124 -93 -213 39 170 -33 66 -272 259 39 -151 102 114 201 101
5958 101 26 -164 -180 -28 76 102 42 -159 111 -194 37 -14 144 -78 34 -280 -352 -59 201 31 -138 96
5980 96 168 -203 -9 -141 -35 81 -16 -105 -110 -275 -329 208 37 66 -58 228 -3 -92 -97 184 65 -25 -34 6 -42
6005 -42 49 178 135 48 -80 -206 -157 -150 278 29 191 168 324 -168 162 325 -26 -128 -66 -80 -317 -411 114 -38
6029 -38 325 93 -95 275 165 269 -164 -198 -289 -111 -251 135 88 170 -416 -4 65 -53 124 -306 176 -104
$$ packed form
5867b55J02K61j30J44j34n9k20K78j17l62P42L2k71J70l43J33K22k17P6j18l0
5888i6K70l65j47L20p6J03o2K91l63M6J84j8p9k00K27N4m13L18J05j99M9O8pk21
5912b11K23j08K07R9l75j27K70N8J45k43k43L92j70k5k37M90m3j20p3J4ON07m88
5935e2J04k09M4j57%J39N1OJ98k17j20K52J31k03R9l38N31k20j90K53J2Q7j00
5958A01p5j90j6J52J04K6o0k01K70l05K31n1J58k22J12l14p2K93K60j70j69K34
5980I6P2l71J94j32J06J16r7q9nj65n4N37j71K9j24K86k31q9nK81j19r0rM0m8
6005d2R1J29m3q7j28j26M9PM28k49J62k3J56m92L30J63l51j02O2j4k37r4N25j52
6029c8L63k32j88L70j10J04m33l4r1J78j40L86m7Q2n86M12O9j18J77m30M82k80
$$ plain form
6051 -104 -388 -114 12 21 25 356 137 10 26 -97 -296 -217 293 230 190 -55 -84 26 128 -6 288 -51 11
6074 11 51 160 23 32 25 164 4 136 -149 -103 -46 -373 -274 -369 -90 96 -62 158 -42 -68 46 234 -26 162
6098 162 -158 150 -85 -87 53 383 278 310 88 -39 -22 -138 142 -120 220 -20 -4 147 94 -149 -31 -106
6120 -106 -56 -267 -195 55 300 -140 -206 -153 -214 -220 -343 42 269 -211 0 40 188 94 -33 303 252 -100 -139 -302
6144 -302 28 -144 138 -192 134 25 -344 206 -54 167 -35 101 -3 191 -217 -114 187 -98 200 97
6164 97 -235 -119 -7 183 363 -96 158 139 -54 40 -289 -136 -230 -391 -205 -33 196 356 16 -185 -57
6185 -57 -55 188 -22 64 -3 -10 -149 -43 -176 170 281 -16 -169 -133 5 32 -216 256 -291 -101 -32 -92 -176 15
6209 15 132 -66 -17 82 -332 33 -73 -315 -213 -316 36 -57 -43 118 192 155 -195 -22 -47 -185 -128 191 -224
$$ packed form
6051a04k84K74J26RML31k19j27J6j23j99P9N10o3m0k45k9J10J02j34K94l39O2
6074A1M0J09j37RpJ39j60J32k85M6N7l27R9r5K79J86j58K20k00k6J14J88k60J88
6098A62l20L08k35kJ40L30j05L2k22j27J7j16K80k62L40k40J6J51n3k43J18p5
6120a06N0k11P2K50K45m40o6N3o1oj23L85K27m80K11M0J48r4j27L36n1l52l9j63
6144c02L30j72K82l30L26j09l69N50k60K21k02J36j04J94m08J03L01k85K98j03
6164I7l32J16J12J90J80m59K54j9j93R4l29J53r4j61J86J72K29J60l40k01J28
6185e7KK43k10Q6o7pj39J06j33L46J11k97j53L6J38K7k48M72n47J90O9o0q4J91
6209A5J17j98M9R9m14L65j06k42J02j03L52r3J4J61P4l7l50J73k5j38N7L19m15
$$ plain form
6232 -224 44 339 -94 -168 89 -29 -20 -36 -289 35 166 103 -128 359 -39 -198 -109 -13 -60 13 -189 -144 -62 55
6256 55 169 60 228 -62 -99 -100 94 -46 -88 -75 -163 88 33 8 388 91 -98 -29 333 -30 259 113 160 98
6280 98 -214 103 -115 -345 151 266 -208 71 -60 -78 -78 84 -7 30 -319 10 27 -88 151 275 51 -84
6302 -84 43 -10 289 98 279 293 180 41 -31 32 277 177 210 -47 -101 119 181 94 -41 -104 -339 -208 237
6325 237 -158 17 268 -79 18 420 23 45 -31 11 242 26 -39 84 -286 19 -121 -25 -264 287 -73 172
6347 172 225 -140 31 136 -37 -68 -281 20 123 -89 -311 38 144 -204 -3 62 -193 8 159 113 200 -129
6369 -129 -252 77 65 234 95 73 95 -176 215 109 306 -121 -148 58 -87 -162 -186 -73 145 -123 7 121
6391 121 159 261 154 201 -91 -4 317 -147 77 -297 -52 5 -117 139 -203 -243 197 30 155 -117 -196 3
$$ packed form
6232b24K68K95m33p4K57j18Rj6k53L24J31o3k31M87l98j59Q9R6m7P3k02M5Q2J17
6256E5J14j09J68k90l7jJ94j40m2J3q8K51n5k5L80k97j89O9L62l63K89j46M7o2
6280I8l12L17k18k30M96J15m74K79j31j8%J62r1L7l49L29J7j15K39J24k24j35
6302h4J27n3K99j91J81J4j13j39p2O3K45j00L3k57n4K20O2q7j35o3k35J31M45
6325B37l95J75K51l47R7M02l97K2p6M2K31k16o5J23l70L05j40R6k39N51l60K45
6347A72N3l65J71J05j73l1k13L01J03k12k22L49J06l48K01O5k55K01J51m6Q7l29
6369a29j23L29j2J69j39k2K2k71L91j06J97m27k7K06j45p5k4J13K18k68J30J14
6391A21L8J02j07M7k92Q7L21m64K24l74K45N7j22K56l42m0M40j67J25k72p9J99
$$ plain form
6413 3 24 30 2 241 23 89 -33 80 -170 -163 60 88 -60 117 312 19 -166 187 33 -215 139 -89 91
6436 91 189 -81 14 -62 58 -39 269 253 43 121 -79 -28 -25 39 -46 449 -204 -199 1 -166 -38 -62 131 -169 -48
6461 -48 78 208 40 29 43 -50 -30 249 290 161 192 -284 -11 -50 89 -241 184 -193 -256 -140 99 -194 65
6484 65 -117 150 -128 93 -43 -97 -102 -104 131 -61 -27 -127 -282 -78 -164 -119 45 -2 217 49 1 12 170 105
6508 105 -171 -122 64 -87 100 -317 61 -59 -120 -126 178 -49 -268 139 -238 -254 -260 -214 156 -133 -188 55 -93
6531 -93 -52 -141 -32 127 15 -248 131 -201 35 143 -47 266 102 235 -203 -4 349 108 -116 128 -138
6552 -138 71 146 -145 59 124 25 8 61 -31 44 0 250 -200 92 39 -93 86 -252 -230 -27 170 -86 -28 26
6576 26 300 135 59 -358 20 -217 107 90 -243 -44 103 53 -156 84 -136 186 -247 48 -279 79 50 -320
$$ packed form
6413CK1Ok8K39k18O6j22J13k50PK23K8j48J77J95k93j85L53j54k48L54k28J80
6436I1R8k70R5p6J20r7L08j6k10P8k00N1LO4q5M95o53NK00j67J28k4J93l00J21
6461d8J26J30j68j1J4r3K0K79M1j29L1m76K73l9J39l30M25l77o3J16K39k93K59
6484F5j82K67k78K21j36n4nkK35j92L4j00j55K04q6M5J64m7K19j68m8J1J58o5
6508A05k76M9J86j51J87m17L78j20o1oL04k27k19M07l77j6oM6L70k89n5K43j48
6531i3M1q9J09J59j12k63L79l32K36J08j90L13j64J33m38J99L53k41k24K44k66
6552a38K09P5k91K04O5r9j7N3r2P5m4K50m50K92n3j32J79l38K2K03J97k56N8N4
6576B6K74j65p6m17L78k37L24j7l33J99J47n0k09K40k20L22m33K95l27L58k9l70
$$ plain form
6598 -320 18 143 -132 27 -19 -256 -69 69 -77 4 -78 58 85 -73 101 22 50 94 49 -472 -132 -62 283
6621 283 -114 161 96 -221 62 164 -68 -324 -230 -107 266 90 -183 -75 -25 270 -183 -54 65 -7 -158
6642 -158 168 -45 -53 80 -30 -168 -4 8 -163 214 -98 209 -151 75 167 27 -202 -41 125 -93 -239
6663 -239 -110 220 282 80 55 -2 81 -11 -58 -25 -59 150 63 -31 -155 -146 102 171 -191 122 -301 -189 -211 180 -174
6688 -174 313 200 -52 -17 76 -42 166 -21 -22 172 28 68 -97 -125 48 -73 -271 76 141 176 -10 -174 24
6711 24 184 -280 -331 -14 186 -220 -34 27 -334 -68 416 10 -340 -111 78 -307 79 -131 -187 116 10
6732 10 -55 -12 -5 343 -59 79 1 309 -4 75 157 -5 3 -192 -128 5 -126 -227 -45 -3 -45 -158 77 -111
6756 -111 18 47 -196 156 -13 7 290 313 158 -84 -223 -140 -191 -24 45 200 -175 35 -78 112 117 1 -102
$$ packed form
6598c20L38J25k75J59m6k37J87J38j46Q1q2J36K7j58J74p9K8M4m5n21L40P0L45
6621B83l97K75o5l17K83J02k32k56R4J23L73j76k73J08N0K95m53J29J19p2j51
6642a58L26k13qJ33j10j38J64J2j71L77l12L07l60K26R2j40k29J61J66k18j46
6663b39J29L30O2k02k5n7Q3r2m7L3l4K09q7r4j24RK48O9l62L13m23J12k2L91l54
6688a74M87j13k52L5R3j18K08j87jJ94j44M0j65k8J73j21j98L47O5L5j86j64J98
6711B4J60m64n1L17K00m06J86O1l61K66M84m06l50K29J89l85L86k10n6L03j06
6732A0o5M3PL48m02J38p8L08l13P9Q2j62Qj95O4J33j31j01J82M2m2j13K35j88
6756a11J29K9k43L52j69K0K83K3j55k42j39Q3n1J67O9J55l75K10j13J90Nj16j03
$$ plain form
6779 -102 -62 326 163 -91 21 -221 108 122 174 -220 -266 -272 -81 -37 -45 127 170 97 32 58 -149 135 139 0 -234
6804 -234 -101 -33 253 -156 -133 31 -71 53 129 2 -20 191 -195 -188 -20 -127 -253 -253 172 -279 -64 213 -320
6827 -320 -48 47 168 -51 15 -252 69 164 -214 26 50 204 -160 -79 111 26 43 -128 10 -47 -160 107 -92
6850 -92 -19 -274 87 -104 8 47 143 -222 -135 200 -107 344 42 58 -24 68 61 192 -11 -187 -86 -215 -307 -177
6874 -177 45 137 63 255 -75 -49 90 -194 59 17 95 -124 388 -27 -57 58 123 -165 45 119 40 124 -170
6897 -170 -218 21 563 -171 -119 -61 91 117 -100 -221 -24 58 163 8 -59 111 -93 -34 -1 68 227 42 32
6920 32 -162 49 -149 -198 70 52 64 -111 57 -73 203 -8 -9 -1 186 65 188 22 77 92 -177 70 90 140
6944 140 -7 -269 -129 -28 174 -31 -19 43 73 93 252 -36 10 93 -58 69 -48 378 183 -111 99 -43
$$ packed form
6779a02M0L88j63k54J12k42L29J4N2l94m6oJ91M4qJ72M3p3o5K6k07K84Mj39k34
6804b34J33O8K86m09K3J64j02J24P6j27k2K11l86PJ68j07j26%M25m51K15K77n33
6827c20K72R5J21k19O6k67L21R5l78K40K4J54l64Q1J90q5J7j71J38n7j13K67j99
6850i2P3k55L61j91J12L9R6l65Q7L35l07M51l02J6q2R2pJ31k03j76J01j29r2J30
6874a77K22R2p4J92l30K6J39k84K53m2P8k19N12m15l0J15O5k88K10P4p9Q4k94
6897a70m8K39N42p34N2N8J52K6k17j21J97Q2J05j55o7J70k04N9L3O9J59j85j0
6920C2j94K11j98m9K68j8J2j75J68j30K76k11jQJ87j21J23j66N5J5k69K47K0N0
6944A40j47k62J40J01K02k05J2O2L0K0J59k88M6Q3j51J27j17M26j95k94K10j42
$$ plain form
6966 -43 -73 -229 27 363 198 96 21 45 54 222 -10 -259 -241 12 -133 267 -59 -124 16 -115 -124 -12 -18 123
6990 123 -8 178 -262 -163 286 -68 70 -134 110 0 -33 -69 -56 -120 -59 36 -53 -67 -41 -263 130 -25 -267
7013 -267 159 -180 69 220 -108 -38 -375 -159 -196 67 -59 -111 71 -277 220 105 145 -199 307 -243 -384
7034 -384 174 -129 -367 -95 189 61 113 16 55 6 -23 -72 72 -220 -132 36 94 54 -100 -90 132 -212 -12
7057 -12 86 -74 242 -126 166 161 -11 212 -139 -246 102 137 78 128 20 -46 -29 236 -45 66 176 34 96
7080 96 -20 136 -191 -119 181 -207 -107 -164 261 -270 115 -130 -13 198 307 -73 31 93 -117 -151 9 210
7102 210 125 -121 110 -74 192 -129 -89 -121 -115 -95 101 200 -295 -4 -112 -153 -315 49 -17 21 53 -33 135 -199
7126 -199 66 203 -115 -148 164 302 440 -104 65 -75 -452 274 -58 -36 -32 83 -164 -87 -314 184 11 0
$$ packed form
6966d3l0j56K56L36j65j02p5K4RJ68k32k49J8K53j45M00l26o5J40j31rJ12oJ41
6990A23j31J86m40R9M49l54J38k04K44j10l3l6J3o4O1R5q9j4K6k22L93j55k42
7013b67M26l39K49J51l28P0l37K16l7K63j26n2J82l48M97j15M0l44N06n50j41
7034c84N58l03k38K72K84j28N2r7L9m9k9m9J44k92Q8J68N8m0j54J0K22l44K00
7057a2R8j60L16l68K92nj72K23l51j07L48L5n9N0j08o6J7K65k81J11J10j42O2
7080I6j16J56l27P2L00l88J00n7M25n31L85k45J17K11J09l80J04O2k10l4J60K01
7102B10q5k46K31j84K66l21M0l2OK0J96R9m95K91j08m1j62L64o6L8L2q6J68l34
7126a99K65J37l18l3L12J38J38n44J69j40l77P26l32K2MJ15k47P7k27M98j73j1
$$ plain form
7148 0 168 73 166 -119 240 181 117 -287 -29 462 -8 -130 39 127 -38 30 -47 67 -105 -44 87 -37 -254
7171 -254 182 -121 -15 42 -73 125 -288 -117 -68 -86 -162 116 37 1 -243 157 -290 -85 -210 2 98 13 -37
7194 -37 58 -72 -202 102 10 -179 -327 92 -78 -109 280 -21 -14 -127 -39 -151 -41 165 -137 109 20 130 18
7217 18 -80 373 -65 -203 237 8 -28 126 150 158 141 -141 -32 -203 89 -55 -92 144 91 317 60 64 -163 101
7241 101 -120 -128 107 -71 23 -192 -135 108 63 309 355 -15 -102 -244 64 82 55 291 209 -43 -221 44 -98
7264 -98 -76 176 -31 -217 -305 -245 -174 -297 206 108 62 -121 -7 -197 56 239 -31 -86 -23 218 -313 -170 -275
7287 -275 55 103 100 -45 -154 125 186 36 4 150 155 76 233 164 252 23 -109 68 359 -189 -57 33 147 222
7311 222 26 75 157 -139 -192 -24 13 45 -14 340 -72 -184 21 52 16 -291 -40 -63 -118 3 -327 113 -202
$$ packed form
7148@J68r5R3k85L59n9o4m04K58M91m70j22J69Q8j65O8p7J14j72O1J31j24k17
7171b54M36l03J06N7j15J98m13J71M9j8p6K78p9l6k44M00m47K05j25K12R6q5n0
7194c7R5j30j30L04r2j89j48M19j70l1L89l01Pj13Q8j12J10K06l02K46q9J10j12
7217A8r8M53m38j38M40k29l6J54K4Qj7k82J09j71K92j44l7K36n3K26k57Mk27K64
7241A01k21qK35j78R4k15N7K43m5K46M6l70q7j42L08J8k7K36q2k52j78K65j42
7264i8K2K52k07j86q8O0P1j23N03r8m6j83J14j90K53J83k70n5O3K41n31J43j05
7287b75L30M8lj45j09K79O1j50l2J46Np9J57o9Q8k29j32J77K91n48J32R0J14P5
7311B22j96M9Q2k96n3J68L7L2n9L54m12j12K05L1l6l07K51k3n5J21l30M40l15
$$ plain form
7334 -202 42 82 -42 89 168 263 142 -55 -63 251 -144 38 -245 -25 -168 276 -2 -72 175 -277 453 54
7356 54 -33 -132 -133 267 105 100 -166 -80 -247 42 -119 28 28 25 -18 -10 -2 13 -174 -91 44 -94 143 61 209 47 155
7383 155 -97 -4 -80 -130 -11 179 108 -195 89 -101 -132 82 210 297 231 -148 154 40 -93 141 -8 24 -159
7406 -159 -81 195 142 5 -170 -3 23 -147 -360 -36 17 44 -268 -80 62 30 184 81 38 -93 108 87 -135
7429 -135 143 -219 388 104 266 -207 -253 322 -167 36 104 417 39 106 10 100 203 -209 -224 7 192 -8
7451 -8 -43 12 -45 66 -142 61 115 -56 262 -21 -83 58 224 100 45 96 2 166 -58 -28 263 133 124 64 239
7476 239 227 149 52 -42 -22 345 104 165 85 -153 81 19 333 271 -164 115 258 -83 -142 -42 62 46 -266 -19
7500 -19 103 -175 -70 128 -31 -83 -221 -340 -189 123 -112 -124 -74 -251 -68 110 64 108 -121 -166 -27 168
$$ packed form
7334b02K44M0j24J31P9R5j21j97qL14l95J82k83K20j43M44k78p0K47m52P30l99
7356E4q7r9jM00j62nk66Q6j67K89j61J47%lm3QQJ5j87Q3J35j38K37q2J48j62J08
7383A55k52R3p6n0J19J90p1l03K84j90l1K14J28Q7o6l79L02j14j33K34j49L2j83
7406a59P8K76n3j37j75J67K6j70k13L24N3K7l12J88J42l2J54j03m3j31K01k1k22
7429a35K78l62O07k84J62m73m6N75m89K03O8L13l78O7r6R0J03m12j5K31J85k00
7451hl5N5n7J11k08K03N4j71L18k83o2J41J66j24n5N1r4J64k24L0K91j30ro0J75
7476B39j2p8r7r4K0L67k41O1q0k38K34o2L14o2m35K79J43l41n9J00J04j6l12K47
7500a9J22k78J05J98j59n2j38j19J51L12k35j2N0j77J83J78m6M4k29m5J39J95
$$ plain form
7522 168 153 -466 -27 -51 -174 -201 -26 242 247 -263 -3 156 -104 285 -226 -294 26 -51 228 -68 -243 -181 -37
7545 -37 334 -104 66 28 9 116 -104 -98 -84 -42 -118 -25 -79 -94 9 321 -70 -237 -116 108 264 124 -222 -272
7569 -272 -105 -57 -31 168 -204 -106 -163 -205 -234 -84 -149 -71 -206 45 97 93 -40 -103 -81 -211 -152 -332 -244 -87 -146
7594 -146 -92 92 222 4 141 86 184 -44 -206 39 2 86 -18 31 33 -253 -166 -277 -59 243 -115 100 -55
7617 -55 -87 11 212 214 242 82 53 9 233 -164 -111 -308 -552 -29 -162 -47 -58 -265 -26 232 -49 97 136 27
7641 27 -40 5 65 195 355 -131 67 108 -42 -227 -120 155 200 -41 -21 111 -45 -257 -90 -386 139 -185
7663 -185 -284 -244 43 246 -171 191 7 -163 -73 31 -114 -46 84 110 83 35 10 76 -184 -181 74 -205 -21 -185
7687 -185 113 -15 90 328 -89 -20 -133 -57 -92 249 215 43 -246 -21 172 -8 178 209 -269 -74 -34 154
$$ packed form
7522A68j5o19M39k4j23k7J75K68Nn10K60J59k60L89n11o8L20p7K79k96j75O2J44
7545c7L71m38J70l8j9J07k20OJ4M2p6R3n4j5J03L12l91j67J21K24J56j40l46n0
7569b72J67M8K6J99l72R8n7m2k9J50o5P8j35K51N2mj33o3K2j30N9j80Q8J57n9
7594a46N4J84J30k18J37n5R8k28j62K45l7Q4j04M9Kk86Q7j11K18L02l58K15j55
7617e5l2R8K01KK8j60k9m4K24l97N3j97k44N23j33J15j1k07K39K58k81J46L9j09
7641B7o7M5O0J30J60m86J98M1j50j85J07K75M5k41K0J32j56k12J67k96N25l24
7663a85r9M0K87K03m17L62j84j70R0J04j45O8J30K6k7m8k5O6k60LK55k79J84j64
7687a85K98j28J05K38m17O9j13P6l5L41l4j72k89K25J93j80J86L1m78J95M0J88
$$ plain form
7709 154 184 294 -263 -191 -54 -149 -105 172 -50 115 -147 207 106 -151 -13 -54 -193 45 104 -87 10 -10 172
7732 172 -177 -153 -35 -40 -116 282 84 13 -159 -103 -213 217 -169 -78 -84 186 2 -149 57 -92 502 -134 246
7755 246 159 296 62 -20 55 88 159 -90 -82 -3 -168 -72 164 180 -141 -240 -45 9 -20 -269 36 25 107 308 -107
7780 -107 152 -38 88 235 -87 -103 -116 -156 51 264 70 -98 217 158 63 -72 -125 -269 -51 -110 77 -181
7802 -181 -132 -380 30 131 -25 274 -190 -155 94 -236 -241 169 -188 100 -155 -124 115 -120 -276 197 18 -246
7824 -246 50 -54 -3 40 -112 -1 56 -179 70 83 226 -20 -5 -101 18 -38 26 -12 251 73 47 146 133 -42
7848 -42 -64 144 -163 -11 58 -211 16 -59 -311 171 -313 -61 -59 -43 49 14 -183 141 -106 -78 309 -38 -72 -191
7872 -191 -38 323 -111 227 -261 230 -81 138 -76 78 -51 8 178 263 -79 257 -134 -74 -135 -84 58 -229
$$ packed form
7709A54L0J10n57P2J37r5M4K77k22J65k62L54j01k57J38m1j39K38N9j91R7k0J82
7732A72l49K4J18np6L98j98p1j72N6j10M30l86R1oK70j84j51K06j49N94o36L80
7755B46q7J37k34q2P5L3P1k49QP9j65R6K36J6l21r9J95N4k9k49L05j1Q2K01m15
7780a07K59j90J26J47l22j6j3m0K07K13j94j68L15n9r5j35n3j44K18n9J87k58
7802a81M9k48M10J01j56K99m64L5K49l30nM10l57K88k55L1K39k35j56M73j79k64
7824b46K96j04N1M3j52J11N7k35K49J3J43k46J5r6J19n6O4l8K63j78k6R9j3j75
7848d2k2K08l07J52O9k69K27p5k52M82m84K52KJ6R2l5j97L24k47K8L87l47l4j19
7872a91J53L61m34L38m88M91l11K19k14J54j29N9J70Q5l42L36l91O0o1N1J42k87
$$ plain form
7894 -229 -30 172 -180 -235 233 309 -128 -277 347 -188 217 -58 -88 -84 -4 -132 -104 35 -195 -97 160 40 0
7917 0 18 240 66 -26 212 -28 137 18 250 78 63 -15 -123 331 68 39 46 -250 155 -63 -63 91 153 83
7941 83 -120 40 418 4 -163 -75 -111 86 149 -160 170 76 16 -154 -455 -226 -36 13 -168 272 148 -45
7963 -45 -7 128 310 -19 -17 -61 180 -184 378 -109 297 -17 -38 8 -14 121 112 148 263 13 32 93 -234 -284 74
7988 74 18 -166 143 17 -165 -119 45 266 -106 210 -150 78 -83 125 -55 -48 -149 -121 -68 183 83 163 301
8011 301 168 37 215 163 -135 191 90 37 198 32 -48 271 -93 115 -234 -19 -5 170 180 -143 53 65
8033 65 19 178 61 -53 -79 115 57 198 -405 91 -61 -97 -15 60 235 126 400 30 -255 368 -16 74 126
8056 126 187 70 2 42 -50 -94 166 -197 136 319 -41 -147 65 68 35 200 -2 380 -170 248 31 -78 -82
$$ packed form
7894b29J99K02l52n5M68P6m37j49O24n35M05k75l0MQ0j28K8J39k30R8K57j20m0
7917@J8K22j74r2K38k40J65j19K32j72j5p8j08M54k63k9Pk96M05k18%J54O2p0
7941H3k03J60L78m14j67Q8l6J97O3l09L30r4o0j70l01K29J90M9j81M40j24j93
7963d5L8J35J82l29Km4K41l64N62m87M06l14k1M6k2J35rL6J15k50J9O1l27n0L58
7988G4n6j84L09j26j82M6J64K21l72L16l60K28j61K08j80Pj01K8N3K51j00Q0J38
8011C01j33j31J78n2k98L26j01n3J61j66q0L19l64K08l49K15J4J75J0l23J96J2
8033F5m6J59j17j14k6J94n8J41o03M96j52l6Q2P5J75j09K74l70k85O23l84R0N2
8056A26O1j17o8M0r2m4K60l63L33J83l60j06K12Ll3J65k02L82n50M18k17j09m
$$ plain form
8079 -82 67 261 -146 -169 340 234 134 -137 75 76 -12 -181 146 -65 27 -108 85 226 96 108 -116 290
8101 290 146 -135 110 79 -147 184 -6 -86 73 -193 8 -75 -134 112 82 -89 94 119 196 -2 -165 -234 48
8124 48 278 68 15 -239 -279 114 7 -273 37 -194 -112 21 118 58 -1 -210 203 -34 -106 -85 164 -76 203
8147 203 281 16 245 -117 -285 211 -13 186 63 -79 -147 144 -30 -130 27 121 -91 -149 86 -277 -87
8168 -87 -98 41 -63 -113 -172 419 96 -32 -151 -371 -55 -98 110 -46 285 -283 -69 -118 -153 96 -17 55 264
$$ packed form
8079h2J49J94m07k3N09j06j00k71K12Jq8j69L27k11R2j35J93J41j30J2k24M06
8101B90j44k81K45l1k26L31j90q0J59k66K01q3n9K46l0j71J83K5P7j98j63o9K82
8124D8K30k10n3k54m0L93j07k80L10k31Q2J33R7o0n9k09M13k37p2K1K49k40K79
8147B03P8k65K29l62j68M96k24J99j23j42o8K91j74j00J57R4k12n8K35l63J90
8168h7j1J39j04n0n9N91l23j28j19k20L16m3K08j56L31n68K14m9l5K49j13P2K09
8191B64
$$ Imaginary data points
##PAGE= N=2
##DATA TABLE= (X++(I..I)), XYDATA
$$ plain form
0 0 0 0 0 0 0 0 0 -4 8 -8 8 -8 16 -16 16 -24 26 -32 40 -47 54 -62 71 -82 96 -108 123 -141 159 -179 203
31 203 -227 255 -286 318 -354 394 -437 485 -537 595 -658 731 -810 897 -993 1104 -1231 1376
49 1376 -1544 1744 -1986 2280 -2654 3144 -3821 4815 -6430 9500 -17478 84034 164973 6100
63 6100 -60111 -35319 49657 88445 80015 13461 -28012 -6280 54107 67723 38688 1198 -9519
76 -9519 -4385 15084 35268 49348 37366 4642 -24906 -16816 17521 45820 36893 -81 -28160
89 -28160 -8466 32972 41364 5823 -24765 -18970 8630 22678 12342 -1563 2368 8935 -4878
102 -4878 -24077 -14314 21602 40035 7726 -42897 -45277 13389 60038 34035 -30032 -59328 -28876
115 -28876 33841 68335 27513 -47453 -61242 -84 51318 41243 -1156 -33886 -37525 -5609
$$ packed form
0@%%%%%%%mJ2j6J6j6K4l2L2m0N0n8P2q7J01j16J33j53J78k04K31k64L00l38L82
31B03m30M82n41O04o72P48q31R22j022J132j253J389j541J707j890K097k335K607
49A376k920L288l730M266m934N798o965Q636j1245J5930k6978J01512Q0939j58873
63F100o6211K4792Q4976L8788q430o6554m1473K1732O0387J3616k9035l7490j0717
76i519N134J9469K0184J4080j1982l2724k9548Q090L4337K8299q927l6974k8079
89b8160J9694M1438Q392l5541l0588N795K7600J4048j0336j3905L931O567j3813
102d878j9199R763L5916J8433l2309n0623k380N8666M6649k6003o4067k9296L0452
115b8876O2717L4494m0822p4966j3789O1158N1402j0075m2399l2730l639L1916
$$ plain form
127 -5609 34974 38700 5873 -23132 -29685 -19491 2214 25922 28029 -2157 -37841 -37359 5254
140 5254 41477 23569 -27776 -51778 -24259 23273 41498 12445 -29960 -36845 -8786 10127
152 10127 2965 -6341 -1900 5760 584 -16775 -22750 -4104 17174 8519 -22627 -34932 -9164
165 -9164 28151 32188 -8093 -51585 -44675 4182 37869 25074 -15164 -41059 -25356 13786 27243
178 27243 -705 -27574 -22112 -2536 10145 15852 11468 -7018 -24387 -23638 -5278 19843 30237
191 30237 9052 -26736 -35054 -3797 33180 31138 -10633 -43041 -24724 22907 40871 12879
203 12879 -23319 -31028 -7131 19051 20423 -445 -11298 -572 7629 780 -6371 -19 13780
216 13780 16150 -2642 -21750 -12249 20224 34605 12213 -21156 -28846 -3987 28128 29351 -515
$$ packed form
127e609M0583L726l2827k9005o553J0194K1705K3708K107l0186l5684M82M2613
140E254L6223j7908n1345k4002K7519M7532J8225k9053m2405o885K8059J8913
152A0127p162r306M441P660n176j7359n975J8646K1278q655l1146j2305K5768
165i164L7315M037m0281m3492O910M8857L3687j2795m0238k5895J5703L9142J3457
178B7243k7948k6869N462J9576J2681N707m384j8486j7369P49J8360K5121J0394
191C0237k1185l5788q318L1257L6977k042m1771l2408J8317M7631J7964k7992
203A2879l6198p709K3897K6182J372k0868j0853J0726Q201o849p151O352J3799
216A3780K370j8792j9108R501L2473J4381k2392l3369p690K4859L2115J223k9866
$$ plain form
229 -515 -24014 -16670 6240 20440 15984 -1899 -16275 -14352 -3818 6933 16907 17222 -3941 -26713
243 -26713 -21560 7924 26725 15192 -15369 -31372 -11212 25559 33693 675 -35669 -34652 2721
256 2721 34568 25990 -11741 -30416 -12752 11884 14823 -631 -15028 -12922 3567 12327 4083
269 4083 -5702 -3468 -609 -5240 -9956 -4273 10623 19849 8351 -14750 -20956 -2286 15412 14461
283 14461 1319 -8626 -6588 5116 11309 5767 -866 -2887 -4310 -5269 1963 14024 18640 7331
297 7331 -15337 -26358 -5673 26291 30471 375 -27289 -22711 7712 31278 20183 -15370 -32940
310 -32940 -11655 21059 27636 4711 -19626 -20320 1059 15182 7887 -5054 -7811 -3958 -669
323 -669 1402 1678 1138 745 -3974 -10566 -7244 5545 10935 688 -12725 -13342 66 12118 7060
$$ packed form
229e15k3499P344K2910J4200m456j7883j4376J923J0534J0751R974L15k1163k2772
243b6713N153K9484J8801j1533l0561j6003K0160L6771Q134l3018l6344J017L7373
256B721L1847q578l7731j8675J7664K4636K939j5454j4397K106J6489Q760q244
269D083r785K234K859m631m716N683J4896R226j1498k3101o206J8670J7698r51
283A4461j3142r945K038J1704O193n542o633k021j423r59P232J2061M616j1309
297G331k2668j1021K0685L1964M180l0096k7664M578L0423K3566j1095l5553j7570
310c2940K1285L2714O577k2925k4337o94K1379J4123p295j2941k757L853L289
323f69K071K76n40l93m719o592L322J2789N390j0247j3413o17J3408J2052n058
$$ plain form
338 7060 -9719 -16312 -5304 7091 7033 1202 -4044 -5071 -3104 -3258 -5959 -1580 8733 9000 -4748
353 -4748 -16016 -9321 8917 17681 2894 -21515 -22597 4303 26818 19873 -7497 -27782 -20316
366 -20316 7201 24079 12228 -9930 -15500 -4396 7471 8468 242 -7416 -6506 -2030 1037 5474
380 5474 8861 3730 -7902 -12728 -7099 4249 12968 8997 -4772 -11344 -2933 7049 5777 -2774
394 -2774 -7394 -2445 6883 7353 -423 -4233 -87 2413 -1243 -4791 -1611 6343 11917 4810 -10935
409 -10935 -13680 2519 16494 11078 -6997 -16544 -4863 15965 20291 1090 -18090 -14696 4440
422 4440 18870 14629 -3338 -15288 -8632 7764 13573 6942 -1711 -7304 -7299 354 8131 10448 4853
437 4853 -5644 -12336 -5513 9151 13394 2621 -10266 -12210 -1449 12230 12353 -2599 -13560
$$ packed form
338G060j6779o593J1008J2395n8n831n246j027J967j54k701M379J0313K67j3748
353d748j1268O695J8238Q764j4787k4409j082K6900K2515o945k7370k0285P466
366b0316K7517J6878j1851k2158n570J1104J1867R97q226p658R10M476L067M437
380E474L387n131j1632m826N629J1348Q719l971j3769o572Q411R982j272q551
394b774m620M949R328M70p776l810M146K500l656l548L180P954N574p107j5745
409a0935k745J6199J3975n416j8075r547J1681K0828M326j9201j9180L394J9136
422D440J4430m241j7967j1950O656J6396N809o631q653n593NP653P777K317n595
437D853j0497o692O823J4664M243j0773j2887j944J0761J3679J23j4952j0961
$$ plain form
450 -13560 -8046 3913 6997 1167 -4168 -1337 4868 3465 -6073 -9358 -216 9172 7864 -2448
464 -2448 -10140 -5234 8252 13082 -316 -14272 -11021 5032 15693 11001 -3496 -12985 -7060 4976
478 4976 9073 4020 -1728 -4512 -1441 5032 7578 2292 -3544 -6387 -4842 4201 13651 11227 -1808
493 -1808 -12024 -8660 4443 14672 9076 -6947 -13225 -1722 12398 12738 -122 -13170 -12623 1172
507 1172 13098 7593 -4593 -8765 -3818 783 1068 -2612 -3535 -122 2532 -1950 -6435 -4223 853
522 853 3617 -119 -7264 -9908 -2307 6490 5505 -3484 -8972 -8166 -2578 3319 3926 -1751 -7133 -7780
538 -7780 -4755 1306 5330 1533 -7827 -11336 -6735 2158 7596 2945 -8995 -13065 -2887 8120
552 8120 7212 -3769 -12514 -8950 4635 12768 4910 -7468 -9907 -2334 5984 7201 -23 -6148 -2235
$$ packed form
450a3560N514J1959L084n830n335K831O205j403r538l285R142R388j308j0312
464b448p692M906J3486M830j3398j3956L251J6053J0661m692j4497r489N925J2036
478D976M097n053n748k784L071O473K546n286n836k843J545R043R450k424j3035
493a808j0216L364J3103J0229n596j6023o278J1503J4120L40j2860j3048N47J3795
507A172J1926n505j2186m172M947M601K85l680r23L413K654m482m485K212N076
522H53K764l736p145k644P601Q797r85q989n488Q06N588N897O07n677n382o47
538g780L025O061M024l797r360l509M601Q893N438m651j1940m070J0178J1007
552H120r08j0981q745L564J3585Q133p858j2378k439P573Q318J217p224o125L913
$$ plain form
567 -2235 5648 6640 315 -3039 -2555 293 3361 2998 1655 3284 4573 1436 -1974 -1562 1277 5200
583 5200 7891 4951 -413 -1009 2139 3865 4263 4483 1964 -1030 860 5512 9120 7337 -932 -8671
599 -8671 -6238 6136 14222 9516 -2687 -11956 -7758 6296 12968 3517 -10266 -11140 -245 9351
613 9351 8597 -3357 -13104 -10056 1754 6653 2533 -5098 -8463 -5200 1489 1925 -3510 -6973 -5083
628 -5083 -1683 108 -224 -3405 -6365 -5384 -2385 -755 -1713 -4028 -6135 -4895 -815 -285 -3213 -5280
644 -5280 -4699 -1903 974 -151 -5761 -6549 -248 5147 2762 -4193 -8663 -4696 4425 7965 1038 -8352
660 -8352 -8467 640 9519 7915 -3923 -13703 -8913 4822 11271 5411 -5251 -11477 -7521 3180
674 3180 7741 1022 -6887 -8871 -3592 3789 6223 241 -7801 -8636 -3648 2715 5409 2118 -4840
$$ packed form
567b235P883R92o325l354M84K848L068l63j343J629J289l137l410M12K839L923
583E200K691k940n364n96L148J726L98K20k519k994J890M652L608j783q269p739
599h671K433J2374Q086m706j2203r269M198J4054O672r451j3783q74J0895R596
613I351p54j1954r747L048J1810M899m120p631l365L263O689M36n435l463J890
628e083L400J791l32l181k960R81K999J630r58k315k107J240M080N30k928k067
644e280N81K796K877j125n610p88O301N395k385o955m470L967R121L540o927r390
660h352j15R107Q879j604j1838r780M790J3735O449n860j0662o226L956J0701
674C180M561o719p909j984N279P381K434n982q042q35M988O363K694l291o958
$$ plain form
689 -4840 -6699 -1770 2169 697 -3028 -4778 -1645 3263 4167 -1275 -6880 -4845 531 3793 1948
704 1948 -3344 -4554 1024 6309 2758 -4012 -6006 -698 5252 7735 3098 -3400 -3101 3544 7445
719 7445 4689 -778 -2972 1845 8990 9615 3022 -2585 -2489 2369 8149 10046 4135 -3000 -2490 4001
735 4001 9119 8027 2075 -4151 -3101 4602 10389 7857 398 -4670 -2805 5115 9804 5562 -1771
750 -1771 -3253 935 5100 5854 2528 -1241 -412 2832 3586 639 -747 -31 2695 4300 1609 -3147
766 -3147 -2411 1450 3149 1513 -1389 -3556 -1661 3448 5262 406 -5089 -5730 -1420 4365 5238 679
782 679 -4632 -4169 282 3301 2720 -1431 -5004 -2561 4130 6494 1639 -4731 -6375 -2075 4609 6879
798 6879 1144 -4865 -4502 1007 5098 3963 -2566 -6976 -3018 4919 7269 2894 -2752 -5168 -2558
$$ packed form
689d840j859M929L939j472l725j750L133M908R04n442n605K035N376L262j845
704A948n292j210N578N285l551o770j994N308N950K483m637o498K99O645L901
719G445k756n467k194M817P145O25o593n607R6M858N780J897n911p135N10O491
735D001N118j092n952o226J050P703N787k532p459n068J865P920M689m242p333
750a771j482M188M165P54l326l769Q29L244P54k947j386P16K726J605k691m756
766c147P36L861J699j636k902k167J895N109J814m856n495o41M310N785Q73m559
782F79n311M63M451L019n81m151l573K443O691K364m855o370j644M300O684K270
798F879n735o009L63N509M091j135o529m410L958P937K350m375n646k416K610
$$ plain form
813 -2558 3503 5021 1583 -1546 -1217 1458 2535 1693 -1809 -2412 877 3402 1483 -828 -1119 -583
829 -583 1790 2242 -878 -4553 -3421 1748 3991 2155 -3084 -6819 -4981 1476 4687 1416 -4465 -7375
845 -7375 -4589 2453 5467 -365 -7907 -7865 -2189 3253 3307 -2618 -8303 -6966 47 4017 310 -5625
861 -5625 -8577 -4755 2000 3157 -2306 -6731 -5935 -1948 1742 1183 -3603 -7531 -5089 967 3095 696
877 696 -4078 -6495 -3974 996 2589 -406 -2941 -2677 -658 1420 1372 -2426 -3973 -648 2714 1927
893 1927 -227 -2238 -1685 944 3096 -160 -3406 -2400 1636 4858 4761 -684 -5538 -3895 2435 5629
909 5629 4027 -91 -3619 -2122 3205 5678 2026 -3401 -4073 -67 4949 6552 1614 -3452 -3853 670
925 670 3501 3707 826 -2614 -1530 2665 4034 351 -2153 -2028 234 3145 3213 341 -2600 -1703 1302
$$ packed form
813b558O061J518l438l129L29K675J077q42l502o03L289K525j919k311k91N36
829e83K373M52l120l675J132N169K243j836n239l735J838O457L211l271n881k910
845g375K786P042L014n832p542M2N676N442N4n925n685J337P013L970l707n935
861e625k952L822O755J157n463m425P96L987L690n59m786l928K442O056K128k399
877F96m774k417K521M970J593k995k535K64K019K078m8l798j547L325L362p87
893A927k154k011N53K629K152l256l246J006M036L222r7n445m854J643O330L194
909E629j602m118l528J497N327K473l652n427o72M006N016J603m938n066m01M523
925F70K831K06k881l440J084M195J369l683k504J25K262K911O8k872k941Q97L005
$$ plain form
942 1302 2383 1486 -926 -2340 316 2837 1940 -180 -1349 -808 567 1981 935 -792 -1482 1070
958 1070 2104 1266 -685 -1576 -263 2786 2801 -480 -2757 -1846 1319 3533 3335 -932 -4439 -2508 2538
975 2538 4182 2314 -1263 -3136 -1507 2632 3770 761 -2372 -2826 -773 3133 4081 547 -2920 -2030
991 -2030 -18 1615 1692 212 -1246 -99 2316 1519 -1292 -2631 -1392 1016 2346 1083 -1563 -1752
1007 -1752 171 1292 491 -1067 -2438 -1530 2129 3316 714 -2758 -2947 -977 1474 2323 87 -2647
1023 -2647 -962 1389 1983 492 -2563 -3717 -822 3465 3580 -459 -3710 -3019 -151 2555 2440 -2236
1039 -2236 -4353 -1737 2089 3564 1024 -3300 -5421 -1844 2878 3364 207 -2744 -3922 -1589 1895
1054 1895 2364 -767 -3156 -1802 412 1361 592 -1949 -2757 -337 1601 643 -931 -2113 -1353 974
$$ packed form
942A302J081q97k412j414K656K521q97k120j169N41J375J414j046j727o90K552
958A070J034q38j951q91J313L049J5l281k277R11L165K214j98m267l507J931N046
975B538J644j868l577j873J629M139J138l009l133m54K053L906R48l534l467Q90
991b030K012J633P7j480j458J147K415p97k811j339J239K408J330j263k646j89
1007a752J923J121q01j558j371R08L659J187k602l472j89J970K451Q49k236k734
1023b647J685K351N94j491l055j154K895M287J15m039l251O91K868K706j15m676
1039b236k117K616L826J475k540m324k121L577M722M86l157k951j178K333L484
1054A895M69l131k389J354K214R49p69k541q08K420J938r58j574j182P60K327
$$ plain form
1070 974 1960 27 -2854 -2334 726 2340 1468 -1212 -3431 -1697 2070 3756 1014 -2141 -3190 -990
1086 -990 2373 3548 296 -2720 -1386 1311 2720 1951 -1091 -3124 -893 3439 3879 1216 -2058 -2432
1102 -2432 -179 2889 2805 -835 -2668 -1201 2005 3329 1854 -1805 -4040 -1190 2748 3667 989 -1303
1118 -1303 -2065 -999 1637 1277 -381 -869 -399 732 1628 900 -1114 -1556 -3 1250 211 -50 -93
1135 -93 -64 1053 1269 -1072 -2665 -1257 1509 2246 1239 -1402 -3299 -1373 1831 2375 287 -1901 -2200
1152 -2200 -95 2729 2464 -772 -2890 -1276 674 2131 1562 -799 -2181 -255 1769 1440 -210 -1438
1168 -1438 -1858 607 2586 1187 -1776 -1864 -138 1578 2165 336 -1785 -2540 94 1957 1367 -204
1184 -204 -1614 -962 919 2129 607 -992 -728 599 1281 1578 -169 -1445 -499 1573 1429 -69 -1588
$$ packed form
1070I74R86j933k881N20L060J614q72k680k219J734L767J686k742l155j049K200
1086i90L363J175l252l016J334K697J409p69l042k033K231M332M40k663l274l74
1102b432K253L068q4l640j833J467L206J324j475l659k235K850L938R19k678k292
1118a303p62J066K636l60j658m88M70J131Q96p28k014m42J553J253j039k61m3
1135i3K9J117K16k341j593J408K766P37j007k641j897J926L204N44k088k188k99
1152b200K105K824k65l236k118J614J950J457n69k361j382J926K024l29j650j228
1168a438m20K465J979j399k963q8J726J716N87j829k121p55K634J863n90j571
1184b04j410O52J881J210j522j599K64J327O82K97j747j276R46K072j44j498j519
$$ plain form
1201 -1588 -498 713 2552 1108 -2226 -3457 -1282 1895 3123 1260 -2752 -3931 -714 2630 1877
1216 1877 -979 -3215 -2503 524 3064 2133 -1943 -3688 -1846 671 2197 1221 -1954 -2749 -145 1247
1232 1247 364 -1553 -2176 -1731 904 2670 974 -2448 -2707 -1147 1497 2143 141 -2716 -2151 1045
1248 1045 2350 1118 -1360 -2784 -1273 2395 3337 535 -2077 -1397 448 2546 2253 -510 -1846 -157
1264 -157 2395 2431 287 -1554 -1912 789 3463 2393 -1427 -2714 -1171 1595 3247 1542 -2221 -3471
1280 -3471 -718 2300 2592 456 -2619 -3074 -102 2993 2425 -848 -2782 -2526 -200 2768 1216 -1912
1296 -1912 -3149 -689 1003 1063 -1074 -2856 -2407 694 2019 -73 -1851 -2926 -1438 666 1408 -882
1312 -882 -2881 -1627 881 1640 556 -1782 -3034 -1450 1283 2804 574 -1535 -1599 -217 1626 1339
$$ packed form
1201a588J090J211J839j444l334j231K175L177J228j863m012j179L217L344p53
1216A877k856k236P12L027K540r31m076j745J842K517J526r76l175p95K604J392
1232A247q83j917o23M45K635J766j696l422k59J560K644O46k002k857N65L196
1248A045J305j232k478j424J511L668R42k802k612O80J845K098k93k763j336J689
1264a57K552L6k144j841l58K701K674j070l820j287J543K766J652j705l763j250
1280c471K753L018K92k136l075m55K972L095n68l273j934K56K326K968j552l128
1296a912j237K460J692O0k137j782M49L101J325k092j778j075J488K104P42k290
1312h82j999J254K508P59j084k338j252J584K733J521k230k109o4J382J843k87
$$ plain form
1328 1339 -503 -1557 40 2012 2072 953 -1299 -2002 97 2566 2400 97 -1083 -795 1543 2718
1344 2718 1401 -1771 -2660 96 2792 3421 1102 -1629 -2435 530 2944 2075 -322 -1758 -686 1370
1360 1370 2573 1077 -1725 -1320 818 1708 1322 -173 -1578 -815 1175 1245 -464 -1451 -824 490 1422
1377 1422 1010 -1092 -2379 -1089 1323 2021 480 -1543 -2535 -550 2006 1654 36 -1618 -1839 15
1393 15 2073 1476 -1426 -2471 -586 1398 1886 279 -1815 -2604 260 2393 1338 -903 -2039 -1165
1409 -1165 1586 2565 221 -2706 -2082 695 2654 2701 418 -2255 -1758 1242 2769 1563 -496 -1603
1425 -1603 -249 2058 2666 577 -1603 -913 833 2272 1982 55 -1251 -394 2042 2217 -40 -1184
1441 -1184 -1158 827 2847 2396 -1038 -2685 -1020 1958 2938 1716 -1390 -2356 247 2627 2679 104 -1892
$$ packed form
1328A339j842j054J597J972O0j119k252p03K099K469j66k303j180K88K338J175
1344B718j317l172q89K756K696O29k319k731q06K965K414q69k397j436J072K056
1360A370J203j496k802M05K138Q90l86j495j405P63J990P0j709r87O27J314R32
1377A422m12k102j287J290K412O98j541k023r92J985K556l52j618j654k21J854
1393A5K058n97k902j045J885J984M88j607k094p89K864K133j055k241j136Q74
1409a165K751R79k344k927O24K777J959M7k283k673M97L000J527j206k059j107
1425a603J354K307O08k089k180O90J746J439k90j927j306Q57K436J75k257j144
1441a184K6J985K020m51l434j647J665K978R80j222l106r66K603K380N2k575j996
$$ plain form
1458 -1892 -2190 847 3272 2410 -1266 -2357 -1168 1458 2261 714 -1768 -2026 480 1960 1158 -941
1474 -941 -1977 -1098 1467 2558 943 -1950 -2271 -700 1867 2177 237 -2604 -1976 426 2242 1951
1490 1951 -281 -2221 -1706 1319 2563 538 -1437 -2086 -420 992 1435 -253 -2164 -1040 694 1207
1506 1207 -418 -1707 -1885 19 2128 1266 -1214 -2482 -1234 879 1808 1057 -1825 -2427 -512 1402
1522 1402 1468 -100 -2034 -2178 21 1649 1548 -722 -1995 -1471 26 1313 835 -1497 -1858 -266 809
1539 809 1077 -429 -1818 -1653 285 1692 268 -1397 -1953 -759 1006 1058 -763 -2478 -1469 487
1555 487 1211 654 -777 -2024 -1246 863 1589 133 -1188 -849 -127 626 819 -1051 -1420 -276 996
1572 996 993 59 -767 -1063 43 1627 657 -1073 -1065 -302 898 1637 593 -1258 -1697 336 1768 1815 -99
$$ packed form
1458a892k98L037K425q62l676j091J189K626Q03j547k482k58K506J480q02k099
1474i41j036Q79K565J091j615k893l21J571K567L10j940k841O28K402J816k91
1490A951k232j940N15L025J244k025j975o49J666J412M43j688j911J124J734N13
1506A207j625j289j78J904K109q62k480j268J248K113R29p51k882o02J915J914
1522A402O6j568j934j44K199J628j01k270j273N24J497J287m78k332l61J592J075
1539H09K68j506j389J65J938J407j424j665n56J194J765N2j821j715J009J956
1555D87P24n57j431j247P78K109P26j456j321L39P22P53J93j870l69J144J272
1572I96lr34q26k96J106J584r70j730QP63J200P39j044j851m39K033J432M7j914
$$ plain form
1591 -99 -1480 -1450 481 2099 1136 -563 -1211 -446 797 2025 833 -1060 -1019 978 1594 973 -623 -956
1609 -956 -747 1272 1401 -39 -923 -792 642 1812 1272 -607 -1775 -316 1587 2030 802 -809 -1672
1626 -1672 -402 1495 1310 398 -1198 -640 31 1631 1083 -971 -1535 -8 1475 1628 516 -817 -1525
1643 -1525 501 1951 529 -946 -1517 -499 1272 2293 298 -2107 -2015 356 1862 1659 167 -1643
1659 -1643 -1660 946 1873 718 -1103 -1386 -578 881 1585 107 -1161 -1345 -31 1090 990 -123 -1437
1676 -1437 -441 1231 910 -423 -1364 -1150 -141 1684 1391 -594 -1877 -756 768 1579 857 -953 -1975
1693 -1975 -352 1384 1166 -14 -1205 -1010 -282 1246 818 -822 -1459 -759 637 1044 761 -987 -1183
1710 -1183 50 1133 552 -687 -832 -846 888 1887 193 -1904 -1444 -57 1390 1399 164 -1368 -1152
$$ packed form
1591i9j381L0J931J618r63j699o48P65J243J228j192j893M1J997O16o21j596l33
1609i56K09K019J29j440q84J31J434J170n40j879j168J459J903M43j228j611q63
1626a672J270J897j85r12j596N58O71J600n48k054n64J527J483J53j112j333p08
1643a525K026J450j422j475n71J018J771J021j995k405R2K371J506k03j492j810
1659a643j7K606R27j155j821k83Q08J459P04j478j268j84J314J121j00j113j314
1676a437R96J672l21j333r41K14J009J825k93j985j283J121J524Q11p22j810j022
1693a975J623J736k18j180j191J95P28J528m28j640o37P00J396M07k83j748j96
1710a183J233J083n81j239j45j4J734R99j694k097M60J387J447Rj235j532K16
$$ plain form
1727 -1152 419 1393 524 -407 -1378 -883 802 1132 368 -784 -799 -337 581 894 238 -921 -5 855 401
1746 401 -546 -950 -1027 126 1321 1142 -582 -1038 -239 728 1057 415 -856 -1368 426 1425 695 -50 -990
1765 -990 -674 412 1493 487 -494 -570 -60 359 483 -23 -810 -411 694 1073 103 -567 -635 -191 894
1784 894 1080 -110 -1113 -138 503 949 481 -459 -1419 -357 1008 900 132 -754 -811 -451 1025 904 -250
1803 -250 -670 15 528 641 227 -894 -608 68 1008 166 -787 -1156 -736 696 1740 543 -1404 -1221
1821 -1221 -206 1344 829 -304 -1687 -1327 748 1240 642 -893 -1493 -1064 1056 1010 -64 -1246 -811
1838 -811 -316 459 575 -242 -1601 -722 1085 852 62 -884 -1272 -24 996 802 -310 -1363 -555 804
1856 804 1509 592 -1083 -1506 -124 1421 1347 231 -1198 -1383 194 1169 730 -466 -828 -496 509 1011
$$ packed form
1727a152J571R74q69r31r71M95J685L30p64j152j5M62R18L13o56j159R16Q60m54
1746D01r47m04p7J153J195j79j724m56P99R67L29o42j271n12J794R99p30p45r40
1765i90L16J086J081j006r81p6N10M19J24n06p87L99J105L79r70o70o8M44J085
1784H94J86j190j003R75O41M46m68r40r60J062J365j08p68q86n7L60J476j21j154
1803b50m20O85N13J13m14j121K86O76R40q42r53l69M20J432J044j197j947J83
1821a221J015J550n15j133j383L60K075M92n98j535o00M29K120m6j074j182M35
1838h11M95P75J16q17j359Q79J807k33p90r46l88J248J020j94j112j053Q08J359
1856H04P05r17j675m23J382J545p4j116j429j85J577R75m39j196l62L32J005N02
$$ plain form
1874 1011 429 -1093 -975 96 1144 874 -143 -1033 -600 680 1485 227 -1098 -867 -65 1015 1403
1891 1403 47 -1229 -1291 428 1630 1032 -414 -1472 -886 914 1680 318 -731 -738 -59 1172 838
1908 838 -216 -1053 -451 656 787 322 -409 -804 337 1129 593 -332 -1051 -552 794 1386 564 -666
1926 -666 -1187 -60 1045 1449 609 -804 -1081 196 1205 769 -309 -804 -645 806 1287 286 -772
1943 -772 -1162 166 672 494 -13 -604 -144 898 796 -420 -912 -841 211 1115 1187 -337 -1098 -942 537
1962 537 738 580 -563 -1121 -373 829 993 -300 -831 -868 -320 1068 797 -320 -812 -254 163 220 -35
1981 -35 -853 -770 594 1007 436 -1211 -967 -356 724 1052 -89 -1134 -1285 53 787 876 -219 -1371
1999 -1371 -1145 474 1005 276 -894 -1255 -255 702 1118 -209 -1395 -403 665 1046 185 -903 -1228
$$ packed form
1874A011n82j522J18J071J048k70j017q90M33J280Q05j258j325K31Q02J080L88
1891A403j356j276o2J719J202n98j446j058N86J800P66j362j049pO79J231l34
1908H38j054q37O02J107J31m65p31l95J141P92n36r25p19M99J346N92q22j230
1926f66n21J127J105M04q40j413k77J277J009m36j078m95J59J451M81j001j058
1943g72l90J328N06j78n07n91M60J042j02j216m92P1J052R04P2j524p61J56J479
1962E37K01j58j143n58P48J202J64j293n31l7N48J388k71j117m92N58M17N7k55
1981c5q18Q3J364M13n71j647K44O11J080L28j141j045j51J338P34Q9j095j152
1999a371K26J619N31p29j170l61J000R57M16j327j186R92J068L81q61j088l25
$$ plain form
2016 -1228 -460 1421 702 -527 -1112 -785 211 1539 1045 -751 -1288 -596 970 1016 737 -886 -1073 167
2034 167 1482 1450 149 -1051 -916 179 1931 814 -504 -986 -283 808 780 99 -968 -883 617 1963
2052 1963 793 -679 -1346 -775 1196 1208 -43 -1644 -1428 354 1373 847 -457 -1575 -810 575 1431
2069 1431 449 -775 -1464 -533 598 1030 160 -874 -443 211 849 663 -622 -1387 -735 784 918 -39
2087 -39 -783 -1200 -330 980 1182 -703 -1371 -1119 566 1268 803 -1205 -1871 -646 909 1391 110 -1011
2105 -1011 -977 -247 1230 799 -463 -1135 -426 921 1022 140 -935 -874 464 1166 319 -459 -741 -152 875
2124 875 1240 -239 -549 -425 1 1055 883 214 -1303 -1042 384 979 930 197 -889 -684 967 1324
2142 1324 292 -672 -518 185 1006 1078 -146 -933 -652 849 1036 219 -724 -1017 34 1153 519 -624
$$ packed form
2016a228P68J881p19j229n85L27R96J328m94j796n37O92J566M6k79j623j87J240
2034A67J315l2j301j200J35J095J752j117j318m82P03J091k8o81j067Q5J500J346
2052A963j170j472o67N71J971J2j251j601K16J782J019n26j304j118P65J385Q56
2069A431r82j224o89R31J131M32q70j034M31O54O38j86j285p65O52J519J34r57
2087c9p44m17Q70J310K02j885o68K52J685P02m65k008o66J225J555M82j281j121
2105a011L4P30J477m31j262o72P09J347J01q82j075O1J338P02q47p78k82N89J027
2124H75L65j479l10J24M26J054j72o69j517K61J426N95m9p33j086K05J651L57
2142A324j032r64J54P03Q21P2j224p87K81J501J87q17r43k93J051J119o34j143
$$ plain form
2160 -624 -715 -248 965 1273 -36 -947 -867 -185 885 575 27 -520 -565 170 788 222 -283 -727 -264 603
2180 603 709 430 -305 -803 -43 439 208 -83 -1120 -427 693 900 -165 -1365 -1033 -285 1226 720
2198 720 -602 -1477 -748 712 1193 89 -782 -1326 -214 956 933 -284 -772 -589 513 1032 138 -901
2216 -901 -850 63 945 201 -63 -606 -616 130 930 438 -706 -684 -637 540 1055 367 -698 -992 -37 723
2236 723 933 198 -967 -1189 255 1479 639 -440 -1238 -470 867 1399 223 -1106 -555 484 1127
2253 1127 586 -479 -1270 7 1542 1056 -188 -1084 -1039 537 1161 920 -369 -902 -63 746 623 453
2271 453 -482 -465 -27 700 809 107 -66 -1085 -36 827 735 -219 -516 -498 323 734 562 -657 -1223 106
2291 106 1232 854 -357 -1313 -864 670 1125 530 -1253 -803 178 997 625 -370 -1002 -866 570 1147
$$ packed form
2160f24r1M67J213L08j309r11Q0O82J070l10n48n47m5P35O18n66n05m44M63Q67
2180F03J06k79p35m98P60M82k31k91j037O93J120K07j065j200L32P48J511n06
2198G20j322q75P29J460M81j104q71n44J112J170k3j217m88J83J102N19q94j039
2216i01N1R13Q82p44k64n43j0P46Q00m92j144K2M7J177N15o88j065k94R55P60
2236G23K10p35j165k22J444J224q40j079p98P68J337N32j176j329N51J039O43
2253A127n41j065p91J277J535m86j244q96M5J576O24k41j289n33Q39Q09j23j70
2271D53r35J7M38P27J09p02j73j019J049Q63r2r54k97J8Q21M11j72j219n66J329
2291A06J126l78j211r56M49J534M55n95j783M50R81Q19l72r95o32J36J436N77
$$ plain form
2309 1147 131 -637 -753 -151 653 445 -494 -522 59 29 129 456 5 -434 -299 408 280 -38 -128 -345
2329 -345 -344 292 658 145 -684 -559 -413 969 913 -389 -1049 -705 472 707 241 -766 -1117 148 913
2348 913 449 -780 -643 -173 250 430 -434 -1185 -577 405 919 -46 -719 -652 54 533 249 -425 -783 76
2368 76 184 214 -234 139 -753 -321 -36 165 215 51 -170 -370 -335 214 189 -284 -145 -518 333 806 -152 -880
2390 -880 -234 355 865 -107 -376 -499 282 989 420 -555 -1133 82 1090 1173 35 -1011 -608 762 958
2409 958 -5 -433 -572 102 873 782 -274 -316 241 502 661 -401 -283 204 531 512 332 -252 191 70
2429 70 34 371 931 261 -246 -630 8 748 982 -121 -1162 -428 594 1208 622 -430 -855 -427 1130
2448 1130 865 -427 -959 -299 803 1001 -146 -831 -802 529 823 49 -780 -812 -150 892 600 -409
$$ packed form
2309A147j016p68j16O02Q04k08r39k8N81l0J00L27m51m39J35P07j28l18r0k17
2329c45JO36L66n13q29J25J46J382n6j302o60L44J177K35m66j007l51J265P65
2348I13m64j229J37M70M23J80q64p51O08R82N14r65o73O7P06M79k84o74l58Q59
2368G6J08L0m48L73q92M32K85K01N0j64k21k00L5N49k5m73J39l73Q51M73r58p28
2390h80O46N89N10r72k69j23P81P07n69r75n78J215J008Q3j138j046M03J370J96
2409I58r63m28j39O74P71r1j056m2N57K61J59j062J18M87L27j9j80n84M43j21
2429G0l6L37N60o70n07l84O38P40K34j103j041P34J022O14n86j052m25M28J557
2448A130k65j292n32O60J102J98j147o85K9J331K94p74q29l2O62J042k92j009
$$ plain form
2466 -409 -847 -315 319 138 415 -221 -372 -381 -295 43 -190 257 -60 -452 267 302 521 60 -651 -722 88 771
2488 771 369 -688 -548 2 638 298 -775 -1202 -362 1146 1091 -421 -1035 -425 202 1046 189 -854 -1241
2507 -1241 260 869 584 -271 -485 -314 516 506 -139 -421 -51 109 -150 115 -165 -167 13 61 -385 -6 385
2528 385 -409 -575 -95 226 260 125 -449 -796 31 628 480 -717 -600 -37 729 812 -323 -866 -548 416
2548 416 790 148 -1114 -454 269 827 221 -788 -740 336 539 396 -542 -788 -66 697 1017 -417 -672
2567 -672 -362 333 556 213 -135 -379 217 99 -28 192 479 99 -372 -177 540 787 425 479 -97 -196 728
2588 728 669 -379 -399 253 948 950 31 -672 -168 925 999 -34 -599 -377 428 1286 625 -888 -1077 230
2608 230 1163 850 -504 -724 -385 614 938 1 -274 -183 407 590 342 -430 -401 -124 -182 92 6 267 -53
$$ packed form
2466d09m38N32O34j81K77o36j51rQ6L38k33M47l17l92P19L5K19m61p11p1Q10O83
2488G71m02j057J40N50O36l40j073m27Q40J508n5j512o14O10O27Q44q57j043l87
2507a241J501O09k85q55k14J71Q30j0o45k82L70J60k59K65k80kJ80M8m46L79L91
2528C85p94j66M80L21L4j35n74l47Q27N97j48j197J17N63P66Q3j135n43L18R64
2548D16L74o42j262O60P23N58o06j009M8J076K03j43r38k46P22P63L20j434k55
2567f72L10O95K23l43l48k44N96j18j27K20K87l80m71J95P17K47l62N4n76r9R24
2588G28n9j048k0O52O95Kr19p03N04J093P4j033n65K22Q05Q58o61j513j89J307
2608B30R33l13j354k20L39R99L24r37k75R1N90J83k48p72K9K77n8K74q6K61l20
$$ plain form
2629 -53 -378 -68 -116 338 -160 -637 -672 88 629 520 -593 -914 -274 719 947 107 -1281 -823 495 1253
2649 1253 449 -1007 -1127 -314 867 471 -553 -839 46 1056 941 -5 -1082 -704 290 935 137 -525
2667 -525 -603 -98 418 402 91 -195 -79 181 -22 84 419 254 -497 -515 -9 530 532 -453 -710 -379 844
2688 844 631 -176 -978 -623 423 950 334 -1040 -1110 157 613 259 -995 -1147 -597 806 605 -367 -1161
$$ packed form
2629e3l25L10m8M54m98m77l5P60N41j09j113l21O40R93K28q40j388M58J318P58
2649A253q04j456j20Q13J181l96j024k86Q85J010j15r46j077L78R94O45p98o62
2667e25p8N05N16j6l11k86J16K60k03J06L35j65p51j8N06N39Kr85k57L31J223
2688H44k13q07q02L55J046N27o16j374p0J267M56l54j254j52N50J403k01r72p94
$$ [...]
8191B54
##END NTUPLES=NMR FID
##END=
