##TITLE=1H_EC-3227(3)
 CDCl3, 8 sc, 
 6.3.2020
##JCAMPDX= 6.0         $$ Bruker NMR JCAMP-DX V2.0
##DATA TYPE= NMR FID
##DATA CLASS= NTUPLES
##ORIGIN= UXNMR, Bruker Analytische Messtechnik GmbH
##OWNER= root
$$ XWIN-NMR		Version 3.5
$$ Fri Mar  6 14:09:12 2020 Russian Standard Time (UT+4h)  she@DPX200
##.OBSERVE FREQUENCY= 200.1315
##.OBSERVE NUCLEUS= ^1H
##.DELAY= (6, 6)
##.ACQUISITION MODE= SIMULTANEOUS
##.ACQUISITION SCHEME= undefined
##.AVERAGES= 8
##.DIGITISER RES= 18
##SPECTROMETER/DATA SYSTEM= spect
##.PULSE SEQUENCE= zg30
##.SOLVENT NAME= D2O
##.SHIFT REFERENCE= (INTERNAL, D2O, 0, 15.7039)
##AUDIT TRAIL= $$ (NUMBER, WHEN, WHO, WHERE, WHAT)
$$ ##TITLE= Audit trail, XWIN-NMR		Version 3.5
$$ ##JCAMPDX= 5.01
$$ ##ORIGIN= Bruker BioSpin GmbH
$$ ##OWNER= she
$$ F:/spectra/data/she/nmr/H-F/1/audita.txt
$$ ##AUDIT TRAIL=  $$ (NUMBER, WHEN, WHO, WHERE, WHAT)
(   1,<2020-03-06 14:08:02.51 +0400>,<she>,<DPX200>,
      <created by zg, POWCHK disabled, PULCHK disabled
       configuration hash MD5:
       00 E9 B6 7A A2 85 ED C7 34 08 36 98 17 FE 4E 26
       data hash MD5: 16K
       48 BE 83 FF D7 64 95 02 3E BE ED 33 57 E8 77 DC>)
$$ ##END=
$$ 
$$ hash MD5
$$ F4 74 50 0D D9 28 FA CB 3B D1 B1 64 3D 95 02 0F
##$RELAX= 
##$RELAX= 
##$RELAX= 
##$RELAX= 
##$RELAX= 
##$RELAX= 
$$ Bruker specific parameters
$$ --------------------------
##$DU= <F:/spectra>
##$EXPNO= 1
##$NAME= <H-F>
##$PROCNO= 1
##$TYPE= <nmr>
##$USER= <she>
##$AMP= (0..31)
100 100 100 100 100 100 100 100 100 100 100 100 100 100 100 100 100 100 
100 100 100 100 100 100 100 100 100 100 100 100 100 100 
##$AQSEQ= 0
##$AQ_mod= 1
##$AUNM= <au_zg>
##$AUTOPOS= <>
##$BF1= 200.13
##$BF2= 200.13
##$BF3= 200.13
##$BF4= 200.13
##$BF5= 200.13
##$BF6= 200.13
##$BF7= 200.13
##$BF8= 200.13
##$BYTORDA= 1
##$CFDGTYP= 0
##$CFRGTYP= 5
##$CHEMSTR= <none>
##$CNST= (0..31)
1 1 145 1 1 1 1 1 1 1 1 1 1 1 1 1 1 1 1 1 1 1 1 1 1 1 1 1 1 1 1 1 
##$CPDPRG= <>
##$CPDPRG1= <>
##$CPDPRG2= <>
##$CPDPRG3= <>
##$CPDPRG4= <mlev>
##$CPDPRG5= <mlev>
##$CPDPRG6= <mlev>
##$CPDPRG7= <mlev>
##$CPDPRG8= <mlev>
##$CPDPRGB= <>
##$CPDPRGT= <>
##$D= (0..31)
0 1.2 0 0 0 0 0 0 0 0.06 0 0.03 0 0 0 0 0.0002 0 0 0 0 0 0 0 0 0 0 0 0 
0 0 0 
##$DATE= 1583489281
##$DBL= (0..7)
120 120 120 120 120 120 120 120 
##$DBP= (0..7)
150 150 150 150 150 150 150 150 
##$DBP07= 0
##$DBPNAM0= <>
##$DBPNAM1= <>
##$DBPNAM2= <>
##$DBPNAM3= <>
##$DBPNAM4= <>
##$DBPNAM5= <>
##$DBPNAM6= <>
##$DBPNAM7= <>
##$DBPOAL= (0..7)
0.5 0.5 0.5 0.5 0.5 0.5 0.5 0.5 
##$DBPOFFS= (0..7)
0 0 0 0 0 0 0 0 
##$DE= 6
##$DECBNUC= <off>
##$DECIM= 24
##$DECNUC= <off>
##$DECSTAT= 4
##$DIGMOD= 1
##$DIGTYP= 9
##$DL= (0..7)
0 120 120 120 120 120 120 120 
##$DP= (0..7)
150 150 150 150 150 150 150 150 
##$DP07= 0
##$DPNAME0= <>
##$DPNAME1= <>
##$DPNAME2= <>
##$DPNAME3= <>
##$DPNAME4= <>
##$DPNAME5= <>
##$DPNAME6= <>
##$DPNAME7= <>
##$DPOAL= (0..7)
0.5 0.5 0.5 0.5 0.5 0.5 0.5 0.5 
##$DPOFFS= (0..7)
0 0 0 0 0 0 0 0 
##$DQDMODE= 0
##$DR= 18
##$DS= 0
##$DSLIST= <SSSSSSSSSSSSSSS>
$$ [...]
##$SUBNAM2= <"">
##$SUBNAM3= <"">
##$SUBNAM4= <"">
##$SUBNAM5= <"">
##$SUBNAM6= <"">
##$SUBNAM7= <"">
##$SUBNAM8= <"">
##$SUBNAM9= <"">
##$SW= 24.9337058887773
##$SWIBOX= (0..15)
0 0 2 0 0 0 0 0 0 0 0 0 0 0 0 0 
##$SW_h= 4990.01996007984
##$TD= 16384
##$TD0= 1
##$TE= 0
##$TE2= 300
##$TE3= 300
##$TEG= 300
##$TL= (0..7)
0 120 120 120 120 120 120 120 
##$TP= (0..7)
150 150 150 150 150 150 150 150 
##$TP07= 0
##$TPNAME0= <>
##$TPNAME1= <>
##$TPNAME2= <>
##$TPNAME3= <>
##$TPNAME4= <>
##$TPNAME5= <>
##$TPNAME6= <>
##$TPNAME7= <>
##$TPOAL= (0..7)
0.5 0.5 0.5 0.5 0.5 0.5 0.5 0.5 
##$TPOFFS= (0..7)
0 0 0 0 0 0 0 0 
##$TUNHIN= 0
##$TUNHOUT= 0
##$TUNXOUT= 0
##$USERA1= <user>
##$USERA2= <user>
##$USERA3= <user>
##$USERA4= <user>
##$USERA5= <user>
##$V9= 5
##$VALIST= <valist>
##$VCLIST= <CCCCCCCCCCCCCCC>
##$VD= 0
##$VDLIST= <DDDDDDDDDDDDDDD>
##$VPLIST= <PPPPPPPPPPPPPPP>
##$VTLIST= <TTTTTTTTTTTTTTT>
##$WBST= 1024
##$WBSW= 4
##$XGAIN= (0..3)
0 0 0 0 
##$XL= 0
##$YL= 0
##$YMAX_a= 804270
##$YMIN_a= -374259
##$ZGOPTNS= <>
##$ZL1= 120
##$ZL2= 120
##$ZL3= 120
##$ZL4= 120
##$ABSF1= 10
##$ABSF2= 0
##$ABSG= 5
##$ABSL= 3
##$ALPHA= 0
##$AQORDER= 0
##$ASSFAC= 0
##$ASSFACI= 0
##$ASSFACX= 0
##$ASSWID= 0
##$AUNMP= <proc_1d>
##$AZFE= 0.1
##$AZFW= 0.1
##$BCFW= 1
##$BC_mod= 2
##$BYTORDP= 1
##$COROFFS= 0
##$CY= 11.3945322036743
##$DATMOD= 1
##$DC= 2
##$DFILT= <>
##$DTYPP= 0
##$F1P= 16.9975609425685
##$F2P= -3.02152046262296
##$FCOR= 0.5
##$FTSIZE= 0
##$FT_mod= 4
##$GAMMA= 1
##$GB= 0.15
##$INTBC= 1
##$INTSCL= 1
##$ISEN= 128
##$LB= 0.24
##$LEV0= 0
##$LPBIN= 0
##$MAXI= 10000
##$MC2= 0
##$MEAN= 0
##$ME_mod= 0
##$MI= 1.114404
##$NCOEF= 0
##$NC_proc= 0
##$NLEV= 6
##$NOISF1= 3.799351
##$NOISF2= 2.8
##$NSP= 1
##$NTH_PI= 0
##$NZP= 0
##$OFFSET= 15.70392
##$PC= 1
##$PHC0= -9790.229
##$PHC1= 18.60082
##$PH_mod= 1
##$PKNL= yes
##$PPARMOD= 0
##$PSCAL= 0
##$PSIGN= 0
##$REVERSE= no
##$SF= 200.130013532006
##$SI= 16384
##$SIGF1= 3
##$SIGF2= 2
##$SINO= 400
##$SIOLD= 16384
##$SREGLST= <1H.CDCl3>
##$SSB= 0
##$STSI= 0
##$STSR= 0
##$SW_p= 3612.71676300578
##$SYMM= 0
##$S_DEV= 0
##$TDeff= 0
##$TDoff= 0
##$TI= <>
##$TILT= no
##$TM1= 0
##$TM2= 0
##$TOPLEV= 0
##$USERP1= <user>
##$USERP2= <user>
##$USERP3= <user>
##$USERP4= <user>
##$USERP5= <user>
##$WDW= 1
##$XDIM= 8192
##$YMAX_p= 0
##$YMIN_p= 0
$$ End of Bruker specific parameters
$$ ---------------------------------
##NTUPLES= NMR FID
##VAR_NAME=  TIME,          FID/REAL,        FID/IMAG
##SYMBOL=    X,             R,               I
##VAR_TYPE=  INDEPENDENT,   DEPENDENT,       DEPENDENT
##VAR_FORM=  AFFN,          ASDF,            ASDF
##VAR_DIM=   8192,          8192,            8192
##UNITS=     SECONDS,       ARBITRARY UNITS, ARBITRARY UNITS
##FACTOR=    0.0002004,     1,               1
##FIRST=     0,             0,               0
##LAST=      1.6414764,     0,               0
##MIN=       0,             -374259,         0
##MAX=       1.6414764,     804270,          0
$$ Real data points
##PAGE= N=1
##DATA TABLE= (X++(R..R)), XYDATA
$$ [...]
2690d959k436O640P194j530n867m905j135O867Q000j794j0190m366L395P239N565
2705G718k087j0071m823N828O722J492k170m536m145L112O340j00m265k070N71
2720b484L288K730l319o053J971O820J720l129l484m106J276Q296M087o230o699
2735e316j221M295O128L398n821q189k43O454N821J498n668q633L36Q809M462
2750F110k927m018l120j00M997L404k990l777Q95J724J366K37l114k958L368N986
2766E083r80n193l861k8N363P211j639r241m423M371O063M221j517q135o003N357
2782c351Q539K079l735o429m787M415R329J128o176n060l74L353N718P65o492
2797a078l089M217L290j107j993k191j90M609K900l457n288q24K566O006L788
$$ plain form
2690 -4959 -7395 -755 6439 4909 -958 -5863 -6998 -131 7869 6075 -4115 -8481 -5086 2153 7718
2705 7718 5631 -4440 -9263 -3435 3287 4779 2609 -1927 -6072 -2960 3380 3280 -985 -3055 -2484
2720 -2484 804 3534 215 -5838 -3867 2953 4673 1544 -1940 -6046 -4770 3526 7613 1383 -5316
2735 -5316 -6537 -2242 3886 7284 1463 -6726 -6969 -515 5306 6804 1136 -7497 -7161 1648 6110
2750 6110 3183 -835 -3955 -4055 942 4346 1356 -2421 -1526 198 1564 1801 -1313 -4271 -903 5083
2766 5083 4103 -1090 -4951 -4979 384 7595 5956 -3285 -7708 -3337 2726 6947 5430 -2705 -8708 -3351
2782 -3351 5188 7267 3532 -2897 -7684 -3269 6060 7188 1012 -4048 -4422 -1069 4649 5414 -1078
2797 -1078 -4167 50 3340 2233 240 -1951 -2141 2468 5368 1911 -3377 -4201 -1635 4371 8159
2812H159n617r711L22Q337N398r51n453o662l78Q092O393k940o791l636J242O220
2828B024N106l660o450q32K490K344L210j256n685r83N419J747l215k285j51K383
2844B06L627l58o127k473L453M175K075j035o083n028M347Q474O15m525m450l190
2860f297L240P554J977n862m910n28L361N052J825n243m910J767L769P83N86j272
2876H92l574Q87L824l68k952Q0R99J526P87j416m481O70N078L013k314l573l796
2893d718m1O561N035l454n400k485O77M772N542j707p250k781L556L621K449r88
2909C389n236j937L390K823n14n41j325j934J439K776j792k085J982J478o51m62
2925H00j787j619K782L945p34l533k538m44K645N158K77n912l196J557K872K149
$$ plain form
2812 8159 2542 -7169 -6847 1490 6888 5937 484 -6178 -6556 1536 7929 4989 -1802 -5438 -4196 2024
2828 2024 7130 3470 -2980 -3812 -1322 1022 4232 2976 -2709 -3692 1727 3474 259 -2026 -2177 206
2844 206 3833 3475 -2652 -5125 -1672 2503 4578 3543 -2540 -7568 -3221 5253 5868 1343 -3107 -6297
2860 -6297 -3057 4497 6474 612 -4298 -4826 -1465 3587 5412 169 -4741 -2974 795 1578 2164 892
2876 892 -2682 -1795 2029 1661 -1291 -1211 -212 1314 2101 685 -3796 -3126 1952 4965 2651 -922 -4718
2893 -4718 -4759 1802 6837 3383 -2017 -4502 -3825 947 6489 4782 -2468 -5249 -1693 1928 4377 3389
2909 3389 -1847 -3784 -394 2429 1915 1374 49 -1885 -446 2330 538 -1547 435 1913 1262 800
2925 800 -987 -2606 176 4121 3387 -146 -2684 -3128 -483 4675 4952 -960 -4156 -2599 273 2422
2941B422J640l355m568P30L372J886J95j588l179j85L293J024k148M85N48j821
2957a249j4J353q77l20K775m20k761o91R85L85J984J683l343k836M55K048K141
2974A298K057k060m959p35L716J969J9k10k394k411J614L155J32k68p04k772k34
2991b787K979Q38j034N29p25k195N50K125p9K59R96j701l073J520K558M14M52
3008A626o79l276o61L214J206PN50k225l201J431L932P47j669j71k250j363K901
3025A19K567j076p24m81k315N56K739J002j039l45j333j797K163L042j365j568
3041A45P40j808p51K487K036j212j335m98j495J329K848j70j912k87l1j050J428
3058D64J116m50m17K90j707j274K143K140q86o20k75k773J89L498J396j414j576
$$ plain form
2941 2422 4062 707 -3861 -3131 241 2127 2322 734 -2445 -2630 663 1687 -461 24 572 -1249
2957 -1249 -1263 90 -787 -1107 1668 1248 -1513 -2204 -1219 -834 1150 2833 -510 -3346 -2891 -843 1298
2974 1298 3355 1295 -3664 -4399 -683 1286 1305 1095 -1299 -3710 -2096 1059 1191 923 219 -2553 -2787
2991 -2787 192 1030 -4 525 -200 -2395 -1845 280 201 460 1456 -245 -3318 -1798 760 1174 1626
3008 1626 947 -2329 -2990 224 1430 1437 1987 -238 -3439 -2008 1924 2671 1002 831 -1419 -2782 119
3025 119 2686 1610 886 405 -1910 -1354 1385 2387 1348 1003 -330 -2127 36 3078 1713 145
3041 145 885 -923 -1674 813 2849 1637 302 -196 -1691 -362 2486 2316 404 117 86 -964 464
3058 464 1580 1130 713 1003 -704 -1978 165 2305 1419 799 524 -2249 -2060 1438 2834 1420 -156
3075a56k124o46L694K973j668l543q88M0K126L018l82l764r74J636O4J213J108
3092A727j769j693J431Q19j497K29R15M8M52J2k859j251L440L327j413k578j658
3109b318j654K421M748M74m118k909l46K173M587J028m170l655L11K663K746J719
3125C700l270m482O57L758J363q08q41j910l1K057O03j346l41J075j23L51K6k244
3143a806p10L907J832k390k163j171n22L910L286j925n465q96K307L228K546j750
3159B218n466j582L537L568Q61j411l961k463L487M364o14l093j240k72J714K656
3175B303q43l099n25K492N14j6j180k539N67M437J512l292l431n47J982M488K301
3192E124m735n272N24M328L047P32l162n251M53N260K589j250k971k905Q2M335
$$ plain form
3075 -156 -2280 -2926 768 3741 2073 -1470 -2358 -2318 -192 2826 2444 -1320 -2294 -658 -594 619 1727
3092 1727 -42 -1735 -304 515 -982 -753 162 210 662 674 -2185 -3436 4 3331 1918 -660 -2318
3109 -2318 -3972 -1551 3197 3671 -447 -3356 -3702 -1529 3058 4086 -84 -3739 -3428 -765 1981 3700
3125 3700 430 -4052 -3395 363 1726 918 77 -1833 -1864 193 796 -550 -891 184 61 412 438 -1806
3143 -1806 -2516 1391 3223 833 -1330 -2501 -3023 887 4173 2248 -3217 -4113 -1806 1422 3968 2218
3159 2218 -3248 -4830 -1293 2275 3136 1725 -2236 -4699 -1212 3152 2538 -555 -1795 -2067 -353 2303
3175 2303 1460 -1639 -2164 328 842 826 -354 -2893 -2326 2111 3623 331 -3100 -3647 -1665 2823 5124
3192 5124 389 -4883 -4359 -31 3016 3748 586 -4665 -4212 1048 3637 2387 -584 -3489 -3407 928
3208I28K653k492l333K71J347J386J265k649k096K281K936j356k626l97j21L035
3224A032K900k054m790j638K897L768K406j889o110k671M919N139K47k679m467
3239b990k557M046O128m36m893k423q5K411L712L53m503j895J844J693J267k04
3255A468k865j325K881K324k314k119L52J486J706Q01k656l995J112M361K034
3270C251o52l024m381R68N553K602k586l166k448O16M750K951l082m841J76L073
3286b40K038L42j753l303O46L178J037r86j286j697M93L851M81m037k034K327
3302i43K575J196j048l801l037L851N630j78l559l808j583L805N089L17m569k983
3318c046j78K283M453Q22m803l263K217L097J230j064k385j979K264K649q10j893
$$ plain form
3208 928 3581 1089 -2244 -1973 -626 760 2025 -624 -2720 -439 2497 1141 -1485 -1882 -2003 1032
3224 1032 3932 1878 -2912 -4550 -1653 2115 4521 2632 -3478 -6149 -1230 3909 4156 1477 -2990
3239 -2990 -5547 -1501 4627 4191 -702 -3125 -3210 -799 2913 3266 -1237 -3132 -1288 405 1672 1468
3255 1468 -1397 -2722 159 2483 169 -1950 -1598 -112 1594 2395 -261 -4256 -3144 1217 3251
3270 3251 2599 -425 -4806 -3838 1715 4317 1731 -1435 -3883 -3267 1483 4434 1352 -3489 -3313 -240
3286 -240 1798 2140 387 -2916 -2270 908 1945 959 -327 -2024 -1531 2320 2801 -1236 -3270 -943
3302 -943 1632 2828 1780 -2021 -5058 -1207 4423 4245 686 -3122 -4705 -900 4189 4506 -63 -3046
3318 -3046 -3224 -941 3512 4334 -469 -3732 -1515 1582 2812 1748 -637 -2616 -352 2297 1487 -406
3334d06m38N72J283J320j877l060J052L276J002j485j907k426M00N234K702l623
3350A619m528q81K119M249K541l200n284n15L162K492J915k266m150p53L435K443
3366B398r87j319j779o00K661K203j963j944o4J175R79N46j666j892J703K443
3382A894k87k082j169q86J763L719j24m088k813J898K218K560P10l715l475J182
3398b695L537J649o99k143k908J291L285J52j726m14j6l40J955P20k471j276K274
3415A75R37q29n87n36q05K290J501j573j979o23J230K266K042k440m100j3L567
3432E23J959j84p78l188j671K767K864k15j177k004q06J751K167p04j356o0l9
3449a51k4J223K81j718o7J982m76j704J1J123j81Q84j11k065k93J861R06J89k37
$$ plain form
3334 -406 -844 -272 1011 2331 454 -2606 -1554 1722 2724 1239 -668 -3094 -2694 2540 5242 1619
3350 1619 -2909 -3790 -1671 2578 5119 1919 -3365 -3880 -718 1774 3689 1423 -2727 -3480 -45 2398
3366 2398 1411 92 -1687 -2287 374 2577 614 -1330 -1394 -219 760 1306 -360 -2252 -549 1894
3382 1894 1607 -475 -1644 -2530 -767 2952 2828 -1260 -4073 -2175 43 2603 3313 -402 -3877 -2695
3398 -2695 842 2491 1792 -351 -3259 -1968 1317 1469 -257 -671 -687 -1027 928 1648 -823 -2099 175
3415 175 1112 283 -304 -840 -1645 645 2146 573 -1406 -2029 -799 1467 3509 1069 -3031 -3044 523
3432 523 2482 2298 1520 -1668 -3339 -572 2292 2077 900 -1104 -1910 -159 2008 1304 -52 -112 -151
3449 -151 -175 1048 1329 -389 -456 1526 1050 -654 -643 480 299 1183 1072 -993 -1286 575 1481 1670 1433
3468A433k336j650J941L163n7j493j665j622L65L044J678j705j539p37k43J439
3484A6J616n89j538M03m43k62J176Q05j354l22J172p53p52P95P16q09L08p3j202
3503a090L02J933n1q30m53q44o59K291J297j376j272l89l26O41K311M58k090q08
3521i55j46Q0Q93J580n32j299J64o66j26J417J131r83p34O7o43k19K012M99j824
3540b84m94L45m23J492P69r71j628N28K93L10J184Nj674o71R02jM31J281k98j651
3560e55l78K82m20J088J491p39j710m07j43N82K177P04k044j621M88M64J331Q10
3578A400j207j904J73J672L09J3k87j236p77J646O50m44n6k92j071O90O51p17
3596g87K4J271M73j312j019k7N58J645J238j970k190J89R42J297J490q43l036
$$ plain form
3468 1433 -903 -2553 -612 2551 2494 1001 -664 -2286 -1921 1123 2801 1096 -443 -1180 -1423 16
3484 16 1632 1043 -495 -92 -535 -797 379 1184 -170 -492 680 -73 -825 -30 686 -123 185 112 -1090
3503 -1090 -788 1145 1094 264 -189 -1033 -1692 599 1896 520 -752 -1141 -1467 -826 1485 1943 -147 -955
3521 -955 -1101 -1021 -128 1452 920 -379 -215 -881 -1007 410 1541 558 -176 -109 -752 -971 1041 1540 -284
3540 -284 -778 -433 -856 636 1405 434 -1194 -666 -373 -63 1121 1126 -548 -1219 -317 -318 113 1394 1096 -555
3560 -555 -933 -651 -1071 17 1508 769 -941 -1348 -1491 -909 1268 1972 -72 -1693 -1205 -741 590 1400
3578 1400 193 -1711 -1538 134 443 456 169 -1067 -1844 -198 452 8 -48 -340 -1411 -721 -70 -787
3596 -787 -763 508 981 -331 -1350 -1377 -819 826 2064 94 -2096 -1907 -965 332 1822 979 -2057
3613b057n26J752J212R58k32k354j212J679K201q57j034n38l11N48J533j01j322
3630f61K8O02k93J56P68j184o9J640k08j457p35O53N17J848L39k653j797J264
3648a242J847J442J45k522k389R20K962R56r05j026j975k31K887J675j051k122
3664f29l54K39J545R27j298j754R54J173k81m73J77o69M26J464q24j522m69J232
3682a36R87J259o27k980j125K678J817O62j688k373j643K987L042n04k436j478
3698a558K0J118K045N22k685j170J264O53J223j85k153q45J658J507q46j429j66
3715a027N60J236J094j830k408J128K276Q69o14j929k148P89L451J162j733j936
3731a060j603J090K843J923k206l115j4J513K137N22j406k427K00K265M36l93
$$ plain form
3613 -2057 -2583 -831 381 1339 1107 -1247 -2459 -780 1421 564 -470 -1008 -1319 -771 762 661 -661
3630 -661 -633 -31 -324 -168 600 -584 -653 987 779 -678 -1413 -760 -243 1605 1944 -709 -2506 -1242
3648 -1242 605 2047 2192 -330 -2719 -1799 1163 2119 1214 188 -1787 -2018 869 2544 1493 -629
3664 -629 -983 -744 801 1728 430 -1324 -370 803 522 49 226 -443 -17 1447 623 -899 -1368 -136
3682 -136 851 2110 1483 -1497 -2622 56 1873 2535 847 -1526 -3169 -182 2860 2356 -80 -1558
3698 -1558 -1538 -420 1625 2147 -538 -1708 -444 209 1432 1247 -906 -1751 -93 1414 568 -861 -1027
3715 -1027 -467 769 1863 33 -2375 -1247 1029 1898 1284 -645 -2793 -2004 1447 2609 876 -1060
3731 -1060 -2663 -1573 1270 3193 987 -2128 -2142 -629 1508 2030 624 -1803 -1603 662 1098 705
3747G05r15q05J82J781N08j876j010J019R41J263k55k574j507K487K355m59j680
3764A60j911m42K012K875k15k755j906M55J542K885p0l250k105J264K507J143
3780B189j16k579j887J721K345M5j478j155k0J012J644p08k301J25J627N67J57
3797A188o51k198J7K838J431j365k477o89L62L149J969k762l332K79J959J848
3813A566J110j733l194kK698J899l33j591k235k45K799J439j424j739l86J109
3829b62R97R17j746k053J023K507K58j471j357n29J169K119O97l069j196PJ586
3846d03K295J4k915k138J496K486J271r25k035j958J260K947K11j330j104o19
3862a447M98J705K64j326j073P44O14K40K7r47j150J658J768q72j969k36N66J351
$$ plain form
3747 705 -210 -1015 -833 948 1456 -420 -1430 -411 530 1793 1538 -1036 -2543 -56 2299 1840 160
3764 160 -1751 -2193 -181 2694 2479 -276 -2182 -1727 -185 2700 2630 -620 -2725 -1461 1046 2189
3780 2189 2073 -506 -2393 -672 1673 1718 240 -915 -935 77 1721 1013 -1288 -1163 464 1031 1188
3797 1188 537 -1661 -1644 1194 2625 1260 -1217 -1906 -1544 1605 3574 812 -2520 -2241 -282 1566
3813 1566 2676 943 -2251 -2253 445 2344 2011 420 -1815 -2060 739 2178 754 -985 -1371 -262
3829 -262 735 1652 -94 -2147 -1124 1383 1641 170 -1187 -1716 -547 1572 2269 -800 -1996 -1989 -403
3846 -403 1892 1906 -1009 -3147 -1651 835 2106 1181 -854 -2812 -1552 1395 1606 276 -828 -1447
3862 -1447 -949 756 1020 -306 -1379 -635 -21 219 246 -701 -1851 -193 1575 703 -1266 -1502 -936 415
3880D15J329j154k675n81K014J614N69j000k715p50K820J987m48j750j843m71
3896b639K477K426j026k406o70Q12R81J176k78j742l06Q47Q64k04k17j164L22
3913g47J480M85j243j363O81O82J012N20j943j546Q93K378M06j177j369j052Q96
3930a007K579L01j528j288r3J96J966J114j882j632Q65R76r9M27p08q93M79J411
3948A184k13j347K9N96M15O48q09j539k08J753J007o24k73j836n15K095J847r24
3966A286j827n37m5J263J580k22k070o48M76P75J011K22j268j380Q34J002n82
3983a30M47j47r63Q21K68q40j41Q36L19n69q8m52p00J041J313m90r82m62o8K44
4003g43J659J43j667q28N10O89N72Q83j457j607N53J316M53j04k42j526N6J133
$$ plain form
3880 415 1744 590 -2085 -2666 -652 962 1531 531 -2184 -2934 -114 1873 1425 -325 -2168 -2639
3896 -2639 -162 2264 1238 -1168 -1838 -1026 -45 1131 853 -889 -1195 -348 516 312 95 -1069 -747
3913 -747 733 1218 -25 -1388 -707 -25 987 1507 -436 -1982 -1089 1289 1695 518 -851 -1903 -1007
3930 -1007 1572 1873 345 -943 -1036 -840 1126 2240 358 -1274 -409 567 468 895 187 -706 -227 1184
3948 1184 971 -376 -347 249 664 1312 503 -1036 -1244 509 1516 892 619 -1217 -1732 363 2210 1286
3966 1286 -541 -1078 -1123 140 1720 1498 -572 -1220 -744 31 1042 1264 -4 -1384 -550 452 -130
3983 -130 317 170 -793 28 296 -544 -685 151 470 -99 -187 -639 -1339 -298 1015 525 -457 -919 -987 -743
4003 -743 916 1059 -608 -1436 -926 -237 335 1218 -239 -1846 -1293 23 476 372 130 -1396 -1340 -207
4021b07N96n69J8P6p61K39O35m83o6P42K58o77m2n51L8P13J279j140p31K26L44
4042f3K75O53K0j511m52J320K29P6K46j138q48J152O44k64L08l00o11J34O73l6
4062E07k63N46K4j213L15j9M11L17N77n21j026l22J092Q5P66m52r57n31P06O48
4082F90o9K37n60o69P10N56l09M2p3n05q61J102L28k09p4K09n57p69J084M64P6
4103H43nj079j003O26J282J15Q4l48j379j28J387Q79m49r52m95j25P19N82J19
4122F73j083J80m1k45Q62M90j307q6L48J10j91j39O98n21N13l62n79l36Q02M43
4142B29j2k0j146n97O95J783k91o97o91p41M07J573O12j358l26l54O25P30K17
4161F38r32p19R60O33r83P0m8m99Q91P93n43j205L13M75K65L18k18j479j6J928
$$ plain form
4021 -207 389 -180 -162 -86 -847 -608 27 -456 -522 220 478 -199 -241 -792 -754 -41 1238 98 -633 -407 -63
4042 -63 212 865 885 -626 -1078 242 471 547 793 -345 -1193 -41 603 339 647 347 -264 -130 543 507
4062 507 244 790 814 -399 -84 -103 308 625 1202 681 -345 -667 425 510 1276 824 -133 -664 42 690
4082 690 621 858 298 -371 339 895 586 628 555 50 -811 291 619 410 336 545 -12 -781 303 767 843
4103 843 838 -241 -1244 -618 664 779 863 515 -864 -992 395 1274 825 -127 -622 -747 -28 554 673
4122 673 -410 -230 -271 -516 346 836 -471 -557 -209 -99 -290 -429 269 -252 261 -101 -680 -1016 -214 229
4142 229 217 197 -949 -1546 -851 932 641 -56 -747 -1488 -1081 492 1104 -254 -580 -934 -309 421 638
4161 638 -294 -1013 -53 580 -403 -333 -381 -880 11 804 261 -944 -631 -156 109 427 209 -1270 -1286 642
4181F42L84l24j081j111N18J238J588r92j469p70J92J487J243l76k168k85J135
4198a49M90R04k24j662j85J099O35n15l95l59K24P60O54j580o72O41R71N4r9j132
4218e40p89J344J734j97j383j245%J183J483K55k077j713R38J246J556J47j978
4235c6j721Q91J776J45l13q33j154O03J476K96j458m06L46O49O79P7j936n93J470
4254d2J237n45q55o80k56J592R28p65j822j17O49J516O94n78k306p14J845J171
4272I52j27n01j605n09J226J801n42j251l78O3O55J233o93j473J78J180L44k37
4290C16r57r52N32J895K62j196j057l17R41J639O38k284j658R46J444J104j59
4307A137k040j499J248K018Q15j112j523q59L95K360N23j185j414K51O56P72K50
$$ plain form
4181 642 1026 702 -379 -1490 -972 266 1854 862 -607 -1377 -1185 302 1545 1169 -999 -1284 -149
4198 -149 341 1245 1021 -641 -826 273 908 393 -2 -361 -137 623 1277 -303 -975 -334 637 691 592 -540
4218 -540 -1329 15 1749 1552 169 -1076 -1076 107 1590 1845 -232 -1945 -1007 239 1795 1942 -36
4235 -36 -1757 -866 910 1055 742 -91 -1245 -642 834 1130 -328 -734 -388 261 940 1017 -919 -1512 -42
4254 -42 1195 650 -205 -885 -1141 451 1379 614 -1208 -1325 -676 840 1534 956 -1350 -2064 -219 952
4272 952 825 324 -1281 -1790 -564 1237 695 -556 -934 -871 -216 1017 324 -1149 -971 209 553 316
4290 316 -641 -1593 -1061 834 1096 -100 -1157 -1474 -533 1106 1744 -540 -2198 -1252 192 1296 1137
4307 1137 -903 -2402 -1154 864 1679 567 -956 -1815 -1420 940 1463 278 -1136 -885 -229 543 793
4324G93j435o00Q33J281j31r16l28k43J175J405r75j585m05P65J216O70m06k142
4342a028n33J852J531l61j257j185j77J609J932j096j617n70K88R83J426n32j615
4359c50n81J126N29J60m75q31m1J548J96j248n45r0O68R91O45j653j472N41J947
4378A065L33m46n90j677N02J692O54j019j296l90L99K056O74j719j375J51J006
4395B0N61M85r06j447O52J325l33o66J28n51R32N06r4j297l47Q73N32L71o00j039
4415h95q92J701J477l62j233p92m75J335J534l06k002l71K94R62J273k6k032j093
4433a903J381J007O4P3j186n70R88R35n22p90K4J49N62K74l81j180L73J436j81
4452E53l70k72q24J01J787M88j314q95J30k3J208M81p07j610K49J178Q55pp69
$$ plain form
4324 793 -642 -1242 -409 872 741 -175 -503 -746 429 1834 859 -726 -1131 -366 850 1520 1114 -1028
4342 -1028 -1561 291 1822 1461 204 -981 -1158 451 2383 1287 -330 -900 -612 371 1797 1265 -350
4359 -350 -931 195 724 884 409 -422 -463 1085 1281 33 -512 -602 66 1057 1702 49 -1423 -882 1065
4378 1065 1398 952 362 -1315 -813 879 1533 514 -782 -1172 -773 1283 1957 238 -1137 -986 20
4395 20 581 1066 160 -1287 -635 690 357 -309 -181 -732 200 706 612 -685 -1032 -159 373 744 144 -895
4415 -895 -1787 -86 1391 1029 -204 -996 -1471 -136 1398 1092 -910 -1281 -987 -25 1248 1222 -810 -1903
4433 -1903 -522 485 549 622 -564 -1134 -146 789 267 -523 -499 -350 212 486 105 -1075 -702 734 553
4452 553 183 -89 -913 -812 975 1463 149 -746 -616 -639 569 1050 343 -1267 -1018 160 1015 1008 239
4471B39j027R8J363J70n85o7n51l37J074N09j006l12O53L58n74L45n91l34R45
4490C70P41m66j022j51Q2N87J002m78r17o66N47M22O71k19p41q69Q80P44q1j26
4510C10k03p18L96Q66l20l99l0R4k02J19J68m57k33R67k53n89M2K45K13N64K34
4531H14j271m82N16L57M05K86o96j285N89Q99J94L2m26m83k12P23L53k22l80L6
4551b53k87L19P99m12l25K30j21k52J70L73m36K92M79r21n75Q16L73j5j7K4j238
4572i77L94Q17M23j85l71q70J85R08R3n71j53M82m10k18R06k83n09N36m4l67K14
4593@K24l76R6P53m10j093M19J074m20Jn06l22k24J132M10q56j67n01J32R32M51
4614G49k77r35l5J92K13M16L48j197L80N24k40l03M75n60K29L34O9q96mQ93m18
$$ plain form
4471 239 -788 -690 673 843 258 191 -360 -697 377 886 -120 -432 221 579 5 350 -241 -575 370
4490 370 1111 645 -377 -528 -446 141 1143 665 -252 -918 -371 51 722 503 -238 -1107 -227 517 436 310
4510 310 107 -611 -215 651 331 -68 -98 -4 -206 -87 81 -376 -609 358 105 -484 -442 -197 16 580 814
4531 814 -457 -939 -423 -66 339 625 -71 -1356 -767 132 326 358 -68 -551 -763 -40 313 91 -289 -253
4551 -253 -540 -221 578 166 -159 71 -50 -302 -132 241 -195 97 576 -345 -920 -104 269 254 237 261 -977
4572 -977 -583 234 657 472 101 -769 -584 324 417 -154 -307 175 -235 -453 453 170 -339 197 153 -214 0
4593 0 224 -152 -56 697 287 -806 -387 687 267 268 -238 -560 -784 348 758 -98 -265 -766 -634 298 749
4614 749 472 -463 -498 -306 -93 323 671 -526 -146 378 138 -165 310 -250 -21 313 382 -514 -518 375 -43
4635d3N33m35m47n12R30J084l32j040n71J2O14J271l11j054l57J76L01J101k05
4654G15p47j002O23O70j28L02m98l09j49J029n23l08J70rK10K29k62p76M94J056
4674G87j90l64l48p56L99J054M91p86r94J87K00J041L65q67j134K19J121K26k12
4693D39j13r50j75J207J44m43k05j52J9P93J19q65o01N55O03K32n45p25j08R35
4713A64J048n04j055n42J26R06J041k42j537o00J037R00K32m82j204k56Q89J072
4731I93l63m18o28k16L50R69O1j218J80M58O5K09k74j010j6J551J9q25n35k37
4751h85N42J151N10j448j007M15O37Q63p6r67j076K00J461M51l47o69q18J43J225
4770C05N79p79n52k06J55O43O03o00q94K78P29K58m09j66p17L58J173p7j435m5
$$ plain form
4635 -43 490 55 -392 -904 26 1110 778 -262 -833 -821 -207 1064 753 -301 -658 -482 -181 920 715
4654 715 -32 -1034 -411 259 131 433 -65 -374 -523 506 -17 -325 -155 -164 46 275 13 -763 -269 787
4674 787 597 233 -115 -871 -472 582 1073 287 -707 -520 -320 721 1086 219 -915 -696 425 651 439
4693 439 326 -624 -799 408 552 109 -96 -248 -229 564 683 -182 -783 -228 375 607 62 -663 -771 164
4713 164 1212 708 -347 -889 -763 143 1184 942 -595 -1195 -158 742 974 492 -712 -968 -79 993
4731 993 630 212 -416 -632 -282 687 748 -470 -290 168 233 442 168 -842 -858 693 712 -113 -648 -885
4751 -885 -343 808 1318 -130 -1137 -722 -85 778 702 -265 -1341 -1141 320 771 424 -245 -1063 -920 305
4770 305 884 105 -447 -653 -498 145 748 148 -746 -468 261 519 110 -56 -773 -415 758 681 -754 -799
4790g99O31K72P44k31j273n16J144Q50J0o09q58n52J100J350n74p03r71M19K03
4809c63J272J10j315k89M5O94O08k15j040j57M54J314o27m89l53l0O43R10p57
4828D15j396K11J063N58N2q27j229J59J630O96n78j073p84J99J461J018j070j194
4846f89k66Q11N70O98m89j292j44J117N16o67r3m93j58J174K53o99p62N60M83
4865D30L77j51j144o26R27J364m00p79k86q01Q85J561n4j640n28K78N03Q62N03
4884A281j587q22M29J089K88r3m33p01L16R61qm92k77m40K97Q25l20p99l44J131
4904C01l5j18j69o29j72R09P69n36p71n60N24N36J226r63j210Q5M45O09O41m24
4924D58j195j23J101J94r5k7m75m68P37M79m02q03L15J63K46K20l89n55K19P22
$$ plain form
4790 -799 -168 104 848 617 -656 -1172 -28 822 832 223 -635 -1187 -87 1263 689 -14 -985 -566 -363
4809 -363 909 1019 -296 -585 -540 154 762 547 -493 -650 -196 1118 491 2 -351 -381 262 1172 415
4828 415 -981 -770 293 851 903 76 -1153 -994 636 1332 754 -319 -1103 -904 557 1575 505 -689
4846 -689 -955 -144 426 1124 635 -657 -801 316 832 165 72 -421 -579 595 848 149 -613 -53 430
4865 430 807 656 -488 -1114 -187 1177 777 -2 -288 -1089 -204 1357 1303 -337 -865 -587 -84 778 1281
4884 1281 -306 -1128 -699 390 678 585 152 -549 -233 728 720 228 -49 -489 -192 633 313 -486 -830 301
4904 301 266 148 -21 -650 -822 87 856 320 -451 -1011 -487 49 1275 312 -898 -813 -368 241 882 458
4924 458 -737 -860 241 435 340 313 -162 -630 107 586 184 -619 -304 -141 105 325 -64 -619 -400 322
4944C22k44j13m59l0L36R11l04p37l19ON50O47J77j033p91O00N41N77J39n94r29
4965g47K35R75k7k09m90K10j09M78l4l13k79M86M6j15K08k35k58N55K71n31n70
4986d53M78K91J62K17k12j180L89O43K05J89m26r20j6Q22N25k98m79k00j82K54
5006a91O81j67j95m57K90n2L17j37m22R3N67j76k30q7k3o8N16j26q09L84N04J5
5028B27j73J14m19l35L55Q29l78j40m3p52L27O94j64j89r8q8j08R6M78m06lk1
5050a97O0k42K39K12l04J39N48n37j82J51L80j36k76l6k91kP51L4o58r0j28J52
5072d13M75O28o00l06j75K00q0K81K34o22L7K77l66L48M05m27K90L4l91l76O78
5093A31J47l68K31j90j60j39Q94R1p49k18J37Q6M11J68k89m43N9M08M9L0m7m27
$$ plain form
4944 322 78 -35 -494 -524 -188 723 419 -318 -637 -631 -81 566 743 -290 -1081 -481 60 637 776 182 -747
4965 -747 -512 463 436 227 -263 -53 -162 316 282 -31 -310 176 222 107 315 80 -178 377 648 117 -453
4986 -453 25 316 478 695 483 -697 -308 335 540 729 303 -617 -633 189 714 416 -63 -263 -445 -191
5006 -191 490 323 128 -329 -39 -91 226 89 -333 -240 327 151 -79 -166 -189 -257 259 133 -676 -292 212 227
5028 227 54 168 -251 -586 -231 598 220 80 37 -715 -388 306 142 -47 -145 -233 -341 -245 233 -173 -176 -197
5050 -197 -137 -379 -140 72 -232 -93 455 -82 -264 -113 267 131 -145 -181 -472 -474 277 311 -347 -437 -565 -413
5072 -413 62 690 90 -216 -391 -191 -271 10 244 -378 -341 -64 -430 -82 323 -104 186 220 -171 -547 131
5093 131 278 -90 141 -49 -209 -348 546 637 -112 -330 -193 -107 304 472 183 -260 -201 207 256 286 239 -188
5115a88j71N52km34N84k3n78L32l0p7n1O86m6n43o2k49K16O55N27j083m18j54
5137e57L47M07M58l37p58K97p6N72L37m34n02k29J79Q30k55o0j01o28O59l7L3
5158A45n24M15K15K07m23l28N3J62N67k39l94n03J15N21M97R9j166l10K15O28
5178d8N75j82q87k54L38P10K99l81m18k29k04Q13J50l07l81L6o3N18J50m59k58
5199d82M21J94l87o6K5n0O58L51p49o08J50L94P66J94r04r14K13P17Q34k93j63
5220C01q49m70J105P34m27o55j2j04P84P21j056k53j82N40M6j21o3m23L01L54
5240B71J23p36j15J69N82L97j07n69o41N75O84J56k99q01o30O50J113K79q35o05
5260c39l67M00Q79L83q00o52K97M44K88Q1m40p82L07O76j81p0J3m48P09R1n33
$$ plain form
5115 -188 -359 193 191 -243 341 318 -260 72 42 -35 -86 600 554 11 -51 -300 -84 571 1098 15 -403 -557
5137 -557 -210 197 655 318 -440 -143 -219 353 690 256 -246 -475 -296 534 279 219 118 -510 149 112 145
5158 145 -379 36 251 458 35 -293 -240 -78 489 250 -144 -647 -532 -11 486 585 -581 -891 -676 -48
5178 -48 527 345 -542 -796 -458 252 551 170 -248 -477 -681 132 282 -25 -406 -370 -433 85 235 -224 -482
5199 -482 -61 133 -254 -320 -295 -345 313 664 -85 -693 -543 -149 617 811 -93 -1007 -794 -77 757 464 301
5220 301 -548 -1018 87 821 394 -261 -273 -377 407 1128 72 -181 -363 177 223 102 39 -384 -83 271
5240 271 394 -342 -457 -288 294 691 584 15 -626 -51 633 789 490 -311 -941 -291 822 1101 266 -339
5260 -339 -706 -306 573 956 156 -496 -199 245 533 614 174 -608 -301 375 194 124 137 -311 398 489 -44
5281d4o35M46K29N24K11o11r73J96J022N93k97o13o73l38J177J070p24j024l97
5300h61K99N13P64l43n95o05P62PM98j50o18l16N17N80l11m82l0r5O66J11n83
5321b72l71J57N76L52l22p28l34N80O00Q57r71r92K67P4J395L73j142q93K13N73
5341hN68L99j026q13L14J128j64k45j67k47m13R62L41q75n23N72L27K89k55o69
5361e05J27M44P62n77o13k50jR09M95m68o48m38L20M26R92k52q93o26O64O29M3
5382E40k71o07o06P51Q86k26o04N9M06l76M11j46o50L36N35J60k55r7m63K07M96
5403D86p1m52n01N7K05N83N38o82j114J11R49M68J72p15p47l3J084L51l86k07
5423I6n98r0P14K18k01l77N7L2N4L22k80j38KN33j32l47l88m4M48R72n99o74m9
$$ plain form
5281 -44 -679 -233 -4 520 731 120 -853 -657 365 958 661 48 -625 -963 214 1284 560 -464 -861
5300 -861 -562 -49 715 372 -223 -828 -66 -59 439 289 -329 -645 -128 452 141 -341 -371 -466 200 311 -272
5321 -272 -643 -486 90 442 120 -608 -942 -362 238 1095 124 -868 -601 -527 868 1241 99 -794 -581 -8
5341 -8 560 959 -67 -880 -566 562 398 153 -14 -261 -674 288 629 -246 -769 -197 130 419 164 -505
5361 -505 -378 66 828 251 -362 -612 -613 296 791 323 -325 -763 -443 -17 975 723 -170 -796 -132 497 540
5382 540 269 -338 -944 -193 693 467 -137 -78 328 -48 363 217 -433 -97 438 598 343 246 -217 -10 486
5403 486 415 -37 -538 -481 -276 307 845 163 -951 -840 109 577 749 34 -713 -746 338 689 303 96
5423 96 -502 -592 122 340 139 -238 -181 -149 -95 227 -53 -191 -189 344 212 -135 -523 -567 -119 853 254 -420 -469
5446d69J94L41K39L1p23m08P37K59L60l07o19m83O84P62q1o91m83L3N10L64R2
5467C42o21k45J55K4L72p6k23K26J19K79l79j98Q3L28q1J68j46q26J84Q50J80
5488E15k14m34m85K26O42L74k62j11o81K65L07L98j82n77j30K85K1L45L33r51
5508c16J85q3L85Q0J43k75m31N46j89Lk37M70k16Q2J8n52J53M78M19m47k62Lj71
5531b14L16L78Q8o02m52K1N17L95K76n34m32M1K37K55N6j89j93m4J0K55l41L51
5553A95j54O1l99L99j33q9M76j42m7q7m48M6N00K52n28k77Q5M30j02M04j98l80
5575a36k3J98O8j4r1J8m88P43m15O8K93j50j11o64O18K40k9k8Qm44L37J15k91
5598a78K72L99q51j36O16m9m08M48n1j15k45L04K0k01M68l32o1Qj24L7O72k00
$$ plain form
5446 -469 -275 66 305 336 -387 -795 -58 201 561 254 -365 -848 -164 598 517 -174 -657 -624 -114 250 342
5467 342 -279 -524 -369 -345 27 -49 -272 -46 73 352 -27 -225 -142 186 105 273 127 -699 -515 335 515
5488 515 301 -133 -618 -392 250 624 362 251 -430 -165 142 540 358 -219 -349 -64 -43 302 635 -316
5508 -316 -131 -214 171 251 394 119 -312 234 45 48 -189 281 65 147 165 -387 -234 244 663 216 -46 -43 -214
5531 -214 102 480 568 -34 -486 -465 52 447 723 189 -243 -202 35 290 346 157 -36 -80 -70 185 -156 195
5553 195 41 102 -297 102 -31 -120 356 214 167 80 -368 -322 178 430 -98 -375 -290 140 38 442 244 -136
5575 -136 -159 39 107 93 2 20 -468 275 -140 -72 221 71 -40 -704 -86 154 125 97 105 -339 -2 113 -178
5598 -178 94 493 -358 -494 122 73 -335 113 62 -53 -298 6 26 -175 293 -39 -100 -92 -216 -179 493 293
5620B93l05m97J64L16L77N0Q8n27m45L98K31K68J17m44o97P15pj1L95p83R8R4
5642a12J69J29k69M38k76l05N18o9j19j63L7L79n12L99r0l95M25N3m48q6J49L4
5664a14K85L34n16o23J45O29j6J70j49n86l11P90J64n5o9p54K88oP70k36m17K79
5686Bk87J25L5N6k22J39L5L10j2m65k66K60L20J51n48j54L91L45N6J80q46k98
5708f93R8R38N6j95o39n04N52N13M58p35l20k98M38N97p3l98m03M97j00K11M47
5729D47l44m33K53J53J36m37k22O03k04J34r7n80nP30K43k39L8p82P9O18O88l96
5751C83o40l73J59O32O18k74q97j41K42L21L18K1o25j90P8N43J0l06K53l53L55
5772A34L63l10l03R2K81o0p8m67q1L08Q01qp65k16j6L68O47J95q29o93M38R0J057
$$ plain form
5620 293 -12 -509 -345 -29 348 398 486 -41 -486 -88 143 411 528 84 -613 102 95 84 479 -304 -206 -112
5642 -112 57 186 -83 355 79 -226 292 223 104 -59 -22 357 -155 244 154 -241 184 237 -211 -297 -148 -114
5664 -114 171 505 -11 -634 -489 140 124 294 145 -441 -752 38 202 147 78 -676 -388 -394 376 140 -277 2
5686 2 -285 -160 -125 -69 -291 -152 -117 193 181 -284 -550 -290 30 181 -367 -521 -130 215 271 451 -395 -693
5708 -693 -595 343 399 204 -435 -939 -387 126 584 -151 -471 -769 -331 266 193 -205 -608 -111 -211 0 447
5729 447 103 -330 -77 76 212 -225 -447 156 -48 86 -11 -591 -596 134 377 138 176 -606 -527 91 779 383
5751 383 -257 -630 -471 161 779 505 -392 -533 -291 30 348 369 -256 -446 -368 175 185 -121 132 -221 134
5772 134 497 187 -116 -24 257 197 119 -348 -429 -121 680 672 -93 -309 -325 43 690 885 56 -637 -199 -109 948
5795I48j7m58r46l14Q98M16j30j25q38J52M20M33m72r1K97k15M36J9n09m74N84
5816A4P4kj93j29k93O53P24n59p49J83L3O82L97l85r08o44M90J082N2p8p86q81
5838a223R10Q84l66K82p03k18K36O22k79k22j06K25J93k72o2k54J87K18L24m38
5858f2j47j2P4K13N17o17o93k4Q45O42l96m30p47K86N96Q14n23m00m67J75L35
5879b1J000k67p29j83j45L41M75m51q2j43M87J10k41J76n08k8Q08q1o45k60J24
5900b63M51N77m32o00o69Q74N57L14m81n75l85N60N67K23m40k65n32K84J037Q
5920H10q80n23J72J94N58o3l57k76J11M94p5n5j96q7J74L08j01o16j4N90L01O3
5942E32o53n29J13P40M55o30k98o14L96L29R26j46q65n31K09N82P08m51m56m38
$$ plain form
5795 948 931 473 -473 -787 111 527 397 272 -566 -414 6 439 -33 -124 173 -42 394 413 -96 -570 14
5816 14 88 86 -107 -236 -529 124 848 289 -460 -277 -244 438 835 450 -458 -1102 -612 470 522 444 -342 -1223
5838 -1223 -313 571 205 487 -216 -434 -198 424 145 -77 -183 42 235 -37 -99 -353 -166 52 376 -62
5858 -62 -209 -221 -147 66 583 -34 -727 -751 94 736 340 -90 -837 -551 45 859 336 -64 -531 -356 -21
5879 -21 979 712 -17 -200 -345 -4 471 20 -62 -205 282 392 151 327 -181 -209 599 518 -127 -387 -263
5900 -263 188 765 333 -267 -936 -62 495 809 328 -247 -632 -72 495 718 278 13 -519 -235 802 810
5920 810 -70 -593 -421 -227 331 268 -89 -365 -254 240 165 110 -86 -173 1 309 208 -408 -422 168 469 532
5942 532 -121 -650 -537 203 658 28 -270 -884 -488 -159 767 621 -244 -775 -566 16 724 273 -183 -621
5962f21K14N34k10J85l05l19L74K18m8j38j1K53M4j31r4n28J20P78K29n19m25
5983d00j14M41L02K99l41m78l83L15P86K26n06n75O0N76j81L99j32j083N44L33
6003H8J11R8k98k46M0J13L07j05k22N1J79l73M3j45m1N69L57l69l66j89M46K05
6025B53N88n53l90k43L47K19J30J01m99m85M63M95K21j15l67p34K75L80J07J07
6045C00n24J89k46O56p0k69n65P20j81j2o8J41J45J4J34l95n68K69o2P58k0o71
6067c25%K53j73N18Jm61l95K8P16L67l67j84l40o2K98K69l57L2M3j58l2M85k35
6090g9J7M11n88K17k03J47L18oj65j42n82L22J91P4K46j54j66k54J29L92N6k34
6112e3j82j60J28L26K06j45Mn26oK29M60k56R7l81n1N6M75j70N1J6m24Q7J94K95
$$ plain form
5962 -621 -407 127 -83 102 -203 -522 -148 70 22 -116 -127 126 170 39 -55 -583 -463 315 544 25 -400
5983 -400 -514 -73 229 528 187 -291 -674 -359 427 653 147 -428 -368 208 27 426 294 -789 -245 88
6003 88 199 297 -1 -247 -207 -94 213 108 -114 -63 116 -257 -214 -359 -400 169 526 157 -209 -398 48 253
6025 253 841 288 -102 -345 2 221 351 452 -47 -532 -69 426 647 532 165 -569 -294 86 193 300
6045 300 -224 -35 -281 375 305 36 -529 191 10 -2 -70 71 216 230 364 -31 -599 -330 -392 366 346 -325
6067 -325 -325 -72 -245 273 274 -187 -582 -554 162 529 162 -22 -362 -424 -126 143 -214 -182 -139 -297 -329 156 -79
6090 -79 -62 349 -239 -22 -225 -78 240 234 69 -73 -655 -333 -142 -68 178 24 -142 -396 -267 125 181 -53
6112 -53 -235 -395 -267 59 265 120 124 -402 -408 -179 281 25 122 -259 -310 -254 221 51 102 118 -306 -219 -25 270
6136B70J60l74j84j0l47L46N04j38k28J54j6l20L28j00o1M89m99j95K5L52J76
6157C32m32O4k23QJ97R5K10L22m94l04M03K68J14o06k19L05k60L52L45m08m13
6178c44K35L46l23J38L1N6N0m9k50j45L32J88k74J16m32K42J18K70J04p36n8K32
6200a53J88L81k7m77m64j2J64L99P61r44l09K4L94O4K62p1l95m51K78O63k14J13
6222A74n33J22M48j32L9l94K50m2N5m4l5k16K75K42L44o18j59k89M43N19K2p97
6244c26j69M5M56L51J20o86k19J44J04L39J59l08l05N4R9P62l83q6k55k9N3k8
6266a08J83k50M07K75k26n64LJ21M31K46l37m11R5l46R22L14n11l32o30P97M72
6287E51L77m52n42n50N73N35j28J8o30n1J33N09L9k66k85j7K40K69j08m22r9N76
$$ plain form
6136 270 430 56 -128 -138 -485 -139 365 227 -1 153 137 -183 145 45 -16 473 -26 -221 -196 156 332
6157 332 -100 -36 -259 -251 -54 41 251 573 79 -225 178 446 560 -46 -265 40 -220 132 477 69 -344
6178 -344 -109 237 -86 52 83 139 189 140 -110 -255 77 265 -9 107 -325 -83 35 305 409 -327 -385 -153
6200 -153 35 416 389 -88 -552 -564 -400 -1 760 -184 -493 -469 -75 -11 251 180 -215 -666 -388 275 61 174
6222 174 -359 -237 211 79 118 -276 -26 -68 -13 -57 -92 -308 -33 209 553 -65 -224 -513 -70 449 471 -326
6244 -326 -495 -450 6 357 477 -209 -428 -284 -180 159 318 10 -295 -241 -142 620 237 151 -104 -133 -80 -108
6266 -108 75 -175 232 507 281 -283 -280 -159 272 518 181 -230 -135 -481 441 755 244 -88 -718 79 551
6287 551 928 476 -66 -616 -43 492 364 382 -248 -299 -166 343 382 116 -169 -186 54 323 215 -207 -306 270
6309B70L0r4l90P7J51M06j29m05k57K65L25P2K37k46j034n2R56K99K9q12q4j38
6331e24Q07J24r4l57k96k78P54K62j93n58M1K75k22L44l13J79k06N92L0p84l2
6352d49M29J19J83M7p20l00P45J94J02M4p84j57K93M54K21n67p58K14M25P04L58
6373G97o84m05J78k9J29P78r99k50J24N22N7L5o98M30K04O1m05J20n1J92K31j24
6395B13o75o2L04J51N72p1n19k90j98Q36N25l18m60n88K20N21N24l19q02k00M70
6416a66M01M76n24j14p22O92N59j23l13j58M21l83K03k18n08L22L86L30m46k40
6436a25l84N90L90R1m52l46l47M75Q20J2q36m68L47L12O91j10p51l66L7N97J07
6457B84M3n03k18m9N37L67m21j26m4L23K16k47n35J95L90J08J59p92O1j49N69
$$ plain form
6309 270 300 206 -184 -107 44 450 321 -84 -341 -76 249 321 558 312 -722 -774 182 481 510 -302 -386 -524
6331 -524 283 407 313 -44 -340 -618 136 398 205 -353 -312 -37 -259 85 -228 -49 -255 337 367 -417 -449
6352 -449 -20 99 282 329 -391 -691 54 248 350 394 -390 -547 -254 200 421 -146 -904 -690 -265 439 797
6373 797 113 -292 -114 -143 -14 764 -235 -485 -361 161 218 253 -445 -15 189 250 -155 -35 -86 106 337 213
6395 213 -462 -524 -220 -69 503 432 -87 -377 -575 261 786 468 8 -580 -360 161 685 366 -436 -636 -166
6416 -166 235 711 187 73 -649 43 602 479 166 8 429 46 249 31 -477 -155 231 561 115 -125
6436 -125 -509 81 471 562 110 -236 -583 -108 712 724 -112 -580 -233 79 770 660 -91 -457 -420 177 284
6457 284 327 -176 -394 -443 94 461 40 -86 -130 193 409 162 -373 -178 212 320 479 -313 -252 -401 168
6478A68O22l44q50j81L01P64J26O6r60k90O57J56J55k29m62m53K75Q79M3l29k98
6499a84R6l46M76R7q1o46O78j16o8P8l03L27K07J9k85n43K05N04k6P5l04l67n3
6522e60Q00K90l35l72l56kP00J58k20k63l13k1M44M87j78o64k71K71P38j9L9n08
6544a55j2J24jj7L1J30l90L81J69n85K25L13M3J44l89j90l46O40L57Kl86p29R3
6567e48N58M63N6l84m12k22M96K52K95m76o76K78K62K28J90l57j76M0L6P2r3K37
6589A19j43K10l9l82J3J90L59k97K49m05j55k63R51K38n05l12l07j41M02N06K8
6610C16o98j37M08p5N46o1n46k57M21J01r4L01R7o55L78k4p2K85k69J35l83J5
6632b68K32k80L94P7j54j46M5l42M2O56M59o50j94P3j72N07K45k01q31j20P18
$$ plain form
6478 168 790 446 -404 -585 -284 480 606 672 -288 -578 79 235 390 161 -301 -754 -479 400 443 114 -184
6499 -184 -88 -434 42 139 58 -588 90 -26 -94 -16 -319 8 215 234 -51 -594 -389 115 89 164 -140 -507 -560
6522 -560 240 530 195 -177 -533 -535 165 323 103 -160 -473 -494 -50 437 259 -405 -676 -405 333 314 353 -155
6544 -155 -167 -43 -44 -61 -30 100 -290 91 260 -325 -100 213 256 400 11 -179 -525 115 472 474 88 -641 -548
6567 -548 10 473 529 145 -267 -489 7 259 554 78 -598 -320 -58 170 360 3 -173 -133 -97 -25 -118 119
6589 119 -24 186 147 -235 -222 -32 327 30 279 -126 -281 -544 407 645 140 -172 -479 -620 -218 288 316
6610 316 -382 -519 -111 -186 360 299 -247 -504 -83 18 -76 225 322 -333 45 21 -51 234 -35 100 -283 -268
6632 -268 -36 -316 78 155 1 -145 -100 -442 -400 256 715 65 -129 -56 -228 279 524 323 -508 -628 90
6653I0J1J11R1j86l82M60k5K28m25q9l00K57K58J68n58M78m9l77KK27N3M9J29
6676B21j70K2l47N14j75J70j39l1l55J72M71P1J9l43o65M03K8M26j86K23o55l4
6698c60L66K52m8q4l79oL9M49P1j71j37Q0l75M45L27m12J67j31r2l43M68l01J13
6721f2R5P2l79K49K87J06J56m43L8j81J85J07J52n8l43l23l0N44J28j3j81n82
6743d76J56M24J64K43l77l87NJ38J56N98o87N2q1j29O54k71Q3k90J89k68l48M26
6765b6K67p5j12m08J81j13l6P32m2m7n22j68L55M68L0j45j86l80MQ30j11k00n74
6788b78L75k17J39O03m61l77R8N3K64o9L8j99l38O27j01j21NJ70j50L42q08K10
6810a95L7N33L02m46j34m34j82O12N00l08k39l57J05L01J03l7p19R0Q8M63K57
$$ plain form
6653 90 101 212 303 117 -265 195 170 398 -27 -116 -416 -159 99 267 -291 187 138 -239 -237 -10 43 92 221
6676 221 51 73 -274 240 65 235 96 65 -290 -118 353 424 443 100 -565 -162 -134 292 106 329 -326 -360
6698 -360 6 258 210 126 -253 -259 -220 229 300 129 -8 72 -303 142 469 57 224 93 1 -342 126 -175 -62
6721 -62 33 105 -274 -25 262 368 524 81 119 -62 123 230 382 324 -19 -342 -372 172 300 287 106 -476
6743 -476 -320 104 268 511 134 -253 -248 -110 46 644 -43 9 -72 -201 453 182 265 -25 164 -104 -452 -26
6765 -26 241 166 54 -354 -173 -286 -322 410 368 321 -201 -369 -14 454 484 339 153 -227 -223 607 496 296 -278
6788 -278 97 -120 19 622 161 -216 -118 -65 199 130 168 -31 -369 258 157 36 41 211 61 403 -405 -195
6810 -195 -158 375 677 231 97 -337 -519 93 593 285 46 -311 -206 95 198 161 -558 -468 -380 83 340
6831C40J2m16l00J65J91K25J58j72m40K74K37j32k73L14j83K86k51k08k09J68
6851b14R6K96J9m81k57N07%O26n89k96p0K41J37L81j67p75O3L88K83J57j00p10
6873d65j74M92M42k61j68k72l5R0M76k98Q0M0J6j26j40M5k17M89N85l35n82q3
6895d01j3M44L15n0n95m29K27M33M09j54l34l91K06N79K24j2l29j031O66M28j52
6916D0k41k56L22J15N2K74j95k39K75k93K4r2j30k14P20M19m42n68l9K39O13L87
6938G71n83n77o5M19O29k91j49n49k51L57N99r8m36J46l76M33L13J22l83j92K26
6959F5N3O6k73j21j31N52Rn31j07m6O24J45r6l69l90L06M18M98l72o03l76L90
6981b89O69K22m61l66n33M62L69K59l30n42K35K31K14J45N3j058L37K75L84J5
$$ plain form
6831 340 352 -64 -364 -199 -8 217 375 203 -237 37 274 142 -131 183 0 286 35 -173 -382 -214
6851 -214 -118 178 197 -284 -541 -34 -34 592 3 -293 -363 -122 15 396 229 -546 -483 -95 188 345 245 -465
6873 -465 -639 -147 295 34 -134 -406 -441 -351 125 -173 -93 -53 -37 -163 -303 -258 -475 14 599 264 -318 -401
6895 -401 -414 30 345 295 -300 -729 -502 -69 340 186 -148 -539 -333 246 470 458 129 -902 -236 192 40
6916 40 -201 -457 -135 -20 32 306 111 -128 147 -146 -122 -214 -344 -558 162 581 139 -429 -468 -229 384 771
6938 771 188 -389 -454 -35 594 303 154 -395 -646 -289 310 212 -224 -78 -454 -21 292 414 31 -161 65
6959 65 118 184 -89 -210 -341 211 220 -311 -418 -464 160 305 209 -160 -550 -244 174 672 300 -303 -679 -289
6981 -289 380 602 141 -225 -758 -296 73 332 2 -540 -305 -74 140 285 338 -720 -383 -108 276 291
7001B91k59k90J5L74k87j14j7L58J81lm52j89K81R1L09j21r8m08l85O10R67n40
7023C14n8n73j78N69L83qo68k68J28N38Q7L19q16j10O5L24O9k77O34n57J00l4
7045a7J08k01j92N60n9qj28k41jN10M59o78l75p5J35O99J93m92n81J39J37P02
7067E94J88n29q26K06K10P83jl00n01m9J36O25q8k91j30n6N5L67l24O1j26L23
7089C27j46k57J14j19P8M60j53j82m44K36l6O99j81l05n58M71M64k33K62m97l71
7110c71J04N89J00j28n14r9J36J35L36l08k17J83j00K01oq4j39K66J40l46k47
7131c69J70J48N9M41l20k18r2L81J79j33O8n45NL43N77l28j40o33r1M91M05J17
7153E15o76O7k96P2M28O6J2j89l43L44J67J32k72k37M18N6l41m5J14j24K74O6
$$ plain form
7001 291 32 -258 -243 131 -156 -270 -287 71 252 249 -203 -392 -111 -20 289 168 70 -338 -723 -113 854 314
7023 314 256 -317 -495 74 457 449 -219 -487 -359 179 266 585 -231 -341 -276 48 117 -160 474 -83 17 -17
7045 -17 91 -110 -302 258 199 191 63 -178 -179 331 790 112 -263 -338 -203 496 689 197 -384 -245 -108 594
7067 594 782 253 -573 -367 -157 626 625 325 -176 -225 -89 536 448 157 27 -29 26 393 69 130 4 327
7089 327 181 -76 38 -81 -3 457 304 122 -322 -86 -122 577 396 91 -467 4 468 235 497 0 -371
7110 -371 -267 322 422 294 -220 -319 -183 -48 288 -20 -237 -54 -154 47 41 -43 -182 84 224 -122 -369
7131 -369 -199 -51 8 449 129 -89 -181 200 379 246 314 -231 -226 117 694 366 226 -407 -498 -7 398 515
7153 515 -161 -94 -390 -318 110 176 188 -1 -344 0 167 299 27 -210 208 264 -77 -122 -8 -132 142 208
7175B08k79p7K53K11Or4m09p1l7M81K23k8n08k76P1K62O66m31l07R7k96L89M54
7198E08l63l7l15K51k7J78m2J26p1k53K67j57k47M46k94J97rm07j67N45L20j68
7220B81k81m33J26M43J19m6q7l99k00M7M73K20j26p04N9N11NK52k21k32m9n7P3
7243b26l6L79l35J3J11K33j35K7j16K79j93k32K0J18j11L22j82j43l01O3L30L45
7265B30k85k74j63j66M42P6K3k84j35J02K91J71L03o71k22k03L88L41J80m9m96
7286d01j9J17M11k25K2M4k72N5J90k49Q7L76l87O4k94M96k57K88K96n37j02l6
7308c33L46J83L7M7n37R5p9M24M34l88k12l76j11O57R1k60j58qk23M50M23o35
7330a33M76n31J02J60J58K7l87J98j03P4k58K59j92M85rl06k73J16M2L57k30L23
$$ plain form
7175 208 -71 -148 105 316 322 228 -181 -252 -289 192 415 387 -121 -397 -326 -64 602 171 -136 -39 -335 54 508
7198 508 145 108 -207 44 17 195 153 279 208 -45 222 65 -182 264 -30 167 158 -249 -416 129 449 281
7220 281 0 -433 -307 136 255 209 122 -277 -477 -430 43 263 137 -567 -508 3 8 260 39 -193 -242 -299 -226
7243 -226 -262 117 -218 -205 -94 139 4 31 -85 194 1 -231 -211 -93 -204 118 -64 -207 -508 -445 -115 230
7265 230 -55 -329 -492 -658 -216 -140 -117 -401 -536 -434 -143 28 331 -340 -562 -765 -377 -36 144 95 -401
7286 -401 -420 -303 108 -117 -95 -51 -323 -268 -78 -327 -240 136 -251 -187 -481 15 -242 46 342 -195 -297 -333
7308 -333 13 196 233 280 -257 -162 -241 183 617 229 17 -359 -470 187 278 18 -140 -148 -371 79 502 -133
7330 -133 343 -188 -86 74 232 259 -128 70 -33 41 -217 42 -150 335 326 20 -253 -137 -95 262 32 355
7352C55p27j94O25R5J47l10l72J56J33L01J65k89m56J60L3M03Q5m46k75K21J3
7373a77M22J27m40j24Q4M1n2K84j83J05j06M76p61J09K08J53J06m3m55m24N70
7394h0L59K79o64%m68R5P59J88m34m81L0L14J76M52q1o05j88N32M0j42J45m87
7416b61K04K36r4l09M09k79K50j7p7k75j17J69M37k12j46l34N8J23M13J48m12
7437h6l63J0M77N27j62J9p27J29p0M38J85j48o56J72L61R8K71l54j68K4K02j65
7459A4l15K95%K61M6l91l66J33P01K44m16j21k55k06P81K33m26o17q0J02Q68j3
7481D72k27m95n15M62L93L41l50O1m44P1K80K68k27N2k4k32N84k67k14l31L02
7502d0K54m37J74l61N77K9n0k48j54r1K39M74L43r21k99K59L08N86j02n70m47
$$ plain form
7352 355 -372 -566 59 154 301 -9 -381 -225 -92 209 374 85 -371 -211 -178 225 310 -136 -411 -190 -177
7373 -177 245 372 -68 -192 -108 -67 -119 165 -18 87 -19 457 -304 -195 13 166 272 229 -226 -650 -80
7394 -80 279 558 -106 -106 -574 -479 280 468 34 -447 -417 -103 73 525 444 -161 -349 183 223 81 226 -261
7416 -261 -57 179 85 -224 185 -94 156 139 62 -213 -330 -161 276 64 -82 -416 -358 -235 178 326 -86
7437 -86 -449 -439 38 565 403 422 -305 -176 -246 192 377 229 -427 -255 106 204 475 121 -47 -23 179 14
7459 14 -301 -6 -6 255 301 -90 -456 -323 378 622 206 85 -170 -376 405 638 212 -405 -485 -383 485 472
7481 472 245 -250 -765 -303 90 431 81 142 -302 -231 49 317 90 142 118 -114 470 203 -11 -342 -40
7502 -40 214 -223 -49 -410 167 196 146 -102 -256 -347 -108 366 709 -212 -511 -252 56 642 540 -30 -477
7523d77k04P50M15J31n24k53l72K80N01j08K1k56j03J81N3k18J80j89M52q9k80
7544a09q9k7m3N86l65q5j99L87M22J99m38o73r5M71M34O4o2q36k52M92O87J03
7566E72m04n19j9J94M71q4n7l75O6Q8L75k92Q1l80L73j07o9k43J94k59M85J55
7588B46j39m40J51O13j41j21n4m10L9N71M68l56m72l58r4R99P0k61n14j56P5L42
7610E8N68j97p78P3K35K37K16k53m30j70P26k9m11P1l2L18J07j01m47l61N81K14
7632A95K97n39Qm70L01Q35Ln27m58J03j17Q62J9n46n49n5O80N62j55l60m55N9
7654c07L73k7J73j84K9k72M43j65K8k20J62j78R2K37l44k56N93K70m77O8k42J70
7676c4M1O14k40p54K4m40R65J90r7o82r4L59M98k57Q0K9m27r4M98L6J43p2m28
$$ plain form
7523 -477 -681 69 484 615 91 -162 -534 -254 247 139 160 -96 -199 -18 35 -183 -3 -192 260 171 -109
7544 -109 -198 -225 -268 318 -47 -132 -331 56 478 677 239 -434 -529 -58 376 440 378 -458 -710 -218 469 572
7566 572 168 -351 -370 -176 295 211 154 -221 -155 -67 308 16 97 -283 90 -17 -86 -329 -135 -394 91 246
7588 246 107 -333 -182 431 290 169 115 -295 -256 315 783 427 -45 -403 -497 502 572 311 -203 -359 -284 58
7610 58 626 429 -349 -276 -41 196 412 159 -271 -441 285 256 -155 -84 -116 202 309 208 -239 -600 -19 195
7632 195 492 -47 -39 -509 -208 627 630 103 -355 -252 -369 493 512 -34 -583 -638 42 604 449 89 -366 -307
7654 -307 66 39 212 28 57 -215 228 63 91 -129 33 -145 -53 184 -160 -416 177 447 -30 38 -204 -34
7676 -34 7 621 381 -373 -349 -789 176 366 269 -413 -507 -148 350 93 173 202 -225 -319 179 215 358 286 -142
7699a42N01k31j01j53K57K7j92K87l29Q1n5L89ll67q7j32K89K55j38k56j08K25
7721A7l43O95q9j90j02o46Q83K0N35q49j28l84N02L33j95j70J23k31J80K04L0
7742A95m88N31K1m78l74M96j31J41M84n20l9M1k9L7J88J14o27j74M56M83J12k91
7764A48k27m87N2Q23R7j20n27k16n2P12J03n13M4J22k57M3M57k15l67L75j59k09
7786c73K91L05k87J18P0l10l38L25L89j29p2j02k82J98K20J62J28m50Q2k30k41
7807e26Q51J87n96j28q1L04J33J54k54j61l3k07K85N31k77k38L2R9j35k56N50
7828B34J13k09l3Q5n19L78L92l42J22l61O1J45K47R7m92k71J80N7K60L50m10k15
7850a31k48N9L25L15j66l36P9k40K45M4M75l19m99J9J43M02j29Q3j29j6M1J26
$$ plain form
7699 -142 359 128 27 -126 131 158 -34 253 -76 5 -50 339 336 -31 -118 -250 39 294 156 -100 -208 17
7721 17 -326 369 280 90 -12 -658 225 245 780 -69 -197 -581 -79 254 59 -111 12 -219 -39 165 195
7742 195 -293 238 259 -219 -593 -97 -228 -87 397 -123 -162 -121 -150 -113 75 189 -438 -612 -156 327 439 148
7764 148 -79 -566 -514 309 406 286 -241 -457 -509 203 306 -207 -163 -41 -298 -255 202 -13 -380 -5 -164 -373
7786 -373 -82 223 -64 54 124 -186 -524 -199 190 61 -11 -113 -395 -197 23 185 313 -137 -55 -285 -526
7807 -526 325 512 -84 -212 -293 11 144 298 44 -117 -150 -357 -72 459 182 -56 -24 75 -60 -316 234
7828 234 347 138 105 190 -329 49 441 99 221 -140 -79 66 313 410 -82 -353 -173 -116 144 494 84 -131
7850 -131 -379 -320 5 320 154 -182 -103 -343 -98 -54 421 102 -397 -378 -235 167 38 121 -8 -24 17 143
7872A43N1r5j69m8P8J7j58o5L27N93m19J71r05L14K14K85n01k84L59k63O12J67
7894D24k36m97m6K64J99M93k49o59m5j10M87J0p5k53j51O2M54m5j77J10K06r2
7916G4n4j07J1P0L38j90j14j87J89K68n7L89n31m34J72m2L81K55j62n53j57N88
7938A47M48l50K06o49n09R35j22J78o0m17J82j8M63k33j86k6J39NJ55k1p10O15
7960A72K7j75k13L0j59N68J55J6n11m01L10M78K32k62k63l49M9L13M00P4o14o89
7982h12M97N81J76l63l99Jl9N01R4n37M2k17J86K45j16j61P6M53j59m6j65J55
8004gj2j6j0K95p39k71Q80K87j63j86j86l02M09N80k94o58j10N4K54N72q6m71
8026a80j13J05K96j86J78k85l03K35N81l45l6q1L6L38l11j51p8O3L90J47j72l27
$$ plain form
7872 143 194 99 -70 -118 -40 -23 -181 -246 81 674 255 426 -479 -165 49 334 -167 -451 -92 -355 257 424
7894 424 188 -309 -355 -91 108 601 352 -307 -352 -462 25 35 -40 -293 -444 -382 72 27 -150 -40 166 74
7916 74 20 -87 -76 -6 332 142 28 -159 30 298 241 630 99 -335 -163 -205 176 431 269 -284 -441 147
7938 147 595 245 451 -198 -707 228 106 284 224 -193 -11 -29 434 201 15 -11 128 133 288 267 -443 172
7960 172 199 24 -189 -159 -318 250 405 421 -90 -491 -181 297 529 267 4 -345 -296 17 417 491 -123 -812
7982 -812 -315 266 442 79 -320 -319 -358 143 237 -300 -258 -475 -289 -44 -160 -321 -245 208 49 3 -162 -7
8004 -7 -19 -35 -45 250 -489 -760 120 407 244 58 -128 -430 -21 559 265 -393 -503 -449 -195 377 291 -180
8026 -180 -293 -188 108 -78 100 -185 -488 -253 328 -17 -53 -134 -98 240 -71 -222 -300 -237 153 300 128 -199
8048a99m66L70P72J71l85n62lK2O80M03l71q06Q8j94Q70J12n33Ql39J27K69L85
8070D19m38Nl18K76L61l88m6o2j25O54o5l98k42L75L69l07j16n11J88N63K02j3
8092C83r10M2J07K80Q49K3r64m66M23r7R24l7n94o40N19L28L48l28j68j21J65
8113F6K29l36j3j92M23k49MJ84m83L95K27K0k12m37k9J87M43N34p92n07L36J53
8135d9K15J24P5p80j53J18Q46j74l66l9l23M09J80o0l72M07k37K42J04k16j10
8156a59J49j09N45m80j76k60L85K39P9p15r7K09M50J20J43l40n10K27N44L55m36
8177A63m13m41N65M18J7l35p7k97K68L98N8m04L5l3
$$ plain form
8048 -199 -665 -295 477 648 263 -299 -302 -280 400 803 432 -374 -286 -480 390 502 -31 -23 -362 -235 34 419
8070 419 -19 -14 -332 -56 305 -83 -129 -191 -316 338 273 -125 -367 8 377 70 -46 -557 -369 194 396 383
8092 383 -527 -485 -378 -98 751 774 -190 -656 -233 -330 594 557 -37 -677 -158 170 518 190 22 -99 66
8113 66 295 -41 -54 -246 177 -72 -68 116 -367 28 255 275 63 -374 -403 -216 227 761 -31 -538 -202 -49
8135 -49 166 290 365 -415 -568 -450 396 222 -144 -183 -506 -97 83 23 -349 58 -179 63 167 -49 -159
8156 -159 -10 -119 426 -54 -230 -490 -105 134 213 -502 -599 -390 60 180 323 -17 -527 -300 244 599 163
8177 163 -250 -691 -126 292 309 -26 -103 -400 -132 266 324 -80 -45 -78
8191g8
$$ Imaginary data points
##PAGE= N=2
##DATA TABLE= (X++(I..I)), XYDATA
0@%%%qJ6j6K4l2M0n0O2p9R9j24J49j81K21k64L12l70M34n02N85o77P76q92J020
27E43j158J313j485J674j882K111k363K638k943L276l638M040m480M962n496O082
43C194o733P462q272R185j0227J1419j2798J4422j6361J8723k1686K5525l0715
56a6862L8174m9879P1020j21115M47165M35767q43427k87553K83173L20929m4537
67B32855J8821N069j19035j79454P5155J95202P3262j65958j36598M5993J67224
78B12536P4042p4421k11753j20921J77903L00648m3426l16515r3690K23779J12396
89B40578j50874j45075P5375J69675L4948j40112j03097K1972p754m4758J38700
100H9578K24832p7270l64472j83464K15097L28525O2163k46969k27294O5167J88132
$$ plain form
0 0 0 0 0 -8 8 -8 16 -16 24 -26 36 -43 56 -68 81 -100 121 -143 169 -201 233 -269 316 -361 415 -477 543
27 543 -615 698 -787 887 -995 1116 -1247 1391 -1552 1724 -1914 2126 -2354 2608 -2888 3194
43 3194 -3539 3923 -4349 4836 -5391 6028 -6770 7652 -8709 10014 -11672 13853 -16862
56 -16862 21312 -28567 42453 -78662 368503 804270 -39157 -326710 -43537 277392 232855
67 232855 251676 256745 137710 -41744 33411 228613 301875 135917 -681 45312 212536
78 212536 286578 212157 404 -120517 57386 358034 314608 -1907 -95597 128182 240578
89 240578 89704 -55371 20004 189679 224627 84515 -18582 3390 -4364 -49122 89578
100 89578 314410 237140 -127332 -310796 -95699 232826 294989 48020 -179274 -114107 74025
111G4025J5875j01661l6164P779K3490P7558J7571j25010r3560M3687N8633N8986
123B1209J03390l5590k59210j38721K32591K83533p3934l03481q6375K23246J69587
134A36245j11982j68936j669O2856L7445Q7490O1486j21429j83388j7512J36431
145h2963J60921P9281j13845k33215n5546J93092J52284n7087j16413j2005P9085
156f411M0845q4316r1105P5415J41599r074r8648j8945J0844k7252K8315R9337
168F0604L1554r0792j09875N523J51480J24824j02292k12949k5643J88046J63963
179A84443j1399j59498j67615j043J74733J51759j695j04111j28779p2756P4075
190f1886J65478P7109p7087j40054o8357Q7906J42930j6356j46590j8717J25585
$$ plain form
111 74025 89900 -11761 -47925 -40146 -16656 60902 78473 -46537 -140097 -96410 -37777 21209
123 21209 124599 89009 -170201 -308922 -76331 207202 133268 -170213 -256588 -33342 136245
134 136245 24263 -144673 -146342 -83486 -46041 41449 102935 -18494 -201882 -219394 -82963
145 -82963 77958 157239 43394 -189821 -245367 -52275 100009 42922 -73491 -85496 -6411
156 -6411 34434 -49882 -140987 -65572 76027 66953 -31695 -50640 -39796 -67048 -38733 60604
168 60604 92158 1366 -108509 -102986 48494 173318 71026 -141923 -167566 20480 184443
179 184443 173044 13546 -154069 -155112 19621 171380 169685 65574 -63205 -135961 -61886
190 -61886 103592 180701 103614 -36440 -104797 -16891 126039 109683 -36907 -55624 69961
201F9961L7959q5057m8661J9680K4889K5357J2069k2016k4183j2974q936L4153
213B2241N0166l8254q7630J0546R1394M2358l9774q4773p2875M2905J42654N6621
225A35579j02910j14277j0513O0930O3004J7449k9151k7804k3611l3988K2292
236d3000Q2296l026r8745p940J00026K0032q9929n6667L1290O9672N0933k7879
248B7063q9077l9158M3869N7525L2453j0837p0211n4604M2607P4864K0041k2442
260A2093n8556p3002K6901J35487O0452r7057j15578j1103P5879Q5562J6990n9987
272a919n0408k832j771J6999O6784K4186o4472m5640K6842K3406n316L068Q363
285b710R768J0918k7291m7928J3224O4455K8343k1417m4224m6014J6407Q5942
$$ plain form
201 69961 107920 22863 -25798 -6118 18771 44128 56197 34181 9998 -2976 -11912 22241
213 22241 72407 34153 -53477 -42931 48463 90821 51047 -33726 -106601 -63696 78958 135579
225 135579 32669 -81608 -92121 -31191 31813 49262 20111 -7693 -31304 -65292 -43000
236 -43000 39296 36270 -62475 -70415 29611 49643 -40286 -96953 -65663 4009 54942 27063
248 27063 -62014 -101172 -57303 222 32675 21838 -48373 -102977 -60370 14494 34535 12093
260 12093 -46463 -119465 -92564 42923 103375 6318 -109260 -120363 -44484 41078 58068 -1919
272 -1919 -52327 -55159 -56930 -39931 26853 51039 -13433 -59073 -32231 -8825 -14141 -11073 -2710
285 -2710 7058 17976 -9315 -57243 -44019 20436 48779 27362 -16862 -62876 -46469 39473
297C9473L3933o2122m6273P272J349K2190O8725J5216q4706p6579K0416Q7248
309B6142P0329k3773r2514m2764L8467L9022K0304K4441k0210o3601j3731M2411
321D523K1732M556P959k5512l4750J9285L4135j2153j9843Q981J5411O175j5155
334A5344l7459L199O1061J8343n2386k7131J8205K828O494L6607M722m9401l8321
347c7895P164M6373N6532m334q0652n1284L6083N5982K6745o46m6396n6446J4868
360c3906N6955J3736j4309l330k1394k5836K0103L3556l412j7641p656J811J6203
373A4880J742l8269r273N8668K9958n1371m3781Q744K2462L0855K7300k8246n9873
386c6204j5229L3045M6422L6176k2821q1358l7729N1508O6240K4715k2285p2387
$$ plain form
297 39473 73406 11284 -34989 -27717 -26368 -4178 64547 79763 -4943 -81522 -61106 26142
309 26142 96471 72698 -19816 -62580 -24113 14909 35213 59654 39444 -24157 -37888 4523
321 4523 26255 30811 38770 13258 -21492 -2207 31928 19775 -68 8913 24324 30499 15344
334 15344 -22115 -18916 42145 60488 8102 -19029 -824 2004 8498 45105 49827 426 -37895
347 -37895 -30731 15642 72174 67840 -12812 -64096 -28013 27969 54714 54068 7672 -48774 -33906
360 -33906 23049 36785 22476 19146 -2248 -28084 -7981 25575 22163 4522 -3134 -1323 14880
373 14880 16622 -21647 -30920 27748 57706 6335 -37446 -28702 -6240 24615 51915 23669 -36204
386 -36204 -51433 -18388 28034 64210 41389 -39969 -77698 -26190 40050 64765 42480 -29907
398b9907n5022M8209Q8450Q541n0246l3824j2173R134L8593K2712j9297k3435
410h265j1267M33K5913J7126l2622k0647M1343K5768l8187l4703P619K3886L6111
423C2508J9383m6890o5186O551O2639M8665J831n7108p3138M162Q1586N5678j2721
436E7960n2309o6669j7075Q1740Q7188k4283q8675m1757K5814N7859M0991k4882
448C5902n6967j1982K8693K1106J1383q267l8948o658N3254K2052m9089l7939
460c7460J8587L7584L2271k172o0793n3467L2034P8161L8202l4123q4569n1163
472h6908N8949J01743J4324o6945n9924k4130K9679Q6180M5689o9195r1437j678
484f3653O4872N5572K255n5613n0897J8119M9588J3479j6999k6284k1576K3169
$$ plain form
398 -29907 -84929 -36720 51730 60271 10025 -23799 -35972 -26838 11755 34467 15170 -8265
410 -8265 -19532 -19099 6814 23940 -8682 -29329 12014 37782 -405 -35108 -27489 -3603 32508
423 32508 51891 5001 -60185 -53634 9005 57670 59501 2393 -70745 -66583 15003 70681 57960
436 57960 5651 -61018 -78093 3647 90835 66552 -22123 -63880 -38066 19793 60784 35902
448 35902 -21065 -33047 -4354 16752 28135 19868 -19080 -25738 27516 49568 479 -37460
460 -37460 -18873 18711 50982 48810 -11983 -65450 -33416 44745 82947 48824 -35745 -86908
472 -86908 -27959 73784 88108 21163 -38761 -62891 -33212 52968 98657 29462 -61975 -63653
484 -63653 1219 56791 59046 3433 -47464 -29345 20243 33722 16723 -9561 -31137 -7968
496g968N0489j0076o5483j7195M6835M1365O265l4369o3137j7812O7875P0495
508F7284o641o6628p1331p766Q8007Q9081k8083j01233n0001K7366O6641O2355
520F9051r507q8565o1444L4314P5895M0166k6175p2877l4977N0294N6985q995
532B4165l5325j7157m528K4644L9268j7944o0948m127O0337L7611k3420n4817
544c2241l7706K8763P5657L1826m5836o8931l7018L6837J00710M8908q3600j07402
556i0033J552P9623O7123J4005n7415q7633j2115Q0801O9277r337o2766n6753
568f3671J0481P1297L6935m1565m7012N58K5374L1439R529m5538m6357L3603O7979
581D3052O610n2598n0833n819N7277O8584j1922q0426n0404K1098O5622O2389
$$ plain form
496 -7968 42521 32445 -33038 -50233 -3398 37967 44232 9863 -53274 -71086 -3211 67284
508 67284 60643 -5985 -77316 -85082 2925 92006 63923 -37310 -87311 -59945 6696 69051
520 69051 59544 -29021 -90465 -56151 19744 59910 33735 -39142 -74119 -23825 33160 24165
532 24165 -11160 -28317 -32845 -8201 31067 13123 -47825 -51952 8385 45996 22576 -32241
544 -32241 -69947 -41184 34473 66299 20463 -48468 -85486 -48649 52061 100969 17369 -90033
556 -90033 -88481 -8858 58265 72270 14855 -72778 -84893 -4092 65185 55848 -6918 -63671
568 -63671 -53190 18107 55042 13477 -33535 -32977 -7603 23836 33365 -12173 -58530 -24927 43052
581 43052 49662 -2936 -53769 -59588 -2311 66273 54351 -26075 -76479 -55381 10241 72630
593G2630j1192r6348o8132M6968R3420L7976l8229p9389m9113M3570Q4872K3958
605F0991m5807n6502k3760L2679O2141P480n4877k7390K5184K1276M717m782l0090
618b8740k0340M1739N0623k2585o4836k5477L6285O4671K5042n2924o9796m620
630g0958N2075N6977K2984n0558r1448j2875R3086P3793k2101o7006n3257n337
642g4625O5219P7828o954p9529n5956K0532O8711M2444l3371n7212l34L5022J2640
655A4415r53n381k7570o474N0906L1177m6905n4314J0122N1232M2394l510n8454
668c315n1755K3172O7541L7819j9956o5075n1254L6451R1238K5190o0713o0115
680c0772r490L4702O0174K8805m4559o4626j2268M1444N2728J4677m7248m8369
$$ plain form
593 72630 61438 -34910 -103042 -56074 37346 75322 37093 -42296 -91409 -47839 37033 60991
605 60991 15184 -41318 -65078 -32399 29742 37222 -17655 -45045 -19861 1415 6132 1350 -28740
618 -28740 -49080 -7341 43282 20697 -44139 -69616 -33331 31340 56382 3458 -66338 -70958
630 -70958 -18883 38094 61078 10520 -80928 -93803 -717 73076 50975 -16031 -69288 -74625
642 -74625 -9406 68422 61468 -18061 -74017 -53485 15226 57670 24299 -32913 -33247 1775 14415
655 14415 13462 8081 -19489 -25963 24943 56120 9215 -45099 -34977 16255 58649 55139 -3315
668 -3315 -55070 -31898 35643 73462 53506 -11569 -62823 -26372 64866 90056 29343 -30772
680 -30772 -40262 -5560 54614 83419 38860 -25766 -38034 3410 56138 70815 23567 -24802
692b4802K0614M7680l501l0898n931R689J7106K0320j4094m9555j6752M2527M9990
705F2393R406m4270o4143p656O5702N4151j1507m7202m9579j5366N9545P9009
717I0483j5536r1241m3158L7586N6623L2096j4995n8157m2895J9780N2728L3983
729E7297j2115n2171l3553K7022L8603k495j7366n377l750O790J8036j4938l7955
742c1972P637M8220J7900k5749l5892k2266J5137N0057K6181k9042m4279k1399
754d5467J7396N2714L1871l9844n9801l223M0349L8647J4612l2728n9259p840
766e2573N5811M1260r819k9933k8647q932K9471L2364p056k2387l940N183N924
779F726N722j3008j6812J8412L4510J478k9843l1192q568L5458N0299q73m8426
$$ plain form
692 -24802 -4188 43492 39991 9093 3162 12851 29957 50277 36183 -13372 -30124 12403 62393
705 62393 71799 27529 -36614 -44270 21432 75583 64076 16874 -32705 -48071 11474 90483
717 90483 74947 -16294 -59452 -21866 34757 66853 51858 -6299 -49194 -29414 23314 57297
729 57297 45182 -6989 -40542 -13520 25083 22588 5222 -155 -3905 2885 20921 5983 -31972
742 -31972 -24335 23885 41785 16036 -19856 -42122 -26985 23072 49253 20211 -24068 -45467
754 -45467 -28071 24643 56514 16670 -43131 -46354 -6005 32642 47254 14526 -44733 -52573
766 -52573 3238 44498 34679 4746 -23901 -32833 -3362 29002 21946 -441 -4381 802 6726
779 6726 12448 -560 -17372 1040 35550 37028 7185 -24007 -32575 2883 53182 52309 3883
792C883l0999N520K4665L7501J4918m1650m6330J4142M1223J8124n085k3800l2820
805b0708Q82M0999K7441j1419k8509k4040J521L0015J8326j1365n832J714j7402
818A623j2208J7140J3333k912Q790N460k5514k5307P265K3392K2699J0429k4528
831A9662m1047o489K8761K7901J2152j6391m1511j6444L2538L2520j143j8980
843A1529k5348j6636K1839L9779M697k8421k6196j4258J3137M2488J8613l2507
855H716l0721J438P202P176J7815L906j7737q282K635l420j724N247M420Q983
869E654P564j8814k5520N019K0474J0124Q612m307l2206j7362K6932K7788n490
882H468j5353j2170o969J3086K1882j107j6815j1556o682R927K9538Q549k8479
$$ plain form
792 3883 -27116 -21596 3069 40570 55488 13838 -32492 -18350 22873 40997 35912 12112 -20708
805 -20708 -19826 21173 48614 37195 8686 -15354 -13833 16182 34508 23143 17311 19025 1623
818 1623 -10585 6555 19888 16976 25766 31226 5712 -19595 -12330 11062 33761 44190 19662
831 19662 -21385 -27874 887 28788 40940 24549 -16962 -33406 -868 31652 30509 11529
843 11529 -13819 -30455 -8616 31163 35860 7439 -18757 -33015 -19878 22610 41223 8716
855 8716 -22005 -20567 -13365 -6189 11626 15532 -2205 -10487 -7852 -11272 -12996 -7749 -3329 5654
869 5654 13218 -5596 -31116 -26097 -5623 4501 13113 8806 -23400 -40762 -13830 13958 8468
882 8468 -6885 -19055 -26024 -12938 8944 7837 -8978 -20534 -27216 -17289 12249 20798 -7681
895g681k0280O371P874Q706J5039j791j7121n150R16n351P202J6230L239k473
909E730m086k0038j5815K0879K8825L217p933j4096k6239n358L6763L0867j0244
922B2472k9421k1524J678K9895K6854j0632k7804j3997k60K0841L4742Q56m2072
935h372k6641J3335K5321K1789Q531k5930l4927J877K5527J4109K374l477j4183
948f67o355O350k624l411J5230J1590q704r969n793j1642N110K9076J2494j8056
962A2629k3218j2138R781L3763J7688k9572l3974M130K2866J9863R825k0398l8111
975b6866l683L4817K4827j492j7839k7757j0866K5845K7336l614j7441j2197j896
988a0826J4611J2407j7096j8291J7862K3652m882j7329j4480j0317J6162L5471
$$ plain form
895 -7681 -27961 -21590 -13716 -5010 10029 8238 -8883 -14033 -13117 -18468 -11266 4964 8203 5730
909 5730 1644 -18394 -34209 -13330 15495 18712 10779 -3317 -29556 -34914 1849 32716 22472
922 22472 -6949 -28473 -26795 3100 29954 19322 -8482 -22479 -22739 -1898 32844 33700 -8372
935 -8372 -35013 -21678 3643 25432 33963 8033 -26894 -25017 510 14619 16993 13516 -667
948 -667 -7022 -672 -3296 -6707 8523 20113 11409 1440 -4353 -15995 -10885 18191 30685 12629
962 12629 -10589 -22727 -12946 20817 38505 8933 -25041 -20911 1955 21818 31643 11245 -26866
975 -26866 -30549 4268 29095 27603 9764 -17993 -28859 -3014 24322 20708 3267 -8930 -10826
988 -10826 3785 16192 -904 -19195 -1333 22319 17437 108 -14372 -24689 -8527 26944
1000B6944O628l0028k7690n641J8670L6926J3357l5342l8415M950L0866K5522
1012B6747L087l1192l6760Q315M0180J9312j0959k3261k3684kL0344K1271j0560
1025A2838j6343r275m375J1963J5977j0759j6037J4020J9101j1409k2849q799
1037b5947Q958K7576K2032j8064l9901j4389J9553L3349K4491j5478n0571k2077
1049e0468L3379M1524J0940k1077m3004k4888L5620N6290L933m2951l7304k781
1061d0787L2624M0208O08l7268k3996O618J8337J8768L482k4685j6960K0655K0827
1074A8431j1222k1018o248J1694K7364J4762k9211l9065K549L5113K9430K424
1086C5003l2791m1791M877M8710K7314j6491l2489k4177M984M1184L2211k1314
$$ plain form
1000 26944 33572 3544 -24146 -29787 -11117 25809 39166 3824 -34591 -29641 1225 26747
1012 26747 29834 -1358 -38118 -29803 10377 29689 18730 -4531 -28215 -28217 2127 23398 12838
1025 12838 -3505 -12780 -17155 -5192 10785 26 -16011 -1991 17110 5701 -17148 -25947
1037 -25947 -16989 10587 32619 14555 -25346 -39735 -20182 13167 37658 22180 -28391 -50468
1049 -50468 -17089 24435 35375 14298 -28706 -53594 -17974 38316 42249 -702 -38006 -40787
1061 -40787 -8163 32045 32653 -4615 -28611 -21993 -3656 15112 18594 -6091 -23051 -2396 18431
1074 18431 7209 -13809 -20057 -8363 19001 33763 4552 -34513 -31964 3149 32579 35003
1086 35003 2212 -39579 -34702 14008 41322 24831 -7658 -31835 -26851 14333 46544 25230
1098B5230m4494j5868K1230L6236J8519k5196l8867j44K7459J4971j801j1610
1110E665j7799J848K6676P420k6431j7333J1635K1694J6506o594l6679k5176K3509
1123a5059M2648J5550k1167m3593k5897L0790N4685Q267l9377l4924o720K3604
1135a1193M1272J3123l8319m0933K953L2669L0239J297l3982l1906J1862L2151
1147I233R900j0853j5814j2427J0167K3540l176k7832n775K1254J6969m68j8229
1160c511k8901j713L7390K9676j1386l5243k9128L017M5286L9292k1272n2513
1172b9006j9722K3040L6533K4152j6430m7688j9253K9927L6546Q705j9628l4170
1184b6994j2571K9416L1319o544k4121j1297K961J7131J5050j3423k5224N345
$$ plain form
1098 25230 -19264 -35132 -13902 22334 40853 15657 -23210 -23354 4105 19076 17275 5665
1110 5665 -12134 -10286 16390 23810 -2621 -19954 -8319 13375 29881 23287 -13392 -38568 -15059
1123 -15059 27589 43139 21972 -21621 -47518 -16728 37957 46224 6847 -28077 -34797 -11193
1135 -11193 30079 43202 4883 -36050 -33097 -428 29811 31108 -2874 -34780 -22918 9233
1147 9233 19133 8280 -7534 -19961 -9794 13746 10570 -17262 -23037 -1783 15186 14718 -3511
1160 -3511 -32412 -34125 3265 32941 21555 -13688 -42816 -39799 5487 44779 23507 -29006
1172 -29006 -48728 -25688 10845 34997 18567 -29121 -48374 -18447 18099 26804 7176 -26994
1184 -26994 -39565 -10149 21170 14626 -9495 -20792 -17831 -700 14350 927 -24297 -18952
1196a8952K7107R279j3363k2326j3659J8611L6947P187l1023k9862l601K2733
1208a0922L8812J2800l9369m2362P417L7884K5951j014k9091l4426O084L8894
1220A0658K0333j2929k3688j6813O249K8331J4096j8983j7624K018Q709R779M559
1233A4695j4572j4801J5158K2658o006k1871j1650O235K3244K0699j3268l3930
1245a3409j2535J7004K6641K0222j1280m2390j9514K7950L4595P470j5813k9731
1257a0790j9559K1277L8156M536k6123k0377k824J4751K2906J476k3488j0538
1269a0597J0647P469K016L9j0586p501J5747J4453j3886j9893n74J4903J9693
1282B1930M757k5204k7590P138K9006J8150k784k4021l1159K559L8720K3930j4265
$$ plain form
1196 -18952 8155 17434 4071 -18255 -31914 -13303 23644 30831 -192 -30054 -33655 -10922
1208 -10922 27890 40690 1321 -41041 -33624 4260 30211 29197 106 -34320 -28236 10658
1220 10658 30991 18062 -5626 -22439 -16190 12141 26237 7254 -10370 -8352 357 10136 14695
1233 14695 123 -14678 480 23138 17132 -4739 -16389 -10154 13090 33789 20521 -13409
1245 -13409 -25944 -8940 17701 37923 26643 -15747 -35261 -7311 27284 34754 18941 -10790
1257 -10790 -30349 -9072 29084 33620 7497 -12880 -15704 -953 21953 23429 -59 -10597
1269 -10597 50 7519 9535 9574 -1012 -8513 7234 21687 7801 -12092 -12666 2237 21930
1282 21930 26687 1483 -26107 -18969 10037 28187 25403 1382 -29777 -27218 11502 35432 21167
1295B1167k6733j8627K633K7733K3975j0996k7810j1666P164J9456J5742j1283
1307A0755k4313J124J6987J542o024J490l394l398J1045M633j5522r219J1003
1320c291J3334M829p262k0239r975J8420K3129J753j4637k0215j2655J7928L2881
1333B4000K888k5572j7654q10R508K0344J1771j6392k1357j202J0572J3131P745
1346A6972r966j6780K474J2717J91l693K280k554k015O718j417j1225K939J3356
1360I997J271n586m644q967j268J8220J2821r506j5553r028k6J8015K1873p012
1374B0607k6660j1166Q981J3865J3813P35j8521j4532N288J0078R274N549j0524
1387F787j5791K442J2239M67j105K599n538n550O189J607o307L990R166m948r523
$$ plain form
1295 21167 -5566 -24193 -21560 6173 30148 19152 -8658 -20324 -13160 6296 22038 10755
1307 10755 -13558 -12434 4553 6095 71 1561 -1833 -5231 5814 10447 -5075 -14294 -3291
1320 -3291 10043 14872 7610 -12629 -22604 -4184 18945 20698 6061 -14154 -26809 -8881 24000
1333 24000 26888 1316 -16338 -17148 -7640 12704 24475 8083 -13274 -14476 -3904 9227 16972
1346 16972 7006 -9774 -7300 5417 5608 1915 4195 1641 -374 6344 4927 -6298 -3359 9997
1360 9997 11268 5682 1038 -7929 -9197 9023 21844 12338 -3215 -12243 -12269 5746 27619 20607
1374 20607 -6053 -17219 -8238 5627 19440 20175 1654 -12878 -7590 2488 11762 17311 6787
1387 6787 -9004 -6562 5677 6144 5039 7638 2100 -3450 2739 4346 -1961 2029 11195 6247 -3276
1402c276j337J336N601J0824j412j4018o501K396L379J2667J0592j4293k0911
1415a4953L17J2480R635Q339l897k0216r451J2241J0742L731J032q333j4123J285
1429a1171J2314N935L82m628j1785k592J2361N884o263j397Q34n916q3P873p93
1444I55l475M621q05q194L33M866p41L443P497p716j3290o06P896Q951J0494m888
1460I341k2385r724J4815J5017M903k751j4703j4400O408J7561O598k172r202
1473f94j5046j0J9769R677j1448q915o61N80O243P156m783p124L858J161m723
1488d960J639M008p54L793K929j0862r873P465J0703N459L275r933k1649j921
1502b0681K3254J6673l111j5048j8340l270K0708J8994n857j4637q271m371R056
$$ plain form
1402 -3276 -4613 -3277 2324 13148 11736 -2282 -8783 -6387 -3008 9659 20251 5958 -14953
1415 -14953 -14636 -2156 7479 15818 11921 -8295 -17746 -5505 5237 8968 10000 1667 -12456 -11171
1429 -11171 1143 7078 7460 2832 -8953 -11545 816 6700 437 -960 -126 -6042 -6125 1748 955
1444 955 -2520 2101 1296 -6898 -6565 -1699 -2440 1003 8500 784 -12506 -13112 -5216 3735 14229 9341
1460 9341 -13044 -22768 -7953 7064 11967 9216 -5487 -19887 -13479 4082 10680 8508 -694
1473 -694 -15740 -15750 4019 13696 2248 -6667 -7328 -6748 -505 6651 1868 -5256 -1398 -237 -4960
1488 -4960 -3321 687 -67 3726 6655 -4207 -14080 -6615 4088 9547 12822 2889 -18760 -20681
1502 -20681 2573 19246 16135 1087 -17253 -20523 185 19179 13322 -1315 -9586 -13957 -4901
1515d901J8778J506j8125j0122N101Q933R155o7j4496p790J0916P869m926k230
1529c99n36j828O241M307j0998r449R058J2512K298l725j2399j4189O818K3072
1543A0783J0384r739j7754j6125M785K8450J6128j7901k3303k524J0437J4676
1555H297Q016j0960j8035P68J2145P753J991p367j4611P25J8136O409j3063q559
1569h355K457P130Q962j755j7932q549J7534J8437j692j6281j8544l998K3524
1582I38K5704m842k5244j6559j523J7802K7751L469k8874k3214O783K1901J6316
1595B0408k805k2721j5162J3211J9046P72r124p451n842N921J4915j24j3608l681
1609f245N850M983L226m633j2616J470J8516P569j2519j5601o906R066K5165J1693
$$ plain form
1515 -4901 13877 15383 -2742 -12864 -7763 1170 10325 10258 -4238 -12028 -1112 6757 1831 -399
1529 -399 -935 -2763 3478 7785 -3213 -12662 -3604 8908 11206 7481 -4918 -19107 -12289 10783
1543 10783 21167 11428 -6326 -22451 -17666 10784 26912 9011 -14292 -16816 -6379 8297
1555 8297 16313 5353 -12682 -11914 231 7984 9975 2608 -12003 -11278 6858 13267 204 -8355
1569 -8355 -5898 1232 10194 8439 -9493 -18042 -508 17929 16237 -44 -18588 -22586 938
1582 938 26642 21800 -3444 -20003 -21526 -3724 24027 27496 -1378 -24592 -17809 4092 20408
1595 20408 17603 -5118 -20280 -7069 11977 12749 3625 -3826 -9668 -3747 11168 11044 -2564 -6245
1609 -6245 -395 4588 7814 3181 -9435 -7965 10551 18120 5601 -10000 -16906 -7840 17325 29018
1623B9018k1722k7314q80J8490J8850R023j4911k6560n374J9930J8790K025j2961
1636F404k0482k847K2001J5880j1079j6098m682O166J3250Q041j2302j6525M361
1649g912J4394M515m305r859r244P925J9828J798j8614j4843J905J6821K1378
1662B3787l10k9574k1743J1268K5552J5670m434k4770k1775R526K7851J0897j0743
1675A1202j6937j1606O916K1553O200j6340j2606L564R345Q774o8j4937r997J3400
1689a537J4578m775j2470o383L269J4773J0662j2738k1543j990J6464J8167P154
1702B3631j8158l0356l324L0351K3975m545k0644k1473m324K3716K5191l604k3699
1715c263j4926K915J7902J6260p024k1057n020J2062R863K639o068j4023k827
$$ plain form
1623 29018 7296 -20018 -20898 -2408 16442 25465 10554 -16006 -21380 -1450 17340 19365 6404
1636 6404 -14078 -16925 5076 20956 9877 -6221 -10903 -4737 8513 16554 4252 -12273 -7912
1649 -7912 6482 10997 6692 -3167 -12411 -4486 15342 17140 -1474 -16317 -14412 2409 23787
1662 23787 23477 -6097 -27840 -16572 8980 24650 20216 -4554 -26329 -16803 11048 21945 11202
1675 11202 -5735 -17341 -10425 11128 17328 988 -11618 -8054 1291 10065 9997 -4940 -14937 -1537
1689 -1537 13041 8266 -4204 -10587 -7318 7455 18117 5379 -16164 -18154 -1690 16477 23631
1702 23631 5473 -24883 -28207 2144 26119 21574 930 -20543 -24867 -1151 24040 20436 -3263
1715 -3263 -18189 -15274 2628 18888 11864 -9193 -14213 -2151 7712 10351 4283 -9740 -12567
1728a2567J6878J0402j1466j1554P77P239R444K116j4591j2189P871J6534P442
1741A6336n354j8468j5864J0703K8444Q729j6903k0237p811R800K2863R962j5783
1754F417j9292j997J0396J2554O207j2015j5502L969J4467L166n663o931n517
1767i741N071J4414P67j6193p532Q405J0629M931o650j6764m416J7140J5386l063
1781A2384j4204j5741l406J9833K3399l994k4974j5206L526J6994J9066k08k2458
1794d989j5646O997J4962R089k006j2964r410P654J0688j300n271k179k166M038
1808b503Q034m040j1496K102J0158K588m569o385n739N363J5126L248j3894j2547
1822a4554n00R931J6688N947j7172j9447J410J4270J2739N632j0303j9131l331
$$ plain form
1728 -12567 4311 14713 3247 -8307 -7530 -291 9153 11269 -3322 -15511 -7640 8894 16336
1741 16336 10982 -7486 -23350 -12647 15797 24526 7623 -12614 -20425 -10625 12238 22200 6417
1754 6417 -12875 -14872 -4476 8078 14285 2270 -13232 -9263 5204 8370 2707 -4224 -9741
1767 -9741 -4670 9744 10511 -5682 -13214 -4809 5820 10751 4101 -12663 -17079 61 15447 12384
1781 12384 -1820 -17561 -20967 -1134 22265 18271 -6703 -21909 -18383 -1389 17677 17469 -4989
1794 -4989 -20635 -13638 1324 10413 8407 -4557 -13967 -6313 4375 3075 -2196 -4375 -6541 -2503
1808 -2503 5531 1491 -10005 -7903 2255 4843 274 -6111 -11850 -6487 8639 11887 -2007 -14554
1822 -14554 -15054 -5123 11565 17512 340 -19107 -17697 -3427 9312 14944 4641 -14490 -17821
1835a7821J5648J0681j085n567q841l263R010P731n098n208Q97J146K501L708
1849D439n161o879N376P294j765m341k401j984N221R665k481j3189l638O307P901
1864D364O608j286j3644j0745P670J2977N864j603j0035j2545K593J3776N729
1877I723k750m933o421k347P683M884m193j525K528k527j895K716m77k333N242
1892C375K333o230m301K678K815L866L265p520r469K675R087N593N25p293j2678
1907a1279m07J3607Q868l031n389q159p320O983J4042K171p658o098m218K21Q657
1922I90N932m804m044m35k438O20N549Q22k474L74j810m571L319O098j732k859
1938a463M38k852k350M981N440k479k659k429n018K523J0144K679o025m881k893
$$ plain form
1835 -17821 -2173 8508 7423 1856 -6985 -10248 -1238 6493 1395 -3813 -2916 -1770 731 4439
1849 4439 -722 -7601 -2225 5069 3304 -1037 -3438 -5422 -201 9464 6983 -6206 -9844 -3537 4364
1864 4364 10972 9686 -3958 -14703 -7033 5944 11808 10205 170 -12375 -9782 3994 9723
1877 9723 6973 2040 -4381 -6728 955 5839 1646 121 2649 122 -1773 943 466 -1867 3375
1892 3375 5708 -522 -4823 -2145 670 4536 7801 281 -9188 -6513 2574 8167 8692 1399 -11279
1907 -11279 -11686 1921 10789 7758 2369 -5790 -13110 -6127 7915 10086 2428 -3670 -7888 -7667 990
1922 990 6922 2118 -1926 -2361 -4799 -4179 1370 2192 -282 92 -1718 -6289 -2970 3128 1396 -1463
1938 -1463 -1025 -3877 -6227 -1246 4194 1715 -944 -3373 -8391 -5868 4276 6955 930 -3951 -6844
1953f844r58O686Q166j535n894m166m074K013J0943M235p512n683J59k16L427
1968a253P355k161o925k22K558q91J773L186k513k872J162J29n8K621L17k076
1984A30J806p44n994J059R596K463o099m196l193k34Q564R006m671r952l944Q1
2000f322O125J0854R72j0746q034J287N685P303L660p904q822K347O245R61J208
2015D819j27n957j440M877Q98j989J740j28l062R43J508l297M93O113O76n094
2031I73l639k257K924Q883M031q373r267l54L900P953P831n054j4082m271P097
2046c705P846N265j571j1626p554P957R352J69l854m542l898L460P325r03n603
2061a882o96J812J111J950j865n213J833P359J90n536l796j367L286J0508L015
$$ plain form
1953 -6844 -7802 -1116 7050 5515 -379 -4545 -8619 -6606 4337 8572 1060 -4623 -4464 -4680 -1253
1968 -1253 6102 3941 -2984 -3206 -648 -1539 234 3420 907 -1965 -803 -674 -732 1889 2206 130
1984 130 1936 1192 -4802 -3743 5853 8316 2217 -1979 -5172 -5406 3158 12164 7493 -2459 -6403 -6322
2000 -6322 -197 10657 11629 883 -7151 -5864 -179 7124 10784 2880 -5942 -3595 2650 3611 4819
2015 4819 4692 -1265 -2705 2172 3070 1081 2821 2693 -369 574 2082 -1215 -722 5391 6067 973
2031 973 -2666 -4923 -1999 6884 10915 2542 -6725 -7079 -3179 4774 12605 7551 -6531 -10802 -3705
2046 -3705 4141 9406 7835 -3791 -11345 -3388 5964 6133 2279 -2263 -6161 -2701 4624 3721 -1882
2061 -1882 -2578 -766 345 2295 430 -4783 -2950 4409 4599 -937 -4733 -6100 -2814 7694 10709
2076A0709j2775j1022M256J1070P464J39j0573j2006K357J2252Q070n85r384j0956
2090a0984R96J3797O320o428o598k194Q14O013N675n980p470L408O501K66l110
2105A026l369k194N402P538l533q701k260L406O902P541l666j5062o188J0792
2119b366J2586L744p409j4451o436J1490J5293Q39q917r578n414O495J4383K915
2133A3174j1404q224J097N629O907J108q571n850N553O390j338l352l648m78P007
2148D000N667p479q831J325P219N954J306p417j2155Q55J3753Q933l456j0909
2162a235j0922J68J6553J1992o947j5292o672M392J2247Q929o382j3106l071O010
2176c336O737M044l416j0107k372J0199N339n816o130pK980O815J227r267q043
$$ plain form
2076 10709 -2066 -13088 -8832 2238 9702 9841 -732 -12738 -10381 1871 9941 9356 -28 -10984
2090 -10984 -9988 3809 10129 3701 -2897 -5091 -4277 1736 7411 1431 -6039 -2631 3870 4136 1026
2105 1026 -2343 -4537 865 8403 4870 -3831 -6091 -2685 4217 11758 8092 -6970 -13158 -2366
2119 -2366 10220 13964 6555 -7896 -14332 -2842 12451 13290 4373 -5205 -10619 -4124 10259 13174
2133 13174 1770 -6454 -5357 272 7179 8287 -284 -6134 -581 5809 4471 1119 -2529 -3007 4000
2148 4000 9667 2188 -6643 -5318 1901 7855 9161 1744 -10411 -9556 4197 13130 9674 -1235
2162 -1235 -12157 -11989 4564 16556 9609 -5683 -12355 -7963 4284 13213 6831 -6275 -9346 -3336
2176 -3336 3401 7445 4029 -6078 -8450 1749 7088 1272 -4858 -4865 -1885 4930 6157 -3110 -11153
2191a1153O186R573L763m154j1420o980R345J5371L94j1406r109k890P455J4385
2205I360L631j3221j2869J202J0728J0230O84j2206j0187N594J0342J762k905
2218B145m300m137L003P755k39q159k541M650N234K125m790r494j66J1666O947
2233I699l867q945p496R63J3319J1151p410j5269m992O638J1645Q447n964j5282
2247g363n631Q112J1060N633m388j3764o064J0189J0453j006o240l836j843M094
2261e94O001j787o185L5M044K120j48m193n729L484J0759J270q791o850o10O147
2277a027J0421K147j1607j1138L188J0031Q583j18j1113j1797L648J3564O030
2290A0812l807q726p873J710J2234O055p255q008q38L987N225J753o712m990N591
$$ plain form
2191 -11153 -4967 4606 8369 4215 -7205 -14185 -4840 10531 10925 -481 -9590 -12480 -5025 9360
2205 9360 12991 -230 -13099 -11897 -1169 9061 9745 -2461 -12648 -7054 3288 5050 2145
2218 2145 -2155 -6292 -3289 4466 4227 -3932 -6473 -1823 3411 5536 746 -8748 -8914 2752 9699
2233 9699 5832 -3113 -10609 -9646 3673 14824 7414 -7855 -12847 -6209 5436 13883 7919 -7363
2247 -7363 -12994 -4882 6178 11811 7423 -6341 -12405 -2216 8237 7231 991 -2845 -4688 -594
2261 -594 5407 3620 -2565 -2530 1514 3634 3486 -707 -6436 -2952 7807 9077 286 -6564 -7174 -1027
2277 -1027 9394 11541 -66 -11204 -8016 2015 10598 10480 -633 -12430 -8782 4782 10812
2290 10812 7005 -1721 -9594 -7884 4350 10405 3150 -4858 -5696 -1709 3516 5269 -1443 -6433 -842
2305h42N417j891l624l476j474O147Q839l308j1257m239M598Q969O394m977j3441
2320h165m537R762R986J565n723r757n072Q442J1274O4p676o012k244M754Q799
2335E460R45p597l986K084K659K575n13m397r58O560K020o681m076K426M363M398
2351E282O69p655p066K757P876N475M86q559j0842K707J3386O868n883q690o503
2366i692J855J1465P712n657j0391l283L027P192O082k837q545k550K877L309
2380E64L583N14o340k326N222K204m964j416L202K385R00j577n841k212N786N716
2396E400l40l491n456l386N291R345o41p201m865r29M023R132K003r880p348L122
2412e221O270L767J22n432n040K277M174q3M0L03k728r13L371m10l931O48M604
$$ plain form
2305 -842 4575 2684 -940 -4416 -5890 257 9096 5788 -5469 -9708 -5110 3859 10253 5276 -8165
2320 -8165 -12702 -2940 7046 8611 2888 -6869 -11941 -3499 7775 7839 163 -5849 -8093 -3339 5460
2335 5460 6405 -1192 -5178 -3094 -435 2140 1627 -2770 -3728 2832 4852 -1829 -5905 -3479 884 5282
2351 5282 5951 -1704 -8770 -6013 1863 7338 7824 -735 -11577 -8870 4516 11384 5501 -3189 -9692
2366 -9692 -7837 3628 11340 5683 -4708 -7991 -4964 2228 8310 5473 -3072 -5622 -2745 564
2380 564 4147 4661 -1679 -4005 1217 3421 -1543 -2959 243 2628 3528 1951 -3890 -6102 -316 5400
2396 5400 5060 1569 -3887 -7273 -1982 7363 6722 -479 -5344 -6273 -2250 6882 8885 -995 -8343 -5221
2412 -5221 1049 4816 4938 -494 -5534 -3257 917 834 874 1177 -1551 -2464 907 497 -3434 -2786 1818
2429A818R34j386k620m462Q3P649L951l420n187l281L47P299N411m552o786q18
2445e020J811K383N138P90p077n172L035M780L277r0m346n055J903L166Q27J697
2461B047J239m503k989J959J117K35L855J284n285l682J763J874K007L151j327
2476B745m890j875J135K026N036J312o248n183L072L893J306J299k080n700p80
2491d932M772L055N31m46m812m255L765N115J042j305k211m179n51N291J995j084
2507A791r5j491l702N40L636Q41N37j5k896k463K518J885j269Q20J739k846k913
2524c383J993K146L47O64j422l656N08L930K34k97L27k814l161K978L652P20n28
2541B238k272n562M83O384L319k362k430k413j628K412L983k15j288l44l089j054
$$ plain form
2429 1818 2752 1366 -1254 -5716 -5633 2016 5967 2547 -2640 -5921 -5574 1725 7136 2584 -4202 -5020
2445 -5020 -3209 -826 4312 5102 -1975 -7147 -4112 668 3945 3855 -491 -5546 -3643 -477 350 2047
2461 2047 3286 -1217 -4206 -2247 -1130 -895 2960 4244 -1041 -4723 -2960 -1086 921 4072 2745
2476 2745 -2145 -4020 -2885 -859 4177 5489 -759 -5942 -2870 1023 2329 3628 1548 -4152 -4932
2491 -4932 -160 2895 3426 2980 -1832 -6087 -2322 2793 3835 2530 319 -3860 -4411 880 2875 1791
2507 1791 1696 205 -3497 -2957 679 1520 2057 2042 -854 -3317 -799 1086 -183 637 2376 -470 -3383
2524 -3383 -1390 756 1103 1767 345 -3311 -2803 1127 1361 1064 1391 -1423 -4584 -1606 2046 2766 2238
2541 2238 -34 -5596 -5113 1271 4590 2228 -202 -2615 -4243 -1831 2152 1937 649 305 -2784 -3838
2557c838L920J935k016l50J591k113j885J325Q91J552K246k305n835N71N291K688
2573C668q10k431n181j385O618N388j831m691l784k201M164Q382J269o745n445
2588e015j007M294N754J433n422l376J994J135k64K101k10k370Q27J767k284k222
2604b865K167J861P11L83k450m418K102N202J589k493l761m035K624Q482K137
2619G236o847n220K65K406M724M601l862p839j456L625M542L172k341o219j395
2634d608M662J915j373n04j001j41K601P57m519k009L918L146J65j655m169l145
2650e960M510O678l66m609m653j453M645Q152j36q915n555L100N950M833K23p933
2666a489o368K780O754L331j79m423o487J754O996J434l843j974N20J042K475
$$ plain form
2557 -3838 82 2017 1 -349 1242 -871 -2756 -1431 -540 1012 3258 953 -4882 -4311 980 3668
2573 3668 2858 427 -4754 -6139 479 5867 4036 -655 -4439 -6640 -2476 5906 7175 430 -5015
2588 -5015 -6022 -1728 4026 5459 37 -3339 -1345 -210 -474 1627 1417 -953 -126 1641 -643 -2865
2604 -2865 -698 1163 1874 2257 -193 -4611 -2509 2693 4282 1789 -1972 -6007 -3383 5099 7236
2619 7236 389 -4831 -4566 -2160 2564 7165 3303 -4536 -5992 -2367 2175 5347 3006 -3213 -4608
2634 -4608 54 1969 596 92 -909 -1050 1551 2308 -2211 -4220 -302 2844 3009 1354 -2815 -5960
2650 -5960 -1450 5228 4862 253 -4400 -5853 -1208 6944 6808 -2107 -7662 -4562 1388 6221 6444 -1489
2666 -1489 -7857 -5077 1677 5008 4829 406 -6081 -4327 2669 4103 260 -1714 -1194 -152 2323
2681B323j080m880k1N704K749k199l594l937K74P245N433m639p856j538L300O317
2697C601M923n068r988j683P559O859J205n143r207j325R033O629k381m787m166
2712c939j105M517O190j444o128j015K160K928J253l810m061K940O555j8n428
2727d05l429k38L245O582R77p607o098K874O275M235q91o836o389L181Q330L749
2743G555k665o915n704L216R933K487o560n089l12K346M607K084m123m051J930
2758a261L000J38k84k698j789L949M483k594o709j189L182N367L513l562r387
2773e841j499P265O408o9m402p118k654P909Q077j530p055n176l54O589P239j723
2789F066q441l321K597M670L628j392o399k244N568L201k812k841l00J085L852
$$ plain form
2681 2323 1243 -3637 -3658 2046 4795 2596 -998 -4935 -4661 2584 8017 3378 -4478 -6016 -2716 3601
2697 3601 8524 3456 -6532 -8215 -656 6203 7408 2265 -6942 -8267 766 7395 5014 227 -3939
2712 -3939 -5044 -527 5663 4219 -1909 -2924 -764 2164 3417 -393 -4454 -1514 5041 5023 -405
2727 -405 -3834 -4072 -827 5755 6732 -875 -6973 -4099 2176 6411 5520 -1316 -7705 -4524 3806 7555
2743 7555 4890 -2025 -7729 -4513 5420 7907 1347 -3742 -4054 -1708 2899 4983 860 -3191 -1261
2758 -1261 1739 1877 1593 -1105 -2894 1055 5538 2944 -3765 -4954 -1772 3595 7108 3546 -5841
2773 -5841 -7340 -75 6333 6264 1862 -5256 -7910 -1 8076 6546 -509 -5685 -6039 550 7789 6066
2789 6066 -2375 -5696 -3099 1571 5199 3807 -2592 -4836 732 3933 1121 -1720 -2020 -935 2917
2804B917J337m671m535J672M903L219R5o375p300L431J0123K981n150o291l551
2819g195K681Q855L698o194p506p28M258O184K487n746o310J036M855K373M91
2834C239k461m892N29N627J418m308k251J975K563J776j610n465r43N779L136
2849D112o46l042m951j785O214P244k206o683l769Q85M809O278r08p535m256L107
2865c132M759L242q74n501l863M016M004J28j357j727k008J352L344p01k876J
2881a193K263O67m44j442l140J576N672N70l817l680j236K126O344K597n592o236
2897d965M18L451M602K380l557p035o81N585L924l20k782m292j091M995K998k150
2913A480j784p32p57J367K488j742k444J462K287j547j317k30p12K147L278j646
$$ plain form
2804 2917 4254 -417 -4952 -3280 1623 4842 4937 -1438 -8738 -5307 4816 7797 2647 -3644 -7195
2819 -7195 -4514 4341 8039 1845 -5661 -6389 -2131 4053 6540 794 -5516 -4480 375 2748 3239
2834 3239 778 -4114 -3585 2042 3460 -848 -3099 -1124 1439 3215 1605 -3860 -4803 976 4112
2849 4112 3466 424 -4527 -6312 -98 7146 4940 -1743 -5512 -4627 182 6460 5552 -1983 -6239 -3132
2865 -3132 1627 4869 3995 -1506 -5369 -1353 2651 2779 1422 -305 -2313 -961 2383 1682 -1194 -1193
2881 -1193 1070 1737 1293 -149 -3289 -1713 3959 4529 712 -2968 -4204 -2078 4266 6863 1271 -4965
2897 -4965 -4547 -1096 3506 5886 2329 -4706 -5387 198 4122 3802 1020 -3272 -4363 632 3630 1480
2913 1480 -304 -1036 -1793 -426 2062 320 -2124 -662 1625 78 -1239 -1469 -2181 -34 3244 1598
2929A598m586j318K641K618K722j200n845k435M438L364N72o83l638l478J990
2944c240M868P26j731k285j848N29L646R37k902j77R77j305q3J842o08n76J618
2961C88j11k856K6J608J132O06N62l253j997K015L072O15J22k367l880P43M603
2978A028J874j861j417j715j068K294K950m41j685n26j764J74L206R00j486q81
2994d18K74j533R56K341m01j029M87j212j952J951L000m82j483o93k120L46L241
3011A273J837j815j040p89k490K337M249j55l436j182m48K0K824K115k174j723
3027e97O7q57N18K870K92k177p03l57o97J754K538j626k350N20l45j53K891J236
3045B824k720j605M4N67O69K703q01k727k45J272p70P66J468j058j237N58o81
$$ plain form
2929 1598 -2988 -4306 -1665 953 3675 2475 -3370 -5805 -1367 1997 2569 1886 -1752 -5230 -3240
2944 -3240 1628 2354 623 -1662 -3510 -2981 665 1602 -1300 -1477 -500 -1805 -1888 -46 -654 -1230 388
2961 388 277 -2579 -2553 -945 187 793 1355 -1898 -3895 -1880 1192 1807 1929 -438 -4318 -3575 1028
2978 1028 2902 1041 -376 -2091 -3159 -865 2085 1644 -41 -567 -2331 -2157 1049 1949 463 -418
2994 -418 -144 -1677 -721 1620 1219 190 677 -535 -2487 -536 2464 1982 499 -194 -2314 -1968 1273
3011 1273 3110 1295 255 -534 -3024 -687 3562 3407 -29 -1211 -1659 -1639 1185 3300 1126 -597
3027 -597 -530 -1387 -869 2001 2293 116 -587 -944 -1641 113 2651 1025 -1325 -805 -1150 -1303 1588 2824
3045 2824 104 -1501 -1457 -890 -221 2482 1681 -1046 -1291 -19 -789 -23 1445 387 -850 -292 -973
3062i73j037K387J787j445j665K56r25O54K766Q82k733j823n18O02L073K531l055
3079G64l659N62J904J273J676q30l981k01K895Q72n13K13p91j869J288J393r40
3096E6m5J027k47m87J69j919q14M055K281k573k938q00N30K615L757j341n305
3113a979j491J996L029K237k42m925k888K712L502J124J24l573l687K212M796
3128B947K55k426j093p85j0K285J021k153k59J000K34n09j56j326j36L319J275
3145C483l556k492P47J364L026J817l634m558M61M360K234j9k776m265m06N230
3161A016L188j572k879l104oM103L644k112m247m11J372J814J810j697l396O36
3177a841L263M53j951j071j050J494L688L8m354k428J286K840L055j18m972m290
$$ plain form
3062 -973 -2010 377 2164 719 -946 -690 -1615 -961 1805 2687 -46 -1869 -2387 -1785 1288 3819 764
3079 764 -2895 -2333 -429 844 2520 1690 -2291 -2492 403 1275 762 975 184 -1685 -397 996 56
3096 56 11 1038 791 304 473 -1446 -2260 1795 4076 1503 -1435 -2235 -1705 910 4667 3326 -1979
3113 -1979 -3470 -1474 1555 3792 3550 -1375 -4263 -1551 1951 3075 3199 -374 -4061 -1849 2947
3128 2947 3202 776 -317 -1102 -1112 1173 2194 41 -218 782 1016 507 351 -975 -1111 2208 3483
3145 3483 -73 -2565 -1818 -454 2572 4389 755 -3803 -3342 1018 3252 3233 457 -3808 -4214 1016
3161 1016 4204 2632 -247 -3351 -3357 746 4390 2278 -1969 -2380 -1008 806 2616 919 -2477 -1841
3177 -1841 1422 1875 -76 -1147 -2197 -703 2985 3023 -1331 -3759 -2473 367 3422 3304 -1668 -5958
3193e958L056N160J565j831l834l483K433N765J392l603l239q14J429M016J779
3208C833m280l019J667J831J004m4j877j889K518K616k017l238O41J957J929J313
3224B945l078m300M27M399L198k32l688m675k21O017M440k576m464k521m6M956
3240E81M366k400n542j374K489K769J957j322l895j794L432K104L7j093k140q71
3256b696L115J743k361k689J695J883O63l0k798k344K015M551O00k679l358j535
3272d225K485N397O10m061l858P5K328M087J477m525m300K077M163J343j128k595
3288f50k532J582L805L48k418j501m86J416L067l79l792j485L498K231k62k078
3304C64l282n51M284M683k527m550k719J549M244L835k066n468j728K674K881
$$ plain form
3193 -5958 -2902 2258 3823 1992 -1842 -5325 -2892 2873 4265 662 -2577 -3391 -1962 2054 3833
3208 3833 -447 -3466 -1799 32 1036 992 -885 -2774 -256 2360 343 -2895 -2254 -297 1632 2945
3224 2945 -133 -4433 -4006 393 3591 3359 -329 -5004 -5225 792 5232 2656 -1808 -4329 -4375 581
3240 581 4947 2547 -2995 -4369 -1880 889 2846 1524 -2371 -4165 -733 1371 1408 315 -1825 -2696
3256 -2696 419 2162 -199 -2888 -1193 690 1353 1323 -1475 -3819 -1804 2747 3347 668 -2690 -4225
3272 -4225 -1740 3657 4267 206 -3652 -3577 -1249 2838 4315 -210 -4510 -2433 1730 3073 1945 -650
3288 -650 -3182 -1600 2205 2553 135 -1366 -1852 -436 2631 2252 -1540 -3025 473 2704 2442 364
3304 364 -2918 -3469 815 5498 2971 -1579 -4298 -2749 1495 5330 3264 -2204 -3932 -1258 1623
3319A623K405q27n180k352L666L683m91k149j945n46K452K646j605k562J07J330
3335B55Q69L66j354k705J554L466k87k647j732k81K022L856R00m754m199J500
3351c171L750L451n9m359m436J555M539K081p79k799l016K79M362J553k156k330
3367a535q65J062K322J493k169k813J226J917M99l75j068j802J697K386p91k319
3383a135n04O31J545K377j346l827j388L077K938K17o33l521k579L092L898N9
3399B901k375j781j228J832K915n3l093m1K99N40J324K34k153j230K337J550j558
3416D20r15M2LJ905Q06j884k286P60J980J369K44k668l634J998M177J332k109
3433A540k026k004j53L624K684j493k899j557M44K068K169r32k147L7N98n0L56
$$ plain form
3319 1623 4028 3201 -1979 -4331 -665 3018 2527 378 -1567 -2113 339 2985 1380 -1182 -1075 255
3335 255 1124 1490 136 -2569 -1015 2451 2164 -483 -2215 -2496 -474 3382 4282 -472 -4671 -3171
3351 -3171 579 4030 3971 -388 -4824 -3269 1270 3351 2572 -227 -3243 -2964 1398 2951 795 -1535
3367 -1535 -2400 -1338 984 2477 308 -2505 -1279 638 1137 762 -306 -2108 -411 1975 1184 -1135
3383 -1135 -1639 -1008 537 2914 1568 -2259 -3647 -570 2368 2585 1952 -1569 -4148 -1056 2842 2901
3399 2901 526 -1255 -2483 -651 2264 2211 -882 -923 -624 -84 1240 1474 -679 -1909 428 1978 420
3416 420 -495 -453 -450 1455 2261 377 -1909 -1149 831 2200 2444 -224 -3858 -1860 2317 3649 1540
3433 1540 -486 -2490 -2643 981 3665 2172 -727 -2284 -1840 228 2397 1465 -682 -645 -47 -97 259
3450B59Q72j618n31J925j6j911L42J757m39k6l01j583j80K121J119j012j055j216
3468a493j027K485K858j111k676j096J84R49K610Q99k482k171N87P60J180J229
3484A685j103j528j62Q04j13P12J074j710p21J342J4j166J044P15j048l07J80
3501b88k90K47J681l96j372r8k80K10J708J126k297j288N36M25N32J672l06k190
3519f68n13N86O21N71Q90p07j644N7L28L78J032P90j692r61O08k39M79J494k98
3538A112j633j69O95K38N03O55j261j848R37J017J71L26j2j835m19J522M12k48
3556A63R60n26j948Q4R90L49N42P89q74k182L89Q08J32J824m3k360j451J518J165
3575C29O84J21j802j600J060K276k59m25l85j134m01J996O42j195l98M28o02L17
$$ plain form
3450 259 1131 -487 -1018 907 891 -1020 -678 1079 640 614 313 -1270 -1450 671 1790 778 -277 -1493
3468 -1493 -2520 -35 2823 1712 -964 -2060 -1876 -927 1683 2582 100 -2071 -1484 -724 456 1685
3484 1685 582 -946 -1108 -304 -417 295 1369 -341 -1062 280 294 -872 172 887 -161 -468 -288
3501 -288 -578 -331 1350 954 -418 -516 -796 -586 1122 2248 -49 -1337 -801 -376 156 1828 1522 -668
3519 -668 -1181 -595 26 597 1487 780 -864 -807 -479 -101 931 1721 29 -932 -324 -563 -84 1410 1112
3538 1112 -521 -690 5 243 746 1401 140 -1708 -771 246 417 743 731 -1104 -1523 -1 411 163
3556 163 1123 597 -1351 -1267 -277 72 614 1403 529 -1653 -1264 -456 -324 1500 1457 -903 -2354 -836 329
3575 329 1013 1134 -668 -2268 -1208 1068 809 384 -1 -1135 -1536 460 1102 -93 -491 -63 -665 -348
3593c48P71p19m78J524k15j624l01O95O83J181L72j913j866R86J671O46N04j436
3611A33k382L15K179J446l62j206j714n13K448J862j292j673l22L68J177J012
3627A476o62j494L1P92l16J11L73k96n99J548r1k006r5J391N59N99m05k372j206
3646b662K081K565k9j091k105j769K242K732N3j593k079j78L89K712R12k022k115
3663a957L18J454J146O91k041j321Q56J586o88l67J25j65J45J178o36j953M53
3680a176J763M14J30j311k270J45K676K002j240k220j506K76K879K401j866k818
3696a721q49J353J836J152o75k486j096K340Q74M15j218j189l29J588J499j615
3712a21j100N77L47J109J50j744j245J533K373k96j411j739p12J681K994L54k782
$$ plain form
3593 -348 423 -296 -774 750 535 -1089 -1390 -695 -12 1169 1541 -372 -2238 -1252 419 1065 1569 133
3611 133 -2249 -1934 245 1691 1329 123 -1591 -2104 344 2206 914 -759 -1081 -713 464 1476
3627 1476 814 -680 -649 143 -173 -62 311 15 -584 964 873 -1133 -1228 163 722 1321 916 -1456 -2662
3646 -2662 -581 1984 1955 864 -1241 -3010 -768 1964 2017 424 -1655 -1833 -1444 1268 2180 158 -1957
3663 -1957 -1639 -185 961 1652 -389 -1710 -854 732 44 -323 -198 -363 -218 960 324 -1629 -1176
3680 -1176 587 1001 1131 -180 -2450 -2305 371 2373 1133 -1087 -2593 -2317 562 2963 1097 -1721
3696 -1721 -2570 -1217 619 1771 1096 -1390 -2486 -146 728 1143 -75 -1264 -1593 -5 1494 -121
3712 -121 -1221 -644 -297 812 962 -782 -2027 -494 1879 1583 172 -1567 -2279 -598 2396 2750 -32
3729c2k090J26J639K892L08l230k316P67K868J275k87k095k051J118K705K62j672
3746A87p71k98M74J988Q3k148p44J688Q86M7o38k119j69K231K027j431k264o37
3764a608N46K444K039j503l920m24K123J775J442r04l531j241K649K480r1j432
3780H44k090q91K334K199o67k375n92P90J297P06r38k027N30K046K7p06j051j049
3798a613L60K886J133k623k294M19J935K060K18k492l088J051L346R86l21k524
3814e61k354N69L861J158j852k211p88J159K095J123k158j975Q74J304N74J46
3830I64j685j434J618K216l55k065m65M51R67J970p47k801j070J623J946R82r59
3847A156k984j378K760K858l66j673k115p19J556K970m25k389j026L58J170J473
$$ plain form
3729 -32 -2122 -1996 -357 2535 2843 -387 -2703 -1936 932 2207 1920 -175 -2226 -1108 1597 1859 187
3746 187 -584 -882 -408 1580 1663 -485 -1229 459 1345 1392 754 -1365 -1534 697 2724 1293 -971 -1608
3764 -1608 -1062 1382 3421 1918 -2002 -2426 -303 1472 2914 2010 -1521 -2762 -113 2367 2276 844
3780 844 -1246 -2137 197 2396 1729 -646 -1238 -448 849 1555 617 -1410 -880 1166 1193 487 -564 -1613
3798 -1613 -1253 1633 2766 143 -2151 -1732 203 2263 2481 -11 -3099 -2048 1298 2284 1963 -561
3814 -561 -2915 -2346 1515 2673 821 -1390 -2178 -1019 1076 2199 41 -1934 -1060 244 818 964
3830 964 -721 -2155 -537 1679 1324 -741 -1206 -755 212 2182 1435 -1366 -2436 -813 1133 2115 1156
3847 1156 -1828 -3206 -446 2412 2046 373 -1742 -2461 -905 2065 1640 -749 -1775 -1417 -247 1226
3863A226M89k217j332J648Q93m68k91q03j13J756P14j522j583N23J186R44M62
3880A512j546k224Q39K699Q05j014j471j608K46K903J514j131k534r34N29K412
3896I97J954j893k604k05J652Q05P59p28k056N59J388L82n34n71k10mJ526P7j454
3915a60q54R22J004M15n42j570r82J818J878k68j831j192R9J157K381l27k413
3932d65r21N14J191J140P0j716j693J382J571j96n64m50o58O21J112n98j115J01
3950f74Q68M14j67l71j271r8K164L03r98q22o89K89J659J325j958j615k4J082
3968e83J307P46j018k256j98J647Q92J80k05j409m3K48J108j86m94K42p59K23
3986e58M56j67p69J253J27o86j65k14j25J072R27q42j363K3N10M67J188k74j918
$$ plain form
3863 1226 1715 -502 -1834 -186 707 239 -52 -855 -968 788 1502 -20 -1603 -1080 106 1050 1512
3880 1512 -34 -2258 -1419 1280 2085 1071 -400 -2008 -1762 1141 2655 1524 -1010 -1944 -1415 997
3896 997 2951 1058 -1546 -1751 -99 706 1465 737 -1319 -760 628 1010 476 -95 -305 -309 1217 1294 -160
3915 -160 -1014 -92 912 1327 785 -785 -1767 51 1929 1661 -170 -1362 -1263 -106 2275 1948 -465
3932 -465 -1386 -872 319 1459 1529 -187 -1880 -498 1073 877 313 -137 -795 -174 938 340 -775 -674
3950 -674 194 608 441 70 -1201 -1299 865 1168 170 -652 -1341 -1052 607 1932 -26 -1641 -1665 -583
3968 -583 724 1470 452 -1804 -2002 -355 537 717 512 -897 -940 -692 416 230 -264 -22 -781 -558
3986 -558 -102 -269 -1038 215 342 -344 -509 -723 -848 224 1151 309 -1054 -1031 -521 -54 1134 860 -1058
4005a058m56R58J442j11J9j137j522J348J519j49k39o21p71J49J395J63q62m0
4023B7r5l75N64N64m92k03N58lq19n7O76j57L45P80j124q22O07R11P9n7l93j210
4045f96K55J209M44p99M3l78r52J061Q79m72m11J07k64j57M81K75n83O27P1j413
4065f73M70O00M44m04M56r16j149M65J299R4k74L4j305K09J082M45l49m76n38
4084d86m18O68J153p87n29M34n52j86L85Q53l72k40j92n37k7R93M25o30k83n69
4104h97l73J110J222l16q20o69p39M39J664J001j513r32N7L85J51Q53m69j095
4122i41R4M85J6M75J37r26j38Q68R6o92M25J3k4P9K70j003M7J075M70r19j88j65
4144d46l93J065J345j132q94j00l9M78J309L42j869l97M31J97R36j10p96o24J239
$$ plain form
4005 -1058 -1514 -556 886 775 794 -343 -1865 -517 1002 853 614 -7 -778 -629 766 929 67 27
4023 27 -68 -443 121 685 193 -10 548 545 -274 -331 345 188 533 1313 189 -633 -26 885 964 907 514 -696
4045 -696 -441 768 1212 413 456 78 -874 187 1066 594 183 290 26 -131 350 625 42 669 740 -673
4065 -673 -203 397 841 437 893 -23 -1172 -707 592 686 412 446 -859 -650 432 877 528 52 -486
4084 -486 -904 -236 917 130 -399 35 -517 -703 -318 535 163 -77 -269 -806 -833 160 585 -45 -328 -897
4104 -897 -1270 -160 1062 746 -74 -743 -1482 -1043 621 1622 109 -823 -766 -381 -230 623 154 -941
4122 -941 -847 -362 -346 129 266 -660 -798 70 166 -526 -101 -88 -112 -33 237 -766 -719 356 826 -93 -281 -446
4144 -446 -839 226 1571 439 -455 -555 -594 -116 1193 1535 -334 -731 -300 -103 833 723 -73 -697 542
4163E42L90r70j11K37k75L14Q69m07j218M55J091n1k53l09q41J64J649L38j257
4182C57r63o2M50J539Q35j737j943M66J353P49J083j659j576j75J661O76Q7p82
4200C59o86o75J509Q03j291l87K35k1O67M14j364m85J134J182j124m40m21m13
4218a004J140J363n82j890n79J292Q92J060o32k132r94J487J827J55j085r96j240
4235a918J265K152k92j628l33m44M94J560r6j563j84R74K58L62k31j321m24J699
4253C30R94j112j219o3M38Q94Q01j182j590O02J343O07K74j353j637j70L032P46
4271A735q82j500n42k98J607J447j481r61R8L28Q34M72r32j452O24J361N67j248
4289b23k2m77L69J902n8k098r16J174Q24R72l97j881j211J687K089l18r40j391
$$ plain form
4163 542 932 -38 -149 88 -187 127 996 589 -629 -174 917 866 613 304 -537 -373 1276 1614 357
4182 357 -606 -668 -218 1321 2156 419 -1524 -1058 295 1044 2127 468 -1108 -1283 378 1054 1141 359
4200 359 -327 -1002 507 1310 19 -368 -133 -154 513 927 -437 -922 212 1394 270 -170 -591 -1004
4218 -1004 136 1499 917 -973 -1552 -260 632 1692 1060 -1072 -2066 -579 1248 1403 318 -678 -1918
4235 -1918 -653 1499 1207 -421 -754 -1198 -704 856 760 -803 -987 -13 245 607 376 -945 -1369 330
4253 330 1324 212 -1007 -1070 -632 262 1063 -119 -1709 -1107 236 843 1117 -236 -1873 -2043 989 1735
4271 1735 853 -647 -1189 -1487 120 1567 86 -875 -777 -449 385 857 -75 -1527 -903 458 1025 -223
4289 -223 -245 -722 -353 1549 1491 -607 -1523 -349 475 1447 1050 -831 -2042 -355 1734 1416 476 -915
$$ [...]
8191f4
##END NTUPLES=NMR FID
##END=
