##TITLE=1H_EC-3227(2)
 CDCl3, 8 sc, 
 5.3.2020
##JCAMPDX= 6.0         $$ Bruker NMR JCAMP-DX V2.0
##DATA TYPE= NMR FID
##DATA CLASS= NTUPLES
##ORIGIN= UXNMR, Bruker Analytische Messtechnik GmbH
##OWNER= root
$$ XWIN-NMR		Version 3.5
$$ Thu Mar  5 13:50:49 2020 Russian Standard Time (UT+4h)  she@DPX200
##.OBSERVE FREQUENCY= 200.1315
##.OBSERVE NUCLEUS= ^1H
##.DELAY= (6, 6)
##.ACQUISITION MODE= SIMULTANEOUS
##.ACQUISITION SCHEME= undefined
##.AVERAGES= 8
##.DIGITISER RES= 18
##SPECTROMETER/DATA SYSTEM= spect
##.PULSE SEQUENCE= zg30
##.SOLVENT NAME= D2O
##.SHIFT REFERENCE= (INTERNAL, D2O, 0, 15.7039)
##AUDIT TRAIL= $$ (NUMBER, WHEN, WHO, WHERE, WHAT)
$$ ##TITLE= Audit trail, XWIN-NMR		Version 3.5
$$ ##JCAMPDX= 5.01
$$ ##ORIGIN= Bruker BioSpin GmbH
$$ ##OWNER= she
$$ F:/spectra/data/she/nmr/H-F/1/audita.txt
$$ ##AUDIT TRAIL=  $$ (NUMBER, WHEN, WHO, WHERE, WHAT)
(   1,<2020-03-05 13:49:08.40 +0400>,<she>,<DPX200>,
      <created by zg, POWCHK disabled, PULCHK disabled
       configuration hash MD5:
       00 E9 B6 7A A2 85 ED C7 34 08 36 98 17 FE 4E 26
       data hash MD5: 16K
       45 F4 C3 4E F0 A8 A6 B4 34 48 04 B2 DA DF 12 48>)
$$ ##END=
$$ 
$$ hash MD5
$$ 62 90 AE F9 77 4B B9 8E A2 B9 97 18 9A 53 C8 1A
##$RELAX= 
##$RELAX= 
##$RELAX= 
##$RELAX= 
##$RELAX= 
##$RELAX= 
$$ Bruker specific parameters
$$ --------------------------
##$DU= <F:/spectra>
##$EXPNO= 1
##$NAME= <H-F>
##$PROCNO= 1
##$TYPE= <nmr>
##$USER= <she>
##$AMP= (0..31)
100 100 100 100 100 100 100 100 100 100 100 100 100 100 100 100 100 100 
100 100 100 100 100 100 100 100 100 100 100 100 100 100 
##$AQSEQ= 0
##$AQ_mod= 1
##$AUNM= <au_zg>
##$AUTOPOS= <>
##$BF1= 200.13
##$BF2= 200.13
##$BF3= 200.13
##$BF4= 200.13
##$BF5= 200.13
##$BF6= 200.13
##$BF7= 200.13
##$BF8= 200.13
##$BYTORDA= 1
##$CFDGTYP= 0
##$CFRGTYP= 5
##$CHEMSTR= <none>
##$CNST= (0..31)
1 1 145 1 1 1 1 1 1 1 1 1 1 1 1 1 1 1 1 1 1 1 1 1 1 1 1 1 1 1 1 1 
##$CPDPRG= <>
##$CPDPRG1= <>
##$CPDPRG2= <>
##$CPDPRG3= <>
##$CPDPRG4= <mlev>
##$CPDPRG5= <mlev>
##$CPDPRG6= <mlev>
##$CPDPRG7= <mlev>
##$CPDPRG8= <mlev>
##$CPDPRGB= <>
##$CPDPRGT= <>
##$D= (0..31)
0 1.2 0 0 0 0 0 0 0 0.06 0 0.03 0 0 0 0 0.0002 0 0 0 0 0 0 0 0 0 0 0 0 
0 0 0 
##$DATE= 1583401747
##$DBL= (0..7)
120 120 120 120 120 120 120 120 
##$DBP= (0..7)
150 150 150 150 150 150 150 150 
##$DBP07= 0
##$DBPNAM0= <>
##$DBPNAM1= <>
##$DBPNAM2= <>
##$DBPNAM3= <>
##$DBPNAM4= <>
##$DBPNAM5= <>
##$DBPNAM6= <>
##$DBPNAM7= <>
##$DBPOAL= (0..7)
0.5 0.5 0.5 0.5 0.5 0.5 0.5 0.5 
##$DBPOFFS= (0..7)
0 0 0 0 0 0 0 0 
##$DE= 6
##$DECBNUC= <off>
##$DECIM= 24
##$DECNUC= <off>
##$DECSTAT= 4
##$DIGMOD= 1
##$DIGTYP= 9
##$DL= (0..7)
0 120 120 120 120 120 120 120 
##$DP= (0..7)
150 150 150 150 150 150 150 150 
##$DP07= 0
##$DPNAME0= <>
##$DPNAME1= <>
##$DPNAME2= <>
##$DPNAME3= <>
##$DPNAME4= <>
##$DPNAME5= <>
##$DPNAME6= <>
##$DPNAME7= <>
##$DPOAL= (0..7)
0.5 0.5 0.5 0.5 0.5 0.5 0.5 0.5 
##$DPOFFS= (0..7)
0 0 0 0 0 0 0 0 
##$DQDMODE= 0
##$DR= 18
##$DS= 0
##$DSLIST= <SSSSSSSSSSSSSSS>
$$ [...]
##$SUBNAM2= <"">
##$SUBNAM3= <"">
##$SUBNAM4= <"">
##$SUBNAM5= <"">
##$SUBNAM6= <"">
##$SUBNAM7= <"">
##$SUBNAM8= <"">
##$SUBNAM9= <"">
##$SW= 24.9337058887773
##$SWIBOX= (0..15)
0 0 2 0 0 0 0 0 0 0 0 0 0 0 0 0 
##$SW_h= 4990.01996007984
##$TD= 16384
##$TD0= 1
##$TE= 0
##$TE2= 300
##$TE3= 300
##$TEG= 300
##$TL= (0..7)
0 120 120 120 120 120 120 120 
##$TP= (0..7)
150 150 150 150 150 150 150 150 
##$TP07= 0
##$TPNAME0= <>
##$TPNAME1= <>
##$TPNAME2= <>
##$TPNAME3= <>
##$TPNAME4= <>
##$TPNAME5= <>
##$TPNAME6= <>
##$TPNAME7= <>
##$TPOAL= (0..7)
0.5 0.5 0.5 0.5 0.5 0.5 0.5 0.5 
##$TPOFFS= (0..7)
0 0 0 0 0 0 0 0 
##$TUNHIN= 0
##$TUNHOUT= 0
##$TUNXOUT= 0
##$USERA1= <user>
##$USERA2= <user>
##$USERA3= <user>
##$USERA4= <user>
##$USERA5= <user>
##$V9= 5
##$VALIST= <valist>
##$VCLIST= <CCCCCCCCCCCCCCC>
##$VD= 0
##$VDLIST= <DDDDDDDDDDDDDDD>
##$VPLIST= <PPPPPPPPPPPPPPP>
##$VTLIST= <TTTTTTTTTTTTTTT>
##$WBST= 1024
##$WBSW= 4
##$XGAIN= (0..3)
0 0 0 0 
##$XL= 0
##$YL= 0
##$YMAX_a= 1003253
##$YMIN_a= -454643
##$ZGOPTNS= <>
##$ZL1= 120
##$ZL2= 120
##$ZL3= 120
##$ZL4= 120
##$ABSF1= 10
##$ABSF2= 0
##$ABSG= 5
##$ABSL= 3
##$ALPHA= 0
##$AQORDER= 0
##$ASSFAC= 0
##$ASSFACI= 0
##$ASSFACX= 0
##$ASSWID= 0
##$AUNMP= <proc_1d>
##$AZFE= 0.1
##$AZFW= 0.1
##$BCFW= 1
##$BC_mod= 2
##$BYTORDP= 1
##$COROFFS= 0
##$CY= 11.3945322036743
##$DATMOD= 1
##$DC= 2
##$DFILT= <>
##$DTYPP= 0
##$F1P= 16.9975609425685
##$F2P= -3.02152046262296
##$FCOR= 0.5
##$FTSIZE= 0
##$FT_mod= 4
##$GAMMA= 1
##$GB= 0.15
##$INTBC= 1
##$INTSCL= 1
##$ISEN= 128
##$LB= 0.24
##$LEV0= 0
##$LPBIN= 0
##$MAXI= 10000
##$MC2= 0
##$MEAN= 0
##$ME_mod= 0
##$MI= 1.114404
##$NCOEF= 0
##$NC_proc= 0
##$NLEV= 6
##$NOISF1= 3.799351
##$NOISF2= 2.8
##$NSP= 1
##$NTH_PI= 0
##$NZP= 0
##$OFFSET= 15.70392
##$PC= 1
##$PHC0= -9785.092
##$PHC1= 9.400822
##$PH_mod= 1
##$PKNL= yes
##$PPARMOD= 0
##$PSCAL= 0
##$PSIGN= 0
##$REVERSE= no
##$SF= 200.130013532006
##$SI= 16384
##$SIGF1= 3
##$SIGF2= 2
##$SINO= 400
##$SIOLD= 16384
##$SREGLST= <1H.CDCl3>
##$SSB= 0
##$STSI= 0
##$STSR= 0
##$SW_p= 3612.71676300578
##$SYMM= 0
##$S_DEV= 0
##$TDeff= 0
##$TDoff= 0
##$TI= <>
##$TILT= no
##$TM1= 0
##$TM2= 0
##$TOPLEV= 0
##$USERP1= <user>
##$USERP2= <user>
##$USERP3= <user>
##$USERP4= <user>
##$USERP5= <user>
##$WDW= 1
##$XDIM= 8192
##$YMAX_p= 0
##$YMIN_p= 0
$$ End of Bruker specific parameters
$$ ---------------------------------
##NTUPLES= NMR FID
##VAR_NAME=  TIME,          FID/REAL,        FID/IMAG
##SYMBOL=    X,             R,               I
##VAR_TYPE=  INDEPENDENT,   DEPENDENT,       DEPENDENT
##VAR_FORM=  AFFN,          ASDF,            ASDF
##VAR_DIM=   8192,          8192,            8192
##UNITS=     SECONDS,       ARBITRARY UNITS, ARBITRARY UNITS
##FACTOR=    0.0002004,     1,               1
##FIRST=     0,             0,               0
##LAST=      1.6414764,     0,               0
##MIN=       0,             -454643,         0
##MAX=       1.6414764,     1003253,         0
$$ Real data points
##PAGE= N=1
##DATA TABLE= (X++(R..R)), XYDATA
$$ [...]
$$ plain form
2535 -3143 -1181 3899 7725 4835 -3362 -6326 -609 6002 7870 4316 -3417 -6172 -536 6223 6698
2550 6698 2277 -2451 -4317 -275 6050 5930 644 -2603 -1933 609 3556 3592 -157 -1962 576 2488
2566 2488 1576 -610 -1271 38 3339 3499 -1439 -4365 -1745 2291 4373 4337 -1134 -6881 -4909 2846
2582 2846 6489 4253 -2160 -7044 -5297 2752 6458 2693 -2853 -5125 -3422 1393 4839 2111 -3236
2597 -3236 -4101 -1679 631 2733 1533 -2251 -2938 -401 702 -371 -989 -873 14 1685 340 -3885
2613 -3885 -3622 1041 3569 2815 -412 -4667 -5424 401 5436 4172 -931 -5027 -5483 -392 6355 5449
2629 5449 -1047 -5538 -4081 424 4489 4402 -1165 -4330 -2165 1488 2264 2300 152 -2465 -1613 1412
2645 1412 1852 346 78 408 614 1263 -367 -1981 -82 3777 3452 512 -1944 -3485 -581 4911
$$ packed form
2535c143J962N080L826k890q197k964N717O611J868l554p733k755N636O759M75
2550F698m421m728j866M042O325j20n286l247O70K542K947L6l749j805K538J912
2566B488r12k186o61J309L301J60m938k926K620M036K082l6n471n747J972P755
2582B846L643k236o413m884J747Q049L706l765n546k272J703M815L446k728n347
2597c236q65K422K310K102j200l784o87K537J103j073o18J16Q87J671j345m225
2613c885K63M663K528p54l227m255p57N825N035j264n103m096m56N091O747r06
2629E449o496m491J457M505M065q7n567l165K165L653P76L6k148k617Q52L025
2645A412M40j506k68L30K06O49j630j614J899L859l25k940k456j541K904N492
$$ plain form
2661 4911 5907 941 -3292 -3317 -263 3382 6234 2394 -3336 -4062 -480 3201 5105 2640 -2708 -3575
2677 -3575 609 2894 2234 1179 -169 -1929 -544 1279 1666 930 977 -498 -636 220 153 -793 1149
2694 1149 2417 519 -2204 -2063 -1198 1557 4008 2079 -2685 -4369 -1823 1280 3635 2637 -1574 -4918
2710 -4918 -3089 776 2949 3229 -697 -4769 -4059 783 2893 1264 -946 -2925 -3153 -580 1602 712
2726 712 -412 -1219 -2763 -2397 114 681 -789 -494 -113 -2205 -2713 -664 559 992 1111 -1250 -4294
2743 -4294 -2899 240 2391 2190 -203 -3948 -4338 -122 2693 2231 388 -1908 -4211 -2060 2506 3204
2759 3204 350 -2079 -3083 -1619 1136 2647 1049 -907 -1561 -1737 -457 2062 1760 -204 -696 -985
2775 -985 -1138 -76 1811 1810 749 43 -1136 -2036 348 2971 2300 1256 -1191 -3371 -1652 2851 3909
$$ packed form
2661D911R96m966m233k5L054L645K852l840n730p26L582L681J904k465n348q67
2677c575M184K285o60j055j348j760J385J823L87p36M7j475j38Q56o7r46J942
2694A149J268j898k723J41Q65K755K451j929m764j684K546L103K355r98m211l344
2710d918J829L865K173K80l926m072P10M842K110j629k210j979k28K573K182q90
2726G12j124q07j544L66K511N67j470K95L81k092n08K049J223M33J19k361l044
2743d294J395L139K151k01k393l745l90M216K815m62j843k296k303K151M566O98
2759C204k854k429j004J464K755J511j598j956o54j76J280K519l02j964m92k89
2775i85j53J062J887jj061p06j179r00K384K623o71j044k447k180J719M503J058
$$ plain form
2792 3909 1683 -674 -2565 -2584 1434 4816 3365 -871 -2777 -2323 457 4110 3469 -485 -2566 -1345
2808 -1345 70 2281 2941 510 -1675 -1114 66 605 1452 1425 -257 -807 47 -24 -1055 762 2240
2825 2240 1011 -404 -2388 -2570 -161 3549 2665 -920 -2943 -3344 -840 3030 3985 -53 -3971 -3418
2841 -3418 -1155 2173 4091 521 -3717 -4143 -700 1718 2342 148 -3126 -3150 -510 1184 207 54
2857 54 -894 -2128 -1504 -140 -794 -1350 190 608 -767 -1804 -2404 -2036 569 2884 760 -3175 -4111
2874 -4111 -2055 1192 4090 1983 -3915 -5362 -1999 1707 3380 2129 -2000 -5650 -2561 2315 3264
2889 3264 1607 -1646 -3780 -1819 2195 2682 61 -912 -994 -1015 384 1339 -169 -588 1277 747 -234
2906 -234 -839 -605 27 2677 3292 -656 -3287 -2149 1317 4374 4685 -181 -5294 -3081 2660 5583
$$ packed form
2792C909k226k357j891j9M018L382j451m236j906M54K780L653o41l954k081J221
2808a345J415K211O60k431k185N61J180N39Q47k7j682n50Q54p1j031J817J478
2825B240j229j415j984j82K409L710q84l585k023m01K504L870R55m038l918N53
2841c418K263L328J918l570m238m26L443K418O24k194l274k4K640J694r77j53
2857E4r48j234O24J364o54n56J540M18j375j037o00L68K605K315k124l935r36
2874d111K056L247K898k107n898j447L363L706J673j251m129l650L089M876R49
2889C264j657l253k134J961M014M87k621r73q2k1J399R55j508m19J865n30r81
2906b34o05K34O32K650O15l948k631J138L466L057L11m866n113K213N741K923
$$ plain form
2922 5583 3897 -162 -4108 -3478 1931 5606 3512 -516 -3232 -2758 1503 4894 2739 -1437 -2257 -611
2938 -611 1422 2269 1152 -850 -1024 1410 1289 -723 -897 -238 1177 2602 1045 -2553 -3168 93 2856
2955 2856 3256 963 -3480 -5118 -803 4416 4284 -580 -4215 -4807 -799 4470 3959 -966 -4374 -3504
2971 -3504 -717 2978 3007 -940 -3811 -2090 408 1357 616 -688 -2195 -1279 1089 -55 -1864 -1452
2987 -1452 -23 853 855 -1611 -3820 -2018 1913 2908 306 -2203 -4331 -2734 2291 4711 1062 -3341
3003 -3341 -4486 -2089 2487 5243 1585 -3854 -4074 -717 2311 3606 1152 -2228 -3191 249 2214
3018 2214 1869 554 -739 -1388 517 1905 179 -1266 411 1862 1466 414 -1545 -1909 1411 4641
3034 4641 2785 -1084 -2596 -1832 2142 5504 3796 -1693 -4536 -1462 2780 5541 3853 -1369 -4822
$$ packed form
2922E583j686m059l946O30N409L675k094m028k716M74M261L391k155m176q20J646
2938f11K033Q47j117k002j74K434j21k012j74O59J415J425j557l598o15L261K763
2955B856M00k293m443j638M315N219j32m864l635n92M008N269n11m925l408Q70
2971c504K787L695K9l947k871J721K498R49p41j304j507R16K368j144j809M12
2987a452J429Q76Kk466k209J802L931R95k602k509k128J597N025K420l649m403
3003c341j145K397M576K756l658n439k20L357L028J295k454l380r63L440J965
3018B214l45j315j293o49J905J388j726j445J677J451l96j052j959l64L320L230
3034D641j856l869j512P64L974L362j708n489k843L074M242K761j688n222l453
$$ plain form
3049 -4822 -1561 3430 4312 2719 -1017 -2893 -535 3093 3318 876 -424 -906 436 1636 1756 -75
3065 -75 -725 1142 1711 447 -707 -992 -197 2705 3404 -282 -3028 -2356 816 3520 3738 -278 -4235
3082 -4235 -3050 1759 4298 3327 -453 -4113 -3488 1265 4050 2448 -879 -3060 -2327 1458 3382 1196
3098 1196 -1122 -1583 -222 434 1315 20 -1420 -666 1461 814 -973 -1448 -979 822 2548 1225 -2548
3115 -2548 -3265 -537 2902 3392 1427 -3115 -4381 -442 3988 3682 675 -2741 -4087 -957 3621 4077
3131 4077 49 -2782 -2624 -390 2616 3501 322 -2072 -1239 765 1535 1103 152 -999 576 1245 -135
3148 -135 -787 295 1322 1781 1620 -387 -2662 -983 2402 3287 1815 -904 -3045 -1715 3264 4726
3164 4726 1484 -2294 -3006 -983 2572 4553 1916 -2311 -2755 -53 1796 3233 2172 -1377 -2614
$$ packed form
3049d822L261M991Q82j593l736j876K358L628K25k442j300m82J342J200J20j831
3065g5o50J867N69j264j154k85P95K902O99l686k746O72L172K704K18m016l957
3082d235J185M809K539r71l780l660O25M753K785j602l327k181P33L785J924k186
3098A196k318m61J361O56Q81j295j440P54K127o47j787m75M69J801J726j323l773
3115b548p17K728L439M90j965m542j266L939M430l06l007l416j346L130M578M56
3131D077m028k831J58K234L006Q85l179k394Q33K004P70m32r51j151J575O69j380
3148a35o52J082J027M59j61k007k275J679L385Q85j472k719k141J330M979J462
3164D726l242l778p12K023L555J981k637m227m44K702J849J437j061l549j237
$$ plain form
3179 -2614 -102 1742 1909 634 -508 -1039 607 1277 159 -254 616 1069 528 -32 -684 -1312 746
3196 746 2734 1015 -898 -1949 -1614 504 3331 2616 -1109 -2684 -1849 599 2722 2489 -893 -3193
3212 -3193 -1513 646 1819 1493 -24 -2405 -1765 274 1256 581 212 -975 -1226 70 480 -613 -532
3229 -532 348 272 -595 -1250 -1608 -357 1302 1485 -1138 -3114 -1747 -493 1428 2354 -70 -2993 -3140
3246 -3140 -346 1561 2389 469 -3180 -3689 -672 1627 1451 507 -1802 -3029 -1161 1174 823 -181
3262 -181 -757 -1362 -1868 -288 877 201 -465 -778 -1031 -1311 -261 -170 115 923 -567 -2719 -1889 14
3280 14 788 1212 100 -2238 -2807 -426 1832 1683 355 -1335 -2855 -1458 1142 2256 718 -876
3296 -876 -2513 -1803 442 1898 456 -1218 -1270 -1175 -388 854 747 -141 -1039 -639 -924 38 433 273 -359
$$ packed form
3179b614K512J844J67j275j142n31J646O70j118m13Q70M53n41n60o52o28K058
3196G46J988j719j913j051L35K118K827p15l725j575Q35K448K123k33l382k300
3212c193J680K159J173l26j517k381O40K039R82o75l69j187k51J296M10j093Q1
3229e32Q80p6q67o55l58J251J659J83k623j976J367J254J921R26k424k923j47
3246c140K794J907Q28j920l649n09L017K299j76r44k309j227J868K335l51j004
3262a81n76o05n06J580J165o76o66l13k53k80J050R1K85Q08j490k152Q30J903
3280A4P74M24j112k338n69K381K258j49j328j690j520J397K600J114j538j594
3296h76j637P10K245J456j442j674n2R5P87J242j07q88q98M00k85R62L95j60o32
$$ plain form
3315 -359 -61 -530 -1308 -565 691 684 604 -219 -1996 -1528 950 1742 786 -565 -1504 -2240 -343 2057 1870
3334 1870 -105 -1283 -2232 -1037 1511 2196 -22 -1433 -1495 -1024 395 1553 438 -1437 -1099 -473 -267
3351 -267 416 1194 -60 -929 -623 -711 -618 480 555 -71 -387 -1222 -1972 -619 1517 1464 -882 -1813 -1965 -1218
3371 -1218 828 2570 912 -1975 -2637 -1033 728 2146 1465 -1349 -2568 -1729 98 1837 2234 -884
3387 -884 -2592 -1346 534 799 957 174 -1072 -1337 -147 714 384 263 -130 -948 -609 -120 -594 296
3405 296 1234 172 -1296 -898 -669 320 1768 1425 -1057 -2299 -1375 692 2122 2212 280 -1984 -2061 323
3423 323 1783 2292 792 -1951 -2007 40 2119 1248 518 -573 -1377 75 1574 1060 -49 26 216 -217
3441 -217 308 649 282 398 1491 -47 -1015 -49 260 1115 1951 1192 -1362 -2351 162 2045 2240 1101
$$ packed form
3315c59K98m69p78P43J256pq0q23j777M68K478P92r56j351r39p36J897K400j87
3334A870j975j178r49J195K548O85k218j411o2M71J419J158j115j875L38O26K06
3351b67O83P78j254q69L06q8R3J098P5o26l16q35p50J353K136n3k346r31j52P47
3371a218K046J742j658k887o62J604J761J418o81k814j219Q39J827J739L97l118
3387h84j708J246J880K65J58p83j246k65J190Q61l30j21l93q18L39M89m74Q90
3405B96R38j062j468L98K29R89J448l43k482j242R24K067J430R0j932k264p7K384
3423C23J460N09j500k743n6K047K079q71p30j091q04J452J499n14j109P5J90m33
3441b17N25L41l67J16J093j538r68R66L09Q55Q36p59k554r89K513J883J95j139
$$ plain form
3459 1101 -1148 -2495 -688 2121 2138 1173 -804 -2194 -1013 1717 2403 866 -543 -1305 -958 520
3475 520 1998 434 -939 -416 160 -26 389 149 -18 55 -159 -728 -1176 218 787 1080 641 -792 -2398
3494 -2398 -1043 1490 2040 737 -1172 -2887 -2229 813 3094 1381 -1475 -2671 -1863 559 2245 1104
3510 1104 -1323 -1922 -1249 -74 1292 1032 -1070 -1832 -701 528 -49 15 -455 -966 -30 100 -920 -1097
3528 -1097 -198 800 455 -327 -1763 -1954 173 2142 1297 -493 -2021 -2261 -290 2396 2576 -527 -2957
3545 -2957 -2369 -217 2138 2562 -624 -2320 -1447 81 1195 936 5 -1732 -1336 679 759 -98 -463
3562 -463 -537 -395 313 406 -283 -689 816 754 84 -712 -1372 -1033 1478 2531 177 -1965 -1674 -212 1910
3581 1910 3163 718 -2259 -2841 -545 1673 2570 1190 -2453 -2541 160 1773 1881 354 -1342 -1583
$$ packed form
3459A101k249j347J807K809J7r65j977j390J181K730O86j537j409p62L47J478
3475E20J478j564j373N23N76j86M15k40j67P3k14n69m48J394N69K93m39j433j606
3494b398J355K533N50j303j909j715O58L042K281j713k856j196Q08K422J686j141
3510A104k427n99O73J175J366k60k102p62J131J229n77O4m70n11R36J30j020j77
3528a097Q99R98l45p82j436j91K127J969q45j790j528k40J971K686J80l103k430
3545b957N88K152K355M24l186j696Q73J528J114k59r31j737L96K015Q0q57l65
3562d63p4J42P08R3o89m06J505o2o70p96o60L39K511J053k354k142K91J462K122
3581A910J253k445k977n82K296K218Q97j380l643q8K701J613J08j527j696k41
$$ plain form
3597 -1583 48 1444 727 -492 -112 -539 -261 706 149 -859 -208 1003 623 -583 -1031 -630 159 2014
3615 2014 1221 -1373 -2310 -935 1101 2300 1417 -1272 -2793 -1089 1314 2101 1074 -965 -3023 -1711
3631 -1711 1302 2654 560 -1134 -1831 -1219 900 1722 -264 -1184 -565 -240 -177 390 -232 -929 -139 514
3649 514 41 -932 -643 -481 748 1067 -363 -2430 -1731 405 1761 1400 -297 -2567 -2018 976 2651
3666 2651 1145 -872 -2119 -1979 381 2362 1834 -699 -1666 -1390 120 2211 1585 -695 -1203 -141
3682 -141 703 721 460 77 -78 334 471 39 -409 542 1022 980 777 -536 -1242 763 2090 1556 386
3701 386 -1017 -1698 75 2849 2809 420 -1787 -1289 448 2328 2380 454 -1374 -647 729 1544 2331
3718 2331 698 -1146 -513 1039 1237 955 793 -21 12 593 656 -261 132 1436 1226 428 -228 -1025 -339
$$ packed form
3597a583J631J396p17j219L80m27K78R67n57j008O51J211l80j206m48M01P89J855
3615B014p93k594r37J375K036J199q83k689j521J704K403P87j027k039k058J312
3631a711L013J352k094j694o97O12K119Q22j986r20O19L25O3N67o22o97P90O53
3649E14m73r73K89J62J229L19j430k067O99K136J356l61j697k270N49K994J675
3666B651j506k017j247J40K360J981n28k533r67K76J510K091o26k280n08J062
3682a41Q44J8k61l83j55M12J37m32m48R51M80m2k03j313p06K005J327n34j170
3701C86j403o81J773K774m0k389k207M98J737J880N2j926j828P27J376Q15P87
3718B331j633j844O33J552J98k82j62q14L3N81O3r17L93J304k10p98o56p97O86
$$ plain form
3737 -339 1501 2241 780 -942 -1517 -456 1395 2534 1134 -1607 -1726 -497 1271 2408 1182 -1586
3753 -1586 -2186 -524 1195 1188 324 -464 -1612 -420 678 404 19 -299 -816 -349 394 38 -982 -376
3771 -376 599 -37 -600 -965 -874 37 1269 1041 -1371 -1668 -947 242 1550 946 -917 -2312 -1405 658
3789 658 1515 897 -841 -2461 -1765 261 1371 449 -588 -1505 -1421 103 660 46 -507 -709 -750 -504 343
3808 343 62 -650 29 194 -591 -777 -144 57 525 994 -635 -1574 -1161 335 1188 1023 -67 -1633 -1820
3827 -1820 519 1674 1013 162 -1231 -2192 -293 1790 1540 -312 -964 -1155 -294 1508 1569 -26 -927
3844 -927 -646 54 228 975 278 -400 181 125 -442 -103 631 98 477 398 -281 -1251 -502 1168 1194 269 -552
3865 -552 -1583 -625 1430 1209 481 -1026 -1595 -1093 122 1559 248 -1117 -1030 -1298 -81 1185 700
$$ packed form
3737c39J840P40j461j722n75J061J851J139j400k741j19J229J768J137j226k768
3753a586o00J662J719pq64p88j148J192J098k74l85l18n17M67P43l56j020O06
3771c76R75o36n63l65R1R11J232k28k412k97P21J189J308o04j863j395R07K063
3789F58Q57o18j738j620O96K026J110r22j037r17Q4J524N57o14n53k02m1K46Q47
3808C43k81p12O79J65p85j86O33K01M68M69j629r39M13J496Q53j65j090j566j87
3827a820K339J155o61q51j393r61J899K083k50j852o52j91Q61J802O1j595r01
3844i27K81P00J74P47o97o78N81n6n67L39P34n33L79p9o79r70P49J670K6r25q21
3865e52j031R58K055k21p28j507n69N02J215J437j311j365Q7k68J217J266m85
$$ plain form
3882 700 -625 -1365 -617 -489 -78 366 -394 -907 -611 -485 -652 -109 292 -65 -380 -456 -1072 -846 186 671
3902 671 -133 -1137 -1025 -1272 75 1372 394 -952 -1503 -1119 4 1046 1184 -782 -1503 -1205 -321 395
3920 395 1160 -150 -1707 -1477 -551 317 722 414 -786 -1086 -484 170 109 522 41 -794 -749 -129 -120 35
3940 35 453 12 -671 -631 -5 53 576 1018 -30 -795 -825 59 823 1542 747 -1161 -1201 -66 922 1254 1041
3961 1041 -455 -1234 -327 721 1035 1088 314 -955 -438 650 1271 698 564 346 -266 234 665 808 361
3980 361 1022 625 -602 147 413 733 1167 915 -485 -539 -56 745 1868 1197 337 -1319 -678 948 1580
3999 1580 1214 210 -1066 -1050 379 1448 1145 42 -464 -923 -232 1310 1394 -150 -284 -376 -607 420
4017 420 992 208 -252 -45 -111 -335 -12 626 375 37 -33 -1009 -668 466 933 298 -5 -1386 -1757 -350
$$ packed form
3882G00j325p40P48J28M11M44p60n13K96J26j67N43M01l57l15p6o16K26J032M85
3902F71q04j004J12k47J347J297r78j346n51L84J123J042J38j966p21K98Q84P16
3920C95P65j310j557K30R26Q68M05l08j200l00O02O54o1M13m81q35M5O20RJ55
3940C5M18m41o83M0O26N8N23M42j048p65l0Q84P64P19p95j908m0J135R88L32k13
3961A041j496p79R07J048L14N3p74j269N17J088O21n73j34k18o12N00M31J43m47
3980C61O61l97j227P49K66L20M34k52j400n4M83Q01J123o71q60j656O41J626O32
3999A580l66j004j276J6J429J069l03j103n06m59O91J542Q4j544j34r2k31J027
4017D20N72p84m60K07o6k24L23O38k51l38p0r76L41J134M67o35l03j381l71J407
$$ plain form
4037 -350 1442 1256 241 -1356 -1726 -1122 1250 1591 -315 -1181 -1422 -879 360 1381 -324 -1030 -1223
4054 -1223 -446 341 516 239 -930 -789 -126 102 -49 141 -253 -240 52 87 -847 -554 658 731 183 -540
4074 -540 -1039 -439 580 1534 697 -1087 -1371 -901 645 1749 896 -1097 -1405 -1047 775 1749 1008 -834
4092 -834 -1453 -482 883 721 571 -138 -570 -206 540 7 -17 199 -85 213 740 319 -711 34 1252
4111 1252 682 -110 -641 -956 288 1240 1257 -327 -1477 -880 198 1699 1804 -231 -1944 -1201 431
4128 431 1162 1342 -81 -1637 -1025 282 956 663 -16 -662 -949 -14 618 223 -281 -501 -115 76 168
4147 168 -370 -606 172 514 -242 -1024 -669 -333 823 1110 -33 -1680 -1451 8 1241 1688 112 -1614
4165 -1614 -2111 -17 1568 1440 -167 -1711 -1852 -248 1399 940 -36 -1012 -1012 -198 1098 626 -527 -709
$$ packed form
4037c50J792j86j015j597l70O04K372L41j906q66k41N43J239J021j705p06j93
4054a223P77P87J75k77j169J41O63K28j51J90l94J3K92L5r34K93J212P3n48p23
4074e40m99O00J019R54q37j784k84M70J546J104q53j993l08L58J822R74p41j842
4092h34o19R71J365j62j50p09m32L64P46n33k4K16k84K98N27m21j030P45J218
4111A252n70p92n31l15J244R52J7j584j150N97J078J501J05k035j713P43J632
4128D31P31J80j423j556O12J307O74k93o79o46k87R35O32l95n04k20L86J91R2
4147A68n38k36P78L42p56p82L55L36J156K87j143j647K29J459J233M47j576j726
4165a614m97K094J585j28j607j544j41J604J647m59r76r76%Q14J296m72j153j82
$$ plain form
4183 -709 51 160 93 -486 -152 -173 203 476 27 -843 -6 317 1016 481 -448 -1507 -541 1289 1355 718
4203 718 -580 -1792 -402 1464 1854 448 -626 -932 -580 1073 1589 831 -742 -592 27 853 1133
4220 1133 560 -263 101 785 482 1 167 155 439 1214 532 -152 -318 803 1244 739 172 -839 -425
4239 -425 934 1971 955 -578 -945 -655 1169 2541 1397 -583 -1152 -341 714 1877 1709 -42
4255 -42 -783 -218 598 1100 1468 26 -666 242 951 522 233 104 634 373 524 262 -327 91 1062 721
4275 721 17 48 -650 293 1671 1420 -14 -1013 -468 256 1618 1564 -678 -1627 -1006 429 1290 1312 -116
4294 -116 -1436 -528 150 947 683 126 -683 -555 236 615 93 -158 33 -86 132 150 -634 -579 116 789
4314 789 -207 -733 -458 -276 578 926 357 -975 -774 -149 768 873 267 -1056 -1166 62 1042 884 293
$$ packed form
4183g09P60J09o7n79L34k1L76K73m49q70Q37L23O99n35r29j059R66J830O6o37
4203G18j298j212J390J866L90j406j074l06L52J653N16p58j573J50O19Q26K80
4220A133n73q23L64O84l03m81J66j2K84P75o82o84j66J121M41n05n67j011M14
4239d25J359J037j016j533l67K90J824J372j144j980n69Q11J055J163j68j751
4255d2p41N65Q16N02L68j442o92R08P09m29k89j29N30k61J51k62n89M18R71l41
4275G21p04L1o98R43J378k51j434r99N45P24J362n4k242r49O21J435Q61K2j428
4294a16j320R08O78P97k64n57q09J28P91L79n22k51J91j19K18J8p84N5O95O73
4314G89r96n26K75J82Q54L48n69j332K01O25R17J05o06j323j10J228R80j58n91
$$ plain form
4333 293 -562 -1435 -483 727 758 -107 -497 -473 -172 596 200 -151 -31 166 -346 -270 -121 -297 77 756 570
4354 570 -502 -499 -174 573 499 555 -717 -1295 146 584 1062 631 -726 -1188 -672 1287 1295 305 -530 -870
4374 -870 -604 516 1115 83 -553 -715 -908 -105 442 261 -161 -495 -138 -262 -196 268 163 -198 166 -57
4394 -57 -596 -324 313 279 247 -305 -1041 -914 161 685 198 -328 -777 -926 231 908 274 -491 -919 -1062
4414 -1062 -593 335 537 -768 -967 -680 -447 66 464 -93 -565 -721 -253 -270 -276 167 164 -315 -515 -305 -437
4435 -437 411 668 -118 -358 -376 -880 -13 539 520 -297 -648 -436 -269 587 731 -213 -503 -733 122 199 630
4456 630 365 -657 -794 -291 402 734 681 -50 -764 -264 321 274 441 477 -106 -354 84 203 42 482 488
4477 488 -342 -117 110 78 256 613 109 -518 -220 21 320 785 596 -458 -876 -159 166 362 736 38
$$ packed form
4333B93q55q73R52J210L1q65l90K4L01P68l96l51J20J97n12P6J49j76L74O79j86
4354E70j072LL25P47p4N6j272n78J441M38M78m31j357m62N16J959Qr90q35l40
4374h70K66J120N99j032o36j62j93Q03N47j81m22l34L57j24O6M64j05l61L64k23
4394e7n39K72O37l4l2n52p36J27J075N24m87n26m49j49J157O77o34p65m28j43
4414a062M69R28K02j305j99K87K33N13L98n57m72j56M68j7oM43lm79k00K10j32
4435d37Q48K57p86k40j8n04Q67N52j9q17l51K12J67Q56J44r44k90k30Q55P7M31
4456F30k65j022j37N03O93L32n3p31p14N00N85m7J67L6n83k48M38J19j61M40O
4477D88q30K25K27l2J78L57n04o27K98K41K99M65j89j054m18P17L25J96L74o98
$$ plain form
4497 38 -880 -418 99 675 899 323 -558 -815 178 910 602 218 152 -729 -500 448 211 235 95 -213 -565
4518 -565 173 148 342 150 139 -114 -383 70 -190 -40 521 231 -470 -704 11 366 804 329 -411 -716 51
4539 51 994 754 474 -16 -995 -823 409 1008 252 -138 -375 -773 142 822 105 -306 -261 -336 4 385 255
4560 255 213 127 165 -20 -104 86 325 484 402 -9 -400 -398 244 677 654 -199 -724 -803 402 1205 637 -404
4582 -404 -730 -456 414 1059 1100 3 -590 -413 -48 882 1151 -158 -703 -397 173 404 625 273 155 -67
4602 -67 296 368 -253 54 465 159 112 -187 -344 225 582 447 24 -395 -486 -204 776 1069 -169 -1023 -696
4623 -696 -488 740 994 -232 -804 -567 12 568 625 94 -989 -844 28 510 553 96 -453 -541 -50 4
4643 4 -193 -521 -213 -214 -182 2 -382 -725 166 401 9 -588 -591 -635 54 840 311 -1105 -987 -436 24 536
$$ packed form
4497C8r18M62N17N76K24n76q81k57R93P32l08l84o6q81K29R48k37K4j40l08l52
4518e65P38k5J94j92j1k53k69M53k60J50N61k90p01k34P15L55M38m75p40l05P67
4539E1R43k40k80m90r79J72J232N99p56l90k37l98R15O80p17m11M5p5L40L81j30
4560B55m2q6L8j85q4J90K39J59q2m11l91KO42M33k3q53n25p9J205Q03n68j041
4582d04l26K74Q70O45M1j097n93J77L65R30K69j309n45L06N70K31K21l52j18k22
4602f7L63P2o21L07M11l06m7k99j57N69L57j35m23m19r1K82R80K93j238q54L27
4623f96K08J228K54j226n72K37N79N56N7n31j083J45Q72M82M3m57n49q8M91N4
4643Dj97l28L08jL2J84l84l43Q91K35l92n97lm4O89P86n29j416J18N51M60N12
$$ plain form
4665 536 483 -760 -1093 -557 527 603 122 -790 -921 -660 434 427 269 -100 -417 -343 -9 261 -273 -343 306
4686 306 125 25 -57 -300 -78 515 171 -213 -778 -261 345 665 1017 -171 -977 -513 822 1043 878 -164
4706 -164 -1339 -846 695 1303 762 -103 -839 -539 448 972 258 -375 -386 49 300 346 323 -265 -65 215
4726 215 185 162 100 247 200 382 232 -604 -284 204 755 743 241 -437 -809 518 1199 810 261 -706 -920
4747 -920 183 1171 895 -309 -631 -779 267 808 1182 -153 -996 -302 287 455 207 -327 -547 -2 422
4766 422 87 -180 34 -382 173 259 -205 -904 -362 454 363 9 -420 -630 -434 500 506 27 -932 -1126 -457
4787 -457 1077 866 233 -992 -958 139 270 870 121 -651 -745 -152 339 125 152 -365 -320 134 -24 -352
4807 -352 -25 177 16 213 29 -575 -535 199 676 426 -269 -639 -482 545 1156 282 -926 -888 -297 478
$$ packed form
4665E36n3j243l33N36J084P6m81r12j31K61J094pj58l69l17P4L34K70n34p0O49
4686C06j81j00q2k43K22N93l44l84n65N17O06L20L52j188q06M64J335K21j65j042
4706a64j175M93J541O08n41q65p36L00R87N24p14o33j1M35K51M6k3n88K00K80
4726B15l0k3o2J47m7J82j50q36L20M88N51j2n02o78l72J327O81l89n49r67k14
4747i20J103R88k76j204l22j48J046N41L74j335q43O94N89J68k48n34k20N45M24
4766D22l35k67K14m16N55Q6m64o99N42Q16r1l54m29k10J96R34Om79r59j94O69
4787d57J534k11o33j225L4J097J31O00p49p72r4N93M91k14K7n17M5M54j58l28
4807c52L27K02j61J97j84o04M0P34M77k50o95l70J57J027O11q74j208L8N91P75
$$ plain form
4827 478 1128 571 -778 -1155 -273 663 625 178 -602 -757 -301 839 860 -60 -71 -85 -93 719 504 71 73 368
4849 368 187 210 199 -12 -11 926 840 -148 -487 53 250 805 775 166 -593 -435 40 563 471 -92 -784 -458
4871 -458 397 664 617 -326 -339 -904 270 771 155 -243 -113 -419 -308 70 -147 -515 -99 -106 -398 -537 -475
4892 -475 -310 7 379 -338 -977 -925 127 244 90 -126 -1147 -1059 60 444 413 -127 -818 -1074 -127 418
4912 418 141 -705 -911 -933 -260 391 330 -603 -775 -548 -164 -219 247 54 -130 -212 -55 -228 -331 -263 26 496
4934 496 -242 -554 -580 -70 343 267 -82 -339 -543 -173 558 568 -199 -488 -232 -283 340 690 299 -729 -129
4955 -129 151 -48 748 79 -384 -331 69 236 263 350 45 -145 34 152 5 -164 254 261 140 -180 7 47
4977 47 271 611 -241 -241 101 -183 213 565 333 -437 -299 -26 533 764 394 -398 -630 -240 456 362 671
$$ packed form
4827D78O50n57j349l77Q82R36l8m47p80j55M56J140K1r20j1j4qQ12k15m33KK95
4849C68j81K3j1k11JR37q6r88l39N40J97N55l0o09p59J58M75N23r2n63o92L26
4871d58Q55K67m7r43j3n65J174N01o16l98J30l06J11L78k17l68M16pk92j39O2
4892d75J65L17L72p17o39N2J052J17j54k16j021Q8J119L84l1n40o91k56R47N45
4912D18k77q46k06k2O73O51o1r33j72K27L84n5M66j93j84q2J57j73j03O8K89M70
4934D96p38l12k6N10M13p6l49k57k04L70P31J0p67k89K56n1O23L50l91j028O00
4955a29K80j99P96o69m63N3M00J67K7Q7l05j90J79J18j47j69M18Pj21l20J87M0
4977D7K24L40q52%L42k84L96L52k32p70J38K73N59K31l70p92k32L90O96r4L09
$$ plain form
4998 671 -45 -417 37 186 -53 -36 140 -252 -258 16 115 -65 323 223 -197 -611 -15 -288 -120 459 -98
5019 -98 -513 -533 -148 -54 427 329 -501 -791 -207 149 384 566 -102 -541 -388 107 322 125 -346 -440 -527 -253
5041 -253 254 128 -7 -346 -451 -526 41 90 294 100 -33 -551 -56 -190 358 148 149 -258 -630 -214 172
5062 172 80 230 57 -490 -330 303 811 331 -55 166 -296 185 250 194 32 7 -329 -287 341 384 318 2
5084 2 85 -241 175 461 483 215 -208 -235 -123 118 585 311 575 14 -240 52 328 424 191 434 57 -181
5106 -181 -84 147 405 347 435 -62 -259 387 693 274 109 -58 -560 42 734 523 305 -274 -102 -167 -11
5127 -11 491 239 -113 -338 -6 236 751 309 -207 -344 -261 44 195 388 -27 -339 -173 -279 -309 -131 250
5148 250 86 -133 -112 -293 -155 93 485 -59 -236 -229 -317 112 661 1 -591 -723 -424 31 101 441 -466 -583
$$ packed form
4998F71p16l72M54J49k39J7J76l92oK74R9j80L88j00m20m14N96k73J68N79n57
5019i8m15k0L85R4M81r8q30k90N84L56K35J82o68m39J53M95K15j97m71r4q7K74
5041b53N07j26j35l39j05p5N67M9K04j94j33n18M95j34N48k10Jm07l72M16L86
5062A72r2J50j73n47J60O33N08m80l86K21m62M81O5n6j62k5l36M2O28M3o6l16
5084BQ3l26M16K86K2k68m23k7J12K41M67k74K64n61k54K92K76R6k33K43l77k38
5106a81R7K31K58n8Q8m97j97O46L06m19j65j67n02O02O92k11k18n79J72o5J56
5127a1N02k52l52k25L32K42N15m42n16j37Q3L05J51J93m15l12J66j06l0J78L81
5148B50j64k19K1j81J38K48L92n44j77Pq8M29N49o60n92j32K99M55P0L40r07j17
$$ plain form
5170 -583 -683 -82 185 351 53 -859 -436 43 -212 87 -166 -447 -551 -123 -51 -246 39 22 -70 -374 -257
5191 -257 -147 -425 310 -102 -260 -352 -295 147 240 478 -176 -909 -316 114 513 559 148 -546 -515 175 190 472
5213 472 -37 -103 -325 213 586 -9 -131 -78 -46 90 450 130 214 176 391 -77 -167 318 -48 298 596 302
5235 302 -155 -316 240 394 560 265 -366 -394 -18 436 513 40 -350 -364 57 773 100 -72 -397 -440 -98
5256 -98 592 768 0 -161 -140 -117 -147 321 62 -38 34 -204 184 -28 239 44 45 150 -148 -540 -307 172
5278 172 479 -12 -130 -790 -382 183 829 -82 -435 -836 -294 280 495 -99 -292 -707 -391 52 270 213
5298 213 -679 -662 -175 -184 46 -158 -246 -445 -212 -188 26 -71 -270 10 5 -113 -331 -518 -358 428 -26 3 -745
5321 -745 -497 -346 549 444 -552 -338 -74 197 667 489 -267 -571 -153 346 380 455 -96 -512 -128 326 236
$$ packed form
5170e83j00O01K67J66k98r12M23M79k55K99k53k81j04M28P2j95K85j7r2l04J17
5191b57J10k78P35m12j58r2N7M42R3K38o54p33N93M30L99M6m11o94L1O90J5K82
5213D72n09o6k22N38L73n95j22N3L2J36L60l20Q4l8K15m68r0M85l66L46K98k94
5235C02m57j61N56J54J66k95o31k8L76M54P7m73l90j4M21P16o73j72l25m3L42
5256i8O90J76p68j61K1K3l0M68k59j00P2k38L88k12K67j95JJ05k98l92K33M79
5278A72L07m91j18o60M08N65O46r11l53m01N42N74K15n94j93m15L16M43K18n7
5298B13q92J7M87rK30k04q8j99K33K4K14r7j99K80nj18k18j87J60P86m54K9p48
5321g45K48J51Q95j05r96K14K64K71M70j78p56l04M18M99L4P5n51m16L84M54r0
$$ plain form
5342 236 135 212 -84 97 574 206 37 -10 73 552 -94 356 -73 123 589 349 67 -429 -268 65 608
5363 608 688 -145 -369 -131 322 677 542 12 -424 -322 67 580 458 74 -413 -464 200 505 503 139 -77
5384 -77 -72 117 205 342 140 64 328 267 -65 -123 -31 303 838 154 -282 -403 260 311 562 -9 -502 -333 -7
5407 -7 601 368 -39 -481 -509 -23 416 365 -275 -737 -347 -153 364 -93 -72 -347 -255 167 -160 -102 -361 -337 -129
5430 -129 8 -23 -325 -300 -209 134 168 -416 -281 -254 12 674 2 -475 -690 -601 371 624 -4 -427 -477 -492 342
5453 342 704 -314 -83 -541 -291 302 40 388 -39 -469 263 113 203 82 -158 162 45 501 -253 52
5473 52 190 236 463 59 -241 -56 174 719 133 -86 4 -140 272 620 404 -143 -350 0 -105 589 428
5494 428 -80 -236 147 359 683 299 -200 -310 -157 213 534 196 247 118 -100 492 78 -161 -45 336
$$ packed form
5342B36j01P7k96J81M77l68j69m7Q3M79o46M50m29J96M66k40k82m96J61L33N43
5363F08Q0q33k24K38M53L55j35n30m36J02L89N13j22l84m87n1O64L05kl64k16
5384g7NJ89Q8J37k02p6K64o1l32n8R2L34N35o84m36j21O63N1K51n71m93J69L26
5407gO08k33m07m42k8M86M39n1o40m62L90J94N17m57K1k75R2M22l27N8k59K4K08
5430a29J37l1l02K5R1L43L4n84J35K7K66O62o72m77k15Q9R72K53o28m23n0j5Q34
5453C42L62j018K31m58K50N93k62L48m27m30P32j50R0j21k40L20j17M56p54L05
5473E2J38M6K27m04l00J85K30N45n86k19R0j44M12L48k16n47k07L50j05O94j61
5494D28n08j56L83K12L24l84m99j10J53L70L21l38N1j29k18N92m14k39J16L81
$$ plain form
5514 336 358 179 -283 -185 124 572 169 -233 -452 -454 181 168 403 -84 -743 -340 -72 90 -217 248 -714 -645
5536 -645 328 379 361 -107 -216 -580 173 207 -122 -128 198 -29 -159 -57 -251 -215 -120 321 -180 -388 -235 -42
5558 -42 -119 306 187 -664 -475 -77 350 102 -228 -498 -618 -56 51 39 -175 -380 -729 -275 93 15 58 -224
5580 -224 -287 -218 5 -93 -98 -90 127 -3 -41 43 -54 -150 314 -185 -105 -156 71 -80 406 196 -95 -155 -197 -18 263
5605 263 575 -262 -627 62 148 221 360 -162 -202 207 199 625 -94 13 -218 127 250 166 -38 -54 296 -28
5627 -28 -22 90 493 498 40 -256 -20 -80 275 98 548 173 57 -406 -454 104 471 -115 22 -93 -46 -166 259
5650 259 5 -4 -141 -97 -49 273 258 -199 -250 -131 -134 118 250 -65 62 -208 -243 -216 -52 86 -262 -131 -342
5673 -342 -827 -151 114 132 -274 -307 -121 -298 -172 -2 -200 -123 -221 -179 -91 341 16 -267 -372 -129 -497 -42
$$ packed form
5514C36K2j79m62R8L09M48m03m02k19kO35j3K35m87o59M03K68J62l07M65r62O9
5536f45R73N1j8m68j09l64P53L4l29oL26k27j30J02j94L6R5M41n01k08J53J93
5558d2p7M25j19q51J89L98M27k48l30k70j20N62J07j2k14k05l49M54L68p8M3k82
5580b24o3O9K23r8nQK17j30l8Q4r7r6M64m99Q0n1K27j51M86k10k91o0m2J79K81
5605B63L12q37l65O89Q6P3J39n22m0M09qM26p19J07k31L45J23q4k04j6L50l24
5627b8OJ12M03Nm58k96K36o0L55j77M50l75j16m63m8N58L67n86J37j15M7j20M25
5650B59k54rj37M4M8L22j5m57n1J19lK52J32l15J27k70l5K7J64J38l48J31k11
5673c42m85O76K65J8m06l3J86j77J26J70j98P7r8M2Q8M32l25k83j05K43l68M55
$$ plain form
5695 -42 166 95 -514 -382 -74 46 -16 -78 110 -377 -545 -249 -307 235 279 -272 -541 -293 143 85 276 87
5717 87 -173 -105 66 240 -83 328 -1 -168 146 -86 62 344 99 72 15 284 -118 184 275 -133 -88 -156
5739 -156 -62 118 313 148 -180 -184 -38 525 211 390 -321 -213 -119 69 210 193 177 214 -264 316 121 71 172
5762 172 -170 -97 60 256 225 90 87 -184 -119 61 80 199 40 155 -45 -148 -161 204 210 190 -71 -251 -355
5785 -355 205 215 29 -8 -341 -371 83 253 363 -277 -274 -170 -212 69 271 11 -198 29 -202 -69 26 -84
5807 -84 -246 -137 -272 -274 -34 -116 -111 88 177 -357 -319 35 273 295 -100 -370 -613 -330 509 239 -114 -662 -726
5830 -726 -287 104 130 20 -192 -306 -203 242 468 -30 -176 59 -200 277 20 -101 153 -283 337 -295
5850 -295 104 84 66 264 -137 -117 -451 75 541 642 130 -48 -181 -140 383 394 192 -18 -227 56 -133 600
$$ packed form
5695d2K08p1o09J32L08J20o2o2J88m87j68K96n8N42M4n51k69K48M36n8J91j89
5717H7k60O8J71J74l23M11l29j67L14k32J48K82k45k7n7K69m02L02R1m08M5o8
5739a56R4J80J95j65l28mJ46N63l14J79p11J08R4J88J41j7j6L7m78N80j95n0J01
5762A72l42P3J57J96l1j35lk71O5J80J9J19j59J15k00j03j3L65Ok0k61j80j04
5785c55N60J0j86l7l33l0M54J70J10o40LJ04m2K81K02k60k09K27k31J33R5j10
5807h4j62J09j35kK40q2NJ99Q9n34L8L54K38K2l95k70k43K83Q39k70l53n48o4
5830g26M39L91K6j10k12j14J03M45K26m98j46K35k59M77k57j21K54m36O20o32
5850b95L99k0j8J98m01K0l34N26M66J01n12j78j33M1N23J1k02k10k09K83j89P33
$$ plain form
5872 600 77 -276 -325 102 410 323 99 -61 -304 246 137 390 -247 18 -200 -88 431 -34 127 -4 370
5893 370 352 137 -369 -233 279 419 134 -46 -334 63 56 576 644 -98 -566 -84 339 430 105 -109 -584 -80
5915 -80 167 396 251 -431 -406 -148 306 290 -205 -194 -428 -130 118 163 -240 -628 140 306 -559 -286 -45 19
5937 19 -110 324 -46 -655 -328 92 552 641 -153 -657 -361 344 278 99 25 -398 -543 167 318 -27 -165
5958 -165 -306 -94 131 106 246 -13 -48 -51 -75 88 -50 151 142 305 -26 -8 57 138 395 376 -13 -292 -199 -83
5982 -83 634 292 180 81 -664 -9 405 467 152 -225 -251 -32 757 395 -20 -140 -415 105 534 21 60 -235
6004 -235 -217 217 271 261 52 -76 260 163 96 -103 10 516 298 177 -23 -263 -192 490 409 358 -279 -257 -228
6027 -228 315 672 0 -458 -351 21 268 436 -163 -568 39 264 249 135 -7 -750 -567 -22 84 -185
$$ packed form
5872F00n23l53m9M27L08q7k24j60k43N50j09K53o37K65k18J12N19m65J61j31L74
5893C70j8k15n06J36N12J40k85j80k88L97pN20O8p42m68M82M23R1l25k14m75N04
5915h0K47K29j45o82K5K58M54j6m95J1k34K98K48M5m03l88P68J66q65K73K41O4
5937A9j29M34l70o09L27M20M60Q9p94n04K96P05o6j79p4m23j45P10J51l45j38
5958a65j41K12K25k5J40k59l5lk4J63j38K01rJ63l31J8O5Q1K57j9l89k79R3J16
5982h3P17l42j12r9p45O55M14O2l15l77k6K19P89l62m15j20k75N20M29n13L9k95
6004b35J8M34N4j0k09j28L36r7o7j99J13N06k18j21k00k40P1O82q1n1o37K2K9
6027b28N43L57o72m58J07L72K47J68n99m05O07K25j5j14j42p43J83N45J06k69
$$ plain form
6047 -185 -21 -297 -82 -74 72 -70 -634 70 242 -80 -314 -113 -376 22 337 -107 -86 -491 -744 38 73
6068 73 149 -309 -658 237 194 292 160 -398 -484 -416 86 55 -155 106 -295 -107 310 -107 -144 -192 -216 -205 -223 -52
6092 -52 105 -88 290 53 -161 -309 57 15 140 -15 -173 -384 -390 127 40 -79 -85 -388 -195 171 357 38
6114 38 -63 -274 -213 289 175 245 66 -336 121 50 31 188 37 -119 100 -130 191 -108 0 217 315 150
6136 150 -162 -283 111 534 204 -154 -131 -412 424 650 244 111 -449 -259 222 478 26 -373 -252 -346 -89
6157 -89 438 128 -162 -303 -429 212 173 56 -196 -103 208 150 2 39 -27 73 28 -118 -140 -418 -266 98 72
6180 72 -159 176 -328 -367 241 -4 -19 -72 -273 -229 -44 39 -63 -147 137 -62 -146 254 131 -21 -355 -118 -96
6203 -96 17 -75 2 -249 36 46 -195 109 -109 11 167 -223 -29 -59 -11 165 39 -300 -475 -22 -126 107
$$ packed form
6047a85J64k76K15QJ46j42n64P04J72l22k34K01k63L98L15m44K1m05k53P82L5
6068G3P6m58l49Q95m3R8j32n58q6O8N02l1k10K61m01J88M17m17l7m8k4J1j8J71
6092e2J57j93L78k37k14j48L66m2J25j55j58k11oN17q7j19ol03J93L66J86l19
6114C8j01k11O1N02j14P0j79m02M57p1j9J57j51j56K19k30L21k99J08K17R8j65
6136A50l12j21L94M23l30l58K3k81Q36K26m06j33n60J90M81K56m52l99J21r4K57
6157h9N27l10k90j41j26O41l9j17k52R3L11n8j48L7o6J00m5j46k2k78J52L64k6
6180G2k31L35n04l9O08k45j5n3k01M4J85Q3j02q4K84j99q4M00j23j52l34K37K2
6203i6J13r2P7k51K85J0k41L04k18J20J56l90J94l0M8J76j26l39j75M53j04K33
$$ plain form
6225 107 121 -360 -268 -87 -16 587 380 -116 -280 -219 228 340 399 49 18 6 -147 -14 108 184 -139 -130 287
6248 287 127 65 231 9 270 -133 156 -122 332 186 239 -330 -208 -110 -31 292 288 81 -265 -36 -48 156
6270 156 307 67 -138 6 -34 -274 205 -128 -144 162 189 531 340 180 111 -381 -134 224 49 57 271 -162
6292 -162 -66 -138 -12 68 255 337 -190 -248 -197 163 300 -43 61 -207 -37 -241 88 109 -10 -233 -452 -123
6314 -123 -22 112 260 376 41 -240 -91 33 -35 -63 -155 -151 -226 234 -4 -19 -251 -296 -259 -32 152 61 -326
6337 -326 -55 -213 126 52 -64 247 103 31 -280 -157 3 59 95 19 -115 -501 331 15 -162 370 148 112
6359 112 -401 199 169 189 -110 -112 174 128 529 106 -209 -370 36 -179 282 426 -48 -372 -259 88 292 507
6381 507 -10 -143 -80 262 272 127 263 -72 -183 -58 267 99 247 30 -73 -75 -83 151 159 120 247 23 -186
$$ packed form
6225A07J4m81R2J81P1O03k07m96j64O1M47J12N9l50l1j2j53J33J22P6l23RM17
6248B87j60o2J66k22K61m03K89k78M54j46N3n69J22R8P9L23mk07l46K29j2K04
6270A56J51k40k05J44m0k40M79l33j6L06K7L42j91j60o9m92K47L58j75QK14m33
6292a62R6p2J26Q0J87Q2n27n8N1L60J37l43J04k68J70k04L29K1j19k23k19L29
6314a23J01J34J48J16l35k81J49J24o8k8r2Mp5M60k38j5k32m5L7K27J84r1l87
6337c26K71j58L39p4j16L11j44p2l11J23J60N6L6p6j34l86Q32l16j77N32k22l6
6359A12n13O00l0K0k99kK86m6M01m23l15j61M06k15M61J44m74l24J13L47K04K15
6381E07n17j33O3L42J0j45J36l35j11J25L25j68J48k17j03kqK34Ql9J27k24k09
$$ plain form
6404 -186 -273 236 219 244 -46 -19 -136 20 206 425 91 -397 -45 226 128 256 255 -176 -138 17 -18 134 29
6427 29 164 164 -45 126 38 138 -76 215 156 25 -124 168 -10 270 -104 -441 -97 -122 603 195 -106 -289
6449 -289 -264 311 283 73 -29 -49 -83 206 133 176 162 -119 -374 -143 464 184 -283 -221 -420 -171 -307 -190 -235
6472 -235 137 98 25 -187 -246 186 -57 167 17 -191 -457 -99 26 310 261 -205 -183 -398 311 476 177 170
6494 170 -197 -59 305 412 193 -194 -71 13 -7 314 336 -203 -54 41 -15 47 20 -31 93 -36 154 49 -11
6517 -11 27 374 280 112 -53 29 133 383 288 134 18 -318 127 589 5 57 -152 -220 138 608 640 0 20
6540 20 -89 157 49 353 -230 22 195 42 386 84 208 -47 -9 -10 -34 -148 83 395 239 164 -380 -484
6562 -484 36 127 344 113 -177 -193 -286 100 486 -144 -444 -480 -166 443 308 8 -397 -312 -263 -254 158 -72 -291
$$ packed form
6404a86q7N09j7K5k90K7j17J56J86K19l34m88L52K71r8J28jm31L8J55l5J52j05
6427B9J35%k09J71q8J00k14K91n9j31j49K92j78K80l74l37L44k5P25m08l01j83
6449b89K5N75k8k10j02k0l4K89p3M3j4k81k55K31O07k80m67O2j99K49j36J17m5
6472b35L72l9p3k12n9M32k43K24j50k08k66L58J25K84m9m66K2k15P09J65k99p
6494A70l67J38L64J07k19l87J23Q4k0L21K2n39J49R5n6O2k7n1J24j29J90j05o0
6517a1L8L47r4j68j65Q2J04K50r5j54j16l36M45M62n84N2k09o8L58M70L2o40K0
6540B0j09K46j08L04n83K52J73j53L44l02J24k55L8jk4j14K31L12j56p5n44j04
6562d84N20R1K17k31k90j6r3L86L86o30l00l6L14O09j35l00m05Q5M9RM12k30k19
$$ plain form
6585 -291 28 -237 338 -26 -77 -17 -130 -194 -153 -136 -288 -115 19 -214 -223 -442 -307 256 288 -132 -306 -372 -480
6608 -480 -70 345 -98 -549 -144 -24 18 241 82 -370 -109 -174 138 -94 18 -231 -231 -49 230 96 -216
6629 -216 -65 244 88 -171 -18 -24 -198 246 450 -20 -153 -94 250 478 -32 11 -289 -418 136 632 340
6650 340 -309 -426 25 78 441 170 -180 -25 -209 435 315 9 -302 17 172 152 305 -96 -138 166 280
6671 280 155 11 -11 64 -253 293 -334 -214 -272 170 283 76 -134 -281 -535 -127 384 184 -21 -622 -218
6692 -218 -70 284 267 -150 -108 -439 -287 74 -154 -55 -304 135 -22 -196 -233 -92 268 173 -68 -142 -247 -168
6714 -168 -158 286 117 -48 -251 -81 -40 -107 2 -226 -253 -312 424 154 -186 -404 -264 -252 145 224 35 -587
6736 -587 -334 46 131 55 -50 -175 -310 -317 -158 85 -99 -531 -359 146 -82 -209 -143 -59 355 152 4 -451
$$ packed form
6585b91L19k65N75l64n1O0j13o4M1J7j52J73J34k33rk19J35N63L2m20j74o6j08
6608d80M10M15m43m51M05J20M2K23j59m52K61o5L12k32J12k49%J82K79j34l12
6629b16J51L09j56k59J53oj74M44K04m70j33N9L44K28n10M3l00j29N54M96k92
6650C40o49j17M51N3L63k71l50J55j84O44j20l06l11L19J55k0J53m01m2L04J14
6671B80j25j44k2P5l17N46o27J20n8M42J13k07k10j47k54M08N11k00k05o01M04
6692b18J48L54j7m17M2l31J52L61k28R9k49M39j57j74l7J41L60r5k41p4j05P9
6714a68J0M44j69j65k03J70M1o7J09k28k7n9P36k70l40k18J40J2L97P9j89o22
6736e87K53L80Q5p6j05j25j35pJ59K43j84m32J72N05k28j27O6Q4M14k03j48m55
$$ plain form
6758 -451 -216 265 156 29 -272 -227 -250 331 331 107 -188 -99 -139 184 340 334 -338 -40 -25 51 577 171 -1
6781 -1 -178 -9 239 102 72 250 191 -159 38 136 201 210 147 -6 -76 -209 -87 -84 217 194 -88 71 -176 97
6805 97 231 385 -179 -375 23 68 112 -3 82 -265 -285 437 17 126 -17 -206 -328 -113 97 109 273 24
6827 24 -335 -262 -225 -24 105 56 -154 -177 52 152 221 110 -96 296 -178 -295 -328 178 190 -67 -36 -155 122
6850 122 10 57 93 5 -303 -66 -81 150 -143 17 -315 -238 92 256 -10 86 13 -336 40 -19 49 -227 -328
6873 -328 -354 -52 -32 358 -4 89 309 -434 139 185 233 32 99 78 -140 -63 -147 248 -188 -30 -430 -228 224
6896 224 239 97 -183 -63 -393 176 344 95 50 -106 98 -238 145 284 -22 -100 -42 103 -34 300 12
6917 12 -126 183 -146 205 227 113 268 -203 -391 -21 105 -30 203 -13 -2 -161 66 -118 255 -45 2
$$ packed form
6758d51K35M81j09j27l01M5k3N81%k24k95Q9m0L23J56oo72K98J5P6N26m06j72
6781aj77J69K48j37l0J78n9l50J97R8O5Ro3j53p0j33J22LL01k3k82J59k47K73
6805I7J34J54n64j96L98M5M4j15Q5l47k0P22m20J09j43j89j22K15K10J2J64k49
6827B4l59P3L7K01J29m9k10k3K29J00O9j11k06L92m74j17l3N06J2k57L1j19K77
6850A22j12M7L6q8l08K37j5K31k93J60l32P7L30J64k66R6p3l49L76n9O8k76j01
6873c28k6L02K0L90l62R3K20p43N73M6M8k01O7k1k18P7q4L95m36J58m00K02M52
6896B24J5j42k80J20l30N69J68k49m5j56K04l36L83J39l06p8N8J45j37L34k88
6917A2j38L09l29L51K2j14J55m71j88L70J26j35K33k16J1j59K27j84L73l00M7
$$ plain form
6938 2 -51 -239 62 131 61 65 -408 -258 -21 44 212 155 72 -133 -147 258 64 69 -39 -500 -287 -57 288 146
6962 146 43 -134 -305 103 -23 -138 -97 112 -250 -251 -261 -112 -135 259 204 -89 33 -502 -52 154 -3 -161
6984 -161 -22 25 71 -31 302 134 -296 -548 252 94 208 277 -38 -328 132 114 -19 143 -34 -118 -380 316
7006 316 278 236 364 164 -134 39 -191 0 317 222 417 -97 275 115 104 163 121 21 -208 123 333 -25
7028 -25 528 21 -164 108 286 125 152 167 -77 19 357 394 83 -50 12 -63 211 175 -54 -193 -12 32 -104
7051 -104 -207 -154 8 359 350 -341 68 42 522 440 213 -172 -287 -394 309 113 398 -12 -276 -158 124 279
7073 279 -60 -48 -297 -410 325 412 -192 -185 -82 -3 205 238 -13 -7 -400 -289 -194 160 -187 -164 124 37 56 -293
7097 -293 -227 291 244 327 -323 -629 -269 -139 141 29 88 -377 -298 170 413 32 -206 -305 -97 112 442 200
$$ packed form
6938Bn3j88L01O9p0Mm73J50K37O5J68n7q3k05j4M05j94Nj08m61K13K30L45j42
6962A46j03j77j71M08j26j15M1K09l62jj0J49k3L94n5k93J22n35M50K06j57j58
6984a61J39M7M6j02L33j68m30k52Q00j58J14O9l15k90M60j8j33J62j77q4k62O96
7006C16l8m2J28k00k98J73k30J91L17r5J95n14L72j60j1N9m2j00k29L31K10l58
7028b5N53n07j85K72J78j61K7J5k44R6L38L7l11j33O2p5K74l6k29j39J81M4j36
7051a04j03N3J62L51ro91M09k6M80q2k27l85j15j07P03j96K85m10k64J18K82J55
7073B79l39J2k49j13P35Q7o04PJ03P9K08L3k51Ol93J11R5L54l47K3K88q7J9l49
7097b93O6N18m7Q3o50l06L60J30K80j12N9m65P9M68K43l81k38r9K08K09L30k42
$$ plain form
7119 200 146 -372 -189 224 82 -81 194 -125 -95 202 51 24 -283 -11 327 -59 145 -218 37 347 513
7140 513 -91 -338 -413 -242 109 375 -39 -109 -441 -29 171 427 23 -340 -414 -125 66 113 193 -497 -531 8
7162 8 -19 112 -117 -281 -263 -79 147 -210 -416 29 260 336 135 -483 -316 -62 328 21 -386 -289 -270 104
7184 104 509 123 -108 -268 -236 76 -192 279 -413 -475 -104 196 173 -406 -135 -396 61 294 -31 -87 -497
7205 -497 241 -388 -182 342 -331 -330 -44 257 -33 -204 -387 -160 -47 -132 -196 -291 -74 80 348 358 115 -450
7227 -450 -414 24 243 176 -84 -368 -413 132 76 -20 -411 -161 -112 347 201 424 -243 -129 -82 -26 -124 39 -47
7250 -47 -262 28 89 -166 -331 -266 232 297 426 -11 -593 -66 387 233 263 -177 -597 124 287 41 -113 -400
7272 -400 -288 -191 -29 424 -284 -297 -65 -86 34 431 121 -286 -116 103 -135 189 -224 129 60 106 -154 -162
$$ packed form
7119B00n4n18J83M13j42j63K75l19L0K97j51k7l07K72L38l86K04l63K55L10J66
7140E13o04k47p5J71L51K66m14p0l32M12K00K56m04l63p4K89J91M7Q0o90l4N39
7162Hk7J31k29j64J8J84K26l57k06M45K31P6k01o18J67K54L90l07m07R7J9L74
7184A04M05l86k31j60L2L12k68M71o92o2L71L00k3n79K71k61M57K33l25n6m10
7205d97P38o29K06N24o73JK86L01k90j71j83K27J13q5o4r5K17J54K68J0k43n65
7227d50L6M38K19o7k60k84m5N45n6r6l91K50M9M59j46K23o67J14M7N6r8J63q6
7250d7k15K90O1k55j65O5M98O5J29m37n82N27M53j54L0m40m20P21J63k46j54k87
7272d00J12R7J62M53p08j3K32k1J20L97l10m07J70K19k38L24m13L53o9M6k60q
$$ plain form
7294 -162 180 95 -20 159 -106 -262 109 407 225 53 -339 -266 -264 413 572 -242 -304 -346 63 150 371 -65
7316 -65 -113 21 191 302 123 92 -220 -413 -210 142 -86 79 236 85 -63 149 -66 255 60 -41 182
7337 182 -256 -120 -365 -116 262 138 -51 -361 -179 210 308 -80 -249 -131 -306 180 89 -40 -3 -134 -106
7358 -106 450 59 -69 -4 195 -73 166 157 88 79 171 -221 119 20 -174 -40 322 -83 -174 -66 -73 -202 164 281
7382 281 57 -169 -78 104 166 246 -2 -223 -522 323 435 187 205 108 -342 23 329 187 276 -221 -35 29
7404 29 5 -35 -19 256 73 -124 153 280 -35 -25 88 6 52 -146 -140 203 246 85 -41 -224 -82 -37 42 293
7428 293 -305 -184 480 197 -79 -36 -4 -478 162 44 -66 -75 91 -291 266 622 144 98 -117 -40 -65 -92 -69
7451 -69 -71 -124 -139 -160 -138 -209 -227 64 -133 50 -200 -314 -160 254 160 -64 -133 -101 20 160 237 -338 -224 -238 -294
$$ packed form
7294a62L42q5j15J79k65j56L71K98j82j72l92P3KO77J59q14o2m2M09Q7K21m36
7316f5m8J34J70J11j79l1l12j93K03L52k28J65J57j51j48K12k15L21j95j01K23
7337A82m38J36k45K49L78j24j89l10J82L89R8l88j69J18j75M86r1j29L7j31K8
7358a06N56l91j28O5J99k68K39ro9rR2l92L40r9j94J34L62m05r1J08pj29L66J17
7382B81k24k26R1J82O2Q0k48k21k99Q45J12k48J8r7m50L65L06j42Q9m97J86O4
7404B9k4m0J6K75j83j97K77J27l15J0J13q2M6j98OL43M3j61j26j83J42M5P9K51
7428B93n98J21O64k83k76M3L2m74O40j18j10rJ66l82N57L56m78m6k15P7k5k7K3
7451f9kn3j5k1K2p1j8K91j97J83k50j14J54M14r4k24o9L2J21J40P7n75J14j4n6
$$ plain form
7476 -294 -73 168 67 -284 -21 -33 -93 -165 -142 98 24 -225 -133 -116 239 52 -5 -188 378 -96 27 -49 111
7499 111 -282 -140 -94 64 47 105 -121 -152 -28 -27 148 332 -104 -126 -124 91 80 153 45 88 -117 -127 18 -40 459
7524 459 -185 -120 -91 -74 -42 332 245 78 -152 96 449 295 189 261 126 -240 -19 172 83 -27 69 -78 51
7547 51 -241 148 24 164 216 -338 -162 164 86 26 -162 175 -82 51 -41 257 178 17 104 -136 292 172
7569 172 220 98 4 -156 20 42 21 19 -41 -92 212 32 229 277 -159 36 195 51 -12 121 -38 298 -208
7592 -208 -268 36 246 81 312 161 -140 31 -274 130 -34 -144 176 -332 -236 -25 207 284 36 -87 -352
7613 -352 -15 203 154 -596 104 -249 272 67 32 -47 -145 24 -96 93 94 51 -223 92 -141 -460 203 237 -40
7636 -40 -135 132 16 -259 390 -32 -123 -279 -162 -56 158 321 119 2 -224 -16 -308 119 310 -374 33
$$ packed form
7476b94K21K41j01l51K63j2o0p2K3K40p4k49R2J7L55j87n7j83N66m74J23p6J60
7499A11l93J42M6J58j7N8k26l1J24JJ75J84m36k2KK15j1P3j08M3k05j0J45n8M99
7524D59o44O5K9J7L2L74q7j67k30K48L53j54j06P2j35l66K21J91q9j10R6j47J29
7547E1k92L89j24J40N2n54J76L26p8o0j88L37k57J33r2K98p9j61Q7k40M28j20
7569A72M8j22r4j60J76K2k1ko0n1L04j80J97M8m36J95J59j44o3J33j59L36n06
7592b08o0L04K10j65K31j51l01J71l05M04j64j10L20n08R6K11K32P7k48j23k65
7613c52L37K18m9p50P00l53N21k05l5p9r8J69j20J89Jm3k74L15k33l19O63L4k77
7636d0r5K67j16k75O49m22r1j56J17J06K14J63k02j17k26K08k92M27J91o84M07
$$ plain form
7657 33 -77 -20 345 496 -189 -303 198 42 -88 156 146 -118 10 301 -15 -38 114 360 98 -2 76 -54
7679 -54 128 205 222 -488 -129 -218 129 149 90 -97 92 -3 345 271 526 -269 -63 -111 295 297 -63 -14 -157 -12
7703 -12 -35 214 43 -34 -204 7 -55 330 -36 -195 -110 -50 -146 58 -38 -219 -86 130 266 -342 -173 -10 -150
7726 -150 68 77 -414 -786 -289 149 91 -135 -254 -305 47 422 -7 -149 -95 -231 -196 151 259 -310 -173 -4
7748 -4 21 44 -133 -261 -143 227 290 -80 -135 -306 101 148 94 -356 -386 192 189 454 203 -176 -416 -195 -18 -64
7772 -64 219 -259 -363 -227 198 289 -178 -4 109 -126 275 124 -498 -53 -7 -148 25 -17 172 -70 -73 61
7794 61 67 -81 -133 -12 320 421 233 -323 -157 20 446 129 -191 -250 -187 52 408 327 -161 -256 -439 266 211
7817 211 343 -80 -187 116 35 -84 217 -283 173 360 31 255 -161 -65 134 -3 -244 -10 -165 -37 -268
$$ packed form
7657C3j10N7L65J51o85j14N01j56j30K44j0k64J28K91l16k3J52K46k62j00P8j30
7679e4J82P7J7p10L59q9L47K0n9j87J89r5L48p4K55p95K06m8M06Kl60M9j43J45
7703a2k3K49j71p7j70K11o2L85l66j59Q5O0r6K04r6j81J33K16J36o08J69J63j40
7726a50K18Rm91l72M97M38n8k26j19n1L52L75m29j42N4j36L5L47J08n69J37J69
7748dK5K3j77j28J18L70O3l70n5j71M07M7n4m50l0N78lK65k51l79k40K21J77m6
7772f4K83m78j04J36M25R1m67J74J13k35M01j51o22M45M6j41J73m2J89k42lJ34
7794F1Oj48n2J21L32J01j88n56J66J77M26l17l20n9O3K39L56q1m88r5j83P05n5
7817B11J32m23j07L03q1j19L01n00M56J87l29K24m16R6J99j37k41K34j55J28k31
$$ plain form
7838 -268 150 -78 -115 -23 -248 -16 273 86 -636 -137 -142 61 178 -51 -636 -68 -217 77 163 -243 -195 -234
7860 -234 -130 -6 80 -312 4 -147 8 57 54 -262 19 70 -157 168 -45 101 44 246 123 -219 -189 -137 63
7883 63 229 -42 -313 -464 -104 334 32 -176 -493 -319 134 251 37 -77 -20 -125 8 220 114 105 205
7904 205 -117 -141 339 142 253 251 5 144 76 13 -56 125 298 202 -72 -92 -79 100 77 192 -61 124 213 373
7928 373 -71 258 -244 -336 40 272 120 96 -183 -388 88 292 180 66 -336 -57 95 76 430 -154 -4
7949 -4 -139 188 126 179 -77 -312 275 -58 199 -139 -111 -117 139 304 168 46 -188 138 217 9 -129 -253 -189
7972 -189 32 293 418 -371 -186 -66 -11 42 61 -78 -117 -147 299 -103 330 -181 -340 -58 40 -27 -62 -170 -11
7995 -11 162 -129 -214 46 -114 336 21 -115 11 95 -60 69 285 -172 -458 -291 -99 303 324 -13 44 -4
$$ packed form
7838b68M18k28l7R2k25K32K89j87p22M99nK03J17k29n85N68j49K94Q6m06M8l9
7860b34J04J24Q6l92L16j51J55M9ll16K81N1k27L25k13J46n7K02j23l42L0N2K00
7883F3J66k71k71j51L60M38l02k08l17J74M53J17k14j14N7j05J33K12j06rJ00
7904B05l22k4M80j97J11kk46J39o8o3o9J81J73r6k74k0J3J79k3J15k53J85Q9J60
7928C73m44L29n02r2L76K32j52k4k79k05M76K04j12j14m02K79J52j9L54n84J50
7949dj35L27o2N3k56k35N87l33K57l38K8oK56J65j36j22k34L26P9k08j38j24O4
7972a89K21K61J25p89J85J20N5N3J9j39l9l0M46m02M33n11j59K82R8o7l5j08J59
7995a1J73k91q5K60j60M50l15j36J26Q4j55J29K16m57k86J67J92M02K1l37N7m8
$$ plain form
8017 -4 -173 -127 40 -177 -125 20 419 209 349 -155 79 -367 323 141 -326 193 4 61 221 114 -236 94
8039 94 128 112 94 63 112 286 250 133 -152 149 -33 -6 111 392 25 -186 146 -81 -116 255 96 -77 -132
8062 -132 -11 268 -133 187 -13 -316 58 103 -12 3 46 -107 50 -222 248 89 312 416 112 -57 150
8083 150 168 105 205 -152 -431 -57 -91 169 192 -110 95 -361 -222 276 58 -25 305 -82 -129 0 -89 52
8105 52 133 -350 -237 66 173 -110 300 -25 -25 -270 -80 194 28 106 -21 -228 112 -115 7 -125 112 -25
8127 -25 -124 17 -146 24 -95 -116 -61 10 -26 109 47 477 -182 -217 -52 58 207 227 -54 -131 -349 -90 -124 -44
8151 -44 -109 -290 -145 -220 174 316 -259 3 -47 119 -62 7 -52 -349 41 18 314 163 13 -103 -96 44 233
8174 233 -169 179 366 145 -64 308 228 278 264 284 -35 -176 -10 -306 251 347 -47
$$ packed form
8017dj69M6J67k17N2J45L99k10J40n04K34m46O90j82m67N19j89N7J60j07l50L30
8039I4L4j6j8l1M9J74l6j17k85L01j82K7J17K81l67k11L32k27l5L71j59j73n5
8062a32J21K79m01L20k00l03L74M5j15J5M3j53J57k72M70j59K23J04l04j69K07
8083A50J8o3J00l57k79L74l4K60K3l02K05m56J39M98k18q3L30l87m7J29q9J41
8105E2Q1m83J13L03J07k83M10l25%k45J90K74j66P8j27k07L40k27J22j32K37j37
8127b5r9J41j63J70j19k1N5P1l6J35o2M30o59l5J65J10J49K0k81p7k18K59l4Q0
8151d4o5j81J45p5L94J42n75K62n0J66j81O9n9k97L90k3K96j51j50j16PJ40J89
8174B33m02L48J87k21k09L72q0N0j4K0l19j41J66k96N57R6l94
8191d7
$$ Imaginary data points
##PAGE= N=2
##DATA TABLE= (X++(I..I)), XYDATA
$$ plain form
0 0 0 0 0 -8 8 -8 16 -24 24 -32 40 -48 64 -80 96 -120 144 -168 200 -235 275 -319 372 -427 491 -563 641
27 641 -723 825 -930 1047 -1175 1318 -1471 1643 -1830 2035 -2258 2506 -2775 3076 -3406 3769
43 3769 -4174 4628 -5130 5707 -6360 7109 -7984 9025 -10272 11808 -13763 16329 -19875
56 -19875 25115 -33661 50031 -92841 438799 1003253 88184 -312871 -87980 367258 446335
67 446335 417845 304948 198348 77007 138452 300651 408363 250522 55179 90988 359786
78 359786 480262 290326 -48598 -116615 211799 549301 401265 2100 -69604 209358
88 209358 328129 148618 -13137 70065 247873 284375 150406 39320 8851 -48356 -50909
99 -50909 196410 454738 275470 -217062 -412949 -86179 349019 393259 34200 -260809
$$ packed form
0@%%%qJ6j6K4m0M8n6P2q8J12j44J76k16K64l12L68m35N10n94O91p99R18j054J204
27F41j364J548j755J977k222K493k789L114l473L865m293M764n281N851o482P175
43C769p943Q802r758J0837j2067J3469j5093J7009j9297K2080k5571L0092l6204
56a9875M4990n8776Q3692j42872N31640N64454r15069m01055K24891M55238P9077
67D46335k8490j12897j06600j21341O1445J62199J07712j57841j95343L5809K68798
78C59786J20476j89936l38924o8017L28414L37502j48036l99165p1704K78962
88B09358J18771j79511j61755Q3202J77808L6502j33969j11086l0469n7207k553
99e0909K47319K58328j79268m92532j95887L26770M35198M4240l59059k95009
$$ plain form
109 -260809 -156901 97245 118828 -25427 -81616 -50060 -11361 44360 54777 -50339 -171009
120 -171009 -189011 -89488 96714 200925 4243 -335378 -356672 -1699 243173 62378
130 62378 -261927 -286459 -14632 143703 -12350 -216322 -215972 -105719 -10274 85377 90179
141 90179 -100029 -309761 -281941 -33988 202815 199858 -80075 -341620 -250840 53352 157376
152 157376 1291 -129547 -84726 22427 30485 -76007 -132990 -30725 82938 59980 -3126
163 -3126 -19057 -62755 -103793 -8785 141475 135621 -31832 -154452 -71973 145416 222770 21724
175 21724 -201813 -136538 128186 273701 167615 -68252 -208631 -110874 120849 252010
185 252010 196144 26395 -151227 -178356 22654 246222 227941 13387 -139194 -89356 85402
$$ packed form
109b60809J03908K54146K1583j44255n6189L1556L8699N5721J0417j05116j20670
120a71009j8002R9523J86202J04211j96682l39621k1294L54973K44872j80795
130F2378l24305k4532K71827J58335j56053k03972L50J10253R5445R5651M802
141I0179j90208k09732K7820K47953K36803k957k79933k61545R0780L04192J04024
152A57376j56085j30838M4821J07153Q058j06492n6983J02265J13663k2958o3106
163c126j5931m3698m1038R5008J50260n854j67453j22620Q2479K17389P7354k01046
175B1724k23537O5275K64724J45515j06086k35867j40379R7757K31723J31161
185B52010n5866j69749j77622k7129K01010K23568j8281k14554j52581M9838J74758
$$ plain form
196 85402 172429 57785 -82417 -33012 101128 101610 3925 -44063 -29404 12596 63770 68575
208 68575 12320 -41611 -53580 -15672 62626 78526 -38471 -136963 -56140 94401 112816 -16364
220 -16364 -160901 -173113 -14194 144470 103503 -75028 -180562 -144465 -34702 61245 60475
231 60475 -37237 -126513 -137125 -78490 12042 36351 -68786 -160610 -85179 32807 1093 -116989
243 -116989 -155302 -88462 6041 34018 -51231 -155161 -148388 -57987 7864 11257 -52360 -146440
255 -146440 -156467 -48758 45259 22227 -81743 -177133 -162530 -11686 111148 35774 -139153
266 -139153 -200461 -109437 22136 79549 13620 -101649 -134962 -80695 -20438 20267 26920 -35186
278 -35186 -98038 -66694 900 3793 -32840 -43286 -20461 14453 11767 -51729 -86043 -19022
$$ packed form
196H5402Q7027j14644j40202M9405J34140M82r7685m7988J4659M2000N1174M805
208F8575n6255n3931j1969L7908P8298J5900j16997r8492Q0823J50541J8415j29180
220a6364j44537j2212J58919J58664m0967j78531j05534L6097J09763R5947p70
231F0475r7712q9276j0612N8635R0532K4309j05137r1824P5431J17986l1714j18082
243a16989l8313O6840R4503K7977q5249j03930O773R0401O5851L393o3617r4080
255a46440j0027J07709R4017k3032j03970r5390J4603J50844J22834p5374j74927
266a39153o1308R1024J31573N7413o5929j15269l3313N4267O0257M0705O653o2106
278c5186o2852L1344O7594K893l6633j0446K2825L4914k686o3496l4314O7021
$$ plain form
290 -19022 59991 50068 -16495 -72940 -75909 2457 88896 67151 -29685 -77725 -55139 4684
302 4684 84732 105566 6023 -105926 -90844 27024 123328 109636 -7105 -100502 -60557 43479
314 43479 86883 66995 23611 -31749 -46032 11459 61483 51542 25237 4470 -12167 6223
326 6223 42423 31838 873 14016 41858 33139 5144 -15228 -6905 46390 80906 29377 -38338
339 -38338 -30624 17796 49473 64823 43226 -21172 -54392 -13723 50185 83658 59322 -24349
351 -24349 -80718 -27923 63866 82011 34521 -20319 -51790 -27409 35808 55770 19921 -5202
363 -5202 -13208 -22302 -5966 27303 22922 -2597 -6353 -2453 -4563 -2423 -9041 -13584 17905 40040
377 40040 -7039 -60257 -39679 14310 40435 31855 -13643 -65758 -57097 4991 44240 37998 -839
$$ packed form
290a9022P9013r923o6563n6445k969P8366Q6439k1745r6836m8040K2586N9823
302D684Q0048K0834r9543j11949J5082J17868R6304j3692j16741r3397L9945J04036
314D3479M3404j9888m3384n5360j4283N7491N0024r941k6305k0767j6637J8390
326F223L6200j0585l0965J3143K7842q719k7995k0372Q323N3295L4516n1529o7715
339c8338P714M8420L1677J5350k1597o4398l3220M0669O3908L3473k4336q3671
351b4349n6369N2795R1789J8145m7490n4840l1471K4381O3217J9962l5849k5123
363e202q006r094J6336L3269m381k5519l756L900k110K140o618m543L1489K2135
377D0040m7079n3218K0578N3989K6125q580m5498n2115Q661O2088L9249o242l8837
$$ plain form
390 -839 -62326 -84263 -19002 57113 54220 -4998 -63564 -82543 -29502 49984 52468 -14073 -55255
403 -55255 -49390 -27258 7219 28180 4993 -28306 -34663 -29301 -14230 11247 6397 -21225 -15330
416 -15330 2541 -19522 -40686 -15611 17347 23990 7489 -34091 -65747 -29613 38411 53326
428 53326 12180 -39824 -71220 -43038 36689 75278 28687 -40389 -72784 -49998 27577 88752
440 88752 46802 -48411 -77387 -26897 35475 63203 32414 -30829 -48835 -8866 23842 29529
452 29529 22022 -4746 -25024 416 28524 8177 -15264 349 23590 28688 15041 -20924
464 -20924 -41327 3804 63650 58653 381 -51546 -54351 11305 87826 75938 -13341 -69085
476 -69085 -47978 14177 79018 85227 792 -81331 -57947 30713 82933 61755 -9911 -63574
$$ packed form
390h39o1487k1937O5261P6115k893n9218n8566j8979N3041P9486K484o6541m1182
403e5255N865K2132L4477K0961k3187l3299o357N362J5071K5477m850k7622N895
416a5330J7871k2063k1164K5075L2958O643j6501m1580l1656L6134O8024J4915
428E3326m1146n2004l1396K8182P9727L8589m6591o9076l2395K2786P7575O1175
440H8752m1950r5213k8976N0490O2372K7728l0789o3243j8006L9969L2708N687
452B9529p507k6768k0278K5440K8108k0347k3441J5613K3241N098j3647l5965
464b0924k0403M5131N9846m997n8272n1927k805O5656P6521j1888q9279n5744
476f9085K1107O2155O4841O209q4435q2123K3384Q8660N2220k1178p1666n3663
$$ plain form
488 -63574 -34893 36339 58436 27341 -8907 -27761 -11724 31547 38328 -6200 -24213 8394
500 8394 33289 25062 130 -31320 -28970 29087 71842 33933 -36499 -64210 -27268 52879 97030
513 97030 36095 -66215 -83818 -10996 66818 89558 34395 -61784 -90829 -12978 76518 85404
525 85404 20025 -58974 -75208 -937 75474 60339 -6444 -41268 -30774 8810 47493 33765
537 33765 -19816 -31043 11839 38038 19571 -14671 -31792 -2849 51428 55296 -5328 -53747
549 -53747 -40202 18547 80774 75811 -19706 -97555 -49322 59652 103713 56706 -32799 -89789
561 -89789 -46574 61321 109763 51490 -40897 -80190 -29183 67096 98008 26162 -47755 -42960
573 -42960 9315 54770 58737 8486 -37792 -11294 48591 52809 8615 -22558 -13050 33368 70305
$$ packed form
488f3574K8681P1232K2097l1095l6248j8854J6037M3271O781m4528j8013L2607
500H394K4895q227k4932l1450K350N8057M2755l7909p0432k7711L6942Q0147M4151
513I7030o0935j02310j7603P2822P7814K2740n5163r6179k9045P7851Q9496Q886
525H5404o5379p8999j6234P4271P6411j5135o6783l4824J0494L9584L8683j3728
537C3765n3581j1227M2882K6199j8467l4242j7121K8943N4277L868o0624m8419
549e3747J3545N8749O2227m963r5517p7849M8233J08974M4061m7007q9505n6990
561h9789M3215J07895M8442n8273r2387l9293N1007R6279L0912p1846p3917M795
573d2960N2275M5455L967n0251m6278K6498N9885M218m4194l1173R508M6418L6937
$$ plain form
586 70305 39875 -29115 -43893 10273 69567 83363 30484 -53205 -66468 24877 111190 93996
598 93996 3656 -70505 -58408 39469 120823 87862 -11337 -64235 -35196 42002 102592 77551
610 77551 -12624 -54290 -5853 56839 71075 39467 -10138 -24141 24067 67660 43197 -7927
622 -7927 -17655 18904 62828 62264 3103 -43173 -9020 58689 80424 44152 -20901 -60117 -14199
635 -14199 84017 109388 28400 -60229 -69909 1264 94141 111050 19051 -78769 -72143 18132
647 18132 94274 85845 -14 -71208 -45372 31940 64828 39022 -6976 -42549 -26267 36303
659 36303 56136 -1351 -48076 -22867 28333 45985 13830 -42295 -56252 984 58442 44605
671 44605 -21340 -71882 -55856 24494 81885 35116 -60174 -90858 -37738 40267 79382 32153
$$ packed form
586G0305l0430o8990j4778N4166N9294J3796n2879q3689j3263R1345Q6313j7194
598I3996r0340p4161J2097R7877Q1354l2961r9199n2898K9039P7198O0590k5041
610G7551r0175m1666M8437O2692J4236l1608m9605j4003M8208M3593k4463n1124
622g927r728L6559M3924n64n9161m6276L4153O7709K1735l6272o5053l9216M5918
635a4199R8216K5371q0988q8629r680P1173R2877J6909r1999r7820O626R0275
647A8132P6142q429q5859p1194K5836P7312L2888k5806m5998l5573J6282O2570
659C6303J9833n7487m6725K5209N1200J7652l2155n6125j3957N7236N7458j3837
671D4605o5945n0542J6026Q0350N7391m6769r5290l0684N3120P8005L9115m7229
$$ plain form
683 32153 -69557 -109772 -37264 58877 77678 10515 -75928 -91548 -15841 55839 40226 -21629
695 -21629 -54435 -42262 -1457 30798 8691 -42666 -47407 -442 31338 15640 -31266 -64088
707 -64088 -33728 37145 54880 -5772 -66536 -65958 -8434 59509 62671 -22745 -98263 -65546 31078
720 31078 80655 44882 -40045 -96127 -58972 37103 87029 44264 -42557 -93040 -52018 43538
732 43538 80176 18897 -50165 -54552 -13465 30194 39120 -4170 -45537 -23788 25511 31844 -3966
745 -3966 -35826 -36021 4161 46649 30372 -30767 -59019 -26824 29002 57031 18428 -57804 -76910
758 -76910 -8009 61258 54964 -10598 -75483 -76751 1407 75750 54471 -31121 -84176 -64246
770 -64246 3195 59121 42784 -31809 -75064 -45496 9250 33202 7202 -41584 -51412 -7495
$$ packed form
683C2153j01710m0215P2508R6141J8801o7163q6443j5620P5707P1680j5613o1855
695b1629l2806J2173M0805L2255k2107n1357m741M6965L1780j5698m6906l2822
707f4088L0360P0873J7735o0652o0764N78N7524O7943L162q5416p5518L2717R6624
720C1078M9577l5773q4927n6082L7155R6075M9926m2765q6821n0483M1022R5556
732D3538L6638o1279o9062m387M1087M3659Q926m3290m1367K1749M9299O333l5810
745c966l1860j95M0182M2488j6277o1139k8252L2195N5826K8029l8603p6232j9106
758g6910O8901O9267o294o5562o4885j268P8158P4343k1279q5592n3055J9930
770f4246O7441N5926j6337p4593m3255K9568N4746K3952k6000m8786r828M3917
$$ plain form
782 -7495 23946 -830 -40040 -48493 -22939 18696 29869 -18918 -70999 -54726 3599 35594
794 35594 17973 -34933 -77226 -52699 21093 51589 5028 -60339 -81535 -37915 36943 59425
806 59425 -3555 -76189 -78871 -22020 36806 47506 -3448 -63219 -61503 -12839 20469 18763 -5997
819 -5997 -34918 -33177 37 12164 -13980 -30584 -14571 9369 18619 -1090 -38604 -44055 426
832 426 38182 25481 -16412 -47694 -39834 12564 54146 27770 -34510 -57411 -26500 27672 61216
845 61216 31284 -41597 -71164 -22522 43096 63240 26074 -38155 -63422 -17049 40848 45237
857 45237 10153 -20219 -28536 -7467 22981 21758 -7353 -16787 1491 18370 18349 -3417 -28990
870 -28990 -18869 24083 39769 9921 -24716 -33467 -10430 31774 44525 1459 -43411 -33530
$$ packed form
782g495L1441k4776l9210q453K5554M1635J1173m8787n2081J6273N8325L1995
794C5594j7621n2906m2293K4527P3792L0496m6561o5367k1196M3620P4858K2482
806E9425o2980p2634k682N6851N8826J0700n0954n9771J716M8664L3308j706k4760
819e997k8921J741L3214J2127k6144j6604J6013K3940R250j9709l7514n451M4481
832D26L7756j2701m1893l1282P860N2398M1582k6376o2280k2901L0911N4172L3544
845F1216k9932p2881k9567M8642O5618K0144l7166o4229k5267M6373N7897M389
857D5237l5084l0372q317K1069L0448j223k9111r434J8278J6879k1k1766k5573
870b8990J0121M2952J5686k9848l4637q751K3037M2204J2751m3066m4870R881
$$ plain form
882 -33530 10082 39346 33743 -8094 -48497 -36649 15540 46815 31653 -11950 -48822 -38970
894 -38970 14718 45295 18993 -18161 -27013 -16252 3629 15721 2560 -14666 -6507 9293
906 9293 5265 -9351 -19927 -18552 6607 31040 14576 -25421 -38299 -16376 15534 37070 19373
919 19373 -31043 -51664 -12821 33965 39203 5806 -37288 -47984 -7588 38789 39870 3023
931 3023 -33410 -45146 -14435 35221 44791 4308 -30742 -29957 -9618 16400 27491 8342 -14665
944 -14665 -10163 2443 2043 -122 1456 2869 9875 12247 -4482 -18477 -6027 13375 19841 16147
958 16147 -2278 -25020 -16939 18768 35741 17476 -12760 -31015 -17366 25001 46294 17436
970 17436 -22275 -31817 -13096 19651 42273 24017 -17620 -32484 -12487 13880 29467 21992
$$ packed form
882c3530M3612K9264n603m1837m0403J1848N2189L1275j5162m3603l6872R852
894c8970N3688L0577k6302l7154q852J0761J9881J2092j3161j7226Q159J5800
906I293m028j4616j0576J375K5159K4433j6464l9997j2878K1923L1910K1536j7697
919A9373n0416k0621L8843M6786N238l3397m3094j0696M0396M6377J081l6847
931C023l6433j1736L0711M9656R570m0483l5050P85K0339K6018J1091j9149k3007
944a4665M502J2606m00k165J578J413P006K372j6729j3995J2450J9402O466l694
958A6147j8425k2742Q081L5707J6973j8265l0236j8255J3649M2367K1293k8858
970A7436l9711r542J8721L2747K2622j8256m1637j4864J9997K6367J5587p475
$$ plain form
982 21992 -7567 -23473 -6718 12099 11481 4184 -2534 -5291 5151 11048 -4443 -16057 -2676
995 -2676 12264 11726 4150 -9649 -21841 -8721 17363 20532 644 -18350 -26359 -11920 20530
1008 20530 29219 -1615 -32295 -30329 -6713 19948 27543 946 -31560 -31877 -8744 10670 19083
1021 19083 8801 -19415 -31400 -13473 3802 6648 3923 -6042 -17420 -12861 -2486 -6088 -8981
1034 -8981 1052 4146 -5710 -14267 -16642 -11909 4859 14243 -251 -18365 -21427 -14774 3015 22497
1048 22497 13495 -20834 -36327 -16871 12106 28429 18393 -18019 -42428 -21615 16021 31121
1060 31121 18977 -10192 -34753 -24691 10214 27898 17442 -2116 -19153 -20399 3549 22174
1072 22174 11267 -5263 -4744 907 3285 5198 564 -2219 8761 15230 2751 -8053 -4970 2976
$$ packed form
982B1992k9559j5906J6755J8817o18p297o718k757J0442N897j5491j1614J3381
995b676J4940n38p576j3799j2192J3120K6084L169j9888j8994q009J4439L2450
1008B0530Q689l0834l0680J966K3616K6661P595k6597l2506l17K3133J9414Q413
1021A9083j0282k8216j1985J7927J7275K846k725r965j1378M559J0375l602k893
1034h981J0033L094r856q557k375M733J6768R384j4494j8114l062O653J7789J9482
1048B2497r002l4329j5493J9456K8977J6323j0036l6412k4409K0813L7636J5100
1060C1121j2144k9169k4561J0062L4905J7684j0456j9558j7037j246K3948J8625
1072B2174j0907j6530N19N651K378J913m634k783J0980O469j2479j0804L083P946
$$ plain form
1086 2976 14244 22913 8001 -17335 -16751 7643 25904 26534 8035 -21417 -25864 6715 35864
1099 35864 30518 2963 -22406 -24974 3851 33436 27461 1138 -15176 -15693 -2196 19401 22925
1112 22925 663 -12952 -4507 5418 6633 3897 -3451 -4886 7819 12400 -4079 -15874 -8395
1125 -8395 5236 15915 13681 -10043 -30000 -14798 15012 23868 10221 -15461 -35368 -22474
1137 -22474 16738 34116 10524 -23967 -39487 -22213 17172 34956 7786 -27191 -32635 -15048
1149 -15048 8112 22233 8513 -20921 -26338 -6705 7264 5056 -2303 -11641 -10239 3611 5372
1162 5372 -10092 -15793 -3584 9208 12959 1627 -21823 -26412 3444 28777 19152 -8055 -27530
1175 -27530 -24683 6064 37632 29052 -11166 -35894 -23025 13145 42873 31012 -13042 -36473
$$ packed form
1086B976J1268Q669j4912k5336N84K4394J8261O30j8499k9452m447L2579K9149
1099C5864n346k7555k5369k568K8825K9585n975k6323j6314n17J3497K1597L524
1112B2925k2262j3615Q445R925J215k736p348j435J2705M581j6479j1795P479
1125h395J3631J0679k234k3724j9957J5202K9810Q856j3647k5682j9907J2894
1137b2474L9212J7378k3592l4491j5520J7274L9385J7784k7170l4977n444J7587
1149a5048K3160J4121j3720k9434n417J9633J3969k208p359r338J402J3850J761
1162E372j5464n701J2209J2792L751j1332k3450m589K9856K5333r625k7207j9475
1175b7530K847L0747L1568q580m0218k4728J2869L6170K9728j1861m4054k3431
$$ plain form
1187 -36473 -14679 19693 35094 24184 -6698 -25594 -6834 22502 25807 9309 -3695 -6241
1199 -6241 5208 20821 15054 -5218 -5344 12683 22654 16904 112 -15812 -5868 26856 38641
1212 38641 12054 -17601 -21035 1591 33269 41447 9402 -26780 -25400 6451 36521 39927 7418
1225 7418 -31485 -28362 11273 38270 28049 -833 -24439 -20656 10647 30095 14558 -9171
1237 -9171 -14673 -5497 9602 14752 -216 -15303 -5876 11156 10721 -1790 -15130 -19402 -126
1250 -126 25465 17131 -18337 -34532 -17059 11892 28955 14454 -25724 -44535 -17624 21353
1262 21353 30954 7320 -28917 -44064 -16374 23720 29339 -11 -29954 -36465 -11710 21392
1274 21392 22209 -9876 -29532 -18442 945 10175 3917 -13949 -20257 -2798 11884 2161 -14494
$$ packed form
1187c6473K1794L4372J5401j0910l0882j8896J8760K9336L305j6498j3004k546
1199f241J1449J5613n767k0272j26J8027R971n750j6792j5924R944L2724J1785
1212C8641k6587k9655l434K2626L1678Q178l2045l6182J380L1851L0070L406l2509
1225G418l8903L123L9635K6997j0221k8882k3606L783L1303J9448j5537k3729
1237i171n502R176J5099N150j4968j5087R427J7032m35j2511j3340m272J9276
1250a26K5591q334l5468j6195J7473K8951J7063j4501m0178j8811K6911L8977
1262B1353R601k3634l6237j5147K7690M0094N619k9350k9943o511K4755L3102
1274B1392Q17l2085j9656J1090J9387R230o258j7866o308J7459J4682r723j6655
$$ plain form
1287 -14494 -19822 -9076 12129 21203 -2930 -31053 -26345 4241 26622 22599 -8156 -38913 -29223
1300 -29223 14680 38572 18955 -16912 -36767 -22423 17303 39051 16092 -20748 -30465 -12322
1312 -12322 16639 31650 12521 -19965 -23859 692 19151 16248 19 -13769 -7417 12743
1324 12743 15579 -1727 -11796 -4493 8813 19261 12112 -13624 -24178 -954 25316 25111 3774
1337 3774 -21246 -28177 -751 33309 31254 -3853 -30828 -25678 5094 34165 26977 -10331 -31639
1350 -31639 -17246 8775 24438 19010 -8621 -28010 -13944 12994 17461 3234 -10770 -15213
1362 -15213 -3404 11935 6898 -11750 -14879 -556 11430 9101 -7325 -24347 -15581 12089 22764
1375 22764 3964 -18668 -27793 -15186 14716 29305 5890 -27549 -32630 -9535 18714 27864
$$ packed form
1287a4494n328J0746K1205R074k4133k8123M708L0586K2381m023l0755l0757R690
1300b9223M3903K3892j9617l5867j9855J4344L9726K1748k2959l6840r717J8143
1312a2322K8961J5011j9129l2486l894K4551J8459k903j6229j3788O352K0160
1324A2743K836j7306j0069P303J3306J0448p149k5736j0554K3224K6270k05k1337
1337C774k5020o931K7426L4060k055l5107k6975N150L0772K9071p188l7308k1308
1350c1639J4393K6021J5663n428k7631j9389J4066K6938M467j4227j4004m443
1362a5213J1809J5339n037j8648l129J4323J1986k329j6426j7022Q766K7670J0675
1375B2764j8800k2632r125J2607K9902J4589k3415l3439n081K3095K8249R150
$$ plain form
1387 27864 3161 -31593 -32034 -1225 21876 17606 -3619 -24297 -23675 558 17797 8400 -7982
1400 -7982 -15027 -11009 1518 10065 -422 -14091 -7798 6368 7676 -1978 -13701 -16849 90
1413 90 21329 14405 -13178 -26046 -14312 8544 24893 14845 -15226 -29971 -12646 13212 24178
1426 24178 13686 -13959 -31189 -12637 19149 25629 5165 -16819 -23219 -6486 17928 19156
1438 19156 -1653 -13915 -9608 -611 7343 9155 -1581 -9244 -698 7603 3394 -4815 -7730 -3868
1452 -3868 8941 16024 1839 -17341 -15934 1355 17163 19693 385 -23571 -19734 7324 21685
1465 21685 13669 -3165 -17320 -17607 2825 21665 15550 -4781 -18098 -14448 5123 21477 11996
1478 11996 -9569 -14159 -3574 4305 8890 6226 -3211 -5966 2333 4431 -2414 -4133 782 5152
$$ packed form
1387B7864k4703l4754m41L0809K3101m270k1225k0678O22K4233J7239r397j6382
1400g982p045M018J2527Q547j0487j3669O293J4166J308r654j1723l148J6939
1413I0K1239o924k7583j2868J1734K2856J6349j0048l0071j4745J7325K5858J0966
1426B4178j0492k7645j7230J8552L1786O480k0464k1984o400J6733K4414J228
1438A9156k0809j2262M307Q997P954J812j0736p663Q546Q301m209q209k915L862
1452c868J2809P083j4185j9180J407J7289J5808K530j9308k3956L837K7058J4361
1465B1685q016j6834j4155k87K0432J8840o115k0331j3317L650J9571J6354r481
1478A1996k1565m590J0585P879M585k664r437k755Q299K098o845j719M915M370
$$ plain form
1492 5152 8232 5329 -8215 -14320 -2566 12856 16465 7596 -11395 -22100 -6027 19756 21909
1505 21909 2159 -14993 -17546 -3439 17217 19560 716 -14726 -13550 -2447 12210 17846 3994
1518 3994 -15808 -14149 1366 10653 9871 1548 -8743 -7580 2873 3598 -2057 -563 3324 2506 232
1533 232 -2992 -8829 -5227 7083 11036 3036 -5945 -12876 -11163 4285 17344 8732 -9427 -17099
1547 -17099 -11016 4869 17300 8710 -12235 -17460 -5290 6446 10238 6124 -7043 -15769 -8142
1560 -8142 4458 9375 6394 -4420 -14057 -8516 5224 5583 -1882 -2406 -283 -2222 -2465 -2848 -5662
1575 -5662 -1153 7563 6292 -3555 -9162 -9173 -2671 9915 13096 107 -12015 -11858 -3624 9796 17252
1590 17252 4385 -16205 -15817 2004 14406 12087 623 -12228 -12224 1958 12075 10682 3529 -6390
$$ packed form
1492E152L080k903j3544o105J1754J5422L609q869j8991j0705J6073K5783K153
1505B1909j9750j7152k553J4107K0656K343j8844j5442J176J1103J4657N636j3852
1518C994j9802J659J5515R287p82q323j0291J163J0453P25n655J494L887q18k274
1533B32l224n837L602J2310L953q000q981o931J713J5448J3059q612j8159p672
1547a7099O083J5885J2431q590k0945n225J2170J1736L792m114j3167q726P627
1560h142J2600M917k981j0814r637N541J3740L59p465n24K123j939k43l83k814
1575e662M509Q716j271r847n607j1O502J2586L181j2989j2122J57Q234J3420P456
1590A7252j2867k0590L88J7821J2402k319j1464j2851MJ4182J0117j393p153r919
$$ plain form
1604 -6390 -12313 -2987 11815 11664 1173 -3402 -2986 -1242 3252 4405 678 3146 6965 2021 -5029
1619 -5029 -4577 975 6759 12118 6911 -6924 -10895 -1150 8675 12777 9983 -3808 -14820 -6440
1633 -6440 11312 17053 7468 -7248 -15412 -5182 13370 16100 3400 -6796 -9905 -6318 6385
1646 6385 14686 6537 -6177 -8549 -3673 2549 7683 3950 -4176 -2789 3010 551 -4272 -3251 42
1661 42 4495 7286 28 -11451 -9842 1989 8787 7838 779 -11031 -14916 -1322 12404 10719
1675 10719 -1960 -14060 -15420 -304 15820 11517 -6378 -15528 -11081 -278 11534 10659 -3943
1688 -3943 -14165 -9054 206 6005 6586 -983 -8618 -4929 2250 693 -3254 -2139 349 3341 3865
1703 3865 -4681 -12632 -4906 9076 10844 2512 -7741 -13369 -6616 10378 16148 3622 -10733 -14821
$$ packed form
1604f390n923R326J4802j51j0491m575M16J744M494J153l727K468L819m944p050
1619e029M52N552N784N359n207j3835l971R745R825M102k794j3791j1012Q380
1633f440J7752N741r585j4716q164J0230J8552K730j2700j0196l109L587J2703
1646F385Q301q149j2714k372M876O222N134l733q126J387N799k459m823J021L293
1661D2M453K791p258j1479J609J1831O798r49p059j1810l885J3594J3726j685
1675A0719j2679j2100j360J5116J6124m303j7895r150M447J0803J1812q75j4602
1688c943j0222N111R260N799N81p569p635L689P179j557l947J115K488K992N24
1703C865q546p951P726J3982J768q332j0253n628O753J6994N770j2526j4355m088
$$ plain form
1717 -14821 -5515 12113 19203 3585 -15011 -14887 -493 12740 15956 4193 -12691 -13579 1305
1730 1305 11331 10501 3446 -5692 -8216 1010 8270 4528 -195 -37 1296 3569 4427 -2559 -6186
1745 -6186 3045 12228 7863 -2418 -7872 -6517 4050 15173 10775 -5093 -12135 -6318 6145 16141
1759 16141 12039 -6586 -15956 -5510 10132 15860 8842 -6025 -15573 -5713 10689 13544 3906
1772 3906 -4879 -8652 -3663 6860 8483 -302 -4049 -398 2691 2710 278 -5056 -4552 5833 10630
1787 10630 1419 -9150 -10456 -2316 10207 14134 658 -15430 -13428 1391 12862 12702 -475
1800 -475 -16486 -15352 3318 15923 10878 -3929 -15929 -13771 2791 15473 8673 -5755 -12374
1813 -12374 -8370 1525 9359 4554 -5996 -6565 -369 1244 -332 -1866 -4097 -959 5996 3786 -6757
$$ packed form
1717a4821R306J7628P090j5618j8596J24J4394J3233L216j1763j6884q88J4884
1730A305J0026q30p055r138k524R226P260l742m723J58J333K273Q58o986l627
1745f186R231R183m365j0281n454J355J0567J1123m398j5868p042N817J2463R996
1759A6141m102j8625r370J0446J5642N728p018j4867r548R860J6402K855r638
1772C906q785l773M989J0523J623q785l747L651L089J9k432n334N04J0385M797
1787A0630r211j0569j306Q140J2523L927j3476j6088K002J4819J1471j60j3177
1800d75j6011J134J8670J2605n045j4807j2000K158J6562J2682o800j4428o619
1813a2374M004R895P834m805j0550n69O196J613j576j534k231L138O955k210j0543
$$ plain form
1828 -6757 -10098 -3326 5747 10508 4324 -10008 -15282 -2682 11449 12493 2048 -11509 -15402 -1992
1842 -1992 14356 14136 -1056 -12812 -12677 -840 13921 13807 -1758 -13109 -8728 2374 9860 9516
1856 9516 -786 -9028 -3458 5244 5348 669 -1779 -1164 3094 6777 1763 -6480 -4795 4021 9944
1871 9944 8477 -574 -11531 -7749 8165 15421 7299 -4922 -11298 -7055 7847 17671 7695 -8787
1885 -8787 -12372 -3429 9378 14715 6557 -8528 -11433 -1019 8625 10642 4357 -6436 -8197 1594
1899 1594 7711 3201 -1891 -1248 392 3064 3302 -2983 -6796 -56 8029 7338 -796 -8748 -10216 473
1915 473 13115 10545 -3972 -13274 -10358 1697 13805 11423 -5638 -16331 -9335 4347 11679
1928 11679 8863 -5560 -15430 -8503 5760 10009 4005 -4975 -10503 -6938 4087 7054 -306 -5294
$$ packed form
1828f757l341O772R073M761o184j4332n274J2600J4131J044j0445j3557l893J3410
1842a992J6348k20j5192j1756J35J1837J4761j14j5565j1351M381J1102P486l44
1856I516j0302q242N570Q702J04m679k448O15M258L683n014q243J685Q816N923
1871I944j467r051j0957L782J5914P256q122j2221o376M243J4902R824r976j6482
1885h787l585Q943J2807N337q158j5085k905J0414R644K017o285j0793j761R791
1899A594O117m510n092O43J640K672K38o285l813O740Q085o91q134p952j468J0689
1915D73J2642k570j4517r302K916J2055J2108k382j7061j0693O996J3682P332
1928A1679k816j4423r870O927J4263M249o004q980n528L565J1025K967p360m988
$$ plain form
1942 -5294 -3662 -871 1397 340 -4513 -4086 2254 5207 -468 -6409 -7786 -3653 5579 9770 943
1957 943 -11013 -10844 -816 8116 10387 1226 -11905 -12297 370 10719 9480 -224 -10547 -11080
1971 -11080 1633 11303 7580 -1854 -7453 -6991 652 8523 6056 -2813 -4849 -796 1778 3085 1622
1986 1622 -2773 -1062 5325 5134 -1997 -4971 -2035 3407 8797 6677 -3728 -9650 -3463 6701 11471
2001 11471 6976 -4298 -12019 -4584 9291 12326 4847 -4865 -9741 -3827 8475 12809 3717 -6423
2015 -6423 -7263 -1578 5601 8920 2715 -4957 -4038 972 2917 3217 1347 -1929 -208 3355 742 -3871
2031 -3871 -2533 2166 4635 4029 -727 -7858 -6771 3305 8861 5086 -2501 -9330 -8523 2470 10809
2046 10809 6088 -5125 -10304 -6963 1975 9541 6113 -5226 -9376 -5281 1111 5817 5105 -3452
$$ packed form
1942e294J632K791K268j057m853M27O340K953n675n941j377M133R232M191q827
1957I43j1956J69J0028Q932K271r161j3131l92J2667J0349j239r704j0323n33
1971a1080J2713R670l723r434n599M62P643P871k467q869k036M053K574J307j463
1986A622m395J711O387j91p131k974K936N442N390k120j0405n922O187J0164M770
2001A1471m495j1274p721P435J3875L035p479r712m876N914J2302M334r092j0140
2015f423q40N685P179L319o205p672R19N010J945L00j870l276J721L563k613m613
2031c871J338M699K469o06m756p131J087J0076N556l775p587o829Q07J0993Q339
2046A0809m721j1213n179L341Q938P566l428j1339m150M095O392M706p12q557
$$ plain form
2060 -3452 -8424 -3899 1819 2005 832 -817 -3027 -2376 281 -933 -2929 -851 1991 1563 -367 -4047
2076 -4047 -6891 -1022 6369 5312 -1791 -6060 -6440 -2185 6471 8575 364 -8228 -8235 -964 7104 8703
2092 8703 357 -8653 -6967 906 5608 6078 1841 -5070 -6407 686 5848 3492 339 -1519 -2397
2107 -2397 362 2747 589 -237 1950 2372 1000 167 -1851 -2580 3177 8488 3505 -4540 -5725 -1457
2123 -1457 4582 8404 5039 -4020 -7549 -2848 4606 8746 6143 -3857 -9455 -2855 6089 7606 3895
2138 3895 -1768 -6762 -3974 4025 6975 2429 -2010 -3533 -2622 945 3193 1267 -126 562 -822
2153 -822 -2147 -1042 -265 -57 2426 3142 -2191 -6145 -3599 1653 4787 4491 -2341 -8701 -5816 1820
2169 1820 5848 4245 -1797 -8741 -8460 680 7119 4270 -2443 -7200 -7674 -1049 6286 4479 -2680
$$ packed form
2060c452m972M525N718J86j173j649k210O51K657j214j996K078K842m28j930l680
2076d047k844N869P391j057p103m269l80M255Q656K104q211q592pP271Q068J599
2092H703q346r010J686P873M702M70m237o911j337P093N162k356l153j858q78
2107b397K759K385k158q26K187M22j372q33k018p29N757N311m983q045j185M268
2123a457O039L822l365r059l529M701P454M140k603j0000n598O600Q944J517l711
2138C895n663m994K788P999K950m546m439j523R11L567K248j926j393O88j384
2153h22j325J105P77K08K483P16n333l954K546N252L134k96o832o360K885P636
2169A820M028j603o042o944K81R140O439k849o713m757m74O625P335j807p159
$$ plain form
2184 -2680 -6180 -5426 -1937 2701 3423 -1552 -4519 -2621 -1067 -834 -154 -760 -1582 223 57 -3849 -4389
2201 -4389 -890 2025 2666 954 -4198 -7660 -2363 5038 5785 722 -5058 -8470 -3472 5349 7643
2216 7643 1166 -5687 -7092 -3488 4645 8356 1585 -6290 -5461 -937 2813 4786 2147 -2834 -3419
2231 -3419 167 1789 1662 1193 -609 -603 2166 1261 -2649 -2374 2789 4430 2737 -563 -4518 -4243 3293
2248 3293 8272 4702 -2238 -5880 -4958 2326 9689 6618 -2523 -7041 -4687 1897 8684 7716 -1994
2263 -1994 -7888 -4211 3100 6614 4853 -574 -5187 -3134 1955 3592 2518 1081 -2056 -2579 757
2278 757 1875 -565 -543 1460 1258 -371 -2221 -3555 -1416 4587 5268 -1217 -6479 -5663 -432 5931
2294 5931 6801 -923 -8298 -6868 -591 5556 6579 831 -8254 -9100 -357 6513 5183 -605 -6988
$$ packed form
2184b680l500P54L489M638P22m975k967J898J554K33O80o06q22J805j66l906n40
2201d389L499K915O41j712n152l462N297P401P47n063n780l412M998Q821K294
2216G643o477o853j405L604Q133L711o771p875Q29M524L750J973k639m981n85
2231c419L586J622j27m69j802OK769r05l910K75N163J641j693l300l955K75P536
2248C293M979l570o940l642R22P284P363l071r141m518K354O584O787r68r710
2263a994n894L677P311L514j761n427m613K053N089J637j074j437l137n23L336
2278G57J118k440K2K003k02j629j850j334K139O003O81o485n262Q16N231O363
2294E931Q70p724p375J430O277O147J023n748r085q46Q743O870j330n788o383
$$ plain form
2309 -6988 -7530 356 5755 2601 -2629 -3877 -3080 -194 2116 622 -2414 -1905 373 -252 -1145 -1844
2325 -1844 -3137 -648 4222 2917 -3652 -6716 -3027 2908 6896 3679 -5165 -8726 -2824 4921 6847
2340 6847 3107 -3696 -8215 -3559 5220 7019 2355 -3165 -6251 -3014 4277 6910 1137 -3790 -3218
2355 -3218 110 2858 3043 -615 -1678 1442 2360 -174 -1265 4 1254 3178 4438 254 -5155
2370 -5155 -3275 3255 7124 6196 -171 -7360 -5915 3861 10037 6622 -1776 -7704 -5834 3990 10327
2385 10327 5961 -2857 -6198 -3694 2349 7858 6191 -2143 -5884 -2574 2885 5504 3480 -1933 -3926
2400 -3926 452 2875 276 -774 -18 831 1910 1296 -2625 -4798 203 4641 4624 -155 -5118 -6763
2416 -6763 -763 6475 6220 -934 -7158 -7776 -1305 7314 7612 -2518 -9174 -6041 1355 5596 4221
$$ packed form
2309f988n42P886N399l154n230j248P97K886K310j494l036N09K278o25q93o99
2325a844j293K489M870j305o569l064L689N935L988l217q844l561N902P745J926
2340F847l740o803m519M656Q779J799m664n520l086L237P291K633n773m927N72
2355c218L328K748J85l658j063L120R18k534j091J269J250J924J260m184n409
2370e155J880O530L869r28o367p189J445R776O176l415q398n928J870R824O337
2385A0327m366q818l341K504O043N509j667q334l741L310N459K619k024n413j993
2400c926M378K423k599j050P56Q49J079o14l921k173N001M438j7m779m963j645
2416f763O000P238k55p154o224o18O471Q619K98j0130o656L133P396M241j375
$$ plain form
2431 4221 -2081 -7940 -5496 1794 4113 1742 -2491 -5549 -2940 2229 1975 -2171 -3572 -1686 244
2446 244 1498 -574 -5196 -4844 1630 5334 1422 -4703 -7132 -4038 3309 7045 1968 -5962 -8113
2461 -8113 -3676 3115 7933 2788 -6638 -8876 -1657 4851 5748 1521 -4933 -6850 -827 4716 4378
2476 4378 -427 -3081 -3035 295 3281 1625 -1247 -524 1489 1190 551 -1096 -2161 355 5457 4378
2492 4378 -1478 -5185 -3051 2746 8026 6069 -2618 -7503 -3079 4370 8557 5992 -2266 -7807 -3799
2507 -3799 5382 8713 4300 -2195 -6398 -2992 5377 8088 2709 -2830 -3727 -617 4080 5337 855
2522 855 -2303 -584 2132 1727 253 -347 -230 2068 4245 987 -3481 -2879 1417 4759 5427 895
2538 895 -6436 -5681 1940 7473 5395 -790 -6566 -5621 1823 7331 4520 -2045 -5290 -3901 1002 5878
$$ packed form
2431D221o302n859K444P290K319k371m233l058K609N169k54m146j401J886J930
2446B44J254k072m622L52O474L704l912o125k429L094P347L736n077p930k151
2461h113M437O791M818n145r426k238P219O508Q97m227o454j917O023N543l38
2476D378m805k654M6L330K986j656k872P23K013k99o39j647j065K516N102j079
2492D378n856l707K134N797N280j957q687m885M424P449M187k565q258n541M008
2507c799R181L331m413o495m203L406Q369K711n379n539q97L110M697J257m482
2522H55l158J719K716m05j474o00J17K298K177l258m468O02M296L342O68m532
2538H95p331P55P621N533k078o185n776R45P444N508k811o565l245J389M903M876
$$ plain form
2554 5878 3785 -2993 -4942 -1685 1794 3216 1729 -2365 -3420 -2 2336 -16 -1557 -1030 187
2569 187 2413 1292 -2926 -4649 -130 3530 3698 1128 -3810 -6538 -1924 5324 6720 716 -5161
2584 -5161 -6399 -2051 5515 6923 343 -5087 -4691 -756 4406 5417 443 -4304 -2932 750 3055
2599 3055 3025 1251 -2075 -1880 1485 2442 917 176 550 1187 1868 449 -2265 -1068 3879 4979 1426
2616 1426 -1696 -3223 -1436 3811 7217 3385 -2940 -4556 -1558 3716 7594 4554 -3073 -5008 -714
2631 -714 4306 6001 3581 -2172 -3884 489 4370 3816 1506 -174 -1670 -242 3138 2724 517 -20
2647 -20 435 733 1278 193 -937 759 3705 2242 -1802 -2748 -1664 1220 4754 3882 -1813 -5149 -2516
2664 -2516 1573 4444 4045 -665 -5281 -3823 1074 4301 3073 -667 -4777 -3944 1419 3467 902
$$ packed form
2554E878k093o778j949L257L479J422j487m094j055L418K338k352j541N27J217
2569A87K226j121m218j723M519L660J68k570m938k728M614P248J396o004n877
2584e161j238M348P566J408o580n430L96L935N162J011m974m747J372L682K305
2599C055l0j774l326J95L365R57j525p41L74O37O81j419k714J197M947J100l553
2616A426l122j527J787N247L406l832o325j616K998N274L878l040p627j935M294
2631g14N020J695k420n753j712M373L881n54k310j680j496J428L380m14k207n37
2647b0M55K98N45j085j130J696K946j463m044r46J084K884L534q72n695l336K633
2664b516M089K871l99m710m616J458M897L227j228l740m110Q33N363K048k565
$$ plain form
2679 902 -1031 -2343 -2457 -851 1466 918 -855 -1369 -1637 -1699 -730 -303 -945 -120 691 -1678 -3487 -2452
2697 -2452 -67 1367 1723 -763 -5165 -4978 -636 2363 2013 -480 -4398 -5789 -1623 2302 2284 342
2713 342 -2894 -5409 -2897 2363 2844 -413 -3158 -3535 -2454 296 1953 180 -2006 -1978 -2234 -1194
2729 -1194 947 915 -1035 -1040 -244 -1508 -1580 495 1519 571 40 -1870 -3392 -1071 2527 2732 969 -1587
2747 -1587 -3789 -2440 2064 3858 1474 -1099 -3124 -3080 -56 3776 2861 -871 -2858 -2035 -201 2573
2763 2573 2747 -192 -1808 -1103 -207 818 2423 1335 -1207 -1144 -409 -284 731 1951 1078 -682 -865
2780 -865 -1115 -1130 1480 2784 1235 -1101 -2449 -2649 -153 3442 2937 -893 -2929 -2921 -1170 2107 3805
2797 3805 1116 -3427 -3613 -1216 1395 3437 1601 -3116 -4280 -1184 1184 2045 832 -1130 -3175
$$ packed form
2679I02j933j312j14J606K317n48j773n14k68o2R69M27o42Q25Q11k369j809J035
2697b452K385J434L56k486m402J87M342K999l50k493l918j391M166L925j8j942
2713C42l236k515K512N260M81l257k745l77J081K750J657j773k186K8k56J040
2729a194K141l2j950nP96j264p2K075J024r48n31j910j522K321L598K05j763k556
2747a587k202J349M504J794k384k573k025M4L024L832r15l732j987Q23J834K774
2763B573J74k939j616P05Q96J025J605j088k542O3P35J25J015J220q73j760j83
2780h65k50j5K610J304j549k336j348k00K496L595n05l830k036QJ751L277J698
2797C805k689m543j86K397K611K042j836m717j164L096K368Q61j213j962k045
$$ plain form
2812 -3175 -1796 682 750 274 79 -1996 -2205 -336 -360 -1154 328 1301 -614 -2177 -2430 -1551 919 2887
2830 2887 953 -2926 -3909 -2118 588 3337 2559 -2158 -4916 -2550 1464 2944 2363 -1185 -4791 -3126
2846 -3126 1642 3215 1825 -573 -2908 -2298 1046 2730 734 -322 -615 -921 -280 1447 942 54
2862 54 885 1356 -249 -1301 -255 841 2441 3481 338 -3259 -1871 1683 4315 4016 942 -3419
2878 -3419 -3212 1641 5031 3950 868 -2644 -3742 896 5084 4545 1046 -1657 -2049 858 4292 3461
2894 3461 -1 -997 284 655 1622 2369 977 -6 1577 1702 -156 -128 670 1449 2686 2302 -1217 -2993
2912 -2993 -75 3874 4245 2274 -1992 -5091 -1307 4857 5469 1065 -3015 -4418 -1432 3674 5407
2927 5407 1225 -3506 -3614 -1014 2934 4380 754 -3696 -3073 217 1580 1214 -42 -2308 -1590 503
$$ packed form
2812c175J379K478O8m76j95k075k09J869k4p94J482R73j915j563k53Q79K470J968
2830B887j934l879r83J791K706K749p78m717k758K366M014J480n81l548l606J665
2846c126M768J573j390k398k335O10L344J684j996j056k93l06O41J727n05q88
2862E4Q31M71j605j052J046J096J600J040l143l597J388L554K632k99l074m361
2878c419K07M853L390j081l082l512j098M638M188n39l499k703l92K907L434q31
2894C461l462r96J281L71R67P47j392r83J583J25j858K8P98P79J237l84l519j776
2912b993K918L949L71j971m266l099L784O164O12m404m080j403K986N106J733
2927E407m182m731j08K600L948J446l626m450O23L290J363l66j256k266P18K093
$$ plain form
2943 503 603 -1862 -1490 59 401 966 -929 -3574 -2814 1054 2648 1394 -2008 -4442 -3984 1027 4925
2960 4925 2297 -3452 -5317 -3102 1329 4467 2296 -3285 -5239 -2172 1219 3003 1767 -2381 -4576
2975 -4576 -1541 1746 1268 -24 -1410 -2348 -744 1404 355 -2203 -846 946 1042 220 -1730 -2814
2991 -2814 -351 3122 2408 -1156 -3175 -2889 45 4127 4210 -797 -4698 -3388 1055 4447 4249 -389
3007 -389 -4952 -3323 1831 4205 2583 -428 -3234 -2539 1570 3473 1347 -314 -1191 -1051 947 1977
3023 1977 58 -1131 391 1547 527 -950 -1681 -942 1790 3534 348 -3351 -3206 46 3225 3951
3039 3951 508 -4567 -4806 190 3806 3887 526 -4099 -5208 -409 4207 3276 -800 -3577 -3826 -285
3055 -285 2752 2038 -1644 -2732 -1549 -324 923 486 -1644 -1665 385 635 -1260 -1302 -1481 -255 1663
$$ packed form
2943E03J00k465L72J549L42N65j895k645P60L868J594j254l402k434M58N011L898
2960D925k628n749j865K215M431L138k171n581j954L067L391J784j236m148k195
2975d576L035L287m78j292j386r38J604K148j049k558J357J792R6q22j950j084
2991b814K463L473p14l564k019K86K934M082Q3n007l901J310M443L392j98m638
3007c89m563J629N154K374j622l011k806O95M109J903k126j661q77J40J998J030
3023A977j919j189J522J156j020j477p31P39K732J744l186l699J45L252L179P26
3039C951l443n075k39M996L616Q1l361m625j109M799M616r31m076k777k49L541
3055b85L037p14l682j088J183J225J247m37k130k1K050K50j895m2j79J226J918
$$ plain form
3072 1663 834 -2405 -4260 -1704 1888 2864 905 -2983 -4968 -1590 3337 3486 290 -3011 -4843 -1814
3088 -1814 2612 3834 45 -3237 -3374 -1305 1821 2910 -118 -3047 -1685 533 847 589 -277 -1353
3104 -1353 -377 1325 147 -1472 -1247 406 1296 1655 440 -2957 -2492 1305 3670 2455 -842 -3612
3120 -3612 -2834 1732 5052 2647 -1753 -3204 -2152 1376 5070 3422 -1311 -3434 -1354 1560 3359
3135 3359 2502 -941 -2535 -560 2198 1945 1021 -116 -715 720 1756 146 -628 648 1615 1445 440
3152 440 -541 -1570 351 3094 2839 -369 -2107 -2397 164 4175 4170 -342 -3871 -2279 844 3577 3799
3169 3799 -335 -3782 -2608 1414 2883 2345 613 -2505 -2169 831 2247 1197 -179 -1111 -1071 400
3185 400 1319 79 -709 405 947 -31 -774 -730 -581 1262 1978 -95 -1898 -1493 -510 1124 2817 1128
$$ packed form
3072A663q29l239j855K556L592R76j959l888j985L378M927J49l196l301j832L029
3088a814M426J222l789l282j37K069L126J089l028k929J362K218L14k58q66j076
3104a353R76J702j178j619K25J653Q90L59j215l397M65L797K365j215l297k770
3120c612P78M566L320k405m400j451J052L528L694j648m733k123K080K914J799
3135C359q57l443j594J975K758k53r24j137n99J435J036j610p74J276R67j70j005
3152D40r81j029J921K743k55l208j738k90K561M011nm512l529J592L123K733K22
3169C799m134l447J174M022J469n38j732l118L36L000J416j050j376r32M0J471
3185D00R19j240p88J114N42r78p43M4J49J843P16k073j803M05R83J634J693j689
$$ plain form
3203 1128 -2647 -3169 -451 1983 2672 988 -2228 -3398 -752 1805 1937 214 -1109 -2525 -1217 1478
3219 1478 1556 90 -553 -1093 -1085 341 610 -744 -501 119 136 -1080 -902 -446 161 1833 899 -1749 -2412
3238 -2412 -610 1132 1409 1260 -1380 -3573 -1825 1388 2555 1634 -492 -3219 -2401 838 2961 1273
3254 1273 -643 -2207 -2323 170 1909 1069 -348 -839 -791 -896 502 1314 495 -982 -36 -523 -521 599
3272 599 752 572 414 -580 -1550 -714 1588 1511 269 -556 -2108 -1797 935 2830 1124 -598 -1935 -1814
3290 -1814 -42 2493 1832 -246 -1661 -1706 -610 2036 2324 -65 -1926 -1131 -87 10 1341 1157 -572
3307 -572 -1310 5 179 335 888 130 -509 -427 -236 -618 216 1192 681 -333 -891 -1496 -686 1680 1721 -46
3327 -46 -1518 -1685 -843 467 2149 876 -1322 -1999 -1487 5 1810 1785 -918 -2144 -1475 116 904
$$ packed form
3203A128l775n22K718K434O89j684l216j170K646K557J32j723j323j416J308K695
3219A478P8j466o43n40QJ426K69j354K43O20J7j216J78M56O07J672r34k648o63
3238b412J802J742K77j49k640k193J748L213J167r21k126k727Q18L239K123j688
3254A273j916j564j16K493J739q40j417m91M8j05J398Q12q19j477R46m87KJ120
3272E99J53j80j58r94r70Q36K302p7j242q25j552L11K732J895j706j722j337J21
3290a814J772K535o61k078j415m5J096K646K88k389j861P95J044R7J331j84j729
3307e72p38J315J74J56N53p58o39Q2J91l82Q34R76n11j014n58o05Q10K366M1j767
3327d6j472j67Q42J310J682j273k198o77N12J492J805k5k703j226O69J591P88
$$ plain form
3344 904 1355 113 -1768 -1374 214 26 353 739 -746 -1262 -348 572 98 560 443 -251 -876 -746 -814
3363 -814 195 1498 1033 -1118 -2068 -817 229 1579 1867 -643 -2690 -1574 165 1816 2291 245
3379 245 -2220 -2675 148 1749 2215 1500 -1288 -2023 -91 1813 1431 648 -58 -995 -801 1046 1560 633
3397 633 127 -143 -263 184 506 801 734 1212 -2 -1235 -362 902 1035 1708 1197 -1013 -2212 129
3415 129 2161 2355 1576 -821 -2047 -1046 1772 2454 1421 -473 -1990 -1270 1016 2804 743 -646
3431 -646 -628 -654 506 1994 1246 -973 -410 179 150 264 670 130 22 623 -365 -1061 -247 452 805 827
3451 827 -162 -2153 -1777 991 2500 989 -594 -2342 -2405 187 2918 1922 -466 -2313 -2251 -531 1853
3468 1853 1753 -866 -2089 -1298 -406 1150 1204 -446 -1845 -952 172 -118 -270 166 -586 -397 -305 -1143
$$ packed form
3344I04M51j242j881L94J588j88L27L86j485n16R14R20m74M62j17o94o25J30o8
3363h14J009J303m65k151r50J251J046J350K88k510k047J116J739J651M75k046
3379B45k465m55K823J601M66p15k788p35J932J904l82p83p06r37J94J847N14r27
3397F33n06k70j20M47L22K95o7M78j214j233Q73J264J33O73n11k210j199K341
3415A29K032J94p79k397j226J001K818O82j033j894j517P20K286J788k061j389
3431f46J8k6J160J488p48k219N63N89k9J14M06n40j08O01r88o96Q14O99L53K2
3451H27r89j991L76K768J509j511j583j748o3K592K731r96k388j847O2J720K384
3468A853j00k619j223P91Q92J556N4j650j399Q93J124k90j52M36p52J89R2q38
$$ plain form
3486 -1143 -1083 376 659 -19 -580 -1384 -1877 -253 2193 1581 -684 -2526 -2476 -1122 2279 2352 -333 -2890
3504 -2890 -2643 -425 1611 2016 291 -2051 -2057 -437 831 1363 484 -1457 -2101 60 1072 372 -485
3521 -485 -760 -702 -41 382 -592 -618 493 994 204 -881 -1283 -1052 1277 2169 129 -1706 -2107 -872 1033
3540 1033 2931 1463 -1926 -3430 -1008 1479 2842 1731 -1661 -2810 -671 1535 1844 470 -490
3555 -490 -1674 -726 1241 1521 -249 -402 -313 281 594 571 -581 -421 901 910 -592 -665 -906 66 1604
3574 1604 1589 -1119 -2485 -939 863 2167 1557 -729 -3070 -1954 858 2436 1735 -890 -2949 -2091
3590 -2091 745 2332 892 -1077 -1581 -1325 681 1545 487 -1320 -1013 -385 -98 700 -89 -1184 -284
3607 -284 468 -94 -893 -1081 -378 523 930 5 -2314 -2445 104 1497 1618 -15 -2207 -2901 -112 2505
$$ packed form
3486a143O0J459K83o78n61q04m93J624K446o12k265j842N0J354L401P3k685k557
3504b890K47K218K036M05j725k342oJ620J268N32q79j941o44K161J012p00q57
3521d85k75N8O61M23r74k6J111N01p90j085m02K31K329Q92k040j835m01J235J905
3540A033J898j468l389j504K422K487J363j111l392j149K139K206L09j374r60
3555d90j184R48J967K80j770j53Q9N94L13k3j152J60J322Rj502p3k41R72J538
3574A604j5k708j366J546J802J304o10k286k341J116K812J578p01k625k059Q58
3590b091K836J587j440j969n04K56K006Q64j058j807L07O28K87P98p89j095R00
3607b84P52n62p99j88P03R01M07r25k319j31K549J393J21j633k192o94K789K617
$$ plain form
3625 2505 1660 -5 -2203 -2674 -926 2173 2058 -603 -2329 -1738 -373 1495 1649 -302 -1639 -893
3641 -893 293 478 322 -73 -671 201 503 168 -770 -381 458 744 974 -570 -1421 -586 1608 2336 342
3660 342 -1161 -2145 -551 2423 2963 631 -1544 -1708 7 1805 2626 1497 -1618 -1791 300 1385
3676 1385 2302 1194 -966 -1031 471 1483 780 620 -93 328 809 678 -171 107 975 1421 579 -32 -745
3695 -745 -886 1060 2120 916 -1035 -1504 -650 1468 2577 1691 -1225 -2166 -756 1361 2299 1422 -885
3712 -885 -2021 -634 1214 1453 1054 -233 -1533 -738 641 1005 267 -390 -756 -540 619 275 -928
3729 -928 -417 720 312 -532 -935 -717 -98 1166 829 -757 -2010 -1128 87 1097 1749 -337 -2690
3746 -2690 -1948 403 1942 1694 -463 -2254 -1869 471 1913 822 -289 -1430 -1461 -9 1098 630
$$ packed form
3625B505q45j665k198m71J748L099j15k661j726N91J365J868J54j951j337P46
3641h93J186J85j56l95n98Q72L02l35r38L89Q39K86K30j544q51Q35K194P28j994
3660C42j503r84J594K974N40k332k175j64J715J798Q21j129l115j73K091J085
3676A385R17j108k160o5J502J012p03j60p13M21M81j31q49K78Q68M46q42o11p13
3695g45j41J946J060j204j951m69Q54K118J109q86k916r41J410K117R38q77k307
3712h85j136J387J848K39l99j287j300P95J379L64p38o57l66K16J159l44j203
3729i28N11J137m08q44m03K18O19J264l37j586j253Q82J215J010O52k086k353
3746b690P42K351J539k48k157j791L85K340J442j091j111j141l1J452J107m68
$$ plain form
3762 630 -641 -925 -722 28 48 337 -527 -468 340 -39 -812 -1038 -159 491 1279 292 -1494 -1550 76 1264
3782 1264 1475 361 -1397 -1972 -42 2075 1814 454 -1181 -1712 -865 1738 2016 399 -820 -1190 -293
3799 -293 1022 1810 498 -348 -104 198 104 694 937 31 39 374 -4 -353 414 998 784 637 -98 -1075
3819 -1075 -324 1573 1573 536 -573 -1535 -449 1185 2194 834 -575 -755 -957 1037 2270 1394 -579
3836 -579 -1140 -654 597 1818 1574 -489 -1149 -44 522 836 813 11 -576 -61 18 -58 151 636 150 -68
3856 -68 -144 -374 -797 -98 1244 665 -320 -1425 -1005 199 1591 1104 -423 -1611 -995 -304 1032 1513
3874 1513 -71 -1517 -1172 -24 827 1477 275 -1159 -1283 27 403 361 362 -442 -824 -210 48 -167 569
3893 569 591 -184 -560 -489 -220 151 897 621 -157 -714 -750 -7 733 1366 293 -1026 -1085 269 926 1215
$$ packed form
3762F30j271k84K03P50K0K89q64N9Q08l79p73k26Q79O50P88r87j786n6J626J188
3782A264K11j114j758n75J930K117k61j360j635n31Q47K603K78j617j219l70Q97
3799b93J315P88j312q46K44L02r4N90K43r06QL35l78l49P67N84k14j47p35r77
3819a075P51J897%j037j109r62J086J634J009j360j409j80k02J994J233q76j973
3836e79n61M86J251J221k44k063o60J105N66L14k3q02n87N15P9p6K09M85m86k18
3856f8p6k30m23O99J342n79r85j105M20J204J392m87j527j188O16O91J336M81
3874A513j584j446L45J148Q51O50j202j434j24J310L76m2Jq04l82O14K58k15P36
3893E69K2p75l76P1K69L71P46k76p78n57l6P43P40O33j073j319n9J354O57K89
$$ plain form
3913 1215 859 -877 -1304 -42 735 1236 1259 -217 -1051 -719 1269 1371 1051 192 -767 -628 459 781
3931 781 753 418 504 -270 -168 834 660 365 528 235 -353 -18 530 753 995 1082 -43 -853 -113 920
3951 920 1591 1027 246 -1220 -562 763 1510 1149 286 -596 -1165 379 1715 1336 -72 -477 -995 -375
3969 -375 1195 1184 403 279 -316 -369 52 645 277 -379 126 -110 -347 -86 563 54 280 391 -559 -899
3989 -899 225 676 449 51 -856 -1347 -491 932 948 -70 -823 -1812 -1160 304 1319 112 -1083 -1247
4007 -1247 -975 -134 1148 483 -1021 -1118 -592 -210 500 336 -540 -759 -527 -462 -514 353 435 -328 -259 -459 -779
4028 -779 -615 507 707 14 -838 -733 -1089 300 1718 657 -929 -1732 -1172 311 1698 847 -856
4045 -856 -1455 -859 263 1263 1611 -347 -1762 -453 484 964 587 -27 -774 -582 509 668 195 126
$$ packed form
3913A215l56j736m27J262P77N01K3j476q34L32J988J02l20q59r59J39J087L22
3931G81k8l35Q6p74J02J002j74k95J63k93n88L35N48K23K42Q7j125q10P40J033
3951I20O71n64p81j466O58J325P47l61q63q82n69J544J336l79j408m05n18O20
3969c75J570j1p81j24n95n3M21N93l68o56N05k36k37K61O49n09K26J11r50l40
3989h99J124M51k27l98r07m91Q56J423J6j018p53r89O52J464J015j207j195j64
4007a247K72Q41J282o65j504r7N26L82P10j64q76k19K32O5n2Q67Q2p63O9k00l20
4028g79J64J122K00o93q52J05l56J389J418j061j586q03N60J483J387q51j703
4045h56n99N96J122J000L48j958j415J309R37M80l77o14p47J92J091J59m73o9
$$ plain form
4063 126 221 -279 294 381 -325 20 1034 554 -298 -848 -434 -72 1077 1175 50 -1014 -929 -33 1307 1698
4083 1698 325 -1458 -1259 266 1218 1243 365 -1243 -1140 160 1302 675 157 -434 -881 140 855 584
4101 584 -399 -218 348 436 205 -139 -509 132 869 291 -839 -945 -348 657 1212 675 -1577 -1966 -469
4120 -469 882 1474 727 -1100 -2101 -603 1105 1523 552 -832 -2078 -865 867 1520 -102 -974 -1223
4137 -1223 -786 426 653 -291 -763 -409 -140 -244 -162 -284 -551 86 279 -246 -1034 -453 372 555 553 -316
4157 -316 -1536 -872 1200 1504 633 -753 -2004 -1293 721 1988 839 -730 -1905 -1171 629 1810
4173 1810 659 -872 -1249 -584 566 789 685 -528 -621 348 617 395 119 -238 -300 380 572 -141 -728
4192 -728 634 602 867 257 -938 -1213 295 1657 1164 -294 -1276 -846 208 1813 1507 -530 -1394 -830
$$ packed form
4063A26R5n00N73Q7p06L45J014m80q52n50M14L62J149R8j125j064Q5Q96J340L91
4083A698j373j783J99J525R52K5q78j608J03J300J142o27n18n91m47J021P15k71
4101E84r83J81N66Q8k31l44l70O41P37n78j130j06N97J005N55n37k252l89J497
4120d69J351N92p47j827j001J498J708M18r71j384j246J213J732O53j622q72k49
4137a223M37J212K27r44m72L54K69j04Q2j22k67O37J93n25p88N81Q25J83kq69
4157c16j220O64K072L04q71j386j251P11K014J267j149j569j175P34J800J181
4173A810j151j531l77O65J150K23j04j213r3R69K69k22k76l57o2O80J92p13n87
4192g28J362l2K65o10j195k75J508J362m93j458r82M30J054J605l06k037q64N64
$$ plain form
4210 -830 64 1419 1472 -196 -1141 -750 528 739 653 -7 -962 -221 828 309 -498 40 58 180 328 -310
4230 -310 -714 -585 711 336 98 -884 -927 -375 1128 1559 -90 -1447 -1046 -399 1256 1637 41 -1665
4248 -1665 -1593 96 1040 1326 313 -1154 -1480 -386 801 477 35 -535 -1084 -337 577 47 -715 -318
4266 -318 84 29 -306 -444 -728 54 476 69 -1093 -755 -502 214 796 196 -1377 -1376 -303 563 1217 650
4286 650 -1068 -1725 -437 1089 1089 525 -980 -1550 -739 760 984 -161 -616 -752 -565 419 614 -236 -454
4305 -454 125 59 306 311 -188 -220 178 1015 -171 -709 -182 139 750 808 -257 -878 -789 813 1047 425 -35
$$ packed form
4210h30Q94J355N3j668r45L91J278K11q6o60r55P41J049n19q07N38J8J22J48o38
4230c10m04J29J296l75k38r82m3N52J503M31j649j357M01O47J655L81j596j706
4248a665P2J689R44K86j013j467l26J094J187l24m42n70n49P47R14n30p62L97
4266c18M02n5l35j38k84P82M22m07j162L38K53P16N82o00j573JJ073Q66O54n67
4286F50j718o57J288J526%n64j505n70Q11J499K24j145m55j36J87R84J95q50k18
4305d54N79o6K47Nm99l2L98Q37j186n38N27L21O11N8j065o21Q9J602K34o22m60
$$ [...]
8191a76
##END NTUPLES=NMR FID
##END=
