##TITLE=1H_EC-3227(1)
 CDCl3, 8 sc, 
 5.3.2020
##JCAMPDX= 6.0         $$ Bruker NMR JCAMP-DX V2.0
##DATA TYPE= NMR FID
##DATA CLASS= NTUPLES
##ORIGIN= UXNMR, Bruker Analytische Messtechnik GmbH
##OWNER= root
$$ XWIN-NMR		Version 3.5
$$ Thu Mar  5 13:57:00 2020 Russian Standard Time (UT+4h)  she@DPX200
##.OBSERVE FREQUENCY= 200.1315
##.OBSERVE NUCLEUS= ^1H
##.DELAY= (6, 6)
##.ACQUISITION MODE= SIMULTANEOUS
##.ACQUISITION SCHEME= undefined
##.AVERAGES= 8
##.DIGITISER RES= 18
##SPECTROMETER/DATA SYSTEM= spect
##.PULSE SEQUENCE= zg30
##.SOLVENT NAME= D2O
##.SHIFT REFERENCE= (INTERNAL, D2O, 0, 15.7039)
##AUDIT TRAIL= $$ (NUMBER, WHEN, WHO, WHERE, WHAT)
$$ ##TITLE= Audit trail, XWIN-NMR		Version 3.5
$$ ##JCAMPDX= 5.01
$$ ##ORIGIN= Bruker BioSpin GmbH
$$ ##OWNER= she
$$ F:/spectra/data/she/nmr/H-F/1/audita.txt
$$ ##AUDIT TRAIL=  $$ (NUMBER, WHEN, WHO, WHERE, WHAT)
(   1,<2020-03-05 13:55:57.84 +0400>,<she>,<DPX200>,
      <created by zg, POWCHK disabled, PULCHK disabled
       configuration hash MD5:
       00 E9 B6 7A A2 85 ED C7 34 08 36 98 17 FE 4E 26
       data hash MD5: 16K
       6E 43 A6 BC 7B 7A 70 D9 23 FC 82 4D 5E BB 8B 4F>)
$$ ##END=
$$ 
$$ hash MD5
$$ 15 47 F5 04 57 24 24 64 8D 93 6E CE F9 8B 75 A5
##$RELAX= 
##$RELAX= 
##$RELAX= 
##$RELAX= 
##$RELAX= 
##$RELAX= 
$$ Bruker specific parameters
$$ --------------------------
##$DU= <F:/spectra>
##$EXPNO= 1
##$NAME= <H-F>
##$PROCNO= 1
##$TYPE= <nmr>
##$USER= <she>
##$AMP= (0..31)
100 100 100 100 100 100 100 100 100 100 100 100 100 100 100 100 100 100 
100 100 100 100 100 100 100 100 100 100 100 100 100 100 
##$AQSEQ= 0
##$AQ_mod= 1
##$AUNM= <au_zg>
##$AUTOPOS= <>
##$BF1= 200.13
##$BF2= 200.13
##$BF3= 200.13
##$BF4= 200.13
##$BF5= 200.13
##$BF6= 200.13
##$BF7= 200.13
##$BF8= 200.13
##$BYTORDA= 1
##$CFDGTYP= 0
##$CFRGTYP= 5
##$CHEMSTR= <none>
##$CNST= (0..31)
1 1 145 1 1 1 1 1 1 1 1 1 1 1 1 1 1 1 1 1 1 1 1 1 1 1 1 1 1 1 1 1 
##$CPDPRG= <>
##$CPDPRG1= <>
##$CPDPRG2= <>
##$CPDPRG3= <>
##$CPDPRG4= <mlev>
##$CPDPRG5= <mlev>
##$CPDPRG6= <mlev>
##$CPDPRG7= <mlev>
##$CPDPRG8= <mlev>
##$CPDPRGB= <>
##$CPDPRGT= <>
##$D= (0..31)
0 1.2 0 0 0 0 0 0 0 0.06 0 0.03 0 0 0 0 0.0002 0 0 0 0 0 0 0 0 0 0 0 0 
0 0 0 
##$DATE= 1583402157
##$DBL= (0..7)
120 120 120 120 120 120 120 120 
##$DBP= (0..7)
150 150 150 150 150 150 150 150 
##$DBP07= 0
##$DBPNAM0= <>
##$DBPNAM1= <>
##$DBPNAM2= <>
##$DBPNAM3= <>
##$DBPNAM4= <>
##$DBPNAM5= <>
##$DBPNAM6= <>
##$DBPNAM7= <>
##$DBPOAL= (0..7)
0.5 0.5 0.5 0.5 0.5 0.5 0.5 0.5 
##$DBPOFFS= (0..7)
0 0 0 0 0 0 0 0 
##$DE= 6
##$DECBNUC= <off>
##$DECIM= 24
##$DECNUC= <off>
##$DECSTAT= 4
##$DIGMOD= 1
##$DIGTYP= 9
##$DL= (0..7)
0 120 120 120 120 120 120 120 
##$DP= (0..7)
150 150 150 150 150 150 150 150 
##$DP07= 0
##$DPNAME0= <>
##$DPNAME1= <>
##$DPNAME2= <>
##$DPNAME3= <>
##$DPNAME4= <>
##$DPNAME5= <>
##$DPNAME6= <>
##$DPNAME7= <>
##$DPOAL= (0..7)
0.5 0.5 0.5 0.5 0.5 0.5 0.5 0.5 
##$DPOFFS= (0..7)
0 0 0 0 0 0 0 0 
##$DQDMODE= 0
##$DR= 18
##$DS= 0
##$DSLIST= <SSSSSSSSSSSSSSS>
$$ [...]
##$SUBNAM2= <"">
##$SUBNAM3= <"">
##$SUBNAM4= <"">
##$SUBNAM5= <"">
##$SUBNAM6= <"">
##$SUBNAM7= <"">
##$SUBNAM8= <"">
##$SUBNAM9= <"">
##$SW= 24.9337058887773
##$SWIBOX= (0..15)
0 0 2 0 0 0 0 0 0 0 0 0 0 0 0 0 
##$SW_h= 4990.01996007984
##$TD= 16384
##$TD0= 1
##$TE= 0
##$TE2= 300
##$TE3= 300
##$TEG= 300
##$TL= (0..7)
0 120 120 120 120 120 120 120 
##$TP= (0..7)
150 150 150 150 150 150 150 150 
##$TP07= 0
##$TPNAME0= <>
##$TPNAME1= <>
##$TPNAME2= <>
##$TPNAME3= <>
##$TPNAME4= <>
##$TPNAME5= <>
##$TPNAME6= <>
##$TPNAME7= <>
##$TPOAL= (0..7)
0.5 0.5 0.5 0.5 0.5 0.5 0.5 0.5 
##$TPOFFS= (0..7)
0 0 0 0 0 0 0 0 
##$TUNHIN= 0
##$TUNHOUT= 0
##$TUNXOUT= 0
##$USERA1= <user>
##$USERA2= <user>
##$USERA3= <user>
##$USERA4= <user>
##$USERA5= <user>
##$V9= 5
##$VALIST= <valist>
##$VCLIST= <CCCCCCCCCCCCCCC>
##$VD= 0
##$VDLIST= <DDDDDDDDDDDDDDD>
##$VPLIST= <PPPPPPPPPPPPPPP>
##$VTLIST= <TTTTTTTTTTTTTTT>
##$WBST= 1024
##$WBSW= 4
##$XGAIN= (0..3)
0 0 0 0 
##$XL= 0
##$YL= 0
##$YMAX_a= 324073
##$YMIN_a= -192081
##$ZGOPTNS= <>
##$ZL1= 120
##$ZL2= 120
##$ZL3= 120
##$ZL4= 120
##$ABSF1= 10
##$ABSF2= 0
##$ABSG= 5
##$ABSL= 3
##$ALPHA= 0
##$AQORDER= 0
##$ASSFAC= 0
##$ASSFACI= 0
##$ASSFACX= 0
##$ASSWID= 0
##$AUNMP= <proc_1d>
##$AZFE= 0.1
##$AZFW= 0.1
##$BCFW= 1
##$BC_mod= 2
##$BYTORDP= 1
##$COROFFS= 0
##$CY= 11.3945322036743
##$DATMOD= 1
##$DC= 2
##$DFILT= <>
##$DTYPP= 0
##$F1P= 16.9975609425685
##$F2P= -3.02152046262296
##$FCOR= 0.5
##$FTSIZE= 0
##$FT_mod= 4
##$GAMMA= 1
##$GB= 0.15
##$INTBC= 1
##$INTSCL= 1
##$ISEN= 128
##$LB= 0.24
##$LEV0= 0
##$LPBIN= 0
##$MAXI= 10000
##$MC2= 0
##$MEAN= 0
##$ME_mod= 0
##$MI= 1.114404
##$NCOEF= 0
##$NC_proc= 0
##$NLEV= 6
##$NOISF1= 3.799351
##$NOISF2= 2.8
##$NSP= 1
##$NTH_PI= 0
##$NZP= 0
##$OFFSET= 15.70392
##$PC= 1
##$PHC0= -9796.141
##$PHC1= 28.40082
##$PH_mod= 1
##$PKNL= yes
##$PPARMOD= 0
##$PSCAL= 0
##$PSIGN= 0
##$REVERSE= no
##$SF= 200.130013532006
##$SI= 16384
##$SIGF1= 3
##$SIGF2= 2
##$SINO= 400
##$SIOLD= 16384
##$SREGLST= <1H.CDCl3>
##$SSB= 0
##$STSI= 0
##$STSR= 0
##$SW_p= 3612.71676300578
##$SYMM= 0
##$S_DEV= 0
##$TDeff= 0
##$TDoff= 0
##$TI= <>
##$TILT= no
##$TM1= 0
##$TM2= 0
##$TOPLEV= 0
##$USERP1= <user>
##$USERP2= <user>
##$USERP3= <user>
##$USERP4= <user>
##$USERP5= <user>
##$WDW= 1
##$XDIM= 8192
##$YMAX_p= 0
##$YMIN_p= 0
$$ End of Bruker specific parameters
$$ ---------------------------------
##NTUPLES= NMR FID
##VAR_NAME=  TIME,          FID/REAL,        FID/IMAG
##SYMBOL=    X,             R,               I
##VAR_TYPE=  INDEPENDENT,   DEPENDENT,       DEPENDENT
##VAR_FORM=  AFFN,          ASDF,            ASDF
##VAR_DIM=   8192,          8192,            8192
##UNITS=     SECONDS,       ARBITRARY UNITS, ARBITRARY UNITS
##FACTOR=    0.0002004,     1,               1
##FIRST=     0,             0,               0
##LAST=      1.6414764,     0,               0
##MIN=       0,             -192081,         0
##MAX=       1.6414764,     324073,          0
$$ Real data points
##PAGE= N=1
##DATA TABLE= (X++(R..R)), XYDATA
$$ [...]
2691B098L9J006l356m666K828N211p97j788n09k613Q8O158j1o173j457L446K583
2708B087J643m30o518l723O758N663k524k877k050k456K669O315j187n585k44
2723b459R92J069L366K92p379k072O777L828k033k192l207k679N536N485l216
2738B108m395O8K49J616L611j533n803M26M803J100o28j375m208j455O894M654
2754F132n167m585L35Q51L751L446m339n109K520L994m37J69j311m875Q61P281
2770C517J655n041l283n44Q50N759L301n960n314K504L493J174Q04l218m816L089
2786b030O740j053m604q38j127Q21N912K101o313m691K880K531K705J607n235
2801e94m621M201N029j619k750o34k091J979N930q62o361j459K961J422K725P70
$$ y = [2098, 2137, 3143, -213, -4879, -2051, 3160, 2363, 575, 66, -2547, -2459, 3699, 3688, -2485, -3942, -496, 2087, 3730, 3300, -3218, -6941, -183, 5480, 2956, 79, -1971, -4427, -1758, 4557, 3370, -2215, -2459, -1467, -398, 2968, 3260, -4119, -6191, 586, 4414, 2381, 189, -3018, -5697, -161, 5324, 2108, -2287, -2219, -1970, -354, 3257, 1724, -4079, -3653, 1150, 2250, 1622, 247, -3961, -5416, 1478, 6132, 965, -3620, -3285, -2434, 1317, 4763, 424, -4685, -2165, 1829, 1392, 1561, 250, -4625, -3764, 3517, 5172, 131, -3152, -3696, -2846, 2913, 6214, 254, -5060, -2556, 937, 2111, 2915, -303, -5119, -2030, 4710, 3657, -947, -1785, -2912, -2091, 3821, 5922, -391, -5082, -2202, 329, 3034, 4641, -594, -5215, -1014, 4015, 2396, -354, -988, -3079, -1100, 4830, 3968, -2393, -3852, -891, 531, 3256, 4026]
2817D026n798l074M527L522j407q09k261k691L897N626k961o229N73K593J895
2832A429K758j447o810p49N527K016p73o04l545k768N295M707l491m500O13P53
2848a589K903L334l458o284J006N899R48j029q85m492o30N842K408m120k344Q84
2864a607n63L366L238m477n186K538M273L65R1k667m971K155P193P3m732j414
2880b325J02J39M246J472n342k951L778J805M43J214l939m393L629O528j566l608
2896g68j301j192J830N306n22n446j426L004J006J428K42m365k662M942L772j913
2912A935k140p49k644K572N755j321n676n03K343J254K372p11n181o31N372J076
2928C123k067o17j426k080M024M271l391m250P75J199J268K845j594n311N91M737
$$ y = [4026, -1772, -4846, -319, 3203, 1796, 987, -1274, -3965, -68, 5558, 2597, -3632, -3059, -466, 1429, 4187, 2740, -4070, -4819, 708, 2724, 1951, 1347, -2198, -4966, 329, 5036, 1545, -2955, -2342, -1589, 1314, 4648, 1190, -5094, -4088, 1811, 2759, 1730, 845, -3647, -4277, 1565, 3973, -147, -2491, -1607, -2170, 1196, 4434, -43, -5229, -2691, 1582, 1947, 2038, -629, -5600, -3445, 3748, 3821, -911, -2325, -2223, -2084, 2162, 3634, -1708, -4659, -881, 924, 1367, 2581, -1358, -5751, -2122, 4406, 2840, -768, -2069, -3261, -1431, 3875, 3353, -2093, -3519, -515, 491, 1919, 2161, -2204, -4866, 76, 3848, 1935, -205, -954, -3598, -1026, 4729, 3408, -2268, -2771, -428, 826, 3198, 2487, -2694, -3325, 2047, 3123, 1056, 439, -987, -3067, 957, 5228, 1837, -2413, -1638, -439, 829, 3674, 2080, -3231, -2640, 2097]
2944B097O51j867k94k853r33O000K269m872k910J591N23J841K764k799m777J212
2960b357M080j33L52j003m205M57N713N84m305j069O55j71L074J941m513l039
2976c939L223K118l30K43j397l537K353M644j941l094N57m39N83L976j35n848
2992b963j359M551J528p49Ok795k729M329L447k724k051n8p01J657M198k027n343
3009c783Q50L245Q18O28k81m203j375N098K364l089j290n58r99K980L222l390
3025B37l699K275J698l65J682m79m636K43N182M95k545m72j327k23L633J923m231
3042f09k092K533N41O15J676k834l802L165M224j506k428l27j100O06M727k3m808
3059a442q96J776J045K309Q71m740l331M451L642j916j661n89k618K198M699p32
$$ y = [2097, 2748, 881, 587, -2266, -3199, 2801, 5070, 198, -2712, -1121, -598, 1243, 4007, 1208, -3569, -2357, 1723, 1590, 1942, 939, -3266, -2809, 2904, 3488, -817, -1886, -1231, -1402, 1672, 3613, -900, -3939, -716, 1402, 1072, 1315, -82, -3619, -1266, 3378, 1437, -1657, -1100, -1539, -956, 3020, 2885, -2963, -4322, 229, 1757, 1008, 1014, -1781, -4510, -181, 3266, 542, -1509, -1567, -2268, -611, 3587, 1560, -3783, -2933, 312, 1130, 1758, 1477, -2726, -4101, 997, 3361, 272, -1018, -1576, -2575, 405, 3627, 237, -3462, -1187, 511, 146, 1828, 1349, -3287, -3044, 2138, 2633, 88, -384, -1711, -1934, 1699, 3622, -609, -2701, -168, 373, 988, 2664, -170, -3972, -807, 3417, 1911, -517, -844, -1944, -1338, 3389, 3366, -1442, -2338, -562, 483, 2792, 3663, -1077, -4408, 43, 3685, 1769, 108, -481, -3099, -901, 3798, 3066]
3075C066m389l10M15J000L082O60n294j551M402R54j255K66j463k362L274L206
3091C701k434l179N04M85J471K570j605m873J582L529o68l53K34k945j650N495
3107A864K390m332k911J088P62K855K245l356m593J828L421P9Q36j454m530O12
3123c196N421Q93l563j305j82K3L061K567m071l678K270K377R29M54k392l653
3139d045K336M573j371k488O29j140J10L309Q60m752j522L164J168K49N27k959
3155a352k588L977L118k396j667j09j046J832L740j809m887Q03L024P48P22p89
3171A321m329r89N326K437k427j464j952j242M212L913l040m431Q89J928J064
3186A216K025j222n329P5M831J148p54j054l306j197M741K915l014k621J099k45
$$ y = [3066, -1323, -1633, -1218, -218, 2864, 3524, -1770, -3321, 1081, 2035, 780, 1046, -417, -2779, 495, 3701, 1267, -1912, -1408, -923, 548, 3118, 1513, -3360, -1778, 1751, 1083, 730, 964, -1981, -3631, 1864, 4254, -78, -2989, -1901, -1139, 1716, 3961, 605, -3988, -2160, 1261, 1340, 2176, 722, -3808, -3196, 2225, 3118, -445, -1750, -1932, -1909, 1152, 3719, -352, -4030, -1760, 617, 1546, 2000, -392, -4045, -1709, 2864, 1493, -995, -366, -1506, -1396, 1913, 2773, -1979, -3501, -337, 831, 1080, 1607, -1352, -3940, 37, 3155, 759, -908, -1017, -2063, -231, 3509, 1700, -3187, -2384, 640, 1388, 2110, 1321, -3008, -3997, 1329, 3766, 1339, -125, -2077, -3319, 893, 4806, 1766, -2665, -1776, 152, 1216, 3241, 2019, -3310, -3235, 1596, 2744, 1990, 936, -2370, -3567, 1174, 4089, 1075, -1546, -447, -692]
3202f92J543K162k172m078J489M126l96j057j215k528J118M487M57m229q53J172
3218f66J36K016J805l889l830L708L685p81j301k356k803L103N395j220m058j175
3234b231m25Q26N202J055n813l089L036K676O68M0l179l199L301M206p38k834
3250d98j601j503K238N023r67n055j158K894O52Q57J205l353k236K804L280j711
3266H71j793j039k50L085L400l631l976P73K635O99J286m17m348q28M748J680
3282B895k567j563j069N67L395K504m012l419R13J768K435K870l827n409J261
3297c258N222Q87j741o63k332o22M196J832l090j967K74L46K789K625m282m366
3313d150K229L703k2n1p98l200M10L808N28l052k36K33P75J714O13l868j732L086
$$ y = [-692, 851, 3013, 841, -3237, -1748, 2378, 1982, 925, -290, -2818, -1700, 2787, 3244, -985, -1838, -666, -530, 1486, 3291, -598, -4428, -720, 2965, 2184, 883, -1473, -4276, -1173, 4222, 3002, -1056, -2231, -2656, -1830, 3372, 4427, -1386, -4475, -1439, 1237, 1905, 1945, -1234, -4433, -1132, 3074, 2336, -498, -2099, -3602, -1364, 3659, 2692, -2363, -3521, -627, 25, 882, 2087, -1266, -3502, -698, 2582, 871, -922, -1961, -2211, 874, 4274, 643, -3333, -2560, 75, 774, 2060, 1643, -2705, -3533, 1215, 2895, 328, -1235, -2304, -1737, 1658, 4162, 150, -3269, -2356, -588, 1847, 4717, 890, -4519, -3258, 1964, 2851, 1110, 447, -1885, -2507, 1689, 3521, 431, -1536, -1262, -916, 1873, 4498, 216, -4150, -1921, 1782, 1760, 1709, 911, -2289, -1879, 1929, 2457, -595, -831, -598, 177, 1891, 2504, -1364, -3096, -10]
3331a0K184m88j95j889l247L060M500j464l687k42Q00R77K716j259m514k48L818
3348H12J260m5l11l641k278L884M176j675k632j280r09J814M175j513m377O16
3364a924J911J197N39r52l745m07M561J553k075j258r08j401K386L501j686l509
3380b217O90J533K76J153j623l249J428M614k16l111n26q43j9L857J517l530k385
3397b651J171R25J086J541k213l310K215L795o55j854j243k077J651N233k78m581
3413a245j551J397Q49K225Q70k903k425J722K501p53or18k634K326M096j418l896
3430a763R5O35R08K785K83m292j269K663J028k04J66j596j022K413J838k524j705
3447a561J062L8J161K432j283m379j07L404J143j66n28k389q85L881N63k131j258
$$ y = [-10, 2174, 1686, 1491, -398, -3645, -585, 3915, 2451, -1236, -1478, -678, 299, 3015, 1756, -2758, -3006, 812, 2072, 2027, 1716, -1925, -4203, -319, 3857, 2182, -450, -1730, -2639, -825, 3350, 1837, -2540, -1924, -13, 1184, 1723, 771, -2974, -3381, 1180, 2733, 658, -600, -1508, -2909, -523, 2978, 1292, -2217, -1527, 6, 282, 1435, -188, -3437, -2009, 2605, 2389, -722, -1248, -2091, -2110, 1747, 3264, -266, -2651, -1480, -555, 531, 2072, -141, -3451, -1236, 2559, 1904, 50, -1193, -3270, -1619, 3614, 3336, -1245, -2796, -1399, -550, 1675, 2545, -358, -2783, -1061, 1440, 687, 681, -237, -2871, -545, 3551, 2133, -1763, -1668, -1033, -125, 2660, 2943, -1349, -2618, 45, 1073, 869, 1035, -561, -1583, 830, 2668, 144, -1561, -499, -461, 700, 3132, 1849, -2530, -2637, 767, 1910, 1744, 1216, -1173, -2058, 1823, 2386, 255, -1003]
3464a003N65q7J810K017k792m090K120K620N81Q49j453l556j57L659J092j503
3480F72n66n31j001K661J434l282k110K218J687k81R48j610l217J562L506o41
3496A449j345j94j139N4K765J5l420k14K789K94k20J74k626j817L516L110j653
3513A538k157p55q41J518L502j650l400R66J347J5Q28P6l030j111L782K202k250
3530E80j252j299o71L195K280k249k141M71N91K56J915q86l472O36L763k60j465
3547hn10j354j46L381J600l045j666L66M07J798J640j798l523J626K930m70j056
3564A72n51j474L34L885J70l086q98O71J94K305Q53l030j900J840K031n08m1j158
3582a91k250K287L550j703k928n14Q14Q96K595k04l825j126K349J503K43K38k501
$$ y = [-1003, -438, -525, 1285, 3302, 510, -3580, -1460, 1160, 1741, 2590, 1137, -2419, -2576, 1083, 2175, 672, 106, -425, -1426, 1235, 2669, -613, -2723, -505, 1182, 901, 1849, 239, -2978, -1416, 2090, 1449, 104, -90, -1229, -1175, 1590, 1605, -1815, -2029, 760, 1054, 834, 1008, -1618, -3435, 81, 3191, 1538, -619, -1374, -2215, -697, 2805, 1155, -2245, -1279, 68, 83, 911, 987, -2043, -3154, 628, 2830, 580, -672, -1971, -2642, 553, 2833, 584, -1557, -1086, -495, -239, 1676, 790, -2682, -2046, 1717, 1457, -8, -518, -1872, -2018, 1363, 2963, -82, -1748, -1382, -975, 823, 2463, 665, -2858, -1232, 1698, 1228, 172, -379, -1853, -1519, 2366, 2536, -550, -1448, -777, -583, 1722, 2575, -455, -2355, -515, 1516, 1008, 967, -191, -2441, -154, 3396, 1693, -1235, -1749, -935, -39, 2556, 2352, -1473, -2599, -250, 1253, 1496, 1734, -767]
3599g67j978K856K644j783j506k51m22J555K799j530l940K56K595Q44L11n16k699
3616a532q00L458J055j857p35j73n94K153J829k301l100P94K475N83P22j138l509
3633b670M2M390N62k000j233r77O07K685J284l358j833J459R79R87J152k108l261
3650c293J794L267J74j473j293j671J149L437L28l431j407J946O53R71N48k816
3666a117k182K953K128o08q69j007k078J657L546n70l065p34N00J409K181j95
3682A949l874p79L124J648j292m07j651j341K833K664j545k622j56J91J103K679
3698B524r66l577k70K632J126k01o77k625m22L481K216k671j956J78k39J986K356
3715B895j597l287J24K378N30J283j249l368q7L654J394k240j613k07P2K683J388
$$ y = [-767, -2745, 111, 2755, 972, -534, -785, -1207, 348, 3147, 1617, -2323, -2067, 528, 1372, 1683, 1167, -1532, -2332, 1126, 2181, 324, -411, -584, -1178, 975, 2804, 503, -2597, -1803, 672, 1255, 1977, 839, -2670, -2628, 1762, 2324, 324, -909, -1886, -1279, 1406, 2690, -668, -2501, -1042, -63, 924, 2076, -32, -3293, -1499, 1768, 1942, 469, -824, -2495, -1346, 2091, 2419, -1012, -2419, -473, 180, 1151, 1699, -1117, -3299, -346, 1782, 1174, 305, -702, -2780, -1123, 2423, 1853, -1212, -1946, -1446, -37, 2144, 1949, -1925, -2704, 420, 2068, 776, 369, -1282, -2623, 210, 2874, 1329, -1293, -1449, -1258, -155, 2524, 1558, -2019, -2289, 343, 1469, 1268, 591, -2034, -2456, 1025, 3241, 570, -1386, -1208, -1447, 539, 2895, 1298, -1989, -1865, 513, 1043, 2326, 1077, -2291, -2378, 1276, 2670, 430, -1183, -1390, -1318, 1365, 2753]
3732B753k865k539J677J448M49Q90j927k742J164L802j34j804q03j231K05L533
3748A876R43l352k061J704J486O39O60k561k327K151K807m75j183q78j484R42
3764a113L521k36l285q78J326O78J255Q22l069j777K483K003p92j022j236q68
3780b188K271K515j684k579K61Q56M92J858m67l032r24L026J430j092n09j629
3796a395o37K979J892k655j684N45L59J179J668j310l188N85K625M90j57j045
3812B51k204q8L404J245k487j229rJ6K248J591k867k464J704J965J53k22p68j981
3830a742L60K886L73j879k40m46m61K413J080k519j661J864J010k38O75j765j919
3847b209J893K679p74k119K0l56P67K175k76l342k17J706M14P07M85k175j922
$$ y = [2753, -112, -2651, -974, 474, 923, 1813, -114, -2856, -1692, 2110, 1976, 172, -631, -1862, -1657, 1876, 2819, -533, -2594, -890, 596, 1235, 1895, -666, -2993, -842, 1965, 1490, 307, -571, -2055, -1113, 2408, 2172, -1113, -1991, -665, 13, 1268, 2090, -979, -2756, -273, 1730, 938, -84, -1320, -2188, 83, 2598, 914, -1665, -1404, -548, -56, 1802, 1335, -1697, -2621, 405, 1835, 743, 234, -1395, -2032, 947, 2839, 184, -1500, -955, -596, 583, 2251, 941, -2247, -1662, 963, 1453, 1296, 251, -1953, -2041, 1363, 2608, 121, -1108, -1117, -1101, 1147, 2738, -129, -2593, -889, 1076, 1229, 1007, 239, -1742, -1382, 1504, 1877, -2, -242, -688, -1149, 1264, 2344, -175, -1836, 28, 1038, 800, 1475, -290, -2209, -316, 2363, 1589, -530, -510, -866, -99, 2076, 1800, -1542, -1759, -53, 361, 1068, 1553, -622, -2544]
3864b544K254K798j059j950j239J77J918K316j539k712L46J093L25J073K40l005
3880a508j197K948J340q84o07j402p40J983K439j947j945N72K31Q87J477j176
3896D71k484O40K295j41r08J04q92m43J952J422k105j493M67N61J344P96j952
3913c66k384J854K250o73l70n30j504M37L253m11k571l51N13O15J255R01k725
3930h07j497J646J362L5N82j407k436J635K879n72k387K91R1K72J487J40k302
3947i88m91J889L15l35P44j285j492K048J373j248q45K74n20N12J630q39k151
3964a409O41J743l8m40J8j681j02K566L01j752n77K03m19J631J761k128k142R45
3982h79J988J70K95j368k371Q96K873K70j718l98j097k34K546J232k100j631J187
$$ y = [-2544, -290, 2508, 1449, -501, -1740, -1563, 355, 2671, 1132, -1580, -1234, -141, 184, 1257, 1497, -1508, -2705, 243, 1583, 699, 92, -1310, -2050, -67, 2372, 425, -1520, -948, -717, 170, 1647, 471, -2013, -1373, 922, 781, -127, -23, -915, -1358, 594, 2016, -89, -1582, -1115, -554, 790, 1586, -366, -2750, -896, 1354, 681, 311, -219, -1723, -1286, 1967, 1556, -1015, -1366, -853, -238, 1017, 1918, -807, -2304, -658, 704, 739, 1321, -86, -2522, -887, 1992, 1420, -967, -676, -585, -313, 1174, 1314, -988, -1479, 410, 725, 390, 1134, -151, -1643, 405, 1778, 530, -315, -41, -561, -49, 1581, 742, -1409, -768, 975, 937, 497, 515, -1166, -1268, 1298, 1599, -153, -730, -527, -946, 685, 2446, 318, -1824, -879, 1109, 1279, 1574, 206, -2165, -1269, 1604, 1874, 156, -242, -1339, -1573, 973, 2205, 105, -1526, -339]
3999c39N92N3J152j247k219J307J731m2p27l94j517Q71K440k81k719J88J369j98
4017B0nO73j554o19J679J096r22p56o33n97J531K777j958k852O10J286M59J108
4035A343l28k667o92K749J223j031r58j173l24K224J995k007j788J95J93J263
4051B17J665n37l217m97K694M50j58q8j696k64K019P96j483o87L58j63R18J745
4069B072j707k422J227J447J60k07k02j483P5K174K70j834l06M16M43J701o6l153
4087a395o86J870J256K10J1j343j973J293K462m2j579p96k41R41K218l30l079
4104a203k1J065R11N44L69k571j479J879K212o23o40r07j007O63K321N3k484n5
4122i73R23M65Q83k01k128q47K451R56j202k62n89o84J211J817j600j475R38O00
$$ y = [-339, 253, 306, 1458, 211, -2008, -701, 1030, 988, 261, -133, -1650, -779, 1661, 1380, -1339, -1151, 218, 20, 15, 688, -866, -1485, 194, 1290, 368, -388, -1021, -1618, -87, 2690, 732, -2120, -1510, -224, 235, 1343, 1015, -1652, -2344, 405, 1628, 597, -361, -1534, -1858, 366, 2361, 354, -1434, -1239, -1046, 217, 1882, 1345, -1872, -2369, 325, 775, 617, 529, -1167, -1431, 588, 1384, -99, -786, -428, -591, 327, 2072, 365, -2057, -830, 617, 777, 570, 368, -1115, -1040, 1134, 1404, -430, -736, -320, 123, 1824, 1758, -1395, -2081, -211, 1045, 1255, 1266, -77, -2050, -757, 1705, 1663, 84, -712, -953, -12, 2206, 1876, -1203, -1224, -159, 752, 1296, 1665, -906, -2385, -506, 1706, 1083, 443, -464, -1471, -808, 1513, 1566, -918, -973, -50, 415, 1298, 1097, -1031, -1878, 573, 1529, 327, 65, -524, -1208, 3, 1820, 220, -1255, -317, 283]
4140B83o4Q54r42k225O05K701M15j343q32j058k37L111J578k905j812Q70L49J346
4158F94J067j743k157J138J789N42q86o78j823L98L031J089k445j314L02k55J783
4175E32J465k005j864J245J296l77L34p11j535R62K458o80j746k09l6K55J980
4192A364N50k528j211J609P85M02k53j549j000K012J802j273j928O58m25R61K216
4209B192p89k314o16J268R11O49K39k484o30K202Q30j270l01m29q05J555K315
4226B523j543k552N40J052P12Q41l13k082n56J364Q66p4j76j243q10J914J460
4243A923j815j208N90Q41M9J151j127k120N95J658L98l46j61j189o30K437K37
4260A283k219j30J001oR31N63k147j662J571K131j13j90j414j571Q91K482l30
$$ y = [283, 219, 1073, 131, -2094, -1489, 1212, 1627, 284, -548, -1606, -1843, 1268, 2846, -59, -1871, -1001, -652, 694, 1761, 18, -2139, -1001, 788, 1330, 444, -234, -2057, -1659, 1372, 2461, 16, -1298, -996, -1251, 532, 1997, -8, -1872, -627, 669, 292, 626, -85, -1620, -658, 1800, 1120, -626, -835, -871, -616, 1364, 1914, -614, -1825, -216, 569, 971, 718, -831, -1831, 181, 1983, 710, -1218, -560, -985, -24, 2192, 1403, -911, -1527, -259, 652, 1301, 1540, -944, -1574, 628, 1458, 188, -113, -542, -1347, 208, 2523, 980, -1572, -1032, 20, 732, 1573, 1260, -822, -1378, -14, 852, 778, 602, -641, -1451, 463, 1923, 108, -1100, -510, 331, 380, 1531, 404, -1716, -1121, 537, 935, 589, 428, -761, -1391, 1046, 1283, -936, -1066, -65, -71, 860, 1423, -724, -2386, -815, 1316, 1203, 1013, -401, -1972, -1081, 1401, 1071]
4277A071j567j28J93N6J018N80j956j316K127O16k09J21j286j196R76K354n58
4294H96j351J6k86J72J571j71k020J09J155N63m15L59j857m63K122J256j286o97
4312c27l26k51P92J812q10k032M67J431m67Q7M9j922K41K421N23j601m58m14N
4331g80J270J736j742j486M37N60lQ94m62j698K56K329J95j396r2r80J97J977
4349A212P47j598j595R08K21N24P57q23j591P60J548p21j95j02j192P79J836Q5
4367A560k062n62J090J1Q12N91j610j203J620L58l67J34m49q13P24J859r55j649
4385i11J18L24J070Q28j09k527p93K214J11n7N78r86j264J252J472j218j114N63
4403d49Q2N42Q52n00k062N39J376K07J37J9j226j123K274L99j381l66M00q9P56
$$ y = [1071, -496, -624, -431, -375, 643, 1223, -733, -2049, 78, 694, 485, 606, -680, -1876, -900, 1454, 896, -455, -439, -725, -553, 1018, 847, -1173, -1064, 91, 654, 239, 598, -1259, -1722, 400, 1656, 370, -327, -653, -904, -112, 1700, 890, -1142, -675, 756, 289, 376, 425, -1497, -1256, 1165, 1688, 87, -371, -785, -780, 490, 2226, 484, -1002, -565, -5, -8, 886, 424, -1274, -1018, 1311, 1506, 110, 18, -962, -765, 1212, 1959, 361, -1234, -326, -105, 419, 1176, 353, -1238, -478, 1070, 349, 154, 52, -1140, -361, 1475, 1560, -502, -1064, 26, 37, 849, 1440, -170, -1373, 247, 605, 238, 372, -77, -890, -166, 1693, 738, -911, -793, -469, 601, 1429, 1320, -1207, -2000, 214, 325, 268, 846, -140, -1404, -152, 1320, 102, -1012, -449, -367, 175, 1027, 527, -1535, -996, 380, 587, 724, 743, -483, -1606, 668, 1067, -314, -680, -280, -369, 387]
4422C87N15j163j321J414N76r7J84m32j178K24J954k16j306k2K00m75J345N46
4440A135j670q81J631N26k90J91r84j258Q66K086n56r43k44n88M95J925k77k055
4458h91L0J036J02K84k3j096p87J655J384j523l94P0o31M88J841n57j714k20P60
4477a86J85O12K31j631m39K324j38p52k22o92l79J643J385j562j597O26N98J89
4495A95J002m52j825M44J483o8q27j51p23j30K045P62j760j040N32M28N80J025
4513A520j642j376J125Q92l18J19l08j036O6K070K21j697n18K56K23J133O43j736
4531c63j394J454J299p12L46p58j168R72J671q40j017p7J09M53R09J48j925l50
4549a243J215L60L92m68j100r86K019J218j290j146M72m50P72J402m77k092K7
$$ y = [387, 902, -261, -1582, -168, 408, 311, 495, 63, -1115, -891, 1063, 847, -459, -481, -281, -756, 589, 1135, -535, -1416, 215, 741, 451, 642, -342, -1600, -734, 1352, 796, -147, -391, -979, -484, 1441, 1164, -891, -861, 175, 277, 561, 538, -558, -1345, 310, 1694, 171, -223, -153, -784, -296, 1545, 988, -726, -946, -186, -1, 611, 842, -789, -1228, 1096, 958, 206, -16, -708, -1087, 556, 1941, 379, -1218, -592, 6, 195, 1197, 745, -1080, -636, 847, 779, -48, -199, -922, -1052, 993, 1755, -5, -1045, -513, -85, 495, 1520, -122, -1498, -373, 519, 201, 320, 12, -1024, -958, 1112, 1333, -364, -882, -626, -403, 730, 1373, -363, -1757, -303, 996, 284, 630, -128, -1296, -324, 1347, 507, -510, -587, -478, -25, 884, 1032, -893, -1243, -28, 332, 724, 256, -844, -1830, 189, 1407, 117, -1029, -557, -1007, -235, 1167, 690, -1402, -1375]
4566a375J695R3K76n00j202m56J644J273j243m01l04m68R84J658j552j600R62
4583e16M46L43P65m10j728R5J474L94q48j36o03k51J671J003j938m65M83M24J92
4602C95O08j455j192J220J314m25l93K40j435N53J927j37j711k74K64M65O10Q07
4620A381j715j437J484J496n76k82o23r30O17K028m76j462j49J22L33J011O46
4637A468k033p35J301M28Kl6j136r56J576J447q14j279j07L78M02R52k8j781m7
4656i98J300K79m90J61j287m00J474J279j032q21m98J88Q22J511j442k051J235
4673g70J190Q7J64k46j675J58J807L90j353k1n70k94J670J111j502j554O46Q14
4691E2M59N84q51j844O00J869Pp74l97l93L28J157L68j648j34M87K25K07M18p32
$$ y = [-1375, 320, 413, 689, 189, -1013, -1469, 175, 1448, 205, -196, -500, -968, 16, 1674, 122, -1478, -516, -70, 273, 1038, 628, -1100, -1005, 469, 863, 15, -121, -724, -975, 696, 1699, -239, -704, -221, 203, 395, 1003, -452, -1644, -424, 890, 465, 72, 312, -1123, -570, 1357, 1220, -491, -765, -501, -36, 574, 1381, -334, -1771, -287, 1209, 633, 351, -272, -1202, -585, 1443, 967, -495, -644, -522, -189, 822, 1468, -565, -1300, 1, 429, 431, 395, -741, -1697, -121, 1326, 512, -767, -874, -496, -94, 858, 830, -951, -998, 302, 581, 91, 252, -1035, -1435, 39, 1318, 286, -535, -1033, -845, -23, 1488, 46, -2005, -770, 420, 507, 671, 425, -1250, -1092, 715, 1105, -248, -269, -839, -1133, 537, 1648, 146, -1408, -762, 52, 511, 1095, 244, -1600, -1000, 869, 876, 102, -295, -688, -360, 797, 1165, -483, -617, -130, 95, 302, 720, -12]
4711a2j395J264J477p48m93j97r93O43J654m44j335QL48K49P55L17k098l53J347
4730fQ45j06j29q10q20N68J927m17j525k68M73L88J193o07j768j16J778K17j78
4749F39o7o54p22R46Q18o84o56q8O1K52J430n60j436L3J045K72j04l96j013k21
4769a105J813N19j565m08P07l58N89P89q24j229R85P46o90L62l16j446N61K010
4787A140l25j042j15l82M27J225K19j434q53J062J75J0K64l15j277P51J144k41
4805D33n28J6q86M40J342J8j375l84O62K4P51K38j068r62J441N11r94k4J04l98
4825f39P69J041n44j345N49J83j60N82K85j550J01J026M40o12l97j84m04J373
4843E14P62j409r66O90M73K72N71j57j875L47J254K88n04J32j148J08J562K22
$$ y = [-12, -1407, -143, 1334, 586, 93, -104, -1097, -454, 1200, 756, -579, -571, -223, 26, 781, 1098, -1000, -1353, -6, 839, 733, 604, -206, -1026, -458, 1469, 1052, -473, -741, -268, 120, 1313, 706, -1062, -1178, 600, 817, 639, 572, -82, -804, 142, 960, 276, -380, -468, -407, -155, 1275, 715, -721, -688, 357, 629, 525, 129, -884, -1105, 708, 1227, -338, -746, -39, -397, 192, 981, 157, -1072, -87, 659, -31, 331, 15, -1431, -870, 1140, 815, -227, -342, -724, -297, 928, 1147, -287, -1140, -78, 97, 107, 371, 56, -1221, -470, 674, 433, -95, -79, -965, -525, 817, 835, -540, -924, -262, -238, 513, 751, -317, -1279, 162, 673, -321, -345, -241, -639, 130, 1171, 627, -718, -169, 14, -146, 436, 721, -829, -728, 298, 738, 126, -271, -455, -859, 514, 1276, -133, -1099, -409, 64, 336, 907, 750, -1125, -778, 476, 764, 260, 392, -756, -648, 914, 1136]
4861A136j386k64L31n6Q75O94j170j246P47P70N13l92k49q17J41Q38J1n64l3k1
4881a42k30P58P01j642m20P89J049m67j78m72m05O62O68l66o86L29n58L43J503
4900A236p16j119k67J412L27p07l09l65p72J362J301j089m67k28k94K35J558p49
4918C49j193J91P68M2J97o2j275M2J262O44r05l69m89P3Q18Q98r32n16k14Q14
4938A43j51J04k02j083P28J352k96j036J71l01K74J118K96j125r19N33L76M01
4956C83M62j408n60J034Q79o04k45n18k31M09J525Lj288m24L18K18N96N73j457
4975c35q03J153R71n14n42r3o22P92J296o15j349J05J66M32J046P2j611m53J083
4994A79R8R3Q1n65p86J079O99o82j053O02J79K19R84o30j058j15P49N74N2m57
$$ y = [1136, -250, -514, -183, -239, 636, 1330, 160, -1086, -339, 431, 944, 552, 303, -514, -373, 465, 476, -88, -121, -142, -372, 386, 1087, -555, -975, -186, 863, 396, 218, -254, -659, 3, 671, 305, -381, -52, -610, -267, 1236, 520, -599, -866, 546, 873, 166, -143, -508, -1280, 82, 1383, 294, -173, -401, -695, -460, 1098, 349, -844, -653, 115, 157, 354, 292, -983, -941, 321, 965, 60, -309, -798, -725, 93, 991, 59, -457, -671, 143, -8, 96, -106, -1189, -461, 891, 595, -441, -270, -571, -297, 821, 1117, -8, -927, -394, -18, 383, 845, -563, -1123, -89, 790, 186, -59, -577, -808, -399, 1126, 1129, -159, -583, -265, -47, 549, 1122, -335, -1138, 15, 986, 472, -70, -163, -785, 7, 1303, 688, -661, -556, -390, 42, 1088, 1160, -451, -904, 179, 277, 370, 451, -114, -900, 179, 878, 196, -857, -255, -76, 143, 1127, 497, -561, -676, 73, 647, 699, 242]
5014B42p92m95J515N25r31m89K10K55M77N95j075j249N62R53K65K32o84j150O8
5033i66J151N54q06k35k53l17J360P35j394j031Q08N41J33K99r53o27M39J152
5051E90k54p4m98k30j96J177M43j773k26R77L39mJ36r66o48R35J156l95o37n30
5071f78j61P43J054l01j306R6O08J02L50J58j445l78J271N81q0k89j228j69J130
5090E8J112p16r49m0M81J75O14m58j170K69Q79N39n15m93l17j94J267Q10j003
5109C49j022J75K42N51N84n73q72J30J034J18k83m83o20N03J144j70q38n83K53
5128c61J08R36N44j159r72N52R22j02Q1l38r70K94J533k91r92k70j50L47J417
5147A129r7j320n88O23O66p6L82q81q29J149O31j60j014j55R1L25J303m03j707
$$ y = [242, -550, -1045, 470, 995, 64, -425, -215, 40, 517, 1112, 37, -1212, -650, 303, 568, 800, 116, -1034, -966, 185, 739, -67, -302, -555, -872, 488, 1223, -171, -1202, -394, 147, 280, 579, -374, -1001, -562, 590, 336, 262, -236, -466, -662, 515, 958, -815, -1041, -64, 275, 271, 407, -559, -1207, -272, 884, 489, -148, -678, -839, -96, 958, 657, -649, -553, 55, 157, 507, 665, -780, -1158, 113, 694, 614, 325, -903, -1072, 58, 1170, 454, -495, -535, -54, 121, 735, 277, -893, -624, 255, 794, 279, -214, -531, -725, 542, 1352, 349, -673, -498, -256, 295, 879, 306, -566, -436, 598, 716, 433, -50, -670, -167, 977, 807, -31, -614, -361, -253, 683, 1227, 68, -904, -352, 570, 468, 549, 211, -759, -465, 1068, 777, -215, -485, -635, -288, 1129, 1032, -288, -876, -253, 413, 337, 719, -162, -991, 158, 789, 629, -385, -540, -449, -124, 1179, 776, -931]
5166i31K84N70J71P10q4j456l82J036N83l47k17k14m13O26R70p53j270O10K77
5185b30N1Q98m75j117j05J154P10n57k93o71n6R45N16q69m90N9K70M48M84p68
5205i6j002M29J152J1k27l85k39n30J545K82j209r4M36m3J33Q30j315m38O23Q56
5225G19l58J05k37r03O9J193r6p46j16J51K12J98O04j125l35O74O21l11K38q79
5245c22m41P06Q04m75l12j09j62J67R44l3j056l55O64N82j07j24o32l76J160L87
5265I10n85m46p0J67J29J025p36j045q4J038k11N53k88j035K13R72N17r27l18
5284b21k19K42N26K26o78q81P25K71K32M01k67j064K67J011k4o41k5o09P5J308
5304F55j9q18m08J51M33M88J68q62n09L77J069n50j85q3n96K84R00K11j192k22
$$ y = [-931, -647, -77, 94, 804, 720, -736, -1118, -82, 501, 154, -63, -277, -690, -64, 906, 153, -1117, -507, -230, -179, 719, 244, -873, -978, 176, 886, 329, 36, -635, -691, 254, 770, -99, -589, -530, -260, 188, 672, -96, -1098, -669, 483, 494, 267, -118, -357, -887, 658, 940, -269, -363, 73, 30, 163, 993, -322, -760, -137, 719, 361, 466, 229, -674, -605, 588, 492, -254, -370, -219, -7, 191, 795, -330, -665, 9, 630, 319, 557, -322, -763, -57, 747, 272, -40, -149, -311, -144, 800, 767, -289, -644, 20, 602, 495, 371, -261, -637, 523, 910, 325, -121, -191, -24, 105, 1130, 394, -651, -735, 303, 92, 645, 357, -678, -465, 507, 1024, 97, -221, -440, -198, 328, 554, -124, -1005, -280, -9, 223, 624, 357, -707, -440, 571, 547, -94, -119, -728, -653, 655, 636, -182, -590, -439, -6, 482, 650, -212, -721, -344, 725, 175, -10, -93, -689, -405, 495, 706, -486, -708]
5324g08K12M78M17J17p00q30R99O70m39l08k83j71M27N75m73n87M18k6J82N46
5344E16j3j172J24P10L04k45M00j204j74R47O77m27j157L12M31k0N99p12p45L40
5364e09O40K05O0j18p12l51J154M30o56n04J94j57M63P88p97r23N00Q39J9p3l98
5385I4o90K84P46j80j97k64j40j79J039P8r87o30P68N36j07N06p34n60L75J040
5405G98n42m52J85n88J43J244l66j065L1M94L14mK4l93l61O19Q38m36o94l32O7
5426d76O00Q09m75j193M21L69J39M10j85p81m57J003L49l33l79j99k81P83P65
5445H89q26p09K98L87j76O93p4j314N5J066K86p83j49n7J18N33N70j000j87K2
5465c58K15M20K82n49j041P78Q03j40l64l15l83L21R91m35m59k92K34J37O53J84
$$ y = [-708, -496, -18, 399, 516, -184, -1014, -15, 655, 216, -92, -375, -546, -119, 456, -17, -604, -186, -212, -30, 516, 503, -669, -545, 165, 469, 224, 624, -580, -754, 193, 870, 443, -714, -402, 29, 9, 608, -104, -849, -509, 131, 336, 396, 278, -434, -785, 369, 799, 143, -361, -167, -324, 139, 927, 130, -793, -293, 546, 565, 492, 94, -596, -312, 434, 254, 57, -207, -347, -526, 513, 591, -396, -1026, -258, 278, 171, 677, -57, -617, -242, 798, 256, -196, -11, -599, -456, 788, 422, -643, -612, -118, 196, 192, 216, -177, -538, 81, 919, 483, -211, -543, -476, 124, 933, 458, -735, -314, 55, 194, 604, 419, -362, -819, 184, 533, 200, -179, -378, -659, 124, 889, 63, -646, -348, 39, -137, 556, 482, -832, -777, 289, 575, -208, -357, -414, -296, 237, 807, -193, -380, -358, -143, 277, 559, 10, -1031, -253, 550, 410, 46, -269, -652, -331, 660, 225, -234, -526, -292, -155, 498, 682]
5485F82j090l48N04P78j81n8l31q46P13Q92k07m23n26L32m3Q64l85p94l41J221
5505D13k41J20J52n77l42N96O21m56l33p9k2j08J214o38r47L72L44L07J0k7p70
5526c91k84J090K97r42J36l85P1N51M97p68n16K47M67J10N29n65j165L64J209
5545E52k6m73k59r6j10R08O4p04o62K08K45O72J36m96r05L22J101l5j74m41k48
5566d21L11O86J34j381J23N20K62R7k5n39n16J023M04o60K36l17o40O16Q45l45
5586D13p99k32M82j7Q80j81j299j53P78P09k54l90k04o29R71Q80p15n23N3k60
5606d90L79P64j05r71n0N18L38J99o75m51k11J004N88n66n47J14r4J79M88l94
5626A7m27JO94O1O7n64l37m0Q05K59l54l50J26k18N73N90j014o75L42R33K24j87
$$ y = [682, -408, -756, -252, 526, 345, 287, -44, -890, -177, 715, 508, 85, -441, -109, -152, 712, 327, -467, -808, 413, 172, 292, 444, -133, -475, 121, 742, 286, -47, -126, -148, -256, 958, 320, -627, -255, 89, 396, 406, 379, -391, -675, 415, 712, -230, -94, -479, -408, 143, 640, -128, -644, -397, 70, 180, 709, 144, -1021, -657, 552, 526, 53, -206, -302, -412, 496, 560, -144, -806, -598, -353, 319, 455, -41, -946, -624, 477, 442, 268, -173, -421, -110, 576, 710, -671, -548, -28, 234, 331, 306, -233, -749, 274, 678, 18, 254, -63, -703, -87, 758, 413, -386, -618, -136, -153, 727, 546, -753, -906, -128, 581, 327, -63, -267, -896, 75, 955, 240, -283, -230, -490, -111, 653, 548, -423, -473, 45, 383, 582, -93, -544, -755, 249, 837, 271, -276, -162, -256, -77, 411, 17, -410, -409, 285, 346, 413, -151, -488, -528, 277, 536, 182, -168, -42, -260, 313, 903, -111, -786, -444, 489, 713, 526]
5648E26n73l25N05L35k63p1k08k15J13O88L18j113m34M08K00L48K09p40m41M94
5668b39R10n84M3J14r48M95Q52n09m34K10Q7k09J20L80n01l98M36O43k03j31o46
5689e12k20P86P44q56p46O07K42j65K01K95o23j98O07J3j34k6j75k39M50P22r89
5710b16j9m9r1N55N57l95j117L62R32l78k47k4j76K07L47K69n85l07Jq9Q42K87
5732F66o60o51O22L88m13J45l7o09K55P26m60l96J59L53j16M63L23r80r9N49m95
5753b67N88N9l03m53K56O11j9p08N9j58M46M57n71n18OM70L09j8J19j70o76P51
5775B70K97j99j53m90M0L80O95l01j014Q1M89J28J69n57m60L02M69L9j25J39j35
5796F4l89L31L85l32o16N12LJ19L74k47q55M44L34J40m04J57m96R1Q07k31m58
$$ y = [526, -47, -372, 133, 468, 205, 134, -74, -289, -176, 512, 830, -283, -717, -309, -109, 239, 448, -292, -733, -239, 671, 87, 130, 244, -704, -209, 643, 134, -300, -90, -3, -212, -92, 288, -213, -611, -175, 468, 265, 134, -512, -732, 54, 798, -58, -804, -197, 45, -120, 81, 376, -247, -445, 162, 175, 41, 15, -160, -399, 51, 773, -216, -235, -284, -375, 180, 737, 342, -775, -413, 519, 141, -106, -130, -306, -99, 248, 517, -68, -375, -374, -463, 379, 666, 6, -645, -23, 365, -48, 97, 60, -549, -294, 432, -28, -424, -265, 88, -28, 435, 758, -222, -321, 228, -267, 321, 380, 77, -376, -120, 491, 472, -236, -177, -335, 111, 568, -3, -521, -515, -45, 264, 246, 365, 195, -481, 270, 567, 368, 215, -275, -235, 145, 840, 539, -475, -394, 95, 223, 392, -165, -625, -323, 146, 185, 60, 199, 64, -325, 6, 391, 59, -557, -45, -42, 77, 451, 204, -651, -207, 127, 267, -137, 20, -476, -385, 422, 191, -267]
5817b67L6J27j9J22L52o47n81J021J88j60l07J33o14L80N56j51l91K37j75K58
5837I8K30l09l10k23J95N49Rl67P8k03j86Q02j29o11M6Q7N3L24K38r51qN36M37
5860C85j27k5l74k36M34K36j42j94L5k50J46O10n75m18L01L11O2k21J25n44R7
5881c64R08j46l78o8r1k52P35M05l68p44J68L95J27r1jm82J8O04J97n30l33J97
5903i4j59P78J30q80lK96LJ00L02m73n20K92Q43l36k15k84k71M91R95r28j77m85
5925e95O81j17K87L97j045j85P49J16j65m37L67m69K10Q39o04m11J77lpQ32l94
5946B23m27m26O35J20j29L6m16k6P11K39m47r22Q28l8J21J52k63l73J20K82M45
5967D45j81m7j054L54Q48O2k58n11K5K02K22P77q78n32L28L87J71m46K18p47J91
$$ y = [-267, -231, -104, -123, -1, 351, -296, -877, 144, 332, 172, -135, -2, -616, -236, 320, 169, -222, 15, -160, 98, 328, 19, -291, -514, -319, 230, 239, -128, -50, -253, -439, 363, 234, -377, -331, -244, -191, 133, 371, -580, -588, -52, 385, 258, 233, -141, -377, 57, 293, 151, -43, -8, -258, -112, 498, -77, -495, -194, 117, 179, -42, 83, -461, -364, 544, 398, 20, -48, -139, -391, 344, 749, 381, -363, -195, 200, 327, 236, 235, -247, -229, 375, 572, 42, -291, -94, -253, 525, 655, -225, -228, 68, 71, 171, 473, 0, -520, -228, 615, 279, 64, -220, -491, 0, 995, 67, -110, -595, 86, -31, 256, 653, -392, -577, 172, 288, 123, -314, 53, -416, -206, 633, 29, -382, -205, -208, -215, 617, 223, -204, -630, 5, 125, -4, 32, -384, -410, 301, 540, 93, -829, -1, -39, 82, 234, -29, -402, -282, 0, 445, 264, 217, -837, -483, 365, 427, 169, -342, -317, -115, 107, 884, 6, -526, -198, 189, 360, -86, 132, -615, -424]
5988d24Q58jo42J65m05J66P01m6m60k64K06M17N3Q0k81p69N30Q46m22j88j96k12
6010b88M83O1M08r46j31J79L32K32n9l03j036J276K93m6m22j72j09L06N59k97
6030C20m97J71J90j7o3L78n84m07M33L47p7J42l05m70O39L01o45k94L4M34K51
6051B81L78n84l22J64L06q8j52J54n39J6O23L43n86k45o6J74L42L15m93o40P84
6072A65J02j3OJ74o09j73P20j28n50K03k04L54M01m5n32k46L62m1L14k7j82n76
6094e25J45L08M84l20k87k0J33N29j93m41l43N77j31Q9M6Q7o15N57J73k60l94
6115d01K36j2K06L99k44m83M0Q6N9L92K29o93p04R40O99m37j41k88k91N90J65
6136C47j84o42K78L49r7O8Q3l33J11L45O7q7j56k71m6L66L73n96n54O21P0P5J89
$$ y = [-424, 434, 433, -209, -44, -449, -283, 418, 372, -88, -352, -146, 271, 324, 404, 123, -646, -116, 730, 308, 120, -76, -288, 195, 256, 664, -282, -413, -234, 98, 330, 271, -32, -1068, 208, 501, 455, 33, -139, -248, 58, 617, 320, -177, -6, 184, 167, 104, 482, -102, -509, -76, 271, 194, 336, 31, -439, 200, 501, -144, -438, -404, 30, 281, 659, 75, -247, -83, 223, 135, -17, 137, -402, -386, 237, 580, -6, -251, -317, -143, 199, 514, 21, -619, 165, 267, 254, 260, 434, -175, -348, 372, 244, -306, -103, -307, 47, 448, 403, -129, -375, -13, -54, 260, 233, 51, -525, -380, -72, 412, 92, -195, -215, -82, 447, 254, -187, -530, 47, -84, 5, 51, 138, -477, 80, 253, -7, -401, -165, -177, 29, 428, 184, -299, -259, -173, -114, 278, 507, -186, -890, 50, 749, 312, 171, -117, -408, 182, 347, 163, -479, -201, 148, 51, 119, 202, -131, -20, 325, 392, 305, 149, -122, -168, 198, 571, -25, -579, 42, 112, 187, 376]
6159C76o30k60L37L99j2k30J92l35n36J360J7p68j69K68K06j51K19l22k16N0K72
6180F7r1J23j77k62J97N43l01m54J46q4L40M05O6o76j41K62Q5q0L96o33j00M0
6202c29O27k46k17K6n3K68K17j50n26n6L50j1K48L72p24rL59K38l91L32j97l68
6224b40K54O63n83m89R0J80L10j17Ml03j36O30j00j62k48Rj56N25M94m77p28M76
6246a04L12K81m91n3m91L81M37k72L6p5k12J07O11M0p06j01L10j97K10M49j59
6267C13m95K20R4j45k82J0j21L6O15l13l5l1J91K02L11k73n79j78N23N04o69P4
6289b8J45l55J33M09j77k56J64M06l79J90K2p65M56L08P9l64%j18k13M23M09n34
6311d5j90R6j93j6O67k12K2o68O73q0k17N3j6j18P18j19k87k42L00j03K12N9m84
$$ y = [376, -254, -514, -177, 222, 210, -20, 172, -163, -699, 661, 678, -90, -259, 9, 215, 64, 283, -39, -255, -205, 67, -24, 99, -78, -340, -143, 400, 99, -355, -209, -293, 47, 452, 518, -158, -299, -37, 48, -32, 364, -269, -369, -329, 298, 52, -165, -139, -192, 76, 293, 143, -383, -439, -89, -100, 148, 520, -204, -213, 146, 384, -7, 325, 128, -240, 14, 677, 94, -395, -305, -125, 185, 68, 72, -231, -367, 263, 163, 1, -247, -238, -394, 131, 625, 148, -580, -104, 208, 489, -2, -55, -546, -165, 272, 0, 36, -39, -251, -144, 467, 507, -199, -300, 10, -187, 23, 472, 313, -182, 38, 132, -13, -295, -285, -406, -370, 245, -68, -103, -134, 57, 259, 570, 297, -282, -460, 63, 567, -102, -28, 117, -238, -105, 304, 127, -129, 35, 441, 62, 252, 274, -491, -35, 273, 352, -12, -12, -130, -343, 80, 489, -45, -235, -139, -332, -348, 319, 107, 129, -539, 134, 54, -163, -110, -126, -244, 474, 355, 68, -174, 126, 23, 235, 294, -190]
6334a90k86N14L44n49L34k32m82K52N21l69J65l14l9R3L98K17n98j37L25N1J78
6355A96m7j96k13L91J34r4k60j07J48lM97p2l75k48J34J62J6K5n22j73N61J55
6377A09j46ol43J06M09O6J8m43q9K43N09r0j90l48p0P18k85l07M7M2l41L68M39
6400D16m02k62j16N81k4J19k24o05K18L50J61k16Oj51o2L89p2j22m70L01q5N62
6422B92J18m24n61N08P8K26j30K9k65J8M16L9k26m18K67k55P77N0o61l46M16L32
6444B80k93J10k06j63J06M77k05L6l3k06L30nj45l20k41L50O8L18J53o59l20O38
6466G0K7R6k00l25j96L39N21n21l3m2j14L61Q6np44L27M50j4j48k01j50J57N32
6489B73J36o56M9j46N38l09N5L44o00J23L22K38l99j6j14J1J38L17l04m85N94
$$ y = [-190, -476, 38, 382, -167, 167, -65, -547, -295, 226, -143, 22, -292, -331, -238, 160, 377, -221, -358, -33, 18, 196, 149, -47, -260, 131, 265, 171, -89, -196, -48, -51, 446, 374, -1, -249, -115, 47, 63, 88, -434, -607, -46, 109, -37, -43, -386, -280, 129, 195, 213, -230, -319, -76, 433, 343, 153, -195, -265, 453, 168, -139, -92, -50, -391, -23, 416, 14, -248, -364, 217, 193, 312, 88, -517, -299, 51, 212, -4, 2, -149, -211, 178, 106, -16, -486, -185, -270, 292, 410, -14, -575, -67, 11, 237, 107, 136, -129, -111, 305, 344, 118, -300, -33, -288, 489, 539, -122, -468, -52, 280, -13, 97, -109, -272, -166, 311, 106, 142, 109, -97, 233, 228, 83, -237, -478, -128, -60, 258, 411, -248, -568, 70, 97, 193, -7, -332, -528, -189, 332, -189, -222, -264, -378, -17, 69, 64, -680, -353, 97, 83, -65, -266, -416, -259, 273, 409, -247, -198, -344, 194, -115, -60, 284, -316, -193, 129, 367, -32, -48, -162, -151, -13, 304, 0, -485, 109]
6510A09l80L64K50k56o38K03P19m39j3k44k65N03N94j72j93j79L7j17L70p9k11
6531c7m3k00K79K06P4j56k88J12P28n26On35L88j45N16l9n60O8J45J17K3J89m81
6554a59rK84Q88j075j4j50r0K93J34j3j09k54M18j34Q8k44k04M6M05N31n64k67
6576a99K42k80L73J55j68n70K61M65j19K20j71l43k84O70l8j02l7q4k4N7L36l41
6598A9l30J93o8P5K84r8m67K30J41N79m79l10N9K06J47p1k05p9K86j60K51j2k27
6621c6l32m0L76K37k38n2l02L32N12l60m24L41o6m3K44K3m25j39O16o4J12j77
6643I5j07l35J98L99k91l23M01r3j04P56j82o38j19N49p4j52K65m44l25M67K39
6664A82O1k82M0j4J26K00k9l13k2K43m54L82r9l26J16L79J98p27J96K21K7L97
$$ y = [109, -271, 93, 343, 87, -551, -348, 371, -68, -81, -325, -590, -87, 507, 335, 142, -37, 0, -117, 253, 174, -37, -80, -280, -1, 205, 279, 123, -165, -53, 675, 149, 155, -380, 8, -137, 379, 340, -220, -152, -7, 110, 133, 322, -159, -168, 116, 1004, -71, -85, -235, -325, -32, 102, 89, -20, -274, 144, 10, 98, -146, -350, -304, 101, 632, 68, -199, 43, -237, 136, 291, 123, -447, -186, 279, 160, 380, 209, -134, -418, 252, 214, 112, 75, -9, -33, 24, 360, 19, -311, -118, -186, -111, 173, 75, -392, -162, -21, 558, 79, -231, -172, 34, 181, 110, -95, -174, 112, -48, 203, 191, -36, -368, -408, -32, 205, -33, -85, -387, -55, 457, 97, -327, 14, -52, -95, 149, 172, -253, -392, 224, 160, 272, 95, -12, -347, -149, 250, -41, -364, 37, -56, -160, 596, 414, -224, -343, 206, 132, -20, 245, -199, -524, -57, 182, 243, -39, 1, -13, 113, 313, 284, -29, -51, 192, -262, 120, 21, -305, -189, 190, 388, -339, -143, 78, 105, 502]
6686E02l04k79m7J72K2K3j4r5j31L64l57L01k32mJ99RJ24J48o59pR6J13r4L83
6710B33l6l80J44L87Jm39n7L30m01O24j93o37K60m5N10k40k6j5j61K15m8k0j19
6733a13J1J55j18L14k66l56M86J25m52K47o7j75j29L10L10k19k25j45R5L34J05
6754B27m97N4J19j12J11J44K31n19o1L36K76j72k05k89j2Q06k04l40j60P5m1O18
6776C85J1k50l66M81J70l00j79J7l78J98K98K23k57j6k30J51J91n8k46J34J19
6797I8J41j63J9k42j52O18J2j77j31j54Q5P6J88l3k74J39R2K87m56j52J05J22
6819D8J13K72k44k43j47p6O52j01j16m36K37P4p6K70n7j44LM63m07j67R4j88J71
6842eL4K90j03p18J96L89j61K82l66l04L33O84k19R2m07m31J42O49j09k66l24
$$ y = [502, 198, -81, -128, 44, 66, 89, 75, -20, -151, 213, -144, 157, -75, -79, 120, 129, 253, 401, -258, -265, -169, -56, -150, 233, 197, -183, -39, 348, 349, -90, -147, 183, -218, 406, 213, -424, -164, -209, 301, 61, 35, 20, -141, 74, 26, 6, -113, -102, 53, -65, 249, -17, -373, 113, 238, -214, 33, -34, -209, -338, -28, 282, 63, -162, -307, -212, 122, 227, -270, -216, -97, -209, -98, 46, 277, -242, -303, 33, 309, 137, -68, -357, -369, 437, 233, -107, -267, -192, -233, 385, 396, 146, -220, 261, 431, 131, -48, -31, -409, -211, 87, 310, 53, 37, -193, -42, 149, 91, -155, -21, 98, 239, 76, 95, -147, -299, 319, 331, 154, 23, -131, -46, 30, 218, 185, -89, 50, 142, 429, -27, -179, -74, 48, 161, 433, 189, -54, -201, -277, 375, 274, 158, -278, -41, 33, -43, 227, 170, 26, 29, 492, 85, -82, 12, -176, -5, 29, 319, 216, -502, -306, 83, -78, 204, -162, -466, -133, 551, 332, 424, 17, -414, -272, 377, 268, 2, -322]
6863c22J12K7K29l1n43J86M41J69m64K24j67Q9j19M14l04n8j03K19O2J92O7n89
6885b69m1L57J3J2P2r2j21K60N9j54j5j92J85L9K03j03j66k67K7J76K23m3k07
6908d4j22K00J71P7k24k35mL55M9j88m38K63O4j59M49r4m41J37R9K33l3l98J70
6931a13j22L12L02p23N7K38K81n5N2k46k80L9L10K39l39j97J67J3L17l5j16J02
6953B03j46K41m83L67n92K13L21N71k84j67j68l10O42l30j06j9q2NJ88j36O3L23
6975C14p47L72N01l10Rk45l57M17K42r8j44k28K68J63l58N29n99R6L04J14l33
6996i0q8J96j81J01N09o50n6k37K32L13j54M29n51J11M15j99J07k91J43j27K52
7017A84K08n89j02K98J8J28m7k28j88K95P9K12k27K4j33m9O05o25R8R9j15j02
$$ y = [-322, -210, -183, 46, 15, -528, -342, 99, 268, -196, 28, -139, -50, -169, 245, -59, -117, -220, -1, 61, 253, 320, -269, -310, 47, 60, 72, 144, 52, -69, 191, 250, 96, 81, -111, 74, 113, 316, 213, 47, -220, -193, -17, 206, 163, -44, -166, 34, 205, 282, 58, -177, -181, 174, 223, 35, -403, -140, -76, -235, 214, 120, -321, -184, -85, 148, 115, -283, -113, -235, 77, 379, -344, -287, -49, 232, 177, 229, -17, -297, -258, 52, 291, -48, -245, -78, -65, 252, 217, 101, 203, 57, 298, -185, 182, -410, -197, 124, 695, 411, 244, 76, -234, 408, 78, -28, -47, -129, -124, 64, -72, -9, 314, -433, -61, 440, 130, 139, -106, -463, -46, 196, 98, -46, -274, -6, 157, -201, 328, -271, -175, 129, 243, -90, -178, 18, -163, -62, 447, -203, -259, -496, -264, 49, -105, 324, -227, -116, 299, 100, 207, -84, 59, -68, 184, 392, -197, -299, -1, 17, 145, 98, -130, -318, -23, 56, 268, 41, 65, -68, -117, 488, -137, -39, 60, -55, -157]
7039a57L39j46m48k9N15K82l32O8l52J40L8L51j76qj04k72M01l1P9J05l50L79
7061B92J9k75J85m07P0j6L19l70P0J00r5N68K6m64k86K6J07J17L72m40j0j72K61
7084cK8qk44j86M31P8J08l00L1P0J38k33K43j91m2k8pJ79Rj17k9J27J74%m62J55
7110g9K33j09q2L93k50m13%O29j55j48r0J22R6j64K19l63r1L93k14J87kl28J21
7133i5J82k15n4J62jR4J4J03m37k26L94J72j26J75j5m24L28O0k33K23j09j29J65
7156Hk2L41l15j74J04r9L9J29j94J52N1k07J40L10j1n59K61M5N11p56J79J82j76
7179f1L00j7L5k44q5K44Kq2j4j83n8N74l14n1j40n6J51Q1K32l67K1j8r9M46k46
7204E1O9k03L02J84k61j71k02K62J2K82j48m61L81K59k07K69k7l47k50J93q7K72
$$ y = [-157, 182, 36, -412, -441, 74, 356, 24, 92, -260, -120, -82, 269, 93, 85, -19, -291, 110, 79, 158, 263, -87, 292, 311, 36, 221, -186, -116, -132, 187, -183, -113, -13, -108, 460, 486, 22, -264, -238, -131, -14, 358, -82, -92, -264, -3, 25, 17, -227, -413, 18, 96, 204, -96, -65, 5, 143, -90, 153, -38, -80, -108, -115, 64, 73, -44, -73, 54, 228, 228, -234, -79, 154, 45, -37, 356, 106, -307, -307, 322, 167, 19, -71, 51, 147, -17, 202, -161, -252, 141, -73, 114, 112, -216, -95, 87, -128, -182, -20, -21, 73, 87, 190, -247, -473, -79, 93, -33, 142, 127, -297, 31, 91, -142, 81, -28, -157, 8, -14, 327, 12, -162, -58, -157, -118, 11, -183, -31, 20, -187, -47, 263, 252, -307, -46, -1, 510, -246, -67, 115, -61, 239, 222, 257, 13, -72, 172, 174, 92, 78, -105, -163, 411, 97, 46, -94, -150, 1, 82, 314, -53, -32, -50, -149, 297, 51, 120, -83, 219, 403, 142, -29, -231, 31, 43, 325, 177, -284, 97, 356, 149, 418, 391, 44, -206, -13, -100, 172]
7226A72k47j27K42O4P9J7k84j60L05k09K40Q6m60K50Oj75J33J87k71j0M4J96K
7249H0k23J74j1J38lj31k49K8L94p1J46k82j81N9K01J55j72k60K18l2J43j95L5
7272c9k51R5M35k93q8J31N4j40N15m36K78k85k16K13K3J28r7pm1J19k0J18m58
7295b62RJ84M02j16j01j26pK43j24L3p63P34k7l8P1rO0m78K35K50p6j84j02N75
7319C83j5qk17n54O9N84L1l4k83K14m30K63J79j42m8K4k75K83L79m04k85K46J72
7342A32K6L16n23J03k0q9M02l44p9j79J94L52n9m69K31J57m6nj02r1J5K18k13
7365g3J33j89L01n85L00M86m81J64p1n3J31J70k31P1k34K08M13m37J02m12KJN63
7388B79k13l12K16l23K86J77J1k61P9K00P9l43L30l57o4K60J17l84j33M50k79
$$ y = [172, -75, -202, 40, 104, 183, 200, -84, -244, 61, -148, 92, 178, -282, -32, -26, -201, -68, 119, -152, -162, -118, 78, 80, -143, 31, 20, 158, 155, 24, -225, -197, 197, 126, 272, -10, -191, -132, 69, 224, 52, -208, 10, -22, 121, -74, -39, -290, -195, 240, -53, -141, -10, 44, -96, 419, -17, 261, -24, -240, -27, -4, 124, 27, 20, -21, 98, 78, 196, -262, -253, -69, 333, 217, 116, -10, -17, 226, 102, 135, -628, 106, 79, 41, 112, 103, 163, -315, -80, 170, 94, -90, -192, 383, 368, 360, 143, -411, -342, 242, 273, 239, -44, 170, -260, 3, 182, 40, -8, 16, -259, 24, 403, -1, -286, -40, 132, 158, 474, -49, 54, 34, -55, 347, 3, -76, -255, -61, 291, 232, -237, -6, 151, 105, 100, -2, -93, -78, 140, -73, 60, -129, 172, -413, -113, 373, -108, 56, -15, -68, 63, 233, 2, 73, -161, 47, 460, 23, 125, -287, -285, -284, 279, 66, -246, -30, -353, -67, 110, 121, -140, -61, 139, 218, -125, 205, -152, -216, 44, 161, -223, -356, 94, -185]
7409a85J29K58j04j46r5J14J72j97K4J68m48K05R0K80m53J4J77J62o3Q2l10RK12
7432I5R3k90J93l12L95RP4k72j90K22p6N16k71k07P6j72P9J93j69J22j93J21K02
7455B38o4k18k0M3j37N87n51m7J39J71J11o7k83k62M0K4L62L4K15p7p67P26j50
7478D7J36k44J69l66J71J98Qm3j04K1Q0Q6j90j30K49k37K35p3j42L00r1l49K48
7501b1J92k21L1L57j06l93K08q4J59J5l1k81JK03j25L13j01l86jM14j60k3M3j9
7525a6j60K95l09J37l1N9Q8j02J47J79l52j0k4k7L84k79L8q2N3k19O3J26k3Oj08
7550a67L57o5m21K37n1K08j73j12J97q4K96k03k14J36R1q1m7J36r8k98K48J87
7572G9J46l25K46j86N4J37J33m22r3M55l32R4J7l9r8K70L8m61N17j53k29K81j70
$$ y = [-185, -56, 202, 98, -48, -143, -29, 143, -54, -30, 138, -310, -105, -15, 265, -188, -174, 3, 165, 102, 184, -126, -117, 95, 188, -102, 91, -221, 174, 183, 257, -15, -205, 17, -59, 457, 186, -21, 55, -117, -38, 155, -14, 108, -85, 36, 238, 174, -44, -64, -21, -158, 429, -122, -169, -30, 141, 252, 185, -98, -360, -320, -296, 66, 100, 315, 238, -529, 197, 47, 183, -61, 108, -258, -87, 111, 119, 76, -28, -7, 73, 159, -31, -161, 88, -149, 86, 13, -129, 171, 80, -269, -21, 171, -50, -19, 338, 232, -161, 47, -37, 122, 137, 106, -175, -174, 29, -96, 217, 116, -270, -271, 143, -17, -40, 3, -16, -176, 119, -190, -53, -84, -25, 63, -39, 108, 287, -65, -75, -99, -126, 258, -21, 17, -65, -12, -231, -168, -42, -65, -59, -167, 190, 125, -296, -59, -110, 98, -75, -187, 10, -74, 222, 19, -195, -59, 32, -49, -96, 40, -58, -356, -108, 79, 225, -100, 146, -40, 14, 151, 284, -138, -231, 224, -108, -14, 3, -36, -134, 136, 174, -287, 230, 77, -152, 129, -41]
7595d1J5K1Q4l66O5K82L85o76J29J56K07j99Oj63J79J50k41j26M9N5j44J50P7
7618E4J70n48M73k60K11O6k17J26o0k63L75k95M15m04RL48j26r2k17N18l61K29
7640A51k75L66l97N4J28J8j06N7P2l85N12r2k86n9J10J90j31K10k99L72j37j72
7662i9K23l9j0j47p1RP29o60p2M46m87M4j1K67l67J49K08l7R4k71k60J87K98R4
7686B17l5j42k24jK61K40l84l7L21j48o8o7j09o2K61j17J65p3k70M04m3l7j2J89
7710B29l22K1K49j20j54M0J57j25M49m69p8j31K60oJ5L4m27M52n22L38K38o04
7732d76M15j02K89oj41P9o6n8o0J67k66K31k0k29K96Qj10l78J17P2J27K27q4k95
7756b63L22L44m62Ll0j65J22K13l27M33n14K63K03m1j79n4p0K06P0qj03n2n4J92
$$ y = [-41, -26, -5, 79, -287, -222, 60, 445, -231, -102, 54, 261, 62, 68, -95, 84, 234, -7, -133, -84, -29, -173, -23, 54, 224, -324, 149, -111, 100, 166, -51, 75, 15, -248, 127, -168, 247, -157, -148, 200, 74, -18, -235, 283, -78, 151, -124, 242, -155, -101, 27, 45, -61, -4, 68, -317, 195, 103, -183, -242, -132, 58, -73, 137, -162, 210, 73, -99, 124, 85, 75, -72, -143, -134, 595, -65, -137, 309, -178, -134, -145, 122, -245, -96, 112, 75, 169, -102, -362, -175, 123, 217, 182, 40, -184, -185, 76, 316, -68, -105, 216, 68, 0, -67, -176, -238, 23, -94, 71, -2, -272, 132, 89, 52, 40, 229, -93, -72, 177, 57, -97, -57, 100, -25, 424, -45, -123, -254, 6, 0, 15, 49, -378, 74, -448, -110, 128, -476, -61, -163, 126, 120, -21, 58, -8, -66, -126, 41, -225, 6, -14, -243, 53, 61, -49, -427, -310, -238, -111, 116, 32, -263, 59, 403, -59, -56, -86, -251, -129, 84, -243, 190, -324, -61, 142, 101, -78, -132, -202, 4, 74, 66, -37, -89, -143, 49]
7780D9K1N0l40j77L80J48K2n4k15O8J79j45k9k68J86j50N03l6j42l49J7K93k06
7803a95J81K33m51o3M74Q8m15J34L1j35J03K34k15k48M30n52L18L79n8l08k38
7824b73N13j12p5Q1p4k86K60L93l27j37J56L5l41N05k78l47M39r8J01l56K40N8
7846G7L0Q5j31l73L80r3O7K45k61O4k38K21j27J19J2r2m7j24O7r3M0j27J9m2L97
7871G5J42n09J06J64K79k43R1k21k31K05J10j16K66K44o51L22p7o6j17K65l02
7892b64O37m13RJ32k33K64k3q3k68J79J29j65l4J60j04M23j73j84L55n16J19J01
7914D8p2J72k9J81k86O7N6o7P0k23K6K1P0n3j46K51j95N32m00j91K29q8J65k71
7938a33K10l79Q9K54J62l8k74Ok04N10n32O3l1K50j04L52j7j96J97k27P1r2j83
$$ y = [49, 70, 120, -220, -397, -17, 131, 153, 99, -116, -48, 131, -14, -43, -311, -125, -275, 228, 192, 50, -299, -282, 11, -195, -14, 219, -232, -295, 179, 267, -148, -14, 17, -118, -15, 219, 4, -244, 186, -366, -48, 331, 273, -35, -273, 240, 128, 53, 134, 60, -226, 34, 427, 100, -37, 119, 154, -187, 318, 40, -307, 132, 34, 135, -221, 19, 77, 107, 192, 61, -312, 68, -25, 42, 287, 26, 90, -148, 73, -54, 65, 77, -15, -62, -186, -119, -212, -172, -299, -280, -322, 75, 217, -292, -186, -22, 257, 14, 105, -116, -347, -142, -32, -148, 118, 362, -289, 33, -44, -110, -227, 38, -264, 373, -40, -31, 101, -132, 132, 109, 26, -242, -63, 66, -99, -133, 27, -77, 346, 173, -11, 344, -172, -53, 48, -24, 148, 119, 300, 14, 81, 137, 70, 140, -83, -57, -36, 34, -19, -165, 86, -109, 423, 23, -168, 61, -27, 138, -133, 77, -302, -213, 41, 203, 165, -109, -103, -307, 203, -329, -266, -297, -47, -151, 201, 184, -12, 185, -42, 29, -63, -246]
7961b46Lm1M53QP7n1k56p9m1M1K92J2q4k30K33k1o4K24l60J50J17J7j87J58k16
7986i1o4K01L3k85m2L35j20J72lj79k60L8J80j17J88j48K52k76O71n52N8k58L38
8009G1j68J30J92l30R1K09r8k07K55q2P3j59J27l58K72k88L59n5k26N10n97K07
8031g2p6K8K56P0n24L19l24M03k83J91n5P8P6l9q3l76J20K19J19M7J07n69K93
8054g5j3L8o0R5n5j38K71j68J69k50R1l6K66r9j59j65L20O0o3J40j84j70M7J94
8078E6K14k91k99M73j30k60M26j1l47L07k22K28k62J6j85J27J83l20J40J86J11
8099A40k87M59l91N7K12j65l2J71k15J42j93k9M52l71j79J70l3O8K64J23o35M53
8121A81k27K00k36l8j90L70m1M51l15l41K89o3M0j45J27j70M5K63k35l4Q5p2M2
$$ y = [-246, -243, -284, 169, 177, 254, 203, -53, -132, -173, -132, 160, 172, 88, -142, 91, 70, 6, 230, -130, 20, 137, 154, -33, 125, -91, -155, 46, 79, -206, -248, 87, -33, 139, 136, -43, -303, -265, -85, -202, -14, -162, 90, -186, 485, -67, -9, -267, 71, -97, 33, 225, -105, -14, 195, 97, -110, 145, 63, 136, -23, 104, -254, 18, -270, 89, 34, -192, 318, -279, -72, -148, -120, 136, 206, -318, 1, -323, 80, -203, -12, -67, 11, 87, 48, -35, -411, -291, -72, 47, 94, 201, -368, -75, -88, -50, -110, -15, -70, -208, 63, -105, 64, -186, -95, -131, 135, 36, -123, -288, 32, 92, 29, 169, -15, -185, -138, 56, 270, -21, -320, 153, 23, -237, 189, 178, -169, 138, -84, 144, -118, -102, -287, -160, 23, -297, -157, 29, 140, -147, 312, -79, -22, 190, 25, -7, 164, -51, 91, -102, -131, 321, -50, -229, -59, -92, -24, 240, 363, -272, 181, -46, 154, -82, -120, -310, 60, 19, 470, 155, -186, 103, 40, 80, -65, 62, -108, -63, 200, -35, -69, 16, -56, -14]
8144a4O1J92l51L33k32j74K95k18K73l38q2L68k42J22m2p9K8p0J35K16j45M2r1
8167a3K07p3nk0m6j80k88Q00l80N7k19J74R4k4l9l4J98K4l59K32q9k84K07K94
$$ y = [-14, 47, 239, -112, 221, -11, -185, 110, -108, 165, -173, -255, 113, -129, -7, -49, -128, -100, -170, -35, 181, 36, 78, -13, 194, 121, 116, 96, 50, -130, -418, 382, 2, 59, -160, 14, 108, 84, 45, 11, 209, 233, -126, 106, 17, -267, -60, 234]
8191B34
$$ Imaginary data points
##PAGE= N=2
##DATA TABLE= (X++(I..I)), XYDATA
0@%%%%JjQj6J6j7K5l2M0n0N9p3Q8j05J29j53J78k10K42k76L17l66M17m73N38o09
30c23O86p70Q62r67J080j203J342j490J651j832K030k248K489k754L052l385L760
47A980m187M675n240N906o699P663q877J0452j2579J5637k0438K9109m9659J83115
61A50858J73215l67021j49133J02750J66140J6701l7912m4963K6580l798o2947
72b9530q211J17404J0348j33068l9502J38829Q9621o0527j42989q4760R2820J95882
84A46317J0238j77305o2921J07514L0306q2866l0507P3034Q9116L930j22387r5336
96a10867P3531R3258m5376k5658R4630J5657j38517q4866P6572J28727M3904j02247
108A8748j34013M6791J69349Q687j59433p0126P6786R2323M2785l2247r2932m3474
$$ y = [0, 0, 0, 0, 0, 1, 0, 8, -8, 8, -9, 16, -16, 24, -26, 33, -40, 48, -57, 72, -81, 97, -113, 129, -147, 170, -196, 221, -252, 286, -323, 363, -407, 455, -512, 568, -635, 707, -783, 868, -964, 1066, -1182, 1307, -1447, 1605, -1780, 1980, -2207, 2468, -2772, 3134, -3565, 4098, -4779, 5673, -6906, 8731, -11707, 17402, -32257, 150858, 324073, -42948, -192081, -89331, 76809, 93510, 55598, 10635, 37215, 33417, -29530, -37741, 79663, 90011, -43057, -82559, 56270, 145891, 85364, -57625, -142385, -49565, 146317, 156555, -20750, -83671, 23843, 54149, -28717, -59224, 13810, 102926, 106856, -15531, -110867, -37336, 55922, 10546, -15112, 79518, 95175, -43342, -128208, -51636, 77091, 120995, 18748, -115265, -68474, 100875, 109562, -49871, -119997, -43211, 49112, 91897, 59650, -33282, -76756]
120g6756K7950J0976L7395J10981Q833j75441j16588J00528J52460K6570r7363
131I545j03355K8529J25992P815j25839l1121R3779L2317l8975J546J2202k4113
143a1678k5863j6690J5979Q1780L8345r4068p3177O2922N1957m9282l0944M3710
155g009N3020J4563o4570j04375J4395J37545N2295q3540n5460J2463O962J6833
167f878K9746j0966k3457K35j0123J0780O7388J045j17399n4310J01885J08138
179I6084J041p9318j00328j9480J04304Q5868l6344n3155k085j5207j1810M2064
191A1634K8396k2982j6677l746k957L7788K3242p0626n4876P1845P8194k9670
203D9565n7183j4945J2260L0476R788m0712n114O2589J0208o5132k0048K6252
$$ y = [-76756, -48806, -37830, -435, 110546, 119379, -56062, -172650, -72122, 80338, 106908, 9545, -93810, -65281, 60711, 68526, -57313, -88434, 5345, 37662, -1313, 233, 12435, -11678, -37541, -54231, -38252, 43528, 81873, -12195, -85372, -22450, 29507, -19775, -50719, -7009, 46011, 60574, -3996, -108371, -93976, 43569, 95864, 12324, -43136, -30673, -23711, -6878, 22868, 11902, -11555, -11320, -21443, -10663, 56725, 57770, -59629, -113939, -12054, 96084, 97125, 17807, -82521, -102001, 2303, 88171, 51827, -1328, -3413, -18620, -30430, 11634, 40030, 17048, 371, -3375, -6332, 31456, 54698, -15928, -70804, 1041, 79235, 49565, -7618, -22563, -10303, 20173, 29961, -10751, -15865, 46724, 56932, -8200, -28248, -1996]
215a996m039R296M7948L796m8431l3821j4569J9117P5513L2269p8302o4648L6199
228b1668N0513R173j3389m3366k9188N4320O0490l1645n1112n695q582M120O2605
241C6576L6949m9927n9423j4679J9517N7300M0492n1670o2408K9090M3096j7863
253G050j7813O398o643R700L0880j5485l8081P402J3009j1339J9367K7395k7259
266D581k9786J5744R607o571Q881p149j7363L5655L3651n3241n8312L0106N2783
279A8586J5036n047l3108m1315J5498M2442L79o369R151k8158k9904M2049M3457
292D2697l3302m2881L340K1869L4519K1630m7576n9013K5241N3298L377p459m311
305A1429l1198j1630L6321J2622j9554M393M516j9316J1032K6299k6719l0795
$$ y = [-1996, -6035, 3261, 51209, 55005, 6574, -27247, -41816, -22699, 52814, 85083, 6781, -57867, -21668, 28845, 38018, 24629, -18737, -47925, 6395, 66885, 35240, -15872, -21567, -30149, -26029, 36576, 73525, 23598, -35825, -50504, -30987, 26313, 66805, 15135, -47273, -18183, 24913, 7050, -10763, -4365, -11008, -1308, 29572, 14087, -23994, -16592, -3583, -14922, 4445, 31840, 4581, -25205, -9461, 146, -6425, 2456, -4693, -22056, 13599, 47250, -5991, -64303, -34197, 18586, 33622, 28575, -4533, -45848, -30350, 12092, 12471, 6102, 15253, -12905, -42809, -760, 42697, 9395, -33486, -30146, -8277, 26242, 47872, 296, -58717, -33476, 19822, 23199, 15740, 11429, -19769, -31399, 4922, 17544, -2010, 2383, 6899, -12417, -1385, 24914, -1805, -32600]
317c2600K6143K9467k942o884k2161k8122K9898M8950k1510m3680J1550K0738
329H847j286Q377o720l4369K970M0805P944j3951m227k7050k4188M3008N0623
342E0783k0033m2802j4608J707L0081M1296k3841n9844Q131M8023M277j4916o397
355A857k1905n445L6804J8990k0216j2637j2116j7743K9919M7562k4052n2621
367c1603O376L1587P462O83j5097l1134J3797M6528l768l6749n565L259K02K9406
381A5384J7208l6649k7775J7851J4071Q452J5783k2996m3547J9575N0947k331
393B5973l1396j5065r388J7019M7220m63n4177j7554K6411J4573J2922R537l3988
406h376l1810K7119L2963n800q607j2710k5848J6430N1682l797n0156j4050J9330
$$ y = [-32600, -6457, 23010, 20068, 13184, -8977, -37099, -7201, 41749, 20239, -23441, -11891, 8847, 7561, 15938, 9218, -25151, -22181, 18624, 26568, 12617, 8390, -18660, -42848, 160, 50783, 30750, -12052, -26660, -24953, 5128, 46424, 22583, -37261, -29130, 18893, 23170, 8254, 1857, -20048, -25493, 11311, 30301, 10085, -2552, -14668, -32411, -2492, 45070, 21018, -31603, -25227, 6360, 13822, 14505, -592, -31726, -17929, 28599, 24831, -11918, -17483, -14224, -14022, 15384, 32592, -4057, -31832, -13981, 90, 8542, 24325, 1329, -42218, -22643, 28304, 25973, -5423, -20488, -29876, -12857, 34363, 33900, -20277, -37831, -11420, 3153, 16075, 25612, -8376, -40186, -13067, 19896, 14096, 5489, -7221, -33069, -16639, 35043, 31246, -18910, -32960, -13630]
419a3630K0066K3271o438m9447j3085M4266K0042j5812o295j1695j8954K4201
431c510L7287j5934l4584k832P672J7845L1024j6151n5417j961M8750J8039j2906
444A7322j5753k5630m961M3534K4818l1788k5616L306L805K1327K7289k5604m7449
457c5400R947L8883J0373l103j6477l6449J693N2489J7523l3931k2099l369N300
470a4620L3293K0440l9330l5455K2649K7582K347J009j8698l2578J4696M6420
482B7755J625k8695j4306r396Q880M2643J0184m9457k6013K7710K3328P290j523
495B0025l1771k6941L2245M0171j0750k4814j2945j2561J7759M6287j488m9825
507a4608j8253K0133J9354K0773J52m4603k4501L9058L2890j2036j6904j5520
$$ y = [-13630, 6436, 29707, 23269, -26178, -39263, 5003, 25045, 9233, 2938, -8757, -27711, -3510, 33777, 17843, -16741, -19573, -11901, 5944, 36968, 20817, -34600, -36561, 12189, 30228, 17322, 1569, -24061, -29022, 14512, 39330, 7542, -18074, -14768, -10963, 10364, 37653, 12049, -35400, -25453, 13430, 23803, 20700, 4223, -32226, -30533, 21956, 39479, 5548, -16551, -19920, -14620, 18673, 39113, -217, -35672, -13023, 14559, 16906, 17915, -783, -33361, -18665, 27755, 29380, 685, -13621, -23017, -14137, 28506, 38690, -10767, -36780, -9070, 14258, 21548, 20025, -11746, -38687, -6442, 33729, 22979, -1835, -14780, -27341, -9582, 36705, 35217, -14608, -32861, -12728, 6626, 27399, 27551, -17052, -41553, -2495, 30395, 18359, 1455, -14065]
519a4065j4937K4880M0400j2063l9890q441J0293J6593K7774n568m9279j2307
531c6610M0217K0656j1050r790k0357j3036L3916L2382k1970l2963l795Q375K2555
544H530K7663k0234m8936L360L8050J1186l665q953k9677q199M1996K5654k7492
557I283k6477l539O680K9355K2991l2455m0420J4237L0233P649K572j4072l5125
570b9088L607M5380J2194k7666j6722o570M618L4476J7673l8052l2111J6618K3261
583G618J1469N722k4644l3334J6779L9154k077j8522o933j2187K086L4209J0354
596B9694l5594j8776J4745J3807J2346N158k9796k3998K6459K7698j0637j2496
608a390m524j2252J0667L0714p311l3336k604J6282Q706J2562k320l5595j2255
$$ y = [-14065, -29002, -4122, 36278, 24215, -15675, -24116, -13823, 2770, 30544, 24976, -24303, -36610, 3607, 24263, 13213, 3423, -16934, -29970, 3946, 36328, 14358, -18605, -22400, -14025, 8530, 36193, 15959, -32977, -29617, 8433, 19619, 15954, 7001, -22676, -30875, 11121, 36775, 9283, -17194, -20733, -14053, 15302, 38293, 5838, -34582, -20345, 9888, 17537, 20109, 6037, -29088, -25481, 19899, 32093, 4427, -12295, -18865, -14247, 20229, 37902, -150, -32261, -15643, 7618, 19087, 24809, 165, -33169, -16390, 22764, 20687, 2165, -4768, -16955, -14869, 19340, 29694, -5900, -24676, -9931, 3876, 16222, 21380, -8416, -32414, -5955, 21743, 11106, -1390, -5914, -18166, -7499, 23215, 15904, -17432, -20036, -3754, 4952, 17514, 15194, -20401, -32656]
621c2656L3692J9613j0618q814j3637j5010K3142L2293j5249l1119M7J0656J1965
634D305J6903j2085l6429J547L2808P414p024k684j9387j5427K8269K7201j6554
647H857k0929j192P91J3804J9423j7957l0429J2064K6543p27n161n889k1655K85
661b2172L4466Q835k3378q752K001l743J4735J6972k0009k1778J4971J7034j052
674H130k073j4784j9996J9446L6228q176k9404m769J846M594K4411P693l1413
687h267j6696K0151J4169P64j509j9867j5957K5596K8228j0911j9547j0101j0543
700b4490J4927L9964l61m2385j3843J9591J1466O509J971j9413j1802J9508J1287
713A2929r729l146m462j2701J5090K8461j2405k9814J422J1330L373J1823J263
$$ y = [-32656, 1036, 20649, 10031, 1217, -12420, -27430, -4288, 28005, 12756, -18363, -18316, -7660, 4305, 21208, 9123, -27306, -25759, 7049, 14463, 7439, 4755, -14632, -30059, -1790, 25411, 8857, -12072, -13264, -12473, 1331, 20754, 2797, -27632, -15568, 10975, 10248, 5087, -802, -22457, -22172, 12294, 21129, -2249, -11001, -9000, -12743, 1992, 18964, -1045, -22823, -7852, 9182, 8130, 6057, -8727, -28723, -9277, 26951, 18775, -10629, -15398, -13552, -8958, 15453, 23146, -8267, -24963, -4812, 9357, 10121, 8612, -11255, -27212, -1616, 26612, 15701, -3846, -13947, -24490, -9563, 30401, 30040, -12345, -26188, -6597, 4869, 11378, 13349, -6064, -17866, 1642, 12929, 3200, 54, -4408, -17109, -2019, 26442, 14037, -15777, -14355, -3025, 348, 12171, 13434]
726A3434k4186m372K3599K631j6101k510O35K450J8944N909k7787j5244J4796
739g802P829N857J5437j2327l3624L587L1069M441j1752o055r558L349K4131K382
753A6964k6347q055J0662M574J3977J2390k5174k8441J4586K3727l15k62j939
766F347j7745l606J9985K810j2720O89K517j184J3884K281k8085r628K7016J1927
780A4488j0880p26l530j3504P628J6289p837j0199P087K704L35R098j1790k5354
794b6191J0231L1788L175j3830p531j7263n820L0399K2072j8942k0224l92L268
807i260J2765J3713j7934k3054J3099K1708J347k266j0251k7669K42L9687J7229
820B9356k0585j6494o444l993J6522J9907j1406j6634N555N191m10N831q859j8728
$$ y = [13434, -10752, -15124, 8475, 11106, -4995, -7505, -6870, -4420, 14524, 20433, -7354, -22598, -7802, 27, 5884, 21321, 8994, -24630, -21043, 10026, 14467, 2715, -3340, -12898, -9549, 14582, 16964, -9383, -17438, -6776, -2202, 11775, 24165, -1009, -29450, -14864, 8863, 8548, 8286, 6347, -11398, -15004, 4981, 7791, -4929, -4240, -1723, -2907, 10977, 13258, -14827, -24455, 2561, 14488, 3608, 2882, -648, -14152, -6524, 9765, 1928, -8271, -1184, 1520, 1855, 10953, -837, -26191, -15960, 15828, 19003, 5173, -2358, -19621, -25441, 4958, 27030, 8088, -12136, -12528, -9260, 3505, 17218, -716, -23770, -10671, 11037, 12384, 10118, -133, -27802, -27560, 12127, 29356, 8771, -7723, -14167, -18160, -1638, 18269, 6863, -9771, -4216, 975, 565, 6396, -2463, -21191]
834b1191J5767K9831r893k4073j119K807O8J6810Q891j8874j1422J0137N833J522
848E094q63j6780o203L0525J9957k4812k5462j232M025J8502K9896p077m0362
861a4792j4286J7854J6803J1949k721k5736j0598K3273J4828j0476r090j0861
873a3853q146K4137L2302j6196l8295o335J3428J4348J9522m9k9090j4126J4997
886g356R516K56L456r167r106J7571J0984k0888j5139J0722P097P597J4593j1785
900H351l1124Q85K4447P552m797n706j1358L540K1804k342k6237l464J4170P613
914C334J2338P023k8653l0503J5689L2873J2307n765k1469k6459R191L4665N767
927B0338k0679q833j169M650K1038N948k9596j9540J7833K0619Q273J543k1168
$$ y = [-21191, -5424, 24407, 14514, -9559, -10678, -7871, -7803, 9007, 17898, -976, -12398, -2261, 3572, 5094, 4231, -12549, -18752, 11773, 31730, 6918, -18544, -19776, -15751, 2751, 32647, 25570, -14792, -29078, -11224, 5579, 17528, 14807, -10929, -21527, 1746, 16574, 6098, -2992, -13853, -21999, 2138, 34440, 18244, -20051, -26386, -12958, 1390, 20912, 20863, -8227, -22353, -7356, 2160, 2416, 5872, -3295, -12401, 5170, 16154, -4734, -19873, -9151, -2054, 5543, 20136, 8351, -22773, -21888, 2559, 10111, 5314, -392, -11750, -8210, 13594, 11252, -14985, -18449, -4279, 3334, 15672, 22695, -5958, -36461, -20772, 12101, 24408, 18643, -2826, -29285, -20094, 14571, 20338, -341, -9174, -10343, -5693, 15345, 21293, -8303, -27843, -10010, 10609, 18882, 20425, -743]
940g43k8606R831L1086O680q802q302j2007N35K0835K493k2937j943J8896N382
954A2398l382l377j6689q934K2479J8434r762j0423n492q102J0576K1816q676
967A0866k4560L800J8000N837J5j1788k6631K512L8564J7411j9378k2242j3155
980b0749M74K7289K3228j5696k3418k271L638R675J8834p663l3263j801L2920
993A1197J4138j2308j7145j7358J479L0798J7348j7567j7159l499l386J0702K0635
1006A7875o832k2335M405J4332l339l472k421j1825L615K6562N495k4024j4515
1019a6479J486Q797J9409O677k4124j4802J6616J0857p100q28l961j2191J0368
1032e275K5460l596k5016j1834J065J5026K7623K280l3846j9754J3332J6723R909
$$ y = [-743, -29349, -19518, 11568, 18248, 9446, 1144, -10863, -10328, 10507, 13000, -9937, -11880, 7016, 12398, 9016, 5639, -11050, -19984, 2495, 20929, 11167, 744, -4748, -12850, -2274, 19542, 10866, -13694, -9894, 8106, 13943, 13958, 2170, -24461, -21949, 16615, 34026, 14648, -7594, -20749, -20275, 7014, 30242, 14546, -8872, -11143, -7505, 2170, 21004, 13341, -19922, -21723, 11197, 25335, 13027, -4118, -21476, -19997, 10801, 28149, 10582, -6577, -10076, -13462, -2760, 17875, 11043, -11292, -6887, 7445, 4106, 634, -1787, -13612, -9997, 16565, 22060, -1964, -16479, -14993, -6196, 13213, 19890, -4234, -19036, -2420, 8437, 1337, 509, -3452, -15643, -5275, 20185, 16589, -8427, -20261, -19196, -4170, 23453, 25733, -8113, -27867, -14535, 2188, 12097]
1045A2097L341k0127j8793J7505K1944r122j4332j339k779P193K1230M69k5560
1058h273j2496P002J1619J8529L875k6941j7867K0138J6149r754n154N13l651
1071f311P875J2317j2399j7002N679J0508M554Q826n047k3947l454K1653Q159
1084A1411o362l018q094n706J7905J2059j9462j6388J0077J3193P302L583j7484
1097i84k1781R700K4044L371n528n148j5752m361K2689J2091j4858j1090J577
1110f030L057J1350Q707j8607j8938J3485J8385L89l851p909j5245L950K1564
1123A0307J454j3006l16R37n130Q848P301j4257q777J3413Q901k915k731j2077
1137h048j0561J7576K0871j0747j7027J133J285K407J3072j029j8904j665J4336
$$ y = [12097, 15438, -4689, -23482, -5977, 15967, 6845, -7487, -8826, -11605, -4412, 16818, 17287, -8273, -20769, -13767, -2148, 16381, 20256, -6685, -24552, -4414, 11735, 1981, -3173, -2660, -6311, 1564, 13881, 1482, -15520, -9841, 667, 5221, 14047, 9000, -14947, -18401, 3252, 11411, 5049, 2031, -6063, -11769, 6136, 18195, -1267, -17655, -7578, 5615, 12917, 16500, -984, -22765, -13065, 10979, 14350, 8822, 3674, -12078, -16439, 6250, 18341, 3483, -7607, -6030, -2973, 8377, 17084, -1523, -20461, -6976, 11409, 11798, 7947, 38, -15207, -11257, 10307, 11761, -1245, -1561, -624, -5754, 3094, 10395, -3862, -12639, 774, 9675, 6760, 4029, -8048, -18609, -1033, 19838, 9091, -7936, -6803, -5518, -3111, 9961, 8932, -9972, -11637, 2699]
1150B699L948j361j389j4759p436K0992J5751j1655j2467l788l944J0924J9688
1163A7203p038k2292O42J2035J742K900r78j4733j898J8565N703j1907m130l823
1177h009m173J4430J5157j3289j7165M447P078K939P698n441j7131M041J8481
1190I063q15j0809k171l667J442J6304M539j7803q329Q173L055M540Q389j0426
1204A485j6503Q961J6050l563p178k250n628N915J6719l364j9182j385R170K122
1218A369P072M102j6803j0530J4602J0798n104k426m253q787R741J5516q512j5099
1232h314L798N470R76Q608j281j7869k439J6084M261n202o15p230n615J3839R886
1247A4357j3081r352N985K279K454Q734p678j7099N508J6180O4m949k889r940
$$ y = [2699, 6647, 5286, 3897, -10862, -18298, 2694, 18445, 6790, -5677, -9465, -13409, -2485, 17203, 10165, -12127, -11485, 550, 2292, 5192, 4214, -10519, -12417, 6148, 11851, -56, -4186, -8009, -12182, 2248, 17405, 4116, -13049, -8602, -1524, 1415, 9113, 3672, -13459, -9418, 9063, 8248, -2561, -4732, -8399, -6957, 9347, 13886, -3917, -12246, -4073, -1018, 3522, 11911, 1485, -15018, -6057, 9993, 6430, -748, -2998, -8626, -2711, 14008, 10644, -8538, -9923, -753, 1369, 8441, 12543, -4260, -14790, -188, 10610, 5506, 3080, -1173, -9960, -219, 15297, 6785, -8314, -4516, 954, 1930, 10538, 9257, -8612, -11051, 5033, 9294, 4092, 3477, -3753, -9368, 4471, 14357, 1276, -8076, -2091, 188, 2642, 11376, 3698, -13401, -7893, 8287, 8351, 3402, 513, -9427]
1261i427k72J8325M432j4994n474L949k77P204R083j2943j4622R876J2236j872
1275E224j649n269j1405O323J8259k235j4853j499K361P75J1409L014j7323p674
1289a4542J3142P175j568p1r040j1269J3324J7379p094j4034k229M34O970J4948
1303A3525m086k1348k171J4087M625J286K67j4293q429J6892J3007q274q810l904
1317g626l350J1143J6521r319k0812K291J1571M217M792l956j7464k456J9790
1330E342P343r779n747n233k225J5749J1827j4740j5395N324P615M985Q091q435
1344D722k0025L055K0210M494p790o617q582J672J9465N908j8133r742P471M779
1358H87N952O665j2733j5980Q646J6248O89m435o961j1975N592K1642J360j8437
$$ y = [-9427, -9699, 8626, 13058, -1936, -7410, -3461, -3738, 3466, 12549, -394, -15016, -5140, 7096, 5224, 3575, -1694, -13099, -6776, 11483, 9248, -5605, -7104, -4743, -3968, 7441, 10455, -6868, -14542, -1400, 5775, 4207, 4136, -4904, -16173, -2849, 14530, 7436, -6598, -8827, -8393, -1423, 13525, 9439, -11909, -14080, 7, 4632, 5918, 6185, -8108, -16537, 355, 13362, 5088, -3722, -7626, -10976, 167, 16688, 7369, -13443, -11152, 419, 4636, 9428, 5472, -11992, -14448, 5342, 12685, 2906, -2841, -8074, -10299, 5450, 17277, 2537, -12858, -7534, 81, 5066, 13157, 4722, -15303, -12248, 7962, 12456, 4666, -1951, -10533, -8861, 10604, 16512, -1621, -11363, -3892, 887, 6839, 13504, 771, -15209, -6563, 9685, 10374, 5939, -1022, -12997, -7405, 14237, 15597, -2840]
1372b840o732M687M795J0674L505j8710j1092J3316J1604n61j802q989j2371Q935
1386e581J9556k544j4182l200l46L465J4099J153j9407o636J3229O792O33p39
1400F292j2628r255J5632J4400r313j0071m51j140N630J2899n492j7100O99J1033
1414A135L601L070l292j6710l709K1066J0080j2202r029k496n48J2088J2176j2145
1428C085j6423M308R830M146M576p278j7879L061K0543M470r859o070p074j122
1442a1686J7812J1550j5533j4827L923Q241P108M733j1383j5259Q220J6217n24
1455H592n863m110j0105J632K0316O145j7922r457M911M746Q028M969j2757j1265
1469a2140R565R940j403j914o432j0478R737K0427n575j9390j909P275M165P723
$$ y = [-2840, -9572, -4885, -90, 10584, 14089, -4621, -15713, -2397, 9207, 8646, 6844, -2145, -14516, -5581, 13975, 11431, -2751, -5951, -6297, -2832, 11267, 12420, -6987, -13623, -394, 6398, 7031, 6292, -6336, -15591, 41, 14441, 5128, -4943, -5394, -6534, -904, 11995, 6503, -10597, -9898, 1135, 4736, 7806, 4514, -12196, -15905, 5161, 15241, 3039, -5990, -8486, -9034, 3054, 15230, 3085, -13338, -9030, 800, 4946, 9522, 2244, -15635, -12574, 7969, 12439, 2580, -3490, -10564, -11686, 6126, 17676, 2143, -12684, -8761, -520, 6588, 11321, -62, -15321, -7101, 9116, 8592, 2729, -1381, -11486, -9854, 10462, 16607, -1315, -10772, -5861, -1115, 6913, 11882, -875, -12140, -2575, 7365, 5962, 4048, -2384, -12862, -3125, 17302, 11727, -7663, -9572, -2297, 1868, 9591]
1483I591J318j5327p627J1491Q255O42k642j2258p680J6983J6442j1526j5733
1496h071j73L168O625J3944l361k0974n568J3273Q961K597l162j4836n917J6028
1510B534J0660q704o941k263m025Q977J5997p708j9254p71J1387M950L288k290
1524E837j3928k864J3579M842o186k217l322l177J1099Q818j3203j1589O841P414
1538A944J947L648n680j4791K852J6539J908p852m538m670K015J4907K443j6278
1552e606o530P520N421M974M675j2866j5545Q471J6853J426m888o261j0179L985
1566h550J7086J217j4143l267L453J891Q161L568j4130r684J0859R216q24J03
1580D956n983j0751N515J4530k384r137P54M95L85P243j070j2997O83J3262J432
$$ y = [9591, 10909, -4418, -12045, -554, 7701, 8343, 5701, -6557, -14237, 2746, 19188, 7662, -8071, -8244, -5076, 1549, 15493, 12132, -8842, -14410, -1137, 7824, 10421, 7259, -7577, -13494, 2534, 13194, 4490, -2451, -4714, -8739, 238, 16235, 8527, -10727, -11498, -111, 4839, 8127, 5837, -8091, -10955, 2624, 7466, 1280, -937, -4259, -7436, 3663, 12481, -722, -12311, -5470, 1944, 3891, 7539, 1859, -12932, -10080, 6459, 8367, 515, -4023, -8693, -6678, 8229, 10672, -5606, -12136, -4616, 805, 5779, 10454, -2412, -17957, -9486, 7367, 8793, 3905, -2356, -12535, -8550, 8536, 9753, -4390, -7657, -4204, -2313, 5848, 9416, -4714, -14398, -3539, 5677, 4853, 4956, -1027, -11778, -6263, 8267, 5883, -3254, -2500, -2005, -1620, 5623, 4553, -8444, -7761, 5501, 6933]
1595F933n319r10n770m305J1670R633q598p971J630N12M174P994p529j2723N901
1610d678J2685N3m298l881j0170Q86J7826P227j2271q618j212P54J0167Q526r740
1625C256j1521N095N414j72M592k902j3095J690J7003K401j0835n125j652J017
1639d834J0714N160j0088n017L592j030J51P052l433r374O909J0482p528r376
1653f620K510J080K996R510j756j3376k451O884K778L607N60j1419m465J3828
1667C666O207r940n290J234j506O469J2114o290j6791k153Q577P199P415l382
1681G529j5746l782J1712M496k910J257m359p210Q754J0751q176j2054L473N639
1695f26L692M826m474j2070J339Q774J72m4K203o090m635R504L828j1276k491
$$ y = [6933, 1614, 704, -5066, -9371, 2299, 11932, 3334, -4637, -3007, -2495, 1679, 9673, 2144, -10579, -4678, 8007, 8060, 3762, -119, -10289, -9403, 8423, 15650, 3379, -5239, -6451, -5697, 4470, 12996, 3256, -8265, -3170, 2244, 2072, 6664, 3762, -9333, -7643, 9360, 11761, 926, -4199, -5851, -4834, 5880, 11040, 952, -4065, -473, -1503, -1352, 5700, 2267, -7107, -198, 10284, 2756, -6620, -4110, -3030, -34, 9476, 7720, -5656, -8107, -1223, 1555, 5162, 5722, -5697, -10162, 3666, 9873, -67, -5357, -4123, -5629, 840, 12954, 6664, -10127, -12280, -3703, 3496, 10911, 7529, -8217, -11999, -287, 4209, 1299, 2556, -1803, -9013, -259, 10492, 2316, -9738, -6265, -626, 3066, 7892, 3418, -8652, -7313, 1461, 1633, 1589, 3792, -2298, -6933, 2571, 6399, -4877, -7368]
1710g368Q305K407O52J538r320q613R074J1380j604l909m630o603M769J3594l183
1725F489j2401P63O326J135L910L01j3018o420J2544J0122j014l712j0005q880
1739a3860J0503J5732l448j1062j496L58J795R014o31j2879j216J0401K525j740
1753C996k18p712o259J0267J0436m785n774j868l613M055R823m103j1737M405
1767c087R963j896m692k732n621L500J3607J598j1030n477l1j1J0270Q370j1236
1782A495j1884N208Q387J914J09p152j0571N794J7296J289j2051p689l185M794
1796f246J4842N183j3931r339L122L253M915P269o306j3053L646J2534K08o450
1810c53m454m234N343J3711m89j4038m513M356K508O249M222r617q303Q084O241
$$ y = [-7368, 937, 3344, 3996, 5534, -3786, -12399, -3325, 8055, 6451, 2542, -2088, -8691, -3922, 9672, 6489, -5912, -5149, 1177, 2312, 6222, 6523, -6495, -12915, -371, 9751, 8737, 5025, -4980, -13860, -3357, 12375, 8927, -2135, -3631, -3273, -1478, 7536, 6905, -5974, -7190, 3211, 5736, 3996, 3778, -3934, -10193, 74, 10510, 5725, -49, -1917, -5530, -1475, 8348, 4245, -7492, -3087, 6876, 4980, 288, -2444, -8065, -4565, 9042, 10640, -390, -5867, -5898, -5909, 4361, 12731, 1495, -10389, -5181, 3206, 5120, 5229, -1923, -12494, -6700, 10596, 11885, -166, -7855, -11040, -6246, 8596, 13779, -152, -9491, -6369, -3116, 1799, 9068, 2762, -10291, -6645, 5889, 6097, -353, -4807, -9041, -3698, 10013, 9524, -4514, -9027, -4671, -2163, 4086, 8308, -1309, -9612, -1528, 4713]
1825D713m473j629n36m195N996J0735m927j3559k283O199O981Q748m387j7012
1839i629k386J3754N174m531j249m076m332Q734R268p409j0441m80M534Q254R008
1854A4193q533j7649J72J3452O185N48l284j1282m080J2700P668p974n405J013
1868b276Q07N103O100p816j0666L614Q024L009K587m364j2668P1J3491L968p985
1883I99l030O59K35O398J697j0781m526Q766O263j107l24p328r048P140J3276
1898I289n26p559m181l870L035J2196J048j3354n052P800O059K256j929j1210
1912e998o454J1731J1058l860n646m627n647M044J3987N16j1717l990K968L764
1926A29O007j196j2082k895J2214O262n264m799m165l019Q615J0573n771r882
$$ y = [4713, 240, -1389, -1925, -6120, -124, 10611, 5684, -7875, -10158, -3959, 3022, 11770, 7383, -9629, -12015, 1739, 6913, 2382, 1133, -2943, -7275, 1459, 10727, 3318, -7123, -7603, -3069, 5185, 14193, 5660, -11989, -11817, 1635, 7820, 8368, 5084, -6198, -10278, 2422, 10090, 2116, -3289, -2276, -1469, 3634, 9734, 1918, -8748, -5134, 2890, 5899, 8486, 4122, -8546, -8475, 5016, 8984, 999, -2031, -1372, -1137, 5261, 6958, -3823, -8349, 417, 6680, 5573, 5249, -2079, -11127, -3987, 9289, 8763, 1204, -2977, -6847, -3812, 8384, 9432, -3922, -8974, -1174, 4885, 7141, 5212, -5998, -12452, -721, 10337, 6477, 831, -3796, -9443, -5399, 8588, 9104, -2613, -6603, -3635, 129, 6136, 4940, -7142, -10037, 2177, 8439, 3175, -1624, -5789, -8808, -193, 10380, 4609, -5273]
1940e273lJ763L252O222k183j0938n97J0294L397l454l817p033o11J4136P194
1955A2349j0942r507J322L519N735O193o314j0837K564Q747R43j66l178q651R45
1970g278J4106M133j0457p429m14L207J0524N904j1634j0685N255P679J202N38
1984D651l526q174K807J0364J81o679j997k714J496J0931L594j2268p855N933
1998c256O129K560O12o577p100O769Q085m037m631J15j514K587Q147j644j0625
2013d380j920N312L235M079Q12j0739n903R154Q248l792m398k054k308O021P173
2028H540n745q634K079M085J065M673r20j0326k734Q756M333j772j326n065l920
2043f911P471P827p139o899K757L130K060K814m938p877L504Q484j189k449l03
$$ y = [-5273, -5276, -3513, -261, 5961, 3778, -7160, -7757, 2537, 5934, 2480, -1337, -8370, -8981, 5155, 12349, 1407, -8100, -6778, -3259, 2476, 8669, 2355, -8482, -5918, 2829, 3772, 3606, 428, -8223, -7278, 6828, 10961, 504, -6925, -7339, -4132, 6392, 12296, 662, -10023, -4768, 2911, 4113, 4651, 1125, -7049, -4242, 6122, 6303, -376, -2373, -5087, -3591, 7340, 10934, -1334, -9189, -3256, 2873, 5433, 6045, -532, -7632, -863, 7222, 3185, -1446, -1331, -2845, -258, 7889, 6245, -4380, -6300, -988, 2247, 6326, 7138, -3601, -9504, -350, 7898, 4106, -292, -2346, -4654, 1367, 8540, 2795, -5839, -3760, 325, 1390, 6063, 5143, -5183, -7917, 839, 5172, 3400, 2074, -2991, -6911, 560, 8387, 1248, -5651, -2894, 236, 2296, 5110, 172, -7705, -4201, 4283, 3094, 645, 342]
2058C42m360k152Q260M591o650m166J148J028M608L498q135p772P621P985k277
2073C569l406k230m414L020Q954q78p402l99P75l05N620K664q526m885O590N198
2089C945p53j127n489n288P379J0143m678p958N1J169K110N618j155q492l26O575
2105A724Q4k29J363n378l928P181O481m729m988p58j128N391P109n058r613K567
2121c909P133K40j516j020m704J89P992J221n752j398k43j663O509N658p065q553
2137f881L596N016K129J685m932p995M062J0075j116o618j150r58J483O944Q35
2152F175q100k533L807R17J797M138n156q460L887R110o23m196l130k647L866
2167a148P970k226r161N17M163Q84K169N47o680l539O984M082l429r80j642m163
$$ y = [342, -4018, -6170, 2090, 6681, 31, -4135, -2987, -1959, 2649, 6147, -1988, -9760, -2139, 5846, 3569, 163, -2067, -6481, -3461, 5493, 4615, -2787, -3186, -2411, -2716, 2904, 5568, -2958, -7843, -1253, 3945, 3192, 2065, -3424, -8712, -1333, 8810, 4132, -3826, -3775, -2606, -496, 5122, 3967, -4525, -4851, 1724, 1808, 1579, 2942, -2436, -6364, 817, 7298, 2569, -2419, -3177, -4305, 1086, 8195, 3137, -6476, -3909, 3224, 3464, 1948, 928, -3776, -3587, 4405, 5626, -126, -1524, -1767, -3430, 3079, 8737, 1672, -6881, -3285, 1731, 3860, 5545, 613, -7382, -3320, 6755, 5639, -979, -2129, -3087, -1604, 5340, 6175, -1925, -4458, -651, 266, 2063, 6201, 1045, -7415, -3528, 5582, 4959, 763, -2367, -5014, -1148, 6822, 4596, -4565, -4048, 115, 999, 3168, 3715, -2965, -6504, 480, 4562, 1133, 153, -1489, -5652]
2183e652M126P754k447p839r38K797L723M701l313j0511L71J0107K379m876j115
2198g33k572j823N303N465m038n043P6K76L345O248m154r747J888P784J403j860
2214A818j957n284N3R180K840p925l679K683J325K874K982n581n316L841M284
2229B138j03N00k612p251K808J1105M52q840l257J656L279N832o1r121l457O701
2245b31L354n3p9m818n472O050Q735k608o499j846n55L147Q073l66j0366l246
2261f780N537M776J794j685p374l241Q494N270m517l077j052k477L750P924k405
2276D937q906j361M412L233K948j737q336q47Q323L021m643j849k073j282O253
2291B093N355o267p259K275M384K285K509l726q987J541Q705K651l016l575m902
$$ y = [-5652, -1526, 6228, 3781, -4058, -4996, -2199, 1524, 6225, 2912, -7599, -7228, 2879, 5258, 382, -733, -3305, -5128, 175, 5640, 1602, -3441, -3365, -3089, 256, 6504, 2350, -7397, -5509, 2275, 3678, 1818, -139, -5423, -5370, 3810, 6650, -1275, -4954, -2271, -946, 1928, 4910, -671, -5987, -2146, 2138, 2035, 2535, -77, -7328, -4520, 6585, 7037, -1803, -5060, -3404, -125, 5707, 5646, -3475, -6932, -231, 3123, 3070, 2991, -1827, -7299, -1249, 7486, 4878, -1621, -3467, -4022, -875, 7198, 6832, -3534, -6780, -1243, 3533, 5327, 3642, -3732, -6973, 1521, 6791, 2274, -803, -1855, -4332, -582, 7342, 4937, -3969, -5330, -918, 2315, 5263, 3526, -4810, -5657, 2666, 5687, 1044, -805, -2878, -4160, 2093, 7448, 1181, -6078, -3803, 581, 2866, 5375, 1649, -7338, -5797, 2908, 5559, 2543, -1032, -5934]
2306e934P47R837L477r124m996K709K350L708L829n375q949J711Q036K691n82
2321D135m104p391J886R473J872o723k677R63K51M867L166p367n315M968M868
2336B872o77l05k909n147L456P235o15n184j555n80K218O552n79r757k372Q296
2352I49L769j393j909n343k914O928O899l371m916k204j301M259P739k342r549
2367d699j513N946L372K074k083q562k386R652N861m005m614k523j330N529O391
2382G110l758o785L66K470J580L916j337p694j335P834L303l480k677l192n81
2397d260P198L962o547m035K660J496Q17K691l166o168L091P132o71m105k004
2412a909l303K532Q276J401q076m224J690K820N446K021q435o653O082P146j356
$$ y = [-5934, -5187, 4650, 8127, -997, -5993, -3284, -934, 2774, 6603, 1228, -7721, -6010, 2026, 4717, 4135, 31, -7360, -5474, 3999, 5871, -852, -3529, -2566, -2315, 2552, 5718, -1649, -6964, -1996, 2872, 2195, 1890, -1019, -6166, -2710, 4525, 3910, -1274, -2829, -3409, -1191, 5361, 4782, -4975, -7347, 949, 4718, 3325, 1416, -3927, -6841, 87, 6986, 3615, -1301, -3505, -4806, -547, 7192, 4850, -4699, -6212, -266, 3106, 5180, 3097, -5465, -7851, 1801, 7662, 3657, -957, -3480, -4810, 719, 7110, 3352, -3433, -3067, -597, 983, 4899, 3562, -4132, -5467, 2367, 5670, 2190, -487, -3679, -4260, 2938, 6900, 353, -3682, -1022, 474, 1291, 3982, 816, -5352, -2261, 4871, 4200, 95, -1909, -5212, -2680, 5596, 6997, -1079, -5303, -3613, -793, 4653, 6674, -1761, -8414, -2332, 4814, 3458]
2427C458k589k617m150K641Q347J307p100l572j195K654P991K375r008n444M536
2442b366K998Q34J513l105n119K852O633j660m945o61L24K062N235j584o794m07
2458d190L681Q14J306J492n362l872O542N070m890m713Q88J552L493L601m439
2473I73p149J478M634K554K614k288q755q91Q992K858m137j943r68j289M212N048
2489E943m684o531R85L954L493K715m279p706J742O856R16k066K95l013k707M964
2505H77L808m666k996K874Q21J071J784l911m275L849M472j456r94m01l565L18
2521b390O610p35n978N16L762L23l36M75n088j583O344L207k364j803l159l062
2537e261M388P705k770o555k19J743J123L549p35o696r28O552J843k006q72l766
$$ y = [3458, 869, -1748, -5898, -3257, 5090, 6397, -703, -4275, -5470, -2816, 5175, 7550, -1458, -6902, -2366, 632, 1466, 2979, -126, -5245, -2393, 4240, 2580, -2365, -3026, -2702, -640, 4595, 3011, -3783, -4190, -509, 305, 1611, 3103, -2259, -6131, 411, 5481, 591, -4122, -3234, -1682, 1811, 5412, 973, -6176, -4698, -64, 2490, 5104, 2816, -5939, -6830, 2162, 5020, 883, -1060, -2028, -3317, 895, 5943, 1259, -5272, -4287, -333, 3160, 5875, 1596, -6110, -4368, 2488, 3404, 1338, 1633, -1380, -4087, 877, 4685, 19, -2977, -103, 718, 1789, 3573, -338, -4613, -764, 3708, 2252, 1258, 857, -2708, -2390, 4220, 3485, -2493, -1977, 1785, 2108, 1772, 2247, -2841, -4424, 1920, 5127, 2763, 960, -2199, -5261, -873, 6832, 4062, -2493, -2712, -969, 154, 3703, 2968, -3728, -4656, 1896, 3739, 1733, 861, -2905]
2553b905k609N829N199l219l487k90j827J054O064o92n892N5M135j15j097p23
2569e20l289R61O526K68n632j348J418m46K460L464l695m702L448K396r90K24
2585E43j398m024K317P560j210o001k419M54K642O581Q11q351m141N255K289K8
2601I36J143j941m850K125N716j007k796j794k263K924P577o37q623k218M163
2616a545J977J811J230m480l860M408L202k582r40L75j683J770M453k663n347
2631c874J092K388J130L137l7p730j877P367K337l474j826jj1L180J815m727k924
2648d035L141J788Q91L114l438p334J107P231J885j756j833m344m05O375L012
2663E399n664l114K635J383J802J513m942m245L977M205q44j04p29n348j0O534
$$ y = [-2905, -5514, 315, 5514, 2295, -1192, -1482, -3309, -2255, 3809, 3117, -2775, -2720, 1415, 1300, 203, -520, -3809, -2848, 3678, 3946, -1686, -3034, -1616, -2062, 398, 3862, 167, -4535, -1087, 1309, 319, 543, -855, -4879, -2562, 4998, 3788, -2213, -4632, -4178, -1536, 5045, 5856, -2495, -6636, -1381, 908, 936, 2079, 138, -4712, -2587, 3129, 2122, -674, -2468, -4731, -1807, 5770, 5133, -3490, -5708, -1545, 432, 2243, 3473, -1007, -4867, -459, 2743, 161, -779, -404, -2087, -317, 4136, 1473, -3874, -2782, -394, 736, 3873, 3836, -3894, -5771, 1596, 3933, 459, -1367, -1368, -1379, 1801, 3616, -1111, -4035, -894, 894, 1785, 4899, 1461, -5873, -4766, 2465, 4350, 2594, 761, -3583, -3988, 2387, 5399, -265, -3379, -744, 639, 2441, 3954, -988, -5233, -1256, 2949, 2105, 2001, 1272, -4076, -4086, 2448]
2679B448K038m534j345K03L16L290O03n782k123O055K605k622q74j831k978L207
2695a324N562j815m026J10l64O13M389o2o204j282N513J808r45j685m674j278
2711e664P067M672m398m483j32r6K533M931j718n998j41K983J398J201o29n704
2727d178q42P236L211m654l603q65K62N066M289m610n919J699K838Q63J534j023
2743A304n299P34O303n0l320j026k047K02O755L024p409m524K391L824J861J186
2759C909m081m725L451M904j383k153o49k551J349O730L71p202k301K399K463
2774E31L583J186o338n070M647N069n92j608k697l006L727O108k624n736J3J934
2790h73R36L924O70p017l493M952L787M09j062m363k713M563N276k950m170M58
$$ y = [2448, 4486, -48, -1393, -1190, -874, 2416, 3019, -2763, -4886, 1169, 3774, 1152, 278, -1553, -4531, -1324, 4238, 2423, -1603, -1493, -1857, -1244, 3145, 3083, -3121, -4403, 1110, 2918, 1973, 288, -4386, -5664, 1403, 6075, 1677, -2806, -2938, -3034, -501, 4430, 2712, -3286, -3427, -444, 954, 2155, 1526, -4178, -5020, 2216, 5427, 773, -2830, -3695, -3433, 1633, 5922, 1312, -4607, -2908, -70, 793, 2327, 1304, -3995, -3261, 3042, 2992, -328, -1354, -3401, -3199, 3556, 6580, -829, -5353, -2962, 862, 2723, 3909, -172, -4897, -1446, 3458, 2075, -78, -727, -3278, -1929, 4801, 5172, -2030, -4331, -1932, 531, 4114, 5300, -1038, -6108, -1461, 3608, 3016, 1408, -1289, -4295, -568, 5540, 2916, -2820, -2807, -873, 63, 3987, 4657, -2360, -5853, -901, 2886, 3295, 2233, -2130, -4843, -280, 4996, 2046, -2124, -1666]
2806a666J86J474M327j971o753j86N229J867k57n47m764k078N488L890l024k743
2822a528m42r57L808M096m307n890K188M244J170j1j900n386N56O614J924l769
2838D10j352j827j238N217L893n021m750K318K800J258J444l387n413K677O706
2853C735n00l475j238j969L34N837J924n492k454K259J148J511J843m232m301
2868e070L958M992j647j793j839k876K567O770p81o613q78K587R94K100R26n416
2884b019j845M417K451j262q07k416l065M472N590k147o090O8J214K352L119o86
2900C346o139p07M518J754j069l16l160k044N525L607m296k883L33mK440M164
2916E069k203o607M33M379J322K16j427m411J82N865J152m400q72K76q37K725
$$ y = [-1666, -1480, -6, 4321, 2350, -4403, -4589, 640, 2507, 2250, 1703, -3061, -5139, 349, 4239, 1215, -1528, -1970, -2927, 881, 4977, 670, -5220, -3032, 1212, 2382, 2371, 471, -4915, -4359, 2255, 4179, 410, -942, -2769, -4007, 1210, 5103, 82, -4668, -2350, 450, 1708, 3152, -235, -5648, -2971, 3735, 3235, -240, -1478, -3447, -3113, 2724, 4648, -844, -3298, -1039, 109, 1620, 3463, -769, -5070, -1112, 3880, 2233, 440, -1399, -4275, -1708, 5062, 4281, -2332, -3210, -623, 371, 2471, 3397, -2019, -3864, 553, 3004, 1742, 935, -1481, -4546, -74, 5516, 3369, -2721, -2653, -1439, 913, 4032, 3346, -2793, -3500, 1018, 2772, 1703, 1387, -1773, -3817, 1708, 5315, 1019, -1864, -1531, -1535, 905, 5069, 2866, -3741, -3308, 1071, 2393, 2609, 1182, -3229, -3047, 2818, 3970, -430, -1302, -1026, -1863, 862]
2932H62L565l906m830K580L113K78Q06j673m744J061N764p9l433p26o85k68N282
2949B967J396n907k918L301K133L87J228l108m043K513M432p21j315j058k163
2964b876N48N294J36n444q64K897M51J316J151l966l053M306K971k175r32p23
2980i63k268K525M606k309m099P22J752J31K459m68n346n25N390J507k436r58
2996b80j614j403M309L293l326l334J337N03Q79K935k240m769J366M661nj382
3012I30n06k733l64M968K169m426k311J490L54J845K141l110l853L103K374j080
3028I91P0k81l284O57N537O5m235q43P47J86K726J103m303k055L253J941j037
3045A238J21j674k904L032M418j974m348Q41K69R16L388o48n064p73L401J374
$$ y = [862, 4427, 521, -4309, -1729, 1384, 1662, 2468, 795, -3949, -2888, 2876, 2797, -636, -1362, -2047, -2315, 2967, 4363, -1544, -4462, -1161, 972, 1359, 2587, -521, -4564, -2051, 2381, 1660, 345, -713, -2876, -2328, 2966, 3102, -2342, -3206, -309, 142, 1458, 2609, -1357, -4410, -104, 2867, 692, -240, -963, -3231, -706, 3900, 1591, -2508, -1786, -34, 97, 2556, 2088, -3258, -3783, 1607, 3114, 678, -280, -1894, -3297, 1012, 4305, 979, -2355, -1018, -515, 364, 3299, 1059, -3710, -2344, 2317, 2312, 930, 424, -2309, -2673, 2295, 4464, 38, -2273, -783, -429, 1416, 3557, 447, -3406, -303, 2071, 991, 1061, 780, -2504, -1847, 3690, 3755, -480, -1323, -576, -390, 2336, 3439, -864, -2919, 334, 2275, 1238, 1359, -315, -3219, -187, 4231, 2257, -2091, -1250, -981, -65, 3323, 2675, -2389, -3162, 239, 1613]
3061A613M98k74l959k451N429L304l353l036K51K01J812L545j680m820J46K153
3077f21J449J329n17m836p61N078J737l360p21L61j494K147L450l046l624J786
3093a643J929L49J001j714l729K045L991n77k572L09j303m89M060K064n094k873
3109d246K404K541J136P33l554l832L366L869p10j377r94k832J421N103J80m900
3125a692j088J946M88K247J098m054l098L301L176o70o01j936k518K547M458j520
3141B084l958Q63O74N7K540J93m097j261L929J441j160p20j828j822M121L120
3157D176l272k551J145K24J104K754k218m635J562M323K88j714n37k839n63N363
3173B610K020m105k272j05N29L100L173m233n003K740L021O52j84j680l785J011
$$ y = [1613, 2111, 1837, -2122, -4573, 856, 4160, 807, -2229, -1978, -1777, 35, 3580, 1900, -2920, -2774, -621, 828, 2157, 1640, -3196, -3957, 1121, 2858, -502, -1223, -862, -2356, -209, 3241, 195, -3429, -1643, 286, 635, 1636, -78, -3807, -1762, 2229, 1652, -920, -611, -1914, -2403, 1657, 3721, -1373, -4246, -1842, 699, 1835, 2568, -986, -4818, -1452, 2417, 1707, 330, -664, -3496, -2075, 3028, 3208, -1692, -2780, -834, -346, 1901, 2999, -1055, -4153, -852, 2324, 1654, 1053, -883, -3401, -854, 3604, 2084, -1874, -1011, -337, -280, 2260, 2453, -1644, -2905, 1024, 2465, 1305, 585, -1243, -3065, 1056, 4176, 904, -1647, -502, -278, 826, 3580, 1362, -3273, -1711, 2612, 2900, 1186, 649, -2190, -2753, 2610, 4630, 525, -1747, -1852, -1323, 1777, 4950, 717, -4286, -1546, 1475, 2127, 1943, 263, -3522, -2511]
3189b511N367P21l104j314j498M01L674K455m085l237K181J556L82J005j944l520
3205c471K312M258j107k761p35o46R96M209l16n110p91K978P90Q08P00l531k971
3222d388M431M022k658k707j362l25L178M414k347n558j96K259J280L012M26o149
3238b668k575N340K801j225j724j837j671L672M114k221m054p92J073K414L713
3253D360j923o014j5M255J048p54M27k309k259L570L012k756k566O5J041K464
3269A646J973l397m385K712L651m4p49m45l603N1N186O47l371j542M45R77K609
3286B361J047m358l007K481L326Q97L27l555m363K493O000O3l563j318k11J6L311
3303A947J167l281k525J852J372J706Q63l931l276L184M243j096j842p20j897
$$ y = [-2511, 2856, 3577, 473, -841, -2339, -1938, 1736, 4191, 106, -3131, -950, 606, 988, 1993, 49, -3471, -1159, 3099, 1992, -769, -1504, -2150, -1154, 3055, 2739, -2371, -3162, -184, 606, 1414, 2114, -1417, -4388, 43, 4065, 1407, -1300, -2662, -2987, 191, 4605, 2258, -3300, -3496, -1237, 43, 3055, 3481, -2668, -5243, 97, 2898, 1673, -51, -1888, -3559, 113, 4227, 2006, -2048, -2840, -1767, 647, 4360, 2437, -3577, -3592, 663, 1711, 957, 1384, -925, -3184, 386, 3398, 642, -1924, -1859, -818, 1646, 3619, 222, -4163, -1451, 2200, 2156, 1407, 962, -2641, -2590, 2596, 3243, -128, -1670, -1225, -248, 2361, 3408, -950, -3957, -1476, 1850, 2747, 3074, -481, -4844, -2351, 3649, 3712, 149, -1169, -1380, -1364, 1947, 3114, -167, -2692, -840, 532, 2238, 3101, -830, -4106, -922, 3321, 2225, 383, -337, -2234]
3318b234M24M049M41l960l94K064K18M05M15l416j471M594J516k040r93p21j771
3335b874K914L872k148m290L07K073R11J131j180m107R13M134R14k131j101j603
3351b265j017M274L393l121l773m2R81J989K841j938m925J506L446J44j007p21
3367b35k484J94M497J059l481j540N15r3K178K401k092l882J547K238K23m43q83
3384b81k416J663M205p79l989o22J164Q39K565Q01m114k396K626J713K34J73j897
3401e11k277K128M080j531l191j65J8J790L585r38n291j160L279K074K40R0k922
3418g02k195K415L048j465q63o89j219J743L384j813m225O97K255R36R27m93l396
3435a655j401L904J392j543j35j350p34K371J498k725j857K198P08J78J330j618
$$ y = [-2234, -1810, 2239, 2680, -1280, -1674, 390, 608, 1013, 1428, -1988, -3459, 1135, 2651, 611, -382, -1103, -2874, 40, 3912, 1764, -2526, -2219, -146, 765, 1896, 716, -3391, -2478, 1656, 2570, 439, -662, -2265, -3282, 992, 4385, 1264, -2509, -2551, -1570, 419, 3260, 1322, -3603, -2097, 1349, 1493, 486, -235, -2719, -2525, 1972, 3031, -450, -1990, -1475, -1568, 610, 3011, 919, -2963, -1416, 822, 1045, 602, -281, -2697, -1034, 3171, 2392, -1597, -2219, -1055, -216, 2349, 3150, -964, -3360, -734, 979, 1213, 1386, -511, -2788, -660, 3420, 1889, -1302, -1467, -1449, 341, 3926, 2988, -2303, -3463, -184, 1890, 2130, 2220, -702, -2897, -482, 2566, 1101, 238, -451, -1670, 73, 3457, 1644, -2581, -1884, 371, 1307, 2234, 1741, -1655, -3056, 848, 2240, 697, 562, -788, -1522, 849, 2347, -378, -2235, -37, 671, 849, 2179, 561]
3451E61l882P08M812J02j816q53j282L3L255N93l235o15J501rJ036J052k871k998
3469c908K949L358o32j099j161k406P56L696P72k721p78J65o9J936Q84l200j444
3486b902K860K168j606o69q13k081J921L643r68k665k43J25L45K058Ql488L05
3503b002K984o3r20j78j709n18L198K657k585l038M44R89J193K025j666l570J361
3520a398K435m30m8q4k362l88M219J041l312j725K84N16K609J697k685l269J741
3537a159J708J40N92r89k590J063L940p44l012k55K91L64K649P83l484j963J563
3554a103J333J061P72k053k940K295L279j554j816Q9n97J019K656n34l522q94
3570b509K579P77N87O21k822k003K728K248j446q57k65j145J547L108j956l669
$$ y = [561, -3321, -2613, 2199, 2301, 485, -368, -1650, -1617, 1638, 2231, -1004, -1619, -118, -127, 909, 1961, -910, -3908, -959, 2399, 1767, 668, -493, -2899, -2143, 1553, 2325, -396, -1174, -1009, -1078, 858, 1742, -1458, -2902, -42, 2126, 520, -149, -962, -3043, -1122, 2521, 1553, -1112, -1355, -1230, -885, 1173, 1181, -2307, -2002, 982, 919, -1, -179, -1888, -2406, 792, 3449, 864, -2174, -1730, -741, 452, 2477, 811, -2759, -1398, 1037, 607, 559, 475, -1887, -2275, 1944, 2985, -327, -2052, -1768, -1252, 1357, 3054, 369, -2900, -1159, 549, 689, 1281, 292, -2298, -1235, 2705, 1961, -1051, -1306, -1015, -651, 1998, 2781, -703, -2666, -1103, 230, 1291, 2063, 10, -2930, -635, 2644, 1090, -726, -637, -1234, -215, 2441, 1907, -1615, -2509, 70, 847, 1434, 2055, -767, -2770, -42, 2206, 760, -97, -362, -1507, 40, 3148, 1192, -2477]
3586b477O86K035R32J010j146l425n30L910J096j101n09j719j114K747K407k373
3602D29k536J016Q08R66J784j784l985R91L633O30j489p67j523m49L706J103l162
3619f29j227J185J26J332J435k658k988K247L075j73r56j291k249R33M237J97
3635B596l404q95M61J017J947L65l512j238K481J648m38j67j604k402K063L905
3651B823n48l018o77k94J575K729p33l866o22L256O29K73q19j708j550L181K626
3668C257k208j981l69m6J412L270j672l431k08K286N33P06k71l457K5L397J610
3685B853k562j016n53k63K358K386k468l052J061J196R76R34r72k951l1L600P22
3702B218j668j156j069Q9L537J325l596k106J082J319J199J168k089l027J112
$$ y = [-2477, -1791, 244, 1176, 2186, 1040, -2385, -2915, 995, 2091, 990, 481, -1238, -2352, 395, 2802, 429, -2107, -1091, -283, 683, 2467, 683, -3302, -2311, 1322, 1952, 463, -304, -1827, -2276, 1430, 2533, -629, -1856, -671, -545, 787, 2222, -436, -3424, -1177, 1898, 1725, 769, -522, -2771, -1838, 2399, 2596, -808, -1703, -1242, -225, 1722, 2087, -1425, -2663, -182, 1466, 1028, 861, -743, -3145, -1082, 2823, 2275, -743, -1420, -1714, -139, 2590, 1857, -2009, -2631, 625, 1254, 1527, 708, -1000, -2550, 631, 3257, 1049, -932, -1301, -1347, 65, 3335, 1663, -1768, -1976, 310, 843, 1549, 1278, -2179, -2154, 1243, 2853, 291, -725, -1278, -1541, 817, 3203, 735, -2317, -1256, -60, 916, 1850, 878, -2073, -2104, 1496, 2218, 550, -606, -1675, -1586, 1951, 3276, -320, -2426, -1344, -25, 1174, 2342, 253, -2774, -1662]
3717a662K998L46r96q66k228O47L830N85l207j814J319J249J187N01k652k265
3733c028K367K539p71m40j219j891J344L418n36k781m48L44Q04K321K79m188j185
3750c071K411K229o71k78j966j566K648K811j508k125l50K7J004K598m60l855
3766b122j00K438Q13L71m98k430j163L270J588j666j140o24n3K235J584k093k593
3783b183R69J765J33L13l29k535j75L498Q63j810j386m82j4K644J641k973k203
3800b264J656J105O67K55j082k513R73L552l88j848p26j146P95K883M76k745j530
3817a880J361Q35J157O54k717k141J944K885r23j310k10j195J021K486j63k685
3833h81j55L69L21J672P55k794j905K798J244q19l80q40j299K069K226j431k614
$$ y = [-1662, 1336, 1682, 686, -180, -2408, -1761, 2069, 2654, -553, -2367, -1048, 201, 1388, 1889, -763, -3028, -661, 1878, 1107, 667, -552, -2443, -1099, 2319, 1783, -998, -1446, -1102, -298, 2023, 2302, -1886, -3071, -660, 1569, 898, 620, -1346, -2912, -264, 2547, 1039, -1086, -1436, -1409, -405, 2193, 1733, -2122, -2222, 216, 1029, 1400, 902, -1528, -2691, 579, 2167, 501, -639, -1263, -1316, 919, 2503, 410, -2183, -1214, 551, 684, 997, 668, -1867, -2042, 1456, 2319, 509, -877, -1359, -1373, 1271, 2912, -61, -2264, -608, 497, 1164, 1419, 337, -2176, -1203, 2349, 1961, 113, -613, -1759, -964, 1919, 2395, -350, -1880, -519, 316, 1473, 2127, -590, -2731, -787, 2098, 1175, -135, -345, -1540, -519, 1967, 1804, -881, -1036, -667, -346, 1326, 2081, -713, -2618, 180, 1424, 605, 225, -615, -1914, 155, 2381, 950, -1664]
3850a664N12Q93O86J171p78k614%K663L63o60k59j463j354L096J918j969k359
3867a818Q6J067J562J352j844k892J074K130R1l03j45k236l59K979J317k141p63
3884h43l35j50J673J844k076k341J160J407N10N14j453k216J117K946q65j413
3900e21l1J56j68J392Q25k027j145J277J018L12L04j815j876J976K355j016j514
3917d98k04l68P67K605p15k854m20J926M91M32q0j699j318J887J699p89l58j084
3935e80j137J281L056j184k739K74J258L80M51L4k167m80K189N74r66M6m44j248
3953a402J795J288j435j279J086M3n5R97n94k364R99K382m22j290n14o13N72K367
3971A561L11k718m47Q63P5P66J242j943j893J319K185k70p08j041j271P52L383
$$ y = [-1664, -1152, -259, 427, 1598, 820, -1794, -1794, 869, 1232, 572, 313, -1150, -2504, 592, 2510, 541, -1818, -1732, -665, 897, 2249, 405, -2487, -1413, 717, 808, 505, 360, -1876, -2235, 744, 2061, -80, -843, -1178, -1328, 345, 2189, 113, -2228, -1068, 339, 849, 1363, -90, -2306, -1189, 1757, 892, -521, -552, -396, -564, 828, 1653, -374, -1519, -242, 776, 1088, 1392, -423, -2299, -323, 2032, 1016, -498, -702, -1070, -303, 2302, 1587, -1267, -1687, 239, 730, 1162, 1082, -617, -1935, -48, 1651, 862, 504, -580, -1717, -436, 2620, 1436, -1303, -1029, 229, 609, 1060, 1094, -1073, -1553, 636, 1210, 244, 290, -154, -1402, 393, 1681, 246, -1033, 53, 96, 41, 1038, 444, -1920, -921, 1461, 1039, -251, -765, -1378, -806, 1561, 1872, -846, -1293, -430, -355, 411, 1653, -290, -2183, -864, 1321, 1051, 343, -698, -1969, -1217, 2166]
3988B166l66l020k96K60M66J689R34l130q98J624J172m31J59r44j331J467K126
4005A647r57j204o3m07O01J884m73k805M0J997J96m54L70p88j115K119J116j797
4023i3j182J75L64J204J561j938k535J090K004K47j52k93k204J74K685Q94j868
4040A33j120j6L07J881J232k479j909Q76J495L25J264r11l237M19L109N51j429
4057D91m31r02n5J886O85j957p16R74L08O21R56j947k016J840J965q68r53O8o65
4076g16p5K078j28k168j66J432L46M91j31k566o48K826J489j553n61o89j244J431
4094e52K737o48k514l26R48O46J334n96k576l60K743M68k54n38j837j088K467
4111E4K395j175k300l1k44J052J445k78k145M8J512R7j05J00j884l58K660J159
$$ y = [2166, 1800, -1220, -1516, -1256, -790, 899, 1833, -1297, -2195, -571, 601, 170, 329, -615, -1946, -479, 1647, 690, -514, -577, -984, -383, 1501, 1028, -1777, -1737, 260, 456, 2, 372, -416, -1531, 588, 1704, -93, -1275, -1100, -736, 468, 2029, 91, -2444, -1354, 650, 897, 745, 452, -1752, -1578, 1107, 2001, 133, -987, -1003, -696, 1185, 2417, -62, -1971, -1095, 400, 725, 1989, 1078, -2159, -1740, 1369, 1920, 491, 60, -842, -897, 989, 1674, -283, -999, -25, 283, 904, 1860, -87, -2103, -263, 1702, 834, -119, -51, -716, -791, 1287, 1159, -1009, -1175, 257, 603, 1094, 963, -1603, -2251, 575, 2064, 511, -50, -739, -1983, -552, 2185, 1537, -977, -1303, -355, 291, 1625, 1029, -1547, -1907, 836, 1304, 1050, 512, -1325, -2413, 54, 2449, 1274, -1026, -1057, -1301, -249, 1196, 918, -1227, -1179, 333, 430, 325, 425, -1459, -1817, 843, 2002]
4129B002j919r99J86o2P67J579j419j794J180J305m08J17p63j656J053K916k03
4146A882k548n04j12R74J947M25k417k036J689J593L25k8j410j628J164K872r04
4163A284j237n41o96L12K966K21k763j330J086R36R41M02j690j738J315J978j205
4180B41n27L8r69J191K153j235j966m59J240M38J112o9j993p42J892P05n34k01
4198C15j035m98J689J873k069k040J396N63O90Q96r12k574k15K290R03n07p5j827
4216a137k05J762J500j949j074M65k8J470J269j974k526J132K230N80o12m94j916
4233a507j6K026N92q27m17o07p64K090J122k144j584J866R91k47j00n99j708O90
4251a143K270j51j156m24j04O2J504J99k074o7J395J53m8K4j287j369K162K243
$$ y = [2002, 83, -916, -730, -792, -25, 1554, 135, -1659, -479, 826, 418, 535, -228, -1884, -831, 2085, 1882, -666, -1170, -1282, -308, 1639, 2064, -353, -2389, -700, 893, 1218, 1190, -220, -1848, -684, 2188, 1284, 47, -494, -1190, -878, 2088, 2309, -454, -1784, -698, 238, 1179, 1581, -109, -1847, -532, 1446, 241, -286, -248, -1217, -26, 2127, 892, -1074, -1533, -293, 145, 1257, 1188, -805, -1547, 345, 1050, 516, 315, -720, -1218, 471, 2344, 275, -1765, -369, 194, 884, 1780, 868, -1706, -1921, 369, 1272, 765, 690, -1137, -1342, 420, 1920, -29, -1103, -638, -666, 804, 2073, 99, -2427, -1295, 935, 1515, 903, 409, -1507, -1523, 503, 1095, 268, -149, -756, -1520, 570, 1692, -452, -2036, -170, 821, 574, 474, -125, -1833, -1143, 1127, 976, -180, -604, -708, -646, 858, 1057, -1017, -1084, 311, 464, 416, 440, -847, -2216, -54, 2189]
4269B189j117j632l76o85J470J883n23k036l7O67J77Q91M4j701r46K376Q61r68
4287E37o02p73j190J937K197r42k167j02P57J02R96J73j968K27J654o3p83J4m89
4306d85o28K105J129j812j483L85M99N75J354r44k130O31J833l85n36R1j086L39
4324e48K078R1j843o69N59J47J021J076j683j944J239J044j85N03q10r80L72K006
4342A474m60j752k83Q66kJ198R10k631j258J804P23j05N83p34j714O43J757n91
4360D28j113K24j9N9J761k49k410k43J882o3L62K08j600r11J711J056j253r6L0
$$ y = [2189, 1072, -560, -936, -1621, -151, 1732, 1209, -827, -864, -197, -20, 871, 915, -786, -1732, 644, 1505, 537, -65, -838, -2028, -91, 2106, 1164, -1003, -1105, -348, -246, 750, 923, -1045, -818, 836, 773, -10, 4, -485, -1113, 992, 2121, 309, -1174, -789, -290, 285, 1639, 695, -1435, -804, 1029, 644, 108, 199, -887, -548, 1530, 1621, -222, -891, -332, -185, 836, 1912, 229, -1715, -476, 568, 383, 886, 76, -904, -532, 1474, 1014, -738, -1021, -155, -157, 1041, 1951, -680, -1938, -134, 589, 484, 1067, 333, -1381, -738, 1019, 428, -685, -461, -480, -421, 1340, 1091, -1319, -1562, 320, 257, 619, 827, -773, -1684, 27, 1083, -170, -266, -236]
$$ [...]
8191a58
##END NTUPLES=NMR FID
##END=
