##TITLE=1H_EC-3226(3)
 CDCl3, 8 sc, 
 6.3.2020
##JCAMPDX= 6.0         $$ Bruker NMR JCAMP-DX V2.0
##DATA TYPE= NMR FID
##DATA CLASS= NTUPLES
##ORIGIN= UXNMR, Bruker Analytische Messtechnik GmbH
##OWNER= root
$$ XWIN-NMR		Version 3.5
$$ Fri Mar  6 14:14:12 2020 Russian Standard Time (UT+4h)  she@DPX200
##.OBSERVE FREQUENCY= 200.1315
##.OBSERVE NUCLEUS= ^1H
##.DELAY= (6, 6)
##.ACQUISITION MODE= SIMULTANEOUS
##.ACQUISITION SCHEME= undefined
##.AVERAGES= 8
##.DIGITISER RES= 18
##SPECTROMETER/DATA SYSTEM= spect
##.PULSE SEQUENCE= zg30
##.SOLVENT NAME= D2O
##.SHIFT REFERENCE= (INTERNAL, D2O, 0, 15.7039)
##AUDIT TRAIL= $$ (NUMBER, WHEN, WHO, WHERE, WHAT)
$$ ##TITLE= Audit trail, XWIN-NMR		Version 3.5
$$ ##JCAMPDX= 5.01
$$ ##ORIGIN= Bruker BioSpin GmbH
$$ ##OWNER= she
$$ F:/spectra/data/she/nmr/H-F/1/audita.txt
$$ ##AUDIT TRAIL=  $$ (NUMBER, WHEN, WHO, WHERE, WHAT)
(   1,<2020-03-06 14:12:59.01 +0400>,<she>,<DPX200>,
      <created by zg, POWCHK disabled, PULCHK disabled
       configuration hash MD5:
       00 E9 B6 7A A2 85 ED C7 34 08 36 98 17 FE 4E 26
       data hash MD5: 16K
       C5 E4 5B 65 AA A7 CF B5 8C 1E F9 F1 1A 1B 46 C0>)
$$ ##END=
$$ 
$$ hash MD5
$$ 1F 6F 65 32 F7 FD 14 A2 3D F1 6B B1 28 62 A3 51
##$RELAX= 
##$RELAX= 
##$RELAX= 
##$RELAX= 
##$RELAX= 
##$RELAX= 
$$ Bruker specific parameters
$$ --------------------------
##$DU= <F:/spectra>
##$EXPNO= 1
##$NAME= <H-F>
##$PROCNO= 1
##$TYPE= <nmr>
##$USER= <she>
##$AMP= (0..31)
100 100 100 100 100 100 100 100 100 100 100 100 100 100 100 100 100 100 
100 100 100 100 100 100 100 100 100 100 100 100 100 100 
##$AQSEQ= 0
##$AQ_mod= 1
##$AUNM= <au_zg>
##$AUTOPOS= <>
##$BF1= 200.13
##$BF2= 200.13
##$BF3= 200.13
##$BF4= 200.13
##$BF5= 200.13
##$BF6= 200.13
##$BF7= 200.13
##$BF8= 200.13
##$BYTORDA= 1
##$CFDGTYP= 0
##$CFRGTYP= 5
##$CHEMSTR= <none>
##$CNST= (0..31)
1 1 145 1 1 1 1 1 1 1 1 1 1 1 1 1 1 1 1 1 1 1 1 1 1 1 1 1 1 1 1 1 
##$CPDPRG= <>
##$CPDPRG1= <>
##$CPDPRG2= <>
##$CPDPRG3= <>
##$CPDPRG4= <mlev>
##$CPDPRG5= <mlev>
##$CPDPRG6= <mlev>
##$CPDPRG7= <mlev>
##$CPDPRG8= <mlev>
##$CPDPRGB= <>
##$CPDPRGT= <>
##$D= (0..31)
0 1.2 0 0 0 0 0 0 0 0.06 0 0.03 0 0 0 0 0.0002 0 0 0 0 0 0 0 0 0 0 0 0 
0 0 0 
##$DATE= 1583489578
##$DBL= (0..7)
120 120 120 120 120 120 120 120 
##$DBP= (0..7)
150 150 150 150 150 150 150 150 
##$DBP07= 0
##$DBPNAM0= <>
##$DBPNAM1= <>
##$DBPNAM2= <>
##$DBPNAM3= <>
##$DBPNAM4= <>
##$DBPNAM5= <>
##$DBPNAM6= <>
##$DBPNAM7= <>
##$DBPOAL= (0..7)
0.5 0.5 0.5 0.5 0.5 0.5 0.5 0.5 
##$DBPOFFS= (0..7)
0 0 0 0 0 0 0 0 
##$DE= 6
##$DECBNUC= <off>
##$DECIM= 24
##$DECNUC= <off>
##$DECSTAT= 4
##$DIGMOD= 1
##$DIGTYP= 9
##$DL= (0..7)
0 120 120 120 120 120 120 120 
##$DP= (0..7)
150 150 150 150 150 150 150 150 
##$DP07= 0
##$DPNAME0= <>
##$DPNAME1= <>
##$DPNAME2= <>
##$DPNAME3= <>
##$DPNAME4= <>
##$DPNAME5= <>
##$DPNAME6= <>
##$DPNAME7= <>
##$DPOAL= (0..7)
0.5 0.5 0.5 0.5 0.5 0.5 0.5 0.5 
##$DPOFFS= (0..7)
0 0 0 0 0 0 0 0 
##$DQDMODE= 0
##$DR= 18
##$DS= 0
##$DSLIST= <SSSSSSSSSSSSSSS>
$$ [...]
##$SUBNAM2= <"">
##$SUBNAM3= <"">
##$SUBNAM4= <"">
##$SUBNAM5= <"">
##$SUBNAM6= <"">
##$SUBNAM7= <"">
##$SUBNAM8= <"">
##$SUBNAM9= <"">
##$SW= 24.9337058887773
##$SWIBOX= (0..15)
0 0 2 0 0 0 0 0 0 0 0 0 0 0 0 0 
##$SW_h= 4990.01996007984
##$TD= 16384
##$TD0= 1
##$TE= 0
##$TE2= 300
##$TE3= 300
##$TEG= 300
##$TL= (0..7)
0 120 120 120 120 120 120 120 
##$TP= (0..7)
150 150 150 150 150 150 150 150 
##$TP07= 0
##$TPNAME0= <>
##$TPNAME1= <>
##$TPNAME2= <>
##$TPNAME3= <>
##$TPNAME4= <>
##$TPNAME5= <>
##$TPNAME6= <>
##$TPNAME7= <>
##$TPOAL= (0..7)
0.5 0.5 0.5 0.5 0.5 0.5 0.5 0.5 
##$TPOFFS= (0..7)
0 0 0 0 0 0 0 0 
##$TUNHIN= 0
##$TUNHOUT= 0
##$TUNXOUT= 0
##$USERA1= <user>
##$USERA2= <user>
##$USERA3= <user>
##$USERA4= <user>
##$USERA5= <user>
##$V9= 5
##$VALIST= <valist>
##$VCLIST= <CCCCCCCCCCCCCCC>
##$VD= 0
##$VDLIST= <DDDDDDDDDDDDDDD>
##$VPLIST= <PPPPPPPPPPPPPPP>
##$VTLIST= <TTTTTTTTTTTTTTT>
##$WBST= 1024
##$WBSW= 4
##$XGAIN= (0..3)
0 0 0 0 
##$XL= 0
##$YL= 0
##$YMAX_a= 573839
##$YMIN_a= -462985
##$ZGOPTNS= <>
##$ZL1= 120
##$ZL2= 120
##$ZL3= 120
##$ZL4= 120
##$ABSF1= 10
##$ABSF2= 0
##$ABSG= 5
##$ABSL= 3
##$ALPHA= 0
##$AQORDER= 0
##$ASSFAC= 0
##$ASSFACI= 0
##$ASSFACX= 0
##$ASSWID= 0
##$AUNMP= <proc_1d>
##$AZFE= 0.1
##$AZFW= 0.1
##$BCFW= 1
##$BC_mod= 2
##$BYTORDP= 1
##$COROFFS= 0
##$CY= 11.3945322036743
##$DATMOD= 1
##$DC= 2
##$DFILT= <>
##$DTYPP= 0
##$F1P= 16.9975609425685
##$F2P= -3.02152046262296
##$FCOR= 0.5
##$FTSIZE= 0
##$FT_mod= 4
##$GAMMA= 1
##$GB= 0.15
##$INTBC= 1
##$INTSCL= 1
##$ISEN= 128
##$LB= 0.24
##$LEV0= 0
##$LPBIN= 0
##$MAXI= 10000
##$MC2= 0
##$MEAN= 0
##$ME_mod= 0
##$MI= 1.114404
##$NCOEF= 0
##$NC_proc= 0
##$NLEV= 6
##$NOISF1= 3.799351
##$NOISF2= 2.8
##$NSP= 1
##$NTH_PI= 0
##$NZP= 0
##$OFFSET= 15.70392
##$PC= 1
##$PHC0= -9787.917
##$PHC1= 17.00082
##$PH_mod= 1
##$PKNL= yes
##$PPARMOD= 0
##$PSCAL= 0
##$PSIGN= 0
##$REVERSE= no
##$SF= 200.130013532006
##$SI= 16384
##$SIGF1= 3
##$SIGF2= 2
##$SINO= 400
##$SIOLD= 16384
##$SREGLST= <1H.CDCl3>
##$SSB= 0
##$STSI= 0
##$STSR= 0
##$SW_p= 3612.71676300578
##$SYMM= 0
##$S_DEV= 0
##$TDeff= 0
##$TDoff= 0
##$TI= <>
##$TILT= no
##$TM1= 0
##$TM2= 0
##$TOPLEV= 0
##$USERP1= <user>
##$USERP2= <user>
##$USERP3= <user>
##$USERP4= <user>
##$USERP5= <user>
##$WDW= 1
##$XDIM= 8192
##$YMAX_p= 0
##$YMIN_p= 0
$$ End of Bruker specific parameters
$$ ---------------------------------
##NTUPLES= NMR FID
##VAR_NAME=  TIME,          FID/REAL,        FID/IMAG
##SYMBOL=    X,             R,               I
##VAR_TYPE=  INDEPENDENT,   DEPENDENT,       DEPENDENT
##VAR_FORM=  AFFN,          ASDF,            ASDF
##VAR_DIM=   8192,          8192,            8192
##UNITS=     SECONDS,       ARBITRARY UNITS, ARBITRARY UNITS
##FACTOR=    0.0002004,     1,               1
##FIRST=     0,             0,               0
##LAST=      1.6414764,     0,               0
##MIN=       0,             -462985,         0
##MAX=       1.6414764,     573839,          0
$$ Real data points
##PAGE= N=1
##DATA TABLE= (X++(R..R)), XYDATA
$$ [...]
$$ plain form
2648 -3970 -4134 -1756 4116 5857 129 -4213 -3556 -976 2045 4155 1741 -3624 -3228 425 1728 2130
2664 2130 1391 -2293 -3439 871 3026 1152 -211 -1606 -2824 25 4345 2045 -1629 -2487 -1179
2679 -1179 392 3467 3975 -1288 -3782 -1845 778 2914 4072 741 -4278 -2999 1591 2855 3024
2694 3024 1904 -2753 -3992 579 3418 2251 968 -809 -3026 -1011 3044 2706 -460 -829 -1339 -1347
2710 -1347 1862 3098 -486 -2170 -799 137 658 2268 710 -2900 -1498 1280 1582 1514 901 -2333
2726 -2333 -3122 1007 3200 663 -261 -1229 -3050 -802 3103 2123 -965 -1873 -1892 -1659 1975 3425 -591
2743 -591 -2464 -1595 -1345 -88 2545 1242 -2979 -2291 -169 -233 867 1616 -1043 -2433 -378 842 -320
2760 -320 322 -81 -1831 -1039 1916 575 -1296 -287 -566 -1443 770 1690 -1377 -1892 117 -203 133
$$ packed form
2648c970j64K378N872J741n728m342O57K580L021K110k414n365L96L653J303M02
2664B130p39l684j146M310K155j874j363j395j218K849M320k300l674q58J308
2679a179J571L075N08n263k494J937K623K136J158l331n019J279M590J264J69
2694C024j120m657j239M571K839j167j283j777k217K015M055l38l166l69n10q
2710a347L209J236l584j684J371R36N21J610j558l610J402K778L02o8o13l234
2726b333p89M129K193k537r24r68j821K248L905r80l088r08j9K33L634J450m016
2743e91j873Q69K50J257K633j303m221O88K122o4J100P49k659j390K055J220j162
2760c20O42m03j750P92K955j341j871J009k79q77K213R20l067n15K009l20L36
$$ plain form
2777 133 1679 252 -2499 -1324 1222 280 487 1184 -1484 -2250 763 1944 486 263 -7 -2127 -717
2794 -717 2011 1230 -102 94 -484 -1551 830 2186 -118 -945 322 -887 -486 1949 1680 -918 -533
2811 -533 775 -322 293 1867 83 -1373 482 836 -467 777 1450 -1101 -803 1112 526 -564
2827 -564 859 653 -1297 489 1366 -455 -602 1068 -26 -527 1314 591 -1200 41 930 -190 -166
2844 -166 986 -255 -1238 567 690 -812 158 730 -1150 -547 1210 194 -892 257 229 -1225 62
2861 62 1174 -931 -933 442 -677 -1057 1024 516 -1231 -173 597 -906 -366 1305 -215 -1492 253
2878 253 172 -1276 362 1112 -1095 -1287 494 -273 -1185 803 386 -1810 -305 829 -659 -180 864
2895 864 -548 -1729 159 454 -661 390 819 -1229 -506 1156 -51 -767 949 142 -1647 140
$$ packed form
2777A33J546j427k751J175K546r42K07O97k668p66L013J181j458k23k70k120J410
2794g17K728p81j332J96n78j067K381J356k304q27J267j209M01K435k69k598L85
2811e33J308j097O15J574j784j456J855L54j303J244O73k551K98J915n86j090
2827e64J423k06j950J786Q77j821j47J670j094n01J841p23j791J241Q89j120K4
2844a66J152j241r83J805J23j502R70N72j880O03J757j016j086J149k8j454J287
2861F2J112k105kJ375j119l80K081n08j747J058P70j503N40J671j520j277J745
2878B53q1j448J638P50k207j92J781p67r12J988m17k196J505J134j488M79J044
2895H64j412j181J888K95j115J051M29k048P23J662j207p16J716q07j789J787
$$ plain form
2911 140 979 -345 -360 874 0 -875 710 757 -922 483 1304 -733 -398 1047 -20 -592 1159 638
2929 638 -1101 290 1390 -548 -458 1439 -58 -590 960 735 -917 376 1314 -605 -501 1116 16
2946 16 -492 1174 756 -1098 88 1186 -272 -195 1413 152 -952 642 743 -366 611 874 -857
2963 -857 -564 1126 416 -581 934 580 -1289 142 1081 -402 -536 846 -490 -1355 470 692 -169
2980 -169 173 791 -1231 -610 1138 69 -668 721 142 -1431 -106 1423 -197 -379 509 -845 -1321
2997 -1321 465 771 -699 -37 38 -1176 -487 971 -42 -1183 222 -51 -1611 271 1018 -712 -792
3014 -792 213 -395 -800 619 504 -1022 -111 577 -484 -739 689 -427 -1093 710 405 -1134 -397
3031 -397 209 -881 -229 1029 -330 -1313 -511 171 -465 661 1249 -1244 -1339 706 207 148 1587 -4
$$ packed form
2911A40Q39j324j5J234q74q75J585M7j679J405Q21k037L35J445j067n72J751n21
2929F38j739J391J100j938R0J897j497n32J550k25j652J293R38j919J04J617j100
2946A6n08J666m18j854J186J098j458P7J608j261j104J594J01j109R77K63j731
2963h57K93J690p10r97J515l54j869J431R39j483j34J382j336q65J825K22q61
2980a69L42O18k022O21J748j069p37J389n79j573J325J529j620j82Q88j354m76
2997a321J786L06j470O62P5j214O89J458j013j141J405k73j560J882P47j730q0
3014g92J005o08m05J419j15j526R11O88j061k55J428j116o66J803l05j539P37
3031c97O06j090O52J258j359r83Q02O82o36J126N88k493r5K045m99n9J439j591
$$ plain form
3049 -4 -1857 -664 1170 244 590 1195 -754 -1626 766 977 -165 569 655 -1029 -296 1819 526 -473
3067 -473 470 11 -728 859 1698 -803 -1077 669 360 116 1154 59 -1403 -376 1356 661 586 832
3085 832 -1200 -2068 1109 2238 405 222 -663 -1924 -419 2603 1399 -656 -764 -1564 -1381 1421 2482
3102 2482 -97 -1184 -639 -805 332 1850 1382 -1647 -1336 383 29 577 1232 -997 -1457 524 917
3119 917 -283 -245 -95 -1628 -67 2248 -62 -1855 -1341 -711 -674 1730 1527 -1577 -2674 -873 304
3136 304 1316 2408 -254 -3458 -2376 568 1556 1851 1039 -2477 -3499 -155 1879 1700 799 -958
3152 -958 -3381 -1726 2163 2447 83 -602 -1680 -2026 999 2427 16 -1308 -479 -962 -138 1710 307
3169 307 -2211 -601 764 632 406 270 -2109 -1941 1393 2570 472 -697 -1930 -2617 135 3819
$$ packed form
3049dj853J193J834r26L46O05j949q72K392K11j142P34Q6j684P33K115j293r99
3067d73R43m59p39J587Q39k501k74J746l09k44J038j095j462J027J732o95p5K46
3085H32k032q68L177J129j833j83q85j261J505L022j204k055j08q00J83K802J061
3102B482k579j087N45j66J137J518m68l029L11J719l54N48O55k229m60J981L93
3119I17j200L8J50j533J561K315k310j793N14O30L7K404k03l104j097J801J177
3136C04J012J092k662l204J082K944R88K95q12l516j022L344K034j79r01j757
3152i58k423J655L889K84k364o85j078l46L025J428k411j324Q29m83Q24J848j403
3169C07k518J610J365j32k26j36k379J68L334J177k098j169j233o87K752L684
$$ plain form
3185 3819 2330 -1189 -2030 -2235 -637 3342 4079 92 -3013 -2258 -872 1623 4378 1770 -2778 -2669
3201 -2669 -482 1136 3092 2283 -919 -3252 -574 1575 1283 1440 147 -2331 -702 2220 1381 -331
3217 -331 -544 -941 -462 1814 2175 -858 -2358 -914 723 1747 2565 -432 -3517 -2239 1732 2685 2731
3234 2731 642 -3302 -3842 235 3564 2867 528 -2256 -4237 -1601 3449 3962 243 -1632 -3311 -2732
3250 -2732 1749 3703 938 -1840 -2055 -1887 -61 3146 1421 -1846 -1782 -618 601 1205 746 -1445
3266 -1445 -2485 420 1648 680 -368 -1635 -2538 -41 3060 1942 -1268 -2682 -2614 -867 3066 3569
3282 3569 -742 -3826 -2988 -545 2548 4212 1075 -3962 -3796 -764 2009 3951 2270 -2498 -4519
3297 -4519 -1146 2091 2612 1850 -818 -3721 -2189 2259 2698 1487 -513 -1887 -1798 1409 2858 291
$$ packed form
3185C819j489l519q41k05J598L979P37l987l105P55J386K495K755k608m548J09
3201b669K187J618J956q09l202k333K678K149k92J57j293k478J629K922q39j712
3217c31k13l97M79K276L61l033j500J444J637J024Q18k997l085J278L971R53M6
3234B731k089l944n40M077L329o97k339k784j981K636N050N13l719j875j679N79
3250b732M481J954k765k778k15J68J826L207j725l267O4J164J219O04m59k191
3266a445j040K905J228r68j048j267r03K497L101j118l210j414O8J747L933N03
3282C569m311l084Q38K443L093J664l137n037J66L032K773J942j681m768k021
3297d519L373L237N21p62k668k903J532M448M39j211k000j374Q9L207J449k567
$$ plain form
3313 291 -1499 -879 -678 1005 2642 308 -2520 -2036 1163 1940 2396 768 -2962 -3129 859 3504 2554
3330 2554 662 -2148 -3820 -473 4042 3721 689 -2087 -3305 -2039 2678 5045 1281 -2182 -2741
3345 -2741 -1712 976 4080 2344 -1685 -2708 -1194 594 2479 2508 -1006 -2945 -937 1507 1188 1105
3361 1105 -473 -2617 -718 2504 1432 -596 -1430 -1891 -741 2496 2722 -561 -2572 -2225 -454 1870
3377 1870 3575 355 -3486 -3143 -128 1618 3252 1665 -2997 -4396 -1050 2280 2866 1389 -1258
3392 -1258 -4190 -2197 2342 2888 1038 -697 -2898 -2601 751 2896 840 -1270 -1552 -1739 48 2173
3408 2173 1176 -1759 -1654 -431 362 1538 1078 -1684 -2691 -51 1822 1182 207 -1459 -2811 -570
3424 -570 2422 2085 -168 -1550 -2087 -1204 2353 3735 475 -2149 -2083 -1210 957 3910 1453 -2266 -2536
$$ packed form
3313B91j790O20K01J683J637k334k828M84L199P77M56j628l730j67L988K645r50
3330B554j892k810j672L347M515l21l032k776j218J266M717K367l764l463n59
3345b741J029K688L104j736m029j023J514J788J885K9l514j939K008K444l19q3
3361A105j578k144J899L222j072k028q34m61J150L237K26l283k011L47J771K324
3377A870J705l220l841L43L015J746J634j587m662j399L346L330N86j477k647
3392a258k932J993M539N46j850j735k201K97L352K145k056k110k82j87J787K125
3408B173r97k935J05J223P93J176m60k762j007K640J873o40r75j666j352K241
3424e70K992l37k253j382n37Q83L557J382l260k624O6Q73K167K953k457l719k70
$$ plain form
3441 -2536 -706 934 2496 2276 -1086 -2926 -788 1438 1686 1758 -67 -2289 -1159 1390 1890 493
3457 493 -225 -1205 -1223 1312 2341 454 -901 -930 -565 812 2246 932 -1802 -1307 255 907 2156
3474 2156 1474 -1389 -2673 -367 1497 1512 1148 -286 -2661 -1156 1987 2214 553 -57 -1457 -1946 820
3491 820 2363 553 -590 -1340 -1180 -103 2110 1125 -1514 -1162 -313 -366 1011 1306 -679 -2109 -398
3508 -398 1020 595 381 -238 -1814 -598 1321 937 -354 -528 -1434 -1495 698 1992 -293 -1439 -1126
3525 -1126 -1006 237 2110 906 -1599 -1698 -701 -125 1125 1739 -783 -2126 -528 331 448 1009 187
3542 187 -1868 -1175 766 890 130 213 -829 -1600 524 1093 -35 -606 -253 -696 -197 1455 654 -757
3560 -757 -502 276 37 525 945 -564 -1237 316 587 551 535 -6 -1268 -476 1169 914 -88 82 -216
$$ packed form
3441b536J830J640J562k20l362j840K138K226K48P2j825k222J130K549N00j397
3457D93p18r80j8K535J029j887j355k9L65J377J434j314k734M95J562O52J249
3474B156o82k863j284K306J864J5l64j434k375J505L143K27j661o10j400m89K766
3491H20J543j810j143p50J60J077K213r85k639L52Q49n3J377K95j985j430J711
3508c98J418m25k14o19j576J216J919l84j291j74r06o1K193J294k285j146L13
3525a126J20J243J873j204k505r9R97N76J250O14k522j343J598Q59J17N61q22
3542A87k055O93J941J24p60Q3j042p71K124N69j128n71L53m43M99J652q01j411
3560g57K55P78k39M88M20j509o73J553K71l6j6n41j262P92J645k55j002J70k98
$$ plain form
3579 -216 -945 745 1558 -63 -461 -235 -401 -154 1451 849 -803 -698 95 -387 887 1370 -187 -914
3597 -914 286 549 257 956 495 -1069 -504 774 599 28 589 -214 -851 400 989 -3 -163 270 -575
3616 -575 -305 799 545 -518 169 245 -583 -97 730 -423 -455 117 38 -638 237 262 -927 -341 529 -121
3636 -121 -251 435 -259 -1061 -19 305 -500 -358 170 -747 -462 925 264 -902 -126 150 -509 -107 754
3655 754 -525 -816 111 -56 -295 233 281 -876 -364 414 -269 -301 297 -171 -1010 -118 328 -254 -91 275
3675 275 -439 -534 100 590 -413 494 319 -772 -185 505 38 -439 446 101 -623 309 623 -436 76
3694 76 478 -255 -487 651 593 -220 310 472 19 -142 582 -179 -143 462 -8 7 698 726 -121 -213 860
3715 860 -125 -213 967 359 -630 409 942 -385 81 690 123 -316 830 213 -367 168 611 -306 90
$$ packed form
3579b16p29J690Q13j621l98K26j66K47J605o02j652J05P93m82J274M83j557p27
3597i14J200K63k92O99m61j564N65J278j75n71N61q03o37J251N89r92j60M33q45
3616e75K70J104k54j063O87P6q28M86Q27j153l2N72p9o76Q75K5j189N86Q70o50
3636a21j30O86o94q02J042L24q05J42N28r17K85J387o61j166P76K76o59M02Q61
3655G54j279k91R27j67k39N28M8j157N12P78o83l2N98m68q39Q92M46n82J63L66
3675B75p14r5O34M90j003R07j75j091N87O90m67m77Q85l45p24R32L14j059N12
3694G6M02p33k32J138n8q13N30J62m53j61P24p61L6O05m70J5O91K8q47r2J073
3715H60r85q8J180o08r89J039N33j327M66O09n67m39J146o17n80N35M43r17L96
$$ plain form
3734 90 862 76 -281 511 363 -226 576 134 -601 -232 363 -153 -53 341 -193 -575 64 520 -128 -30 553
3755 553 -597 -350 562 406 -508 -11 209 -665 81 504 -54 -620 0 -40 -537 241 474 -616 -399 149
3775 149 -228 -454 878 119 -616 -181 175 -724 -107 591 -253 -640 127 -156 -591 248 181 -402 -465 326
3795 326 -155 -377 300 238 -474 161 108 -455 -7 513 16 -580 185 -28 -713 404 360 -765 115 577
3815 577 -158 -150 429 397 -515 -35 394 -185 15 394 147 -237 470 76 -500 427 464 -11 112 676 -271
3836 -271 -779 776 494 -229 151 625 -768 208 740 344 -180 482 -225 -450 524 831 -413 97 435
3855 435 -317 95 719 461 -574 93 326 99 228 800 -588 -754 541 264 234 65 253 -501 12
3874 12 716 333 -276 289 -249 -753 571 845 -98 -479 -104 -518 -53 911 158 -635 -729 -52 -382 524
$$ packed form
3734I0P72p86l57P92j48n89Q02m42p35L69N95n16J00L94n34l82O39M56o48R8N83
3755E53j150K47R12j56r14M97K20q74P46M23n58n66O20m0m97P78K33j090K17N48
3775A49l77k26J332p59p35M35L56q99O17O98q44l87P67k83m35Q39o7n83o3P91
3795C26m81k22O77o2p12O35n3n63M48N20m97n96P65k13o85J117m4j125Q80M62
3815E77p35QN79l2r12M80M29n79K00L79k47l84P07l94n76R27L7m75J23N64r47
3836b71n08J555k82p23L80M74j393R76N32l96n24O62p07k25R74L07j244N10L38
3855D35p52M12O24k58j035O67K33k27J29N72j388j66J295k77l0j69J88p54N13
3874A2P04l83o09N65n38n04J324K74r43l81L75m14M65R64p53p93r4O77l30R06
$$ plain form
3894 524 917 -496 -1105 197 103 28 833 85 -1341 -527 621 394 -223 27 -453 -776 636 398 -302
3913 -302 -481 78 -496 91 1030 -127 -1204 -578 65 -104 548 471 -861 -1558 65 823 437 452 -717
3932 -717 -1770 -510 1406 794 155 -47 -1113 -1298 844 1768 221 -513 -765 -868 -39 1552 748 -558
3950 -558 -1025 -226 -305 920 980 -594 -966 78 685 321 781 -137 -1363 -517 945 964 74 -107 -771
3969 -771 -526 1054 1500 220 -1116 -712 -628 834 1740 852 -1138 -1167 -326 631 1660 1169 -1166 -1938
3987 -1938 -99 769 1148 1171 -212 -1925 -1002 830 1485 664 285 -1196 -1366 653 1738 714 -620
4004 -620 -718 -1218 84 1409 838 -1010 -872 -415 274 1042 1144 -1266 -1999 -406 640 1020 636 -806
4022 -806 -2019 -658 1619 1430 403 -694 -2012 -1493 1316 2191 623 -780 -1819 -1415 26 2198
$$ packed form
3894E24L93j413o09J302r4p5Q05p48j426Q14J148k27o17K50m80l23J412k38p00
3913c02j79N59n74N87R39j157j077O26O43j69O52p7j332o97J623P58l86J5j169
3932g17j053J260J916o12o39k02j066j85K142R24j547p34k52j03Q29J591q04j306
3950e58m67P99p9J225O0j574l72J044O07l64M60r18j226Q46J462J9q90j81o64
3969g71K45J580M46j280j336M04Q4J462R06q88j990k9Q41R57J029m91k335p72
3987a938J839Q68L79K3j383j713R23J832O55q21l79j481j70K019J085j024j334
4004f20r8n00J302J325n71j848J38M57O89P68J02k410p33J593J046L80l84j442
4022h06j213J361K277j89j027j097j318N19K809Q75j568j403j039M04J441K172
$$ plain form
4038 2198 1576 -1407 -1864 -1294 -203 1843 1723 -953 -2371 -864 369 1190 1198 -258 -2101 -1162 859
4055 859 1189 531 -262 -1366 -1337 902 1629 309 -1088 -1231 -795 543 2242 797 -1274 -1779 -613
4072 -613 709 2014 1311 -1179 -2586 -880 903 1960 1650 -836 -2785 -1442 1522 2142 1418 -243
4088 -243 -1940 -1933 921 2798 1308 -226 -1433 -1763 436 2232 1508 -583 -1137 -770 113 1709 1509
4105 1509 -484 -2046 -634 628 1147 1278 -497 -2194 -711 1565 1688 698 -558 -1836 -1535 1038
4121 1038 2499 911 -912 -1693 -1441 548 2729 1278 -1230 -2031 -1259 283 2070 2244 -500 -2620
4137 -2620 -1415 584 1638 1762 -215 -2198 -1373 750 1804 1123 106 -2050 -1780 400 1953 950
4153 950 -198 -1529 -1518 154 1903 1175 -1316 -1836 -722 178 1734 1721 -1394 -2435 -902 1060 1803
$$ packed form
4038B198o22k983m57N70J091K046j20k676j418J507J233Q21Qj456j843R39K021
4055H59L30o58p93j104K9K239P27j320j397j43M36J338J699j445k071n05J166
4072f13J322J305p03k490j407J706J783J057l10k486j949J343K964O20p24j661
4088b43j697PK854J877j490j534j207l30K199J796p24k091n54L67Q83J596k00
4105A509j993j562J412J262N19J31j775j697J483K276J23r90j256j278L01K573
4121A038J461j588j823p81K52J989K181j451k508q01P72J542J787J74k744k120
4137b620J205J999J054J24j977j983Q25K123J054o81j017k156K70K180J553j003
4153I50j148j331J1J672J749p28k491n20J114R00J556j3l115j041J533J962P43
$$ plain form
4170 1803 1283 -901 -2618 -1655 1256 2127 1033 -443 -2116 -2104 868 2371 1196 -357 -1552 -2143
4186 -2143 157 2271 1313 -864 -1455 -1533 -380 1632 1804 -474 -1803 -1034 109 1226 1350 -54 -2144
4203 -2144 -1473 1018 1371 1167 351 -1639 -1628 958 1699 944 -678 -1435 -1446 328 2324 1243 -1133 -1566
4221 -1566 -912 237 2099 1916 -431 -1914 -1286 372 1690 2039 268 -2028 -1261 850 1592 1383 295
4238 295 -1725 -1929 273 1710 1269 -98 -1152 -1538 149 2189 1401 -567 -1241 -781 46 1352 1475
4255 1475 -557 -1740 -780 693 1273 1452 -7 -1884 -1027 846 1311 806 -66 -1556 -1671 578 2229
4272 2229 665 -578 -1409 -1649 50 2190 1183 -622 -1451 -1243 -465 1539 1651 -160 -1619 -969 17
4289 17 977 1395 48 -1895 -1187 298 845 738 163 -1399 -1335 631 1358 555 -214 -806 -1011 175 1216
$$ packed form
4170A803n20k184j717R63K911Q71j094j476j673J2K972J503j175j553j195n91
4186b143K300K114r58k177n91p8J153K012J72k278j329P69J143J117J24j404k090
4203b144O71K491L53k04q16j990J1K586P41p55j622p57j1J774J996j081k376m33
4221a566O54J149J862j83k347j483O28J658J318L49j771k296P67K111P42k09j088
4238B95k020k04K202J437m41j367j054l86J687K040p88j968o74M60Q27J306J23
4255A475k032j183R60J473N80J79j459j877Q57J873M65n05q72j490j15K249J651
4272B229j564j243q31k40J699K140j007j805q29K08P78K004J12j811j459O50R86
4289A7R60M18j347j943P08J485N47j07n75j562O4J966P27q03p69n92k05J186J041
$$ plain form
4308 1216 738 -528 -1028 -550 -22 1418 1145 -636 -1361 -604 317 1043 1502 -102 -1589 -1010 269 813
4326 813 572 392 -1259 -1431 88 1289 643 222 -444 -1152 -315 1200 986 -410 -481 -708 -255 1107
4344 1107 1199 -456 -781 -239 107 261 1368 557 -1260 -711 489 699 630 761 -634 -804 280 1001
4362 1001 275 50 -392 -1109 5 1061 884 -224 -394 -568 -185 776 1052 -30 -747 -420 1 366
4380 366 1060 452 -823 -828 11 350 380 387 -280 -694 136 453 434 -254 -142 -738 -554 940 516 -316 -206
4401 -206 -488 -620 425 747 -143 -771 -306 -79 261 703 220 -1067 -753 185 173 199 446 -585 -786 101
4421 101 559 64 -107 177 -942 -418 507 172 -152 -258 47 -623 319 427 76 -368 -94 -595 -269 517
4441 517 223 -549 -249 -135 62 283 683 -255 -685 285 260 -256 200 265 -590 -382 731 146 -161 360
$$ packed form
4308A216m78j266n00M78N28J440k73j781p25P57R21P26M59j604j487N79J279N44
4326H13k41j80j651j72J519J201o46m21o66p08Q37J515k14j396p1k27M53J362
4344A107R2j655l25N42L46J54J107q11j817N49J200K10o9J31j395j70J084P21
4362A001p26k25m42p17J114J056j77j108j70j74L83R61K76j082p17L27M21L65
4380C66O94o08j275nQ39L39L0Po67m14Q30L17j9o88J12n96J84J494m24q32J10
4401b06k82j32J045L22q90o28M65K27L40M42m83j287L14R38j2K6K47j031k01Q87
4421A01M58m95j71K84j119N24R25l35l24j06L05o70R42J08l51m44K74n01L26P86
4441E17k94p72L00J14J97K21M00r38m30R70k5n16M56O5q55K08J113n85l07N21
$$ plain form
4461 360 109 -736 122 559 -64 -151 206 92 -128 311 278 -222 -197 378 -118 1 483 119 -302 106 221
4482 221 -23 -19 453 -161 -451 621 -37 365 572 61 -267 360 383 183 36 432 -158 -256 367 253 -223
4503 -223 -192 302 -383 192 698 172 -335 273 -21 -379 145 400 -249 -215 254 -110 -227 613 141 -470 -185
4524 -185 198 -383 -216 277 -424 -627 446 410 -364 81 143 -518 -130 412 189 -402 284 -340 -618 121
4544 121 699 -211 -293 80 -331 -326 349 258 -499 -79 171 -61 208 -28 -414 -694 353 182 -449 73 669
4565 669 -793 -91 415 -364 -169 204 24 -312 9 490 -289 -159 254 -164 -161 265 107 -244 -41 35 -587
4586 -587 -17 71 -107 -103 55 49 -139 -52 277 -43 67 637 -65 -298 460 72 -363 169 429 -98 -83 440
4608 440 -127 -258 565 413 -400 -37 480 -84 157 579 69 -321 -57 547 -301 190 439 -288 -95 91
$$ packed form
4461C60k51q45Q58M37o23q7L57j14k20M39l3n00K5N75m96J19M82l64m21M08J15
4482B21k44MM72o14k90J072o58M02K07n11l28O27K3k00j47L96n90r8O23j14m76
4503b23L1M94o85N75N06n26n07O08k94l58N24K55o49L4M69l64j17Q40m72o11K85
4524a85L83n81J67M93p01k03J073l6p74M45O2o61L88N42k23n91O86o24k78P39
4544A21N78r10q2L73m11NO75r1p57M20K50k32K69k36l86k80J047j71o31N22N96
4565F69j462P02N06p79J95L73j80l36L21M81p79J30M13m18LM26j58l51K03P6o22
4586e87N70Q8j78MJ58oj88Q7L29l20J10N70p02k33P58l88m35N32K60n27J5N23
4608D40n67j31Q23j52q13L63N17n64K41M22n10l90K64O04q48M91K49p27J93J86
$$ plain form
4628 91 53 -63 699 96 -521 -215 187 -356 113 400 -155 -99 84 62 -367 94 246 -296 -210 436 -173 -367
4650 -367 427 -73 -434 19 402 -258 -80 281 -307 -240 390 334 -429 -243 -45 -324 -98 768 -54 -395 -95
4671 -95 -160 -408 568 340 -245 -648 184 -17 -5 542 -43 -766 -270 244 -47 474 -7 -538 -613 516 440
4692 440 -454 103 225 -634 -92 586 118 -402 138 -316 -277 388 246 -786 -446 201 162 265 729 -112
4712 -112 -796 -252 730 -55 408 153 -852 -893 693 357 33 -82 -327 -715 101 1094 214 -438 -213 -296
4732 -296 -184 1224 655 -372 -420 187 -211 225 829 221 -685 -37 618 230 713 472 -602 -436 792
4751 792 828 237 -152 -222 -758 278 931 456 -211 -169 -379 141 663 733 -695 -728 25 -49 751 830 -152 -1187
4773 -1187 -116 563 724 482 -134 -1197 -908 408 758 691 -5 -678 -1102 214 959 320 -502 -511 -471 -175
$$ packed form
4628I1l8j16P62o03o17L06M02n43M69K87n55N6J83k2m29M61J52n42Q6O46o09j94
4650c67P94n00l61M53L83o60J78L61n88O7O30n6p63J86J98k79K26Q66q22l41L00
4671i5o5k48R76k28n85m03Q32k01J2N47n85p23M96N14k91N21m81n31p5J129p6
4692D40q94N57J22q59N42O78m68n20N40m54L9O65j42j032L40O47l9J03M64q41
4712a12o84N44R82p85M63k55j005m1J586l36l24j15k45l88Q16R93q80o52K25q3
4732b96J12J408n69j027m8O07l98M36O04o08r06O48O55l88M83k41j074J66J228
4751G92L6n91l89p0n36J036O53m75o67M2k10N20N22P0j428l3P53p4Q00P9r82j035
4773a187J071O79J61k42o16j063K89J316L50o7o96o73m24J316P45o39q22rM0K96
$$ plain form
4793 -175 886 713 -332 -721 -241 -176 384 765 -275 -1125 -343 353 357 551 -147 -1023 -675 476 726 235
4813 235 -353 -738 -1070 265 1348 392 -532 -1018 -799 -134 1338 706 -598 -955 -645 5 1018 997 -212
4832 -212 -1480 -639 535 741 897 135 -1423 -1128 401 1008 557 -17 -509 -1213 150 1125 762 -181
4850 -181 -408 -457 -61 1148 744 -387 -807 -297 -27 864 1228 -122 -1121 -410 510 812 830 -184 -1117
4869 -1117 -991 771 991 686 -103 -1146 -1274 354 1451 851 -506 -790 -976 -121 1465 1385 -477 -1019
4887 -1019 -499 240 1047 1377 -112 -1399 -716 411 873 862 -65 -1194 -1297 614 1257 529 -210 -708
4905 -708 -1043 326 1328 656 -464 -737 -894 122 1335 814 -758 -1191 -749 -103 873 1197 -497 -1627
4923 -1627 -828 89 889 880 -138 -1461 -1372 365 1008 982 321 -704 -1431 -249 1113 472 -501 -662 -918
$$ packed form
4793a75J061j73j045l89M80O5N60L81j040q50P82O96MJ94o98q76L48J151K50m91
4813B35n88l85l32J335J083r56r24m86K19O65J472o32j304l57L10O50J013k1j209
4832b12j268Q41J174K06J56p62j558K95J529O07m51n74m92p04J363R75l63r43
4850a81k27m9L96J209m04j131m20N10K70Q91L64j350r99P11R20L02J8j014r33
4869a117J26J762K20l05p89j043j28J628J097o00j357k84j86Q55J586q0j862n42
4887a019N20P39Q07L30j489j287O83J127M62j1r27j129j03J911O43p28p39m98
4905g08l35J369J002o72j120k73j57J016J213n21j572m33M42O46R76L24j694j130
4923a627P99R17Q00rj018j323Q9J737O43k6o61j025p27J182J362o41r73j61k56
$$ plain form
4942 -918 -389 1482 1345 -667 -1135 -791 -272 643 593 -383 -1422 -691 32 782 531 12 -1182 -1046 754
4961 754 1003 392 -92 -1060 -1289 393 1660 769 -508 -892 -1292 -243 1134 1349 -491 -1046 -823 -48
4979 -48 980 1720 266 -1237 -1029 178 680 1204 334 -1329 -1054 106 961 580 323 -782 -1002 -13
4997 -13 1145 731 -346 -594 -810 159 1238 1199 -197 -850 -641 -147 880 1230 -417 -899 -668 244 608
5016 608 1070 40 -1312 -996 577 997 558 353 -660 -1196 -189 1084 936 58 -689 -1256 -254 969
5034 969 911 -133 -745 -604 -322 617 985 -182 -1098 -719 156 202 820 53 -701 -766 355 679 815 -14
5054 -14 -861 -1062 -75 954 791 56 -737 -527 -432 788 1072 -255 -771 -397 -741 337 1180 -125 -888
5073 -888 -805 -191 354 1049 209 -823 -1012 168 332 663 535 -539 -1101 206 883 43 -83 -289 -434
$$ packed form
4942i18N29J871j37k012m68L44N19R15n0r76j039P31P23P50k51n19j194J36J800
4961G54K49o11m84r68k29J682J267q91j277l84m00J049J377K15j840n55K23P75
4979d8J028P40j454j503K08J207N02N24q70j663K75J160Q55l81k57j105k20R89
4997a3J158m14j077k48k16R69J079l9j396o53K09M94J027L50j647m82K31R12L64
5016F08M62j030j352L16J573M20m39k05j013n36J007J273j48q78p47n67J002J223
5034I69n8j044o12J41K82R39L68j167r16L79Q75M6O18p67p54o5J121L24J36q29
5054a4q47k01R87J029j63p35p93K10R5J220K84j327n16L74l44J078Q43j305p63
5073h88Q3O14N45O95q40j032j89J180J64L31j28j074n62J307O77q40j26k06j45
$$ plain form
5092 -434 -142 1136 567 -100 -772 106 42 508 993 -292 -1024 -392 120 30 516 398 -842 -1061 472
5111 472 787 817 399 -450 -845 131 953 481 -66 -108 -690 -454 650 960 -136 -743 -500 -597 562 986
5131 986 97 -708 -232 -64 70 959 618 -353 -342 62 170 313 456 -361 -959 152 432 427 245 -22 -864
5152 -864 -587 490 223 -135 -105 -236 -348 141 569 113 -227 14 -223 41 546 142 -324 -440 153 143
5172 143 507 191 -281 -546 -106 420 -158 30 99 -459 -217 142 396 -522 -137 -121 -297 151 648 -52 -481
5193 -481 5 -131 -43 567 164 -356 -566 -95 137 209 415 -228 -662 176 232 217 420 -32 -509 -277 260
5214 260 654 70 189 288 -264 255 194 248 -322 -119 -47 -312 390 216 -289 -232 212 -228 -191 834 -142 -88
5236 -88 135 155 -417 199 51 -478 -328 94 20 48 -10 198 -382 -52 306 19 -117 171 24 -148 328 171
$$ packed form
5092d34K92J278n69o67o72Q78o4M66M85j285p32O32N12r0M86j18j240k19J533
5111D72L15L0m18q49l95R76Q22m72n47m2n82K36J104L10j096o07K43r7J159M24
5131I86q89q05M76J68J34Q89l41r71J1M04J08J43J43q17n98J111K80nj82k67q42
5152h64K77J077k67l58L0j31j12M89M28m56l40K41k37K64N05m04m66j16N93j0
5172A43L64l16m72k65M40N26n78J88O9n58K42L59K54r18L85J6j76M48M97p00m29
5193d81M86j36Q8O10m03n20k10M71K32P2K06o43m34Q38N6j5K03m52m77K32N37
5214B60L94n84J19R9n52N19o1N4n70K03P2k65P02j74n05N7M44m40L7J025r76N4
5236h8K23K0n72O16j48n29J50M22p4K8n8K08n80L30L58k87j36K88j47j72M76j57
$$ plain form
5258 171 -89 -419 211 -47 -42 272 206 -456 79 131 117 -26 -85 -57 -474 150 156 -43 146 88 -568 -45 592
5281 592 -32 -251 24 -234 -299 161 262 -221 1 -31 -203 -5 801 126 -400 150 108 -404 -159 628 -412
5302 -412 -452 -264 40 -220 23 50 -179 58 273 -108 -311 162 26 -319 -38 112 -332 -77 347 -33 -210
5323 -210 232 -237 -344 154 374 -34 -40 -50 178 -179 150 -280 -229 225 171 -189 -97 412 -10 -35 347 59
5345 59 -569 -3 218 42 78 209 -134 -491 177 238 -289 58 458 -234 190 164 102 193 122 -225 -277 167 227
5368 227 -298 -282 234 145 5 607 -45 -343 -47 92 -259 146 340 -479 -195 128 119 195 -32 -24 -259 87
5390 87 337 230 338 489 -321 -502 183 305 49 -56 190 -295 -68 531 159 -106 113 308 -324 290
5410 290 113 300 -411 240 112 -52 296 36 4 42 212 -247 -111 286 -171 -340 54 381 -127 -188 -90
$$ packed form
5258A71k60l30O30k58NL14o6o62N35N2j4j43n9K8m17O24Oj99J89n8o56N23O37
5281E92o24k19K75k58o5M60J01m83K22l2j72J98Q06o75n26N50m2n12K45P87j040
5302d12m0J88L04k60K43K7k29K37K15l81k03M73j36l45K81J50m44K55M24l80j77
5323b10M42m69j07M98K20m08oj0K28l57L29m30N1M54n4l60R2N09m22k5L82k88
5345E9o28N66K21j76L6J31l43l57O68O1n27L47M00o92M24k6o2R1p1l47n2M44O0
5368B27n25J6N16q9j40O02o52k98K96J39l51M05J94q19K84L23rP6k27Qk35L46
5390H7K50j07J08J51q10j81O85J22k56j05K46m85K27N99l72k65K19J95o32O14
5410B90j77J87p11O51j28j64L48k60l2L8J70m59J36L97m57j69L94L27n08o1R8
$$ plain form
5431 -90 -126 -245 437 -65 -148 -12 1 -165 -178 83 -382 -430 531 -179 -359 132 7 -204 47 169 -30 -84
5453 -84 460 -288 -289 162 237 138 4 -224 -347 101 166 67 -169 236 -137 -38 -20 320 -198 33 282 -69 -412
5476 -412 164 74 -356 381 209 16 -128 242 40 -574 -47 -28 -430 245 613 -28 -259 232 51 -180 191
5497 191 259 -389 45 254 22 215 241 -19 -36 221 233 -330 308 -104 -184 -39 340 -9 -75 101 124 -342
5519 -342 85 220 -145 -115 204 4 114 294 -22 -225 -127 77 -126 165 316 -414 -374 271 120 -223 51
5540 51 135 -212 -165 324 23 -121 713 281 -432 0 77 -392 17 75 -195 189 288 -5 -345 -60 120 -321
5562 -321 37 138 -178 -443 371 285 -167 -66 -78 -385 -17 425 134 -319 -168 -157 -458 109 164 -80 -309
5583 -309 53 -145 -26 283 162 -561 -385 130 -211 322 382 -225 -356 -142 226 -196 191 -90 -545 -124
$$ packed form
5431i0l6j19O82n02q3J36J3j66j3K61m65m8R61p10j80M91j25k11K51J22j99n4
5453h4N44p48jM51P5r9j34k28j23M48O5r9k36M05l73R9J8L40n18K31K49l51l43
5476d12N76r0m30P37j72j93j44L70k02o14N27J9m02O75L68o41k31M91j81k31L71
5497A91O8o48M34K09k32J93K6k60j7K57J2n63O38m12q0J45L79l49o6J76K3m66
5519c42M27J35l65L0L19k00J10J80l16k03R8K04k03K91J51p30M0O45j51l43K74
5540E1Q4l47M7M89l01j44Q34m32p13M32P7m69M09N8k70L84R9k93l40K85J80m41
5562c21L58J01l16k65Q14q6m52J01j2l07L68M42k91m53J51J1l01N67N5k44k29
5583c09L62j98J19L09j21p23J76N15l41N33O0o07j31K14L68m22L87k81m55M21
$$ plain form
5603 -124 501 76 -147 -111 23 -160 -129 42 -140 -153 -79 29 151 253 -190 -477 -71 93 145 305 265 -308
5625 -308 -273 404 312 -203 320 -191 -281 -366 282 298 -189 98 -328 -352 153 479 -88 -21 -169 -159 -168 683 69
5648 69 -319 -168 334 153 46 663 12 -467 306 211 48 -162 -135 -549 -147 267 182 -218 -26 -293 -58
5669 -58 459 508 -78 -483 -242 -442 89 496 338 -420 -141 141 185 432 288 -125 -596 228 377 41 105
5690 105 17 -700 -385 158 123 -89 -107 -7 -325 494 485 -307 -443 -32 -498 -235 378 78 -387 -229 46 -22
5712 -22 213 372 -600 -449 226 365 -137 262 -202 -860 -11 225 188 -37 -76 -150 -614 240 351 78 -410
5733 -410 -258 -40 -106 424 369 -205 -358 105 -43 275 570 -94 -419 134 242 -175 243 162 -416 -72 535
5754 535 32 -19 51 -125 -194 400 488 93 -44 -71 -653 -44 608 393 -229 -290 266 33 458 843 -25 -210
$$ packed form
5603a24O25m25k23L6J34j83L1J71j82j3P4J08J22J02m43k87M06J64N2J60m0n73
5625c08L5O77r2n15N23n11r0q5O48J6m87K87m26k4N05L26n67O7j48J0rQ51o14
5648F9l88J51N02j81j07O17o51m79P73r5j63k10K7m14M02M14q5m00J92k67K35
5669e8N17M9n86m05K41k00N31M07j58p58K79K82M4K47j44m13m71Q24J49l36O4
5690A05q8p17L15N43l5k12j8J00l18Q19rp92j36M11m66K63O13l00m65J58K75o8
5712b2K35J59r72J51O75J39n02L99m64o58Q49K36l7k25l9p4m64Q54J11k73m88
5733d10J52K18o6N30n5n74j53M63j48L18K95o64l25N53J08m17M18q1n78L44O07
5754E35n03n1P0j76o9N94Q8l95j37k7n82O09O52k15o22o1N56k33M25L85q68j85
$$ plain form
5776 -210 -141 145 180 728 341 -462 -56 327 185 109 271 -412 -338 392 96 -32 -214 106 -294 178 316
5797 316 261 -252 3 227 -258 281 734 -235 -380 88 349 -238 292 63 -630 -47 240 195 -1 241 -428
5818 -428 -320 117 598 -132 -376 -267 -420 -127 432 323 -220 -173 -139 -233 57 639 -144 -490 -88 246 -203
5839 -203 589 95 -579 -515 258 143 -68 107 -313 -446 231 457 30 -60 -8 -378 153 463 281 -62 12
5860 12 -96 -419 256 437 -491 -328 -169 -184 34 354 350 -596 -130 173 236 281 355 -259 -134 202 -61 -104 232
5883 232 141 -568 -154 421 232 -218 69 67 -129 -90 442 -75 -534 223 97 71 345 371 -337 -100 472 221
5905 221 160 93 -268 -564 209 544 -203 267 -64 -409 -121 262 85 78 202 -117 -211 368 602 -235 -274 -155
5927 -155 -305 244 -19 321 -383 -283 -51 66 368 653 -37 -177 161 203 171 84 238 -559 -386 273 11
$$ packed form
5776b10O9K86L5N48l87q03M06L83j42p6J62o83P4P30k96j28j82L20m00M72J38
5797C16n5n13K55K24m85N39M53r69j45M68K61n87N30k29o93N83K87m5j96K42o69
5818d28J08M37M81p30k44J09j53K93N59j09n43M7L4r4K90N82p83l46M02L34m49
5839b03P92m94o74O4P73j15k11J75m20j33O77K26m27r0N2l70N31L10j82l43P4
5860A2j08l23O75J81r28J63J59j5K18L20mr46M66L03O3M5P4o14J25L36k63m3L36
5883B32r1p09M14N75j89m50K87kj96L9N32n17m59P57j26k6K74K6p08K37N72k51
5905B21o1o7l61k96P73L35p47M70l31l45K88L83j77pJ24l19r4N79K34q37l9J19
5927a55j50N49k63L40p04J00K32J17L02K85o90j40L38M2l2q7J54p97J73O59k62
$$ plain form
5948 11 -161 89 -11 -313 -307 341 -178 -58 42 -455 -58 -43 -107 -326 17 281 -70 -155 -16 -464 -127 -12
5970 -12 474 -49 185 337 -267 -334 317 21 -270 -226 -152 -418 -148 441 -38 -46 -240 46 -81 566 86 -397
5992 -397 30 10 267 195 153 -75 -486 -22 99 -85 185 295 -130 -286 226 -80 -12 -19 37 -315 91 343
6014 343 -348 -97 -50 -78 -123 466 228 -225 10 371 -300 -20 249 277 -390 167 85 -166 223 173 -160 -122
6036 -122 107 -77 -13 228 94 -123 92 89 37 -222 210 -61 -510 211 -39 -125 -32 25 -224 -154 168 -286 -317
6059 -317 80 233 -61 223 329 -277 -172 41 -73 -113 -367 94 14 7 -10 126 6 299 -176 100 195 297
6081 297 -127 53 124 -250 -427 247 55 -210 111 -135 -315 225 376 -177 -142 129 -259 -323 62 -30 -206
6102 -206 271 274 -490 -251 252 -129 -229 308 26 -115 130 423 -234 -87 129 -43 -50 420 163 101 -204 449
$$ packed form
5948A1j72K50j00l02OO48n19J20J00m97L97J5o4k19L43K64l51q5J39m48L37J15
5970a2M86n23K34J52o04o7O51k96k91M4P4k66K70N89m79qj94K86j27O47m80m83
5992c97M27k0K57p2m2k28m11M64J21j84K70J10m25j56N12l06O8pN6l52M06K52
6014C43o91K51M7k8m5N89k38m53K35L61o71K80K69K8o67N57q2k51L89n0l33L8
6036a22K29j84O4K41j34k17K15ln2k59M32k71m49P21k50q6R3N7k49P0L22m54l1
6059c17L97J53k94K84J06o06J05K13j14m0k54M61q0pj7J36j20K93m75K76R5J02
6081B97m24J80P1l74j77O74j92k65L21k46j80N40J51n53L5K71l88o4L85r2j76
6102b06M77Lp64K39N03l81j00N37k82j41K45K93o57J47K16j72pM70k57o2l05O53
$$ plain form
6124 449 -265 -162 16 -113 -172 365 393 -147 26 109 -138 -208 146 78 -315 382 269 -213 332 264 -121 -206
6146 -206 395 193 -81 8 229 -222 -76 317 -109 -139 -191 26 -69 220 86 -440 -117 -22 -256 17 435 -77
6168 -77 -247 249 -69 -79 479 158 -387 76 171 -123 -153 359 205 -336 7 152 23 -258 202 -250 -333 409
6190 409 -90 -270 -40 315 -538 161 371 -149 -85 -45 5 -371 127 304 -436 -393 22 -45 -322 139 -8 -81
6212 -81 -136 371 -24 -98 381 -67 -413 235 333 -405 -54 107 -273 -114 122 212 -218 198 -243 -278 222 435
6234 435 -219 -249 178 -18 -289 79 71 -278 -94 141 -121 250 439 -198 -145 -215 71 97 -177 172 -290 -56
6256 -56 154 -128 -66 238 139 -139 91 342 -272 -128 191 187 -50 247 256 -267 -70 263 -197 107 208 -27
6278 -27 -386 287 251 -186 309 -6 -631 101 308 -170 -137 186 80 -614 -20 -127 -299 -7 259 -93 -300
$$ packed form
6124D49p14J03J78j29n9N37K8n40J73Q3k47p0L54o8l93O97j13m82N45o8l85q5
6146b06O01k02k74Q9K21m51J46L93m26l0n2K17r5K89j34n26L23R5k34K73M18n12
6168g7j70M96l18j0N58l21n45M63R5k94l0N12j54n41L43J45j29k81M60m52q3P42
6190D09m99j80K30L55q53O99K10n20O4M0N0l76M98J77p40M3M15o7k77M61j47p3
6212h1n5N07l95p4M79m48l46O48R8p38L51J61l80J59K36R0m30M16m41l5N00K13
6234D35o54l0M27j96k71L68ql49J84K35k62L71J89o37N3p0K86K6k74L49m62K34
6256e6K10k82O2L04r9k78K30K51o14J44L19mk37K97Rn23J97L33m60L04J01k35
6278b7l59O73l6m37M95l15o25P32K07m78L3L23j06o94N94j07j72K92K66l52k07
$$ plain form
6299 -300 -52 -103 -477 176 -356 -233 109 185 -79 -261 48 98 -220 111 175 -183 -399 121 -6 -99 683 -91
6321 -91 -192 349 151 -141 -222 251 -67 -47 349 250 -280 -10 46 -48 -97 228 -94 -120 226 161 -219 133 -39
6344 -39 -255 -28 469 -126 112 -76 -225 -334 -15 83 -444 373 129 -131 -370 225 3 -225 -133 123 -411
6365 -411 116 430 -478 -365 183 74 -250 198 327 -24 61 264 78 -400 87 183 -325 112 -129 -437 -151
6386 -151 100 -289 -415 -48 238 -228 -31 -23 47 -78 284 -135 -305 283 -241 -157 296 241 -287 -141 264 -208
6408 -208 -14 181 -77 -243 90 418 46 -208 148 -84 -39 260 144 -135 -82 33 -271 124 260 306 131
6429 131 103 -150 -301 518 350 -345 -20 -50 -229 66 425 150 -241 81 -20 -222 110 173 -60 -112 103
6450 103 -67 -287 395 116 -562 -3 326 -50 -214 203 -151 -521 180 -258 -346 212 133 -410 -263 333 310
$$ packed form
6299c00K48n1l74O53n32J23L42P6k64j82L09N0l18L31O4l58k16N20j27r3P82p74
6321i1j01N41j98k92q1M73l18K0L96r9n30K70N6r4m9L25l22k6L46o5l80L52j72
6344c9k16K27M97n95K38j88j49j09L19R8n27Q17k44k60k39N95k22k28R2K56n34
6365d11N27L14r08J13N48j09l24M48J29l51Q5K03j86m78M87R6n08M37k41l08K86
6386a51K51l89j26L67K86m66J97QP0j25L62m19j70N88n24Q4M53n5n28J46M05m72
6408b08J94J95k58j66L33L28l72k54L56k32M5K99j16k79N3J15l04L95J36M6j75
6429A31k8k53j51Q19j68o95L25l0j79K95L59k75l91L22j01k02L32O3k33n2K15
6450A03j70k20O82k79o78N59L29l76j64M17l54l70P01m38q8N58p9n43J47N96k3
$$ plain form
6471 310 -368 -195 195 -423 1 124 -94 -222 -86 187 -483 519 194 -347 -53 148 -76 225 37 -321
6491 -321 -154 208 25 -76 -64 53 -440 -84 627 105 -118 -177 352 -124 78 486 -454 -537 302 33 322
6512 322 209 20 -589 87 230 183 -18 -200 -400 -594 388 202 60 -22 -172 -236 -526 540 -15 -389 -361
6533 -361 -86 -281 295 580 -80 12 108 -21 -198 431 -212 -477 -77 81 -180 -8 177 -461 -637 159 -227
6554 -227 -134 138 -141 -441 -285 350 142 -260 80 38 -165 162 186 -144 -47 167 -91 203 309 13 -419
6575 -419 -53 201 -133 -52 324 -89 -496 286 226 -382 6 108 -302 95 356 164 -498 -293 189 -260 118
6596 118 125 -403 -144 83 -336 108 404 -60 -343 31 373 227 76 360 -356 -382 251 333 -178 -71 54
6617 54 -223 -214 546 257 -54 260 -288 -197 -31 406 -200 -224 112 351 -224 136 235 -390 27 354 36 -93
$$ packed form
6471C10o78J73L90o18M24J23k18j28J36K73o70J002l25n41K94K01k24L01j88l58
6491c21J67L62j83j01J2J17m93L56P11n22k23n9N29m76K02M08r40q3Q39k69K89
6512C22j13j89o09O76J43m7k01j82k00j94R82j86j42q2j50o4k90J066n55l74K8
6533c61K75j95N76K85o60R2R6j29j77O29o43k65M00J58k61J72J85o38j76P96l86
6554b27R3K72k79l00J56O35k08m02L40m2k03L27K4l30R7K14k58K94J06k96m32
6575d19L66K54l34Q1L76m13m07P82o0o08L88J02m10L97K61j92o62K05M82m49L78
6596A18Pn28K59K27m19M44K96m64k83L74L42j46j51K84p16k6O33Q2n11J07J25
6617E4k77RP60k89l11L14n48R1J66M37o06k4L36K39n75L60R9o25M17L27l18j29
$$ plain form
6639 -93 445 -140 -473 195 359 -315 305 -88 -391 -64 218 182 -144 43 230 -217 265 163 -296 -436 -132
6660 -132 -57 -296 305 167 -675 -209 317 65 91 329 -123 -256 276 -18 211 255 110 -300 -41 410 -52
6681 -52 -37 226 -121 -343 244 575 58 -74 -243 -111 110 251 420 -145 -58 -206 -171 59 517 -221 -509
6702 -509 -122 142 -207 113 175 -212 -50 375 -298 -219 -201 -106 -433 199 270 -328 -100 132 -190 -118 -86 -77 -378
6725 -378 -446 204 -8 -348 293 -214 -599 19 34 -130 -285 265 -309 -157 151 201 -454 178 340 208 248
6746 248 498 -196 -76 -119 -274 -183 94 286 -492 48 -150 101 -191 426 -20 -142 -95 -98 122 230 353 -508
6768 -508 -66 -79 169 -238 250 -277 -331 16 166 -169 223 174 -222 -254 260 132 -371 125 356 -452 179
6789 179 167 -249 -324 161 202 -251 -12 434 -183 -357 372 -57 -93 411 182 -238 437 251 -158 -68 453 -26
$$ packed form
6639i3N38n85l33O68J64o74O20l93l03L27K82l6l26J87J87m47M82j02m59j40L04
6660a32P5k39O01j38q42M66N26k52K6K38m52j33N32k94K29M4j45m10K59M51m62
6681e2J5K63l47k22N87L31n17j32j69J32K21J41J69n65Q7j48L5K30M58p38k88
6702e09L87K64l49L20O2l87J62M25o73P9J8R5l27O32P1n98K28K32l22P2L2Rl01
6725c78o8O50k12l40O41n07l85O18J5j64j55N50n74J52L08N0o55O32J62j32M0
6746B48K50o94J20m3j55R1K77J92p78N40j98K51k92O17m46j22M7lK20J08J23q61
6768e08M42j3K48m07M88n27n4L47J50l35L92m9l96l2N14j28n03M96K31q08O31
6789A79j2m16p5M85M1m53K39M46o17j74P29m29l6N04k29m20O75j86m09R0N21m79
$$ plain form
6811 -26 83 387 316 -333 -95 207 -249 -130 25 22 -149 -106 154 -181 19 236 -77 -268 304 -183 -93 403
6833 403 220 -377 -10 172 -514 138 424 -404 -305 397 200 -30 152 100 -82 -255 77 -104 -296 111 -83
6854 -83 -454 -216 365 -150 -63 277 -231 -88 144 27 -299 -109 -11 -179 -25 168 -319 -148 410 167 -60
6875 -60 -101 492 -355 100 154 -206 -145 217 262 -582 229 350 -84 -15 118 -202 -98 318 123 -186 92 357
6897 357 -63 161 341 -216 -333 -4 172 -343 175 278 -356 -275 83 -67 -229 106 220 -212 -38 316
6917 316 -286 -56 22 -19 -45 264 493 -355 194 124 -45 16 107 24 -72 -64 -8 -286 141 304 48 -136 208 -170
6941 -170 -218 199 39 -285 54 199 -39 47 82 -54 217 379 -34 -474 146 -98 -220 135 212 -177 -546
6962 -546 508 16 -218 -71 362 -288 -76 -12 -216 -158 224 397 -164 28 167 -308 -94 287 -433 -70
$$ packed form
6811b6J09L04p1o49K38L02m56J19J55lj71M3K60l35K00K17l13j91N72m87R0M96
6833D03j83n97L67J82o86O52K86q28R9P02j97k30J82n2j82j73L32j81j92M07j94
6854h3l71K38N81n15Q7L40n08J43K32j17l26J90R8j68J54J93m87J71N58k43k27
6875f0m1N93q47M55N4l60O1L62M5q44Q11J21m34O9J33l20J04M16j95l09K78K65
6897C57m20K24J80n57j17L29J76n15N18J03o34Q1L58j50j62L35J14m32J74L54
6917C16o02K30P8m1k6L09K29q48N49p0j69O1R1q3r6QN6k78M27J63k56j84L44l78
6941a70m8M17j60l24L39J45k38Q6L5j36K71J62m13m40O20k44j22L55P7l89l69
6962e46J054m92k34J47M33o50K12O4k04N8L82J73n61J92J39m75K14L81p20L63
$$ plain form
6982 -70 259 -95 -297 -43 374 -170 78 104 -94 -137 86 -49 -282 229 358 -58 -222 194 -204 -315 35
7003 35 67 -454 333 107 -216 -145 119 -128 -288 150 90 -99 134 95 5 -109 298 182 -317 -27 39 -187
7025 -187 154 468 -241 -203 158 -193 37 216 80 -176 361 598 34 -101 174 -106 14 163 162 -257 96
7046 96 18 51 -158 506 -176 100 173 86 -200 157 230 -336 59 103 -84 -105 119 -55 -597 23 326 -187 -142
7069 -142 -82 -255 -176 322 363 -15 -324 47 -146 -43 315 81 -349 153 112 -52 248 228 -429 -128 120 -306
7091 -306 -70 54 -135 -310 198 121 74 -73 -40 -360 -44 128 17 -43 339 294 -65 -134 124 -149 -240 -57
7113 -57 264 -366 49 128 -481 323 259 -140 -72 47 -112 -375 254 -33 -312 302 274 -116 -453 277 -195 -196
7135 -196 360 277 -211 -121 467 15 -233 527 87 -204 224 164 44 -38 140 -104 -32 122 142 -228 238 0
$$ packed form
6982g0L29l54k02K54M17n44K48K6j98m3K23j35k33N11J29m16j64M16l98j11L50
7003C5L2n21P87k26l23P1K64k47j60M38o0j89K33l9r0j14M07j16m99K90O6k26
7025a87L41L14p09L8L61l51K30J79j36k56N37K37n64j35K75k80J20J49jm19L53
7046I6p8L3k09O64o82K76P3q7k86L57P3n66L95M4j87k1K24j74n42O20L03n13M5
7069a42O0j73P9M98M1l78l09L71j93J03L58k34m30N02m1j64L00k0o57L01K48m26
7091c06K36J24j89j75N08p7m7j47L3l20L16J72j11o0L82m5l59o9K58k73r1J83
7113e7L21o30M15P9o09Q04o4l99O8J19j59k63O29k87k79O14k8l90l37P30m72j
7135a96N56q3m88R0N88m52k48P60m40k91M28o0j20q2J78k44P2J54K0l70M66k38
$$ plain form
7157 0 9 56 244 -107 -123 234 -82 -209 179 118 -381 133 302 -344 0 324 97 -133 142 64 -194 86 382
7180 382 -329 -288 70 -203 9 -1 -5 -347 53 -31 -315 -423 104 74 -291 291 148 -227 -209 161 123 108 211
7203 211 -39 -80 53 351 -100 67 296 -357 -202 104 9 -420 389 -6 -288 -135 -141 -411 -257 192 -58
7224 -58 -325 -100 50 -431 -138 43 -404 -79 28 -168 -205 -48 29 -138 -38 109 42 -97 382 -32 -437
7245 -437 49 -69 -360 -23 376 4 58 383 134 -349 9 -80 13 276 252 -264 -212 101 -498 -142 -63 -138
7267 -138 -370 -230 58 -77 -82 92 52 -184 2 -46 -179 -168 308 -256 -265 573 -6 -16 53 113 -292 -7 378
7290 378 -204 86 195 -43 -314 -163 336 -72 205 147 -78 -276 -97 172 -134 18 331 -44 -60 209 282
7311 282 -198 304 20 -134 15 240 78 -116 351 -75 -57 508 16 -272 162 216 -161 276 35 -361 29
$$ packed form
7157@RM7J88l51j6L57l16j27L88o1m99N14J69o46L44L24k27k30K75p8k58K80K96
7180C82p11M1L58k73K12j0ml42M00q4k84j08N27l0l65N82j43l75J8L70l8j5J03
7203B11k50m1J33K98m51J67K29o53J55L06r5m29Q09l95k82J53ok70J54M49k50
7224e8k67K25J50m81K93J81m47L25J07j96l7J57P7j67J00J47o7j39M79m14m05
7245d37M86j18k91L37L99l72N4L25k49m83L58q9R3K63k4n16N2L13n99L56P9p5
7267a38k32J40K88j35nJ74m0k36J86m8j33J1M76n64rQ38n79j0O9O0m05K85L85
7290C78n82K90J09k38k71J51M99m08K77n8k25j98J79K69l06J52L13l75j6K69P3
7311B82m80N02k84j54J49K25j62j94M67m26J8N65m92k88M34N4l77M37k41l96L90
$$ plain form
7332 29 236 157 -423 334 152 -342 47 488 103 -350 206 -138 -302 182 185 -315 -41 4 -113 -103 478 188
7354 188 -336 -192 94 -29 -87 93 118 -63 40 -110 -531 163 229 -37 -26 79 -142 -87 233 21 -116 53
7376 53 319 -368 146 388 -358 -122 48 -185 -58 239 235 -556 -196 274 -256 -272 -124 -217 -382 -48 137 -362
7398 -362 -177 143 -429 -367 265 29 -264 203 166 -317 164 393 -291 -122 314 240 35 434 499 -158 304
7419 304 203 -143 -258 223 -16 -351 -85 209 175 197 64 49 3 -20 -79 142 212 107 -495 110 230 -162
7441 -162 -86 88 62 -216 236 -49 -355 -57 345 -287 -88 195 56 -253 -207 107 -301 250 148 134 -45
7462 -45 447 -7 -293 111 -53 -189 -43 145 -181 -182 241 -29 29 9 525 -143 -190 270 -319 -31 510 -186
7484 -186 -156 305 251 -203 126 248 -178 -173 209 -52 -174 269 307 -36 66 203 -170 78 54 216 -438 -29
$$ packed form
7332B9K07p9n80P57j82m94L89M41l85m53N56l44j64M84Ln00K74M5j17J0N81k90
7354A88n24J44K86j23n8J80K5j81J03j50m21O94O6k66J1J05k21N5L20k12j37J69
7376E3K66o87N14K42p46K36J70k33J27K97mp91L60M70n30j6J48r3j65L34J85m99
7398c62J85L20n72O2O32k36k93M67l7m83M81K29o84J69M36p4k05L99O5o57M62
7419C04j01l46j15M81k39l35K66K94l4K2j33j5m6k3n9K21P0j05o02O05J20l92
7441a62P6J74k6k78M52k85l06K98M02o32J99K83j39l09M6L14m08N51j02j4j79
7462d5M92m54k86M04j64j36J46J88l26jM23k70N8k0N16o68m7M60n89K88N41o96
7484a86L0M61n4m54L29J22m26NL82k61j22M43L8l43J02J37l73K48k4J62o54M09
$$ plain form
7506 -29 -156 79 -192 137 -239 -182 166 -246 -425 297 478 -161 -249 370 -52 -33 34 -120 113 59 96 -233
7528 -233 -171 329 -186 -269 211 -17 -190 258 320 -393 -173 91 -38 -95 258 -48 -215 -166 282 -285 -12 237
7550 237 -302 -174 252 29 28 331 231 35 198 263 -24 -32 322 -249 -139 249 147 -128 -138 60 -48 73
7572 73 314 -266 -315 153 149 -247 8 29 71 56 13 18 -328 54 74 3 138 141 -294 -324 68 -33 65 266 51
7597 51 -257 85 66 -202 -315 193 95 -122 16 192 -236 71 274 -386 -335 457 -124 -208 -38 29 -167 -18
7619 -18 84 26 -274 316 -79 114 -169 205 -311 -381 231 -325 -28 59 214 -243 -43 145 -331 92 6 -212
7641 -212 -483 79 -2 -145 119 -166 -214 68 204 -64 37 116 -301 18 56 254 -76 -202 161 53 129 64
7663 64 35 -341 -161 212 -267 15 -81 -471 256 282 -107 -72 -76 76 -267 -116 295 -26 -172 378 -361 -72
$$ packed form
7506b9j27K35k71L29l76N7L48m12j79P22J81o39q8O19m22J9O7j54K33n4L7l29
7528b33O2N00n15q3M80k28j73M48O2p13K20K64j29n7L53l06j67M9M48n67K73K49
7550B37n39J28M26k23jL03j00j96J63O5k87qL54n71J10L88j02k75j0J98j08J21
7572G3K41n80m9M68ml96K55K1M2j5m3Nl46L82K0p1J35Lm35l0L92j01R8K01k15
7597E1l08L42j9k68j13N08r8k17J38J76m28L07K03o60N1P92n81q4J70O7j96J49
7619a8J02n8l00N90l95J93k83L74n16p0O12n56K97Q7J55m57K00J88m76M23q6k18
7641b12k71N62q1j43K64k85m8K82J36k68J01P9m17L19L8J98l30j26L63j08P6o5
7663F4k9l76J80L73m79K82r6l90P27K6l89L5mJ52l43J51M11l21j46N50p39K89
$$ plain form
7685 -72 161 -238 17 -7 176 -64 1 326 201 -403 34 323 -190 307 354 -294 -100 23 54 -211 273 211
7707 211 -115 176 168 -230 104 98 -137 -510 260 -108 0 -187 218 -115 -141 360 -307 -130 -120 33 -373 302
7729 302 -64 -161 -301 124 -40 56 23 37 46 -16 74 -160 -251 326 -140 -298 164 -87 3 -152 106 -255 48
7752 48 55 -291 -255 291 59 -149 109 230 -132 74 264 78 -306 344 42 -371 101 272 -332 -84 -208
7773 -208 -218 -224 229 109 -213 61 178 -143 142 -66 108 -55 -271 271 -181 317 190 -483 118 1 79
7794 79 -23 314 -244 -284 222 8 136 -107 -93 20 64 139 337 -45 96 90 -162 122 430 -144 -304 324
7816 324 271 -156 -137 150 -284 -180 212 225 -187 105 -131 -139 222 -99 -319 163 337 83 -272 -12 121 -457
7838 -457 35 331 -105 217 268 -50 -331 373 -85 -426 -136 8 -330 180 53 -16 -115 64 -124 -199 144
$$ packed form
7685g2K33l99K55k4J83k40O5L25j25o04M37K89n13M97M7o48J94J23L1k65M84o2
7707B11l26K91ql98L34ok35l73P70l68J08j87M05l33k6N01o67J77J0J53m06O75
7729C02l66r7j40M25j64R6l3J4Ro2R0k34r1N77m66j58M62k51R0j55K58l61L03
7752D8Pl46L6N46k32k08K58J21l62K06J90j86l84O50l02m13M72J71o04K48j24
7773b08j0oM53j20l22K74J17l21K85k08J74j63k16N42m52M98j27o73O01j17P8
7794G9j02L37n58m0N06k14J28k43J4J13M4P5J98l82J41ok52K84L08n74j60O28
7816C24n3m27J9K87m34J04L92J3m12K92k36qL61l21k20M82J74k54l55K60J33n78
7838d57M92K96m36L22N1l18k81P04m58l41K90J44l38N10j27o9r9J79j88p5L43
$$ plain form
7859 144 221 -230 39 -77 18 19 74 387 -63 -156 217 -184 -225 -119 -17 21 142 -116 -498 -57 64 20 337
7882 337 175 -112 -86 137 -226 -153 112 196 -361 -371 290 -271 141 16 233 0 60 55 -189 -366 125 214 -21
7905 -21 153 38 -108 92 429 -126 55 128 104 40 72 410 -96 -44 -98 -430 -134 -8 111 -195 144 -4
7927 -4 -62 -40 382 -91 -44 -80 -125 -70 89 11 -199 -128 230 -61 193 208 -11 -12 34 309 -304 217 165 0 -151
7952 -151 290 -120 111 139 222 -125 -134 -81 -108 -109 264 -334 -42 133 -274 -60 -136 40 107 -42 -28 -302 -123 224
7976 224 122 -330 -4 296 63 75 183 -89 -182 189 247 -181 -219 153 -27 97 144 -18 -294 253 -63 -213
7998 -213 70 285 56 -30 432 277 -51 31 -179 -372 -55 127 -22 216 166 -359 -259 368 82 -357 -89
8019 -89 68 -122 -3 121 86 75 259 305 20 62 65 149 -273 71 -33 -153 39 -59 -163 137 -144 51 120
$$ packed form
7859A44P7m51K69j16R5JN5L13m50r3L73m01m1J06J02L8J21k58l82M41J21m4L17
7882C37j62k87K6K23l63P3K65Q4n57j0O61n61M12j25K17k33O0nk44j77M91Q9k35
7905b1J74j15j46K00L37n55J81P3k4o4L2L38n06N2n4l32K96J26J19l06L39j48
7927dn8K2M22m73M7l6m5N5J59p8k10P1L58k91K54J5k19jM6K75o13N21n2j65j51
7952a51M41m10K31K8Q3l47rN3k7jL73n98K92J75m07K14p6J76O7j49J4k74J79L47
7976B24j02m52L26L00k33J2J08k72r3L71N8m28l8L72j80J24M7j62k76N47l16j50
7998b13K83K15k29q6M62j55l28Q2k10j93L17J82j49K38n0n25J00O27k86m39K68
8019h9J57j90J19J24l5j1J84M6k85M2LQ4m22L44j04j20J92r8j04L00k81J95O9
$$ plain form
8042 120 119 21 -60 -257 -122 36 48 83 -374 -214 379 -202 -219 155 -218 -119 -26 364 127 -26 -75 18 -420 16
8066 16 5 43 305 -114 -372 49 372 -20 97 212 146 -40 136 -53 34 -223 103 -31 -194 264 129 -304
8088 -304 -151 77 124 31 178 100 -26 230 -146 -360 -67 -215 -58 -255 -13 60 -125 -39 140 -16 203 266
8110 266 -239 153 303 -338 35 328 18 -2 227 292 -362 15 273 103 -422 103 98 -287 -221 303 -85 -98
8132 -98 410 -159 -41 10 137 -205 -43 277 -115 28 529 -15 62 -62 -240 -586 59 225 -152 -92 -7 -343
8154 -343 -200 344 13 129 108 234 215 -292 337 -140 -27 50 -56 -160 101 20 -201 215 83 -37 22 74
8176 74 -59 21 -167 55 -205 -30 349 138 -18 -25 60 -482 291 34 -57
$$ packed form
8042A20jr8q1j97J35J58J2L5m57J60N93n81j7L74l73R9R3L90k37j53m9R3m38M36
8066A6j1L8K62m19k58M21L23l92J17J15o6j86J76j89Q7k57L26j34j63M58j35m33
8088c04J53K28M7r3J47p8j26K56l76k14K93j48J57j97K42P3j85Q6J79j56K19O3
8110B66n05L92J50o41L73K93l10k0K29O5o54L77K58j70n25N25nl85O6N24l88j3
8132i8N08n69J18N1J27l42J62L20l92J43N01n44P7j24j78l46O45J66l77O0Q5l36
8154c43J43N44l31J16k1J26j9n07O29m77J13P7j06j04K61q1k21M16j32j20N9N2
8176G4j33Q0j88K22k60J75L79k11j56pQ5n42P73k57r1
8191e7
$$ Imaginary data points
##PAGE= N=2
##DATA TABLE= (X++(I..I)), XYDATA
$$ plain form
0 0 0 0 0 -8 8 0 8 -9 9 -17 24 -25 35 -42 50 -65 74 -89 106 -124 147 -170 196 -227 260 -295 339 -384 435
29 435 -492 554 -621 697 -779 870 -967 1076 -1195 1327 -1469 1629 -1801 1994 -2211 2447
45 2447 -2716 3021 -3365 3765 -4231 4775 -5439 6255 -7288 8654 -10536 13322 -17879 26632
59 26632 -49644 236049 573839 57447 -362355 -462985 -130845 272809 425932 144087
69 144087 -178761 -270844 -145496 23809 183529 183605 49560 -79908 -126722 -127056 -9131 143150
81 143150 146776 13531 -65009 -76240 -53884 6533 46614 17630 35905 92996 30659 -124235
93 -124235 -168555 -56635 128084 258160 156427 -158084 -337857 -172977 140377 323044
103 323044 247006 -65722 -346183 -287916 33455 280717 289374 79152 -221231 -337419 -126359
$$ packed form
0@%%%qJ6qQj7J8k6M1m9O0p7R2j15J39j63J95k30K71l17L66m23M87n55O34p23Q19
29D35r27J046j175J318j476J649j837K043k271K522k796L098l430L795m205M658
45B447n163N737o386P130p996R006j0214J1694j3543J5942j9190K3858l1201M4511
59B6632p6276K85693L37790n16392m19802j00630L32140M03654J53123k81845
69A44087l22848r2083J25348J69305J59720P6j34045j29468m6814l34J17925J52281
81A43150L626j33245p8540j1231K2356O0417M0081k8984J8275N7091o2337j54894
93a24235m4320J11920J84719J30076j01733l14511j79773J64880L13354J82667
103C23044p6038l12728k80461N8267L21371K47262Q657k10222l00383j16188K11060
$$ plain form
114 -126359 175800 284074 167856 -76740 -275785 -213271 57945 222376 153251 -8191
124 -8191 -135587 -148841 -20625 96391 67534 -4553 -14296 -11097 -15422 -6865 -32744 -58066
136 -58066 14266 102531 70695 -24274 -92487 -125783 -59925 108734 188921 74835 -98377
147 -98377 -194917 -158511 37608 240096 206220 -32002 -223933 -229350 -50112 200585 274279
158 274279 66012 -185244 -236334 -103779 97750 229542 145445 -80569 -193392 -119825
168 -119825 14992 124418 139768 18361 -107838 -94405 -11952 35962 57519 38411 -21931
179 -21931 -28717 18288 6448 -43933 -31854 18493 55614 77622 26593 -94489 -129129 -17311
191 -17311 103711 136725 76452 -70518 -182417 -106280 78695 171644 128050 -2212 -155220
$$ packed form
114a26359L02159J08274j16218k44596j99045O2514K71216J64431o9125j61442
124h191j27396j3254J28216J17016k8857p2087r743L199m325Q557k5879k5322
136e8066P2332Q8265l1836r4969o8213l3296O5858J68659Q0187j14086j73212
147i8377r6540L6406J96119K02488l3876k38222j91931n417J79238K50697P3694
158B74279k08267k51256n1090J32555K01529J31792q4097k26014j12823P3567
168a19825J34817J09426J5350j21407j26199J3433Q2453M7914K1557j9108o0342
179b1931o786M7005j1840n0381J2079N0347L7121K2008n1029j21082l4640J11818
191a7311J21022L3014o0273j46970j11899P6137J84975R2949m3594j30262j53008
$$ plain form
202 -155220 -182307 -18410 159214 177558 62932 -97028 -193543 -105092 98123 187260 99169
213 99169 -43188 -142768 -125774 22578 142644 96923 -15651 -69671 -70896 -23629 54672
224 54672 64467 431 -25299 -5887 -6777 -6047 7513 -9362 -14684 32294 47331 -5910 -42706
237 -42706 -43661 -30022 30830 93372 48205 -56399 -92760 -55562 14643 98047 100523 -17273
249 -17273 -115990 -92471 -6747 77718 114812 36476 -93744 -116683 -29096 52478 89099 63289
261 63289 -37341 -107694 -56522 30482 61908 51096 2185 -66986 -62737 12079 45598 21674
273 21674 -213 -25542 -38753 4630 39581 1319 -34119 -13737 6352 14354 26453 -2476
285 -2476 -52055 -33218 26085 40074 23951 -906 -48083 -57031 10223 59527 37142 1293
$$ packed form
202a55220k7087J63897J77624J8344j14626j59960r6515Q8451K03215Q9137q8091
213I9169j42357r9580J6994J48352J20066m5721j12574n4020j225M7267P8301
224E4672R795o4036k5730J9412q90P30J3560j6875n322M6978J5037n3241l6796
237d2706r55J3639O0852O2542m5167j04604l6361L7198P0205Q3404K476j17796
249a7273r8717K3519Q5724Q4465L7094p8336j30220k2939Q7587Q1574L6621k5810
261F3289j00630p0353N1172Q7004L1426j0812m8911o9171M249P4816L3519k3924
273B1674k1887k5329j3211M3383L4951l8262l5438K0382K0089Q002J2099k8929
285b476m9579J8837N9303J3989j6123k4857m7177q948O7254M9304k2385l5849
$$ plain form
297 1293 -32038 -61693 -25703 52755 62773 8738 -28891 -46088 -38657 22100 66555 27046
309 27046 -25339 -33481 -27336 -1681 45447 39968 -16402 -31442 -7071 351 13961 30073 725
322 725 -29261 -3050 20206 6240 2424 2236 -16895 -5700 30850 19943 -14339 -13369 -6364 -5545
336 -5545 23740 38053 -4490 -34098 -12570 4798 15142 35248 16387 -32185 -31732 4599 17377
349 17377 23412 24660 -13369 -40385 -8127 21869 15307 14631 7112 -27273 -26329 14646 22569 3882
363 3882 2899 -6194 -23891 -2470 23345 6005 -8786 660 -6881 -12502 11632 13531 -13464 -9128
377 -9128 8498 -3849 -5827 11562 -1621 -19390 744 12004 -4434 -2334 3340 -14963 -11877
390 -11877 14997 7905 -12807 -3346 -1402 -14907 1728 18310 -4890 -16808 318 -2112 -9925
$$ packed form
297A293l3331k9655L5990P8458J0018n4035l7629j7197P431O0757M4455l9509
309B7046n2385q142O145K5655M7128n479n6370j5040K4371P422J3610J6112k9348
322G25k9986K6211K3256j3966l816j88j9131J1195L6550j0907l4282R70P005Q19
336e545K9285J4313m2543k9608K1528J7368J0344K0106j8861m8572M53L6331J2778
349A7377O035J248l8029k7016L2258K9996o562o76p519l4385R44M0975P923j8687
363C882r83r093j7697K1421K5815j7340j4791R446p541n621K4134J899k6995M336
377i128J7626j2347j978J7389j3183j7769K0134J1260j6438K100N674j8303L086
390a1877K6874p092k0712R461J944j3505J6635J6582k3200j1918J7126k430p813
$$ plain form
403 -9925 9190 10828 -14030 -10628 4633 -4555 -3392 13138 -1483 -18744 112 7914 -7696
416 -7696 563 11164 -9455 -14010 8177 4787 -8105 4518 5276 -13459 -3857 12115 -1852
429 -1852 -6375 8100 -1119 -11775 6746 10158 -8960 -2085 11256 -4957 -8263 10912 4846
442 4846 -8110 5210 7143 -8799 -20 12995 -2305 -5826 10175 2576 -8512 7893 10038
455 10038 -8369 -340 12798 -3054 -6127 11779 5079 -8445 5139 8593 -6602 1046 12082
468 12082 -3468 -5458 11385 3154 -8291 6866 8624 -8965 -421 12709 -2893 -6330 10282
481 10282 2677 -9897 5208 8972 -7042 -1082 9170 -4836 -5456 10817 1906 -10671 4315
494 4315 6666 -9529 -1011 11160 -3745 -7786 6704 -130 -10011 5108 7708 -9719 -4405 6139
$$ packed form
403i925J9115J638k4858L402J5261r188J163J6530j4621j7261J8856P802j5610
416g696Q259J0601k0619m555K2187l390j2892J2623P58j8735R602J5972j3967
429a852m523J4475r219j0656J8521L412j9118O875J3341j6213l306J9175o066
442D846j2956J3320J933j5942Q779J3015j5300l521J6001p599j1088J6405K145
455A0038j8407Q029J3138j5852l073J7906o700j3524J3584L454j5195P648J1036
468A2082j5550j990J6843q231j1445J5157J758j7589Q544J3130j5602l437J6612
481A0282p605j2574J5105L764j6014N960J0252j4006o20J6273q911j2577J4986
494D315K351j6195Q518J2171j4905m041J4490o834r881J5119K600j7427N314J0544
$$ plain form
508 6139 -5855 -5771 10022 -407 -12783 1426 4735 -9561 -993 10193 -6400 -11696 4057
521 4057 600 -7327 4478 3572 -13341 -5079 7647 -3568 -5277 6153 -4211 -13479 4172 7836
535 7836 -8420 -3470 5199 -8364 -8013 10616 3743 -11626 -2378 1879 -6581 4061 11083 -8077
549 -8077 -13213 3631 2755 -2864 9360 3640 -16884 -7134 10970 3586 912 8129 -6414 -17304
563 -17304 4092 14791 1892 1120 1415 -13511 -6908 16576 11204 -4883 -159 -1448 -10360 5449
577 5449 18611 245 -9823 1349 778 -1209 12399 7708 -12882 -4561 11884 5082 2007 6567
591 6567 -7894 -13476 11902 20139 1037 -5446 -4413 -12149 502 25610 16047 -10089 -13588 -10541
605 -10541 -4330 21045 29302 -2223 -23578 -13775 -2852 10916 29553 13597 -23649 -24743 -482
$$ packed form
508F139j1994Q4J5793j0429j2376J4209L309j4296Q568J1186j6593n296J5753
521D057l457p927J1805r06j6913Q262J2726j1215j709J1430j0364r268J7651L664
535G836j6256M950Q669j3563L51J8629o873j5369R248M257q460J0642P022j9160
549h077n136J6844q76n619J2224n720k0524R750J8104p384k674P217j4543j0890
563a7304K1396J0699j2899p72K95j4926O603K3484n372j6087M724j289q912J5809
577E449J3162j8366j0068J1172n71j987J3608m691k0590Q321J6445o802l075M560
591F567j4461n582K5378Q237j9102o483J033p736J2651K5108r563k6136l499L047
605a0541O211K5375Q257l1525k1355R803J0923J3768J8637j5956l7246j094K4261
$$ plain form
618 -482 8948 16759 19293 -6658 -27004 -8738 10103 8955 11004 4413 -17309 -14633 9397 8999
632 8999 -3364 280 -2219 -9907 5344 13528 -8959 -18383 -924 6981 8111 12648 -5518 -31798
646 -31798 -16902 16302 22608 14263 -2273 -33701 -36940 7169 38139 24345 -1738 -27178 -42967
659 -42967 -14070 35290 39377 5661 -21540 -37432 -29451 15407 44797 18660 -16084 -27430
671 -27430 -27038 -5668 30707 28767 -7656 -21806 -12466 -6372 6209 18010 1364 -13748 -642
684 -642 7068 -3188 -4532 -3327 -8478 6543 26610 8660 -22179 -23716 -10252 8754 36929
697 36929 33642 -15659 -48459 -28557 9179 40955 49883 7148 -50646 -51979 -4334 37754 54525
710 54525 31171 -30121 -63191 -26329 27758 48434 38387 -2032 -48910 -42690 9464 38582
$$ packed form
618d82R430P811K534k5951k0346J8266J8841j148K049o591k1722K676K4030l98
632H999j2363L644k499p688J5251Q184k2487r424J7459P905J130M537j8166k6280
646c1798J4896L3204O306q345j6536l1428l239M4109L0970j3794k6083k5440j5789
659d2967K8897M9360M087l3716k7201j5892P981M4858K9390k6137l4744j1346
671b7430L92K1370L6375j940l6423j4150R340O094J2581J1801j6646j5112J3106
684f42P710j0256j344J205n151J5021K0067j7950l0839j537J3464J9006K8175
697C6929l287m9301l2800J9902L7736L1776Q928m2735n7794j333M7645M2088J6771
710E4525k3354o1292l3070L6862N4087K0676j0047m0419m6878O220N2154K9118
$$ plain form
722 38582 31214 11538 -18896 -35330 -8187 22788 17822 5122 2122 -7497 -8505 6656 3903
735 3903 -12298 -1341 19633 16728 2911 -11413 -30648 -20984 25031 47728 21331 -16487 -44561
748 -44561 -44603 5351 62312 54024 -4730 -49792 -58613 -22440 45842 75621 25947 -41165 -64337
761 -64337 -40295 17068 67215 50249 -16825 -55217 -43995 -7827 36696 51994 10381 -35676
773 -35676 -35658 -12414 6998 24481 19347 -9664 -18583 -2621 -673 -8492 -3025 1956 5382 17860
787 17860 10456 -25300 -39413 -11727 20749 38940 32073 -15175 -62700 -46319 13779 54128
799 54128 53138 9708 -56855 -76121 -18040 50778 68609 35272 -29676 -79900 -52553 25801
811 25801 68909 49521 -1385 -53849 -64070 -9793 48561 50042 15258 -21091 -43205 -27785
$$ packed form
722C8582p368j9676l0434j6434K7143L0975m966j2700l000r619j008J5161k753
735C903j6201J0957K0974k905j3817j4324j9235R664M6015K2697k6397l7818k8074
748d4561m2M9954N6961q288n8754m5062q821L6173O8282K9779m9674o7112k3172
761f4337K4042N7363N0147j6966o7074l8392J1222L6168M4523J5298m1613m6057
773c5676J8K3244J9412J7483n134k9011q919J5962J948p819N467M981L426J2478
787A7860p404l5756j4113K7686L2476J8191o867m7248m7525J6381O0098M0349
799E4128r90m3430o6563j9266N8081O8818J7831l3337o4948n0224K7347P8354
811B5801M3108j9388n0906n2464j0221N4277N8354J481l4784l6349k2114J5420
$$ plain form
823 -27785 15712 32619 14593 771 -5895 -14843 -9212 3741 -195 644 20110 21959 -4337
836 -4337 -22741 -25253 -14403 21410 52405 29973 -22550 -50411 -40691 2938 60321 67769 4697
849 4697 -58820 -65166 -22022 43398 82663 43992 -39227 -76481 -43792 17082 67153 64946 -786
862 -786 -61820 -55959 -8459 37380 57561 29111 -28128 -49415 -20958 11026 27899 29345 5602
875 5602 -22298 -17406 -1557 -1234 2031 12856 11345 4649 1031 -16274 -30977 -8454 26793 34896
889 34896 18789 -12655 -48611 -44269 11326 54856 45852 3199 -44953 -65805 -23234 46045
901 46045 66045 27110 -28053 -65386 -51787 15312 65830 47498 -6423 -47511 -55587 -17070
913 -17070 41118 53385 12143 -26886 -38001 -26172 8304 33602 19156 -8318 -15068 -12850
$$ packed form
823b7785M3497J6907j8026j3822o666q948N631J2953l936Q39J9466J849k6296
836d337j8404k512J0850L5813L0995k2432n2523k7861R720M3629N7383P448o3072
849D697o3517o346M3144O5420L9265l8671q3219l7254L2689O0874N0071k207o5732
862g86o1034N861M7500M5839K0181k8450n7239k1287K8457L1984J6873J446k3743
875E602k7900M892J5849L23L265J0825j511o696l618j7305j4703K2523L5247Q103
889C4896j6107l1444l5956M342N5595M3530r004m2653m8152k0852M2571O9279
901D6045K0000l8935n5163l7333J3599O7099N0518j8332n3921m1088q076L8517
913a7070N8188J2267m1242l9029j1115J1829L4476K5298j4446k7474o750K218
$$ plain form
925 -12850 -9593 3882 8888 -808 863 11118 390 -17110 -15759 -6983 6405 28138 25587
938 25587 -12302 -39208 -28576 1177 33605 46131 10574 -41964 -50309 -14393 26627 50785
950 50785 35553 -19744 -57518 -35259 12280 42764 44253 8007 -40638 -46555 -6560 28150
962 28150 37531 22355 -13296 -37300 -19306 12941 21649 16345 5910 -12461 -16418 1232 8212
975 8212 -62 2840 9379 4446 1240 -2164 -14988 -13144 13130 27225 14346 -4182 -21865 -28910
989 -28910 -2320 34952 35062 4956 -21993 -35463 -22170 20869 47330 24712 -14534 -35742
1001 -35742 -32957 782 40663 39274 -294 -29694 -31680 -13659 19473 38578 15316 -18050
1013 -18050 -24944 -14533 1118 20578 20258 -2979 -15504 -8633 -3789 481 9432 4924 -4974 -376
$$ packed form
925a2850L257J3475N006r696J671J0255j0728j7500J351Q776J3388K1733k551
938B5587l7889k6906J0632K9753L2428J2526l5557n2538q345L5916M1020K4158
950E0785j5232n5297l7774K2259M7539L0484J489l6246m8645n917L9995L4710
962B8150R381j5176l5651k4004J7994L2247Q708n304j0435j8371l957J7650O980
975H212q274K902O539m933l206l404j2824J844K6274J4095j2879j8528j7683p045
989b8910K6590L7272J10l0106k6949j3470J3293M3039K6461k2618l9246k1208
1001c5742K785L3739L9881j389l9568k9400j986J8021L3132J9105k3262l3366
1013a8050o894J0411J5651J9460l20k3237j2525O871M844M270Q951m508r898M598
$$ plain form
1027 -376 3106 -7270 -9821 -162 3197 6229 11761 -441 -20458 -17145 2296 12914 17709 9324
1041 9324 -17439 -30326 -9755 14376 21217 15692 -5402 -30739 -24090 7317 22916 16886 2696
1054 2696 -18774 -28308 -6311 18748 18039 5154 -7644 -20443 -14613 9412 17291 4681 -4202
1067 -4202 -7802 -11333 -878 12193 4602 -6377 -2241 816 -1477 2739 2723 -7141 -4216 8073
1081 8073 6313 -1051 -1606 -6291 -8128 6422 15873 3567 -7315 -7123 -7914 237 16357 13846 -4793
1096 -4793 -11819 -6933 -1774 9969 17129 3086 -12071 -8184 -852 3691 12379 9968 -6908 -11061
1110 -11061 446 4810 5204 8073 795 -9190 -1857 7150 3235 712 2499 -2817 -3181 6784 6026
1125 6026 -4178 -3026 1313 -486 3378 8452 -1349 -9804 -1981 4331 3255 5775 2276 -9290
$$ packed form
1027c76L482j0376k551R659L359L032N532j2202k0017L313J9441J0618M795q385
1041I324k6763j2887K0571K4131O841n525k1094k5337O649L1407J5599o030j4190
1054B696k1470r534K1997K5059p09j2885j2798j2799N830K4025P879j2610q883
1067d202l600l531J0455J3071p591j0979M136L057k293M216j6r864K925J2289
1081H073j760p364n55m685j837J4550R451j2306j0882J92p91Q151J6120k511j8639
1096d793p026M886N159J1743P160j4043j5157L887P332M543Q688k411j6876m153
1110a1061J1507M364L94K869p278r985P333R007l915k523J787n316l64R965p58
1125F026j0204J152M339j799L864N074r801q455P823O312j076K520l499j1566
$$ plain form
1139 -9290 -8175 4516 6410 2927 3457 -4011 -11270 -1779 8941 4298 277 67 -7703 -8034 4883
1154 4883 8133 -177 -2683 -2672 -6841 -1448 7319 1951 -4915 -1471 -1570 -4893 2225 5369 -3812 -4806
1170 -4806 1568 -880 -3597 2435 765 -5620 -1278 3682 -2466 -3119 1326 -2518 -3994 3725 2579
1185 2579 -5259 -2499 1258 -2843 -890 4971 -806 -6131 -455 1620 -2105 2248 3690 -4924 -4673
1200 -4673 2558 1146 -989 3621 484 -6126 -819 4877 -434 -1106 3065 -1438 -4372 3072 4045
1215 4045 -1860 432 2273 -3458 -1483 5428 1684 -2503 2260 1528 -3542 1730 5749 -1210 -1790
1230 -1790 3884 92 -2573 3944 3787 -2533 441 3533 -1564 -330 5131 711 -2506 3092 2435
1245 2435 -2887 1443 4850 -1311 -1380 3877 433 -2409 3671 3116 -2917 260 3514 -1317 -1004 3881
$$ packed form
1139i290J115J2691J894l483N30p468p259R491J0720m643m021k10p770l31J2917
1154D883L250q310k506J1m169N393Q767n368o866L444r9l323P118L144r181r94
1170d806O374k448k717O032j670o385M342M960o148o53M445l844j476P719j146
1185B579p838K760L757m101J953N861n777n325N676K075l725M353J442q614K51
1200d673P231j412k135M610l137o610N307N696n311o72M171m503k934P444R73
1215D045n905K292J841n731J975O911l744m187M763p32n070N272M019o959n80
1230a790N674l792k665O517j57o320K974L092n097J234N461m420l217N598o57
1245B435n322M330L407o161o9N257l444k842O080n55o033L177L254m831L13M885
$$ plain form
1261 3881 -195 -3063 2834 2091 -3200 353 3392 -2385 -1910 3678 31 -3224 1726 1294 -3952 247
1277 247 3496 -2497 -2238 2763 -945 -3470 2192 1485 -4357 -532 2720 -2824 -2111 2956 -1238 -4593
1293 -4593 1017 1389 -3651 -257 1724 -3654 -2563 3110 -799 -3920 736 481 -4689 -128 2916
1308 2916 -3044 -2581 1961 -1171 -3991 1823 1556 -3669 -1097 2021 -2912 -1567 3379 -1397 -4040
1323 -4040 1591 1680 -3355 430 3056 -2909 -2574 3063 -136 -2905 2084 1315 -3579 9 3292 -1495
1339 -1495 -1272 3076 -282 -3191 2980 2721 -2598 334 3062 -2288 -1346 4659 1129 -2002 2397 1159
1355 1159 -2994 1619 4603 -671 -946 2699 -630 -2030 4061 3742 -2393 384 2582 -1688 -166
1370 -166 5104 1211 -3019 1608 1827 -1488 2210 3472 -2279 -1577 3683 945 -1526 2548 1068 -3421
$$ packed form
1261C881m076k868N897p43n291L553L039n777M75N588l647l255M950m32n246M199
1277B47L249n993K59N001l708k525N662p07n842L825L252n544P13N067m194l355
1293d593N610L72n040L394J981n378J091N673l909l121M656k55n170M561L044
1308B916n960M63M542l132k820N814k67n225K572L118m933J345M946m776k643
1323d040N631Q9n035L785K626n965L35N637l199k769M989p69m894L588L283m787
1339a495K23M348l358k909O171k59n319K932K728n350R42O005l530l131M399j238
1355A159m153M613K984n274k75L645l329j400O091l19o135K777K198m270J522
1370a66N270l893m230M627K19l315L698J262n751P02N260k738k471M074j480m489
$$ plain form
1386 -3421 1200 4856 -865 -1889 2000 -755 -1806 4216 3254 -3356 -2303 1091 -1355 1428 5628
1401 5628 -1256 -6525 -981 1526 -31 3707 3497 -5389 -5674 1252 1739 743 3653 -909 -7551 -2649
1417 -2649 3394 872 517 1421 -4440 -6096 1756 3333 -1701 -861 350 -4095 -2101 3577 -711 -4565
1433 -4565 -1 1270 -1947 720 436 -5890 -3848 4326 2987 -822 -649 -4382 -7474 1473 8385
1448 8385 2903 -3264 -4627 -7373 -3535 8543 8913 -1280 -6302 -6355 -5729 3603 12456 4574 -6832
1463 -6832 -7609 -4252 -272 8582 9465 -2563 -8562 -3277 -14 2929 7954 2607 -6209 -3691 1835
1478 1835 731 1896 4340 -1541 -3386 3538 3574 -2621 -1810 1534 681 3980 6617 -2077 -8631 -2296
1494 -2296 4433 6385 8028 1837 -11027 -10158 3469 10589 9178 4869 -7621 -15490 -3721 11654
$$ packed form
1386c421M621L656n721j024L889k755j051O022r62o610J053L394k446K783M200
1401E628o884n269N544K507j557L738k10q886k85O926M87r96K910m562o642M902
1417b649O043k522l55R04n861j656P852J577n034Q40J211m445J994N678m288l854
1433d565M564J271l217K667k84o326K042Q174j339l809J73l733l092Q947O912
1448H385n482o167j363k746L838J2078L70j0193n022n3O26R332Q853p882j1406
1463f832p77L357L980Q854Q83j2028n999N285L263K943N025n347q816K518N526
1478A835j104J165K444n881j845O924L6o195Q11L344q53L299K637q694o554O335
1494b296O729J952J643o191j2864Q69J3627P120j411m309j2490p869J1769J5375
$$ plain form
1508 11654 12818 6079 -2994 -13356 -10665 6224 14526 7673 -716 -8251 -12027 -1637 12046 9141
1522 9141 -873 -4352 -6252 -4766 5118 8023 -1075 -4686 -325 283 -229 2125 -1871 -6016 1081
1537 1081 7436 2277 -3632 -5337 -7649 -1432 11067 10817 -3511 -11533 -10222 -4010 9507 17219
1551 17219 3829 -13951 -15859 -6912 5614 17456 11961 -8978 -19138 -10342 2586 12376 14549
1564 14549 55 -16741 -13846 356 7620 10197 5040 -8429 -12752 -2291 5433 3600 2126
1577 2126 -1271 -6126 -1952 4989 129 -5628 -1921 2411 3360 5537 206 -11545 -10255 4159 12250
1592 12250 10104 1726 -12498 -18132 -2218 16607 17006 4942 -9715 -20961 -11760 12404 23257
1605 23257 11090 -6431 -17706 -17112 2116 21345 17525 -912 -13323 -15282 -5219 13093 17831
$$ packed form
1508A1654J164o739r073j0362K691J6889Q302o853q389p535l776J0390J3683k905
1522I141j0014l479j900J486R884K905r098l611M361O08n12K354l996m145P097
1537A081O355n159n909j705k312O217J2499k50j4328q022J311O212J3517P712
1551A7219j3390j7780j908Q947J2526J1842n495k0939j0160Q796J2928R790K173
1564A4549j4494j6796K895J4202P264K577n157j3469m323J0461P724j833j474
1577B126l397m855M174O941m860n757L707M332R49K177n331j1751J290J4414Q091
1592A2250k146q378j4224n634J5914J8825L99j2064j4657j1246R201K4164J0853
1605B3257j2167j7521j1275N94J9228J9229l820j8437j2411j959J0063J8312M738
$$ plain form
1618 17831 3915 -9044 -9298 -4973 3484 11358 6362 -4711 -4234 1446 1308 1383 1471 -2682 -611 7507
1634 7507 6924 -3550 -8195 -5495 286 11623 15674 179 -16328 -14473 -1512 12525 20253 9277
1648 9277 -15266 -23257 -8064 10885 21081 16228 -6286 -24831 -16677 5944 18402 17338 2800
1661 2800 -17518 -21324 -1923 14483 14219 5177 -7143 -16108 -7585 8220 9698 2574 -2931 -6626
1675 -6626 -5552 3169 5672 -2953 -5442 786 3452 2815 479 -7185 -11740 -99 12132 9834 -208
1690 -208 -10579 -16755 -6710 13380 19091 4861 -11404 -19290 -13464 7375 23284 13525 -8603
1703 -8603 -20043 -16003 -242 19195 19724 -1453 -18137 -15874 -3724 10895 17743 5419 -11975
1716 -11975 -13334 -3203 4873 9404 6447 -5122 -9388 -450 5627 2174 -459 -2161 -3216 3212
$$ packed form
1618A7831j3916j2959k54M325Q457P874m996j1073M77N680j38P5Q8m153K071Q118
1634G507n83j0474m645K700N781J1337M051j5495j6507J855J2961J4037P728j0976
1648I277k4543p991J5193J8949J0196m853k2514j8545Q154K2621J2458j064j4538
1661B800k0318l806J9401J6406k64r042j2320q965Q523J5805J478p124n505l695
1675f626J074Q721K503q625k489O228K666o37k336p664m555J1641J2231k298j0042
1690b08j0371o176J0045K0090N711j4230j6265p886N826K0839J5909r759k2128
1703h603j1440M040J5761J9437N29k1177j6684K263J2150J4619O848j2324j7394
1716a1975j359J0131Q076M531k957j1569m266Q938O077l453k633j702j055O428
$$ plain form
1730 3212 8526 934 -8410 -6837 13 6951 12505 5568 -11299 -15429 -2361 10454 15510 10579
1744 10579 -7516 -20678 -10317 9622 18354 13552 -1493 -18083 -16688 3640 18091 14781 2208
1757 2208 -11115 -16950 -4171 13986 14912 3558 -5946 -10786 -6839 6418 12141 3291 -5116 -4153
1771 -4153 -2052 2364 6506 887 -6314 -1978 5552 4170 734 -3000 -8218 -4032 8710 11622 1166
1786 1166 -8089 -10891 -6457 7040 16775 7291 -9141 -14506 -9448 2743 16360 13726 -5136 -16939
1800 -16939 -11824 75 11539 15342 2343 -14447 -14146 -1930 7367 11115 5933 -7885 -13143
1813 -13143 -3781 5701 6230 3774 -2446 -8847 -4317 5155 3830 -1729 -2472 -2827 -1512 4101 3809 -4765
1829 -4765 -7006 -1228 3545 5404 4169 -4845 -11987 -4481 6986 8583 4868 -2825 -11859 -9785 5068
$$ packed form
1730C212N314p592r344J573O850O938N554o937j6867m130J3068J2815N056m931
1744A0579j8095j3162J0361J9939Q732m802j5045j6590J395K0328J4451l310j2573
1757B208j3323n835J2779J8157R26j1354r504m840L947J3257N723q850q407R63
1771d153K101M416M142n619p201M336P530j382l436l734n218M186J2742K912j0456
1786A166r255k802M434J3497R735r484j6432n365N058J2191J3617k634j8862j1803
1800a6939N115J1899J1464L803j2999j6790L01J2216R297L748n182j3818n258
1813a3143R362R482N29k456o220o401M530R472j325n559p43l55J315N613k92q574
1829d765k241N778M773J859j235r014p142P506J1467J597l715p693r034K074J4853
$$ plain form
1844 5068 12567 6518 -2291 -9683 -11250 -312 12772 10124 -744 -7712 -9488 -3676 8499 12005
1858 12005 1305 -7349 -6346 -2937 3420 9356 4033 -5809 -5367 380 3017 4646 3470 -3461 -5060
1873 -5060 1824 5229 2145 102 -2252 -4255 1014 7941 4021 -3266 -3925 -2604 660 7635 7221
1888 7221 -2503 -7075 -3173 1308 5235 7893 569 -8100 -5282 2222 4903 6026 2953 -5559 -7637
1903 -7637 569 5887 4273 1845 -2217 -6403 -1810 5579 4326 -447 -1832 -2991 -2885 3517 5077
1918 5077 -958 -4215 -1425 -250 1448 4361 451 -5969 -3254 2180 2459 2270 902 -5041 -5426 1636
1934 1636 4741 1271 -500 -2674 -5998 -1442 5698 3533 -1611 -3169 -3800 -3097 3025 5540 -680
1949 -680 -4242 -3075 -2218 345 4687 1871 -4497 -3099 -385 -535 1946 2819 -1916 -4459 -396 1860
$$ packed form
1844E068P499o049q809p392j567J0938J3084k648j0868o968j776N812J2175L506
1858A2005j0700q654J003L409O357N936n323r842M42N747K637J629j176o931j599
1873e060O884L405l084k043k354k003N269O927l920p287o59J321L264O975m14
1888G221r724m572L902M481L927K658p324q669K818P504K681J123l073q512k078
1903g637Q206N318j614k428m062m186M593P389j253m773j385j159J06O402J560
1918E077o035l257K790J175J698K913l910o420K715N434K79j89j368n943l85P062
1934A636L105l470j771k174l324M556P140k165n144j558o31P03O122K515o220
1949f80l562J167Q57K563M342k816o368J398K714j50K481Q73m735k543M063K256
$$ plain form
1965 1860 -162 438 52 -3078 -1464 2851 1173 -1525 -160 -588 -1878 2008 2914 -2028 -2420 539
1981 539 121 445 2875 732 -3895 -1428 2284 892 1482 1605 -2195 -3367 1455 3153 477 1154
1997 1154 134 -3173 -845 3991 2194 -265 416 -858 -1671 2040 4047 259 -1267 277 -1242
2012 -1242 -460 3654 2250 -1862 -678 986 -732 799 3084 30 -2002 928 934 -691 1422 1894
2028 1894 -1710 -1010 1761 123 -810 1877 606 -2118 497 1650 -998 -865 1856 -494 -1403 1195
2044 1195 311 -1718 293 1438 -1201 -482 1616 -807 -1572 1095 671 -1715 -158 830 -1926 -884
2060 -884 1805 -339 -1787 387 -132 -1990 498 1419 -1478 -1629 814 -1179 -1496 1145 767 -1954
2076 -1954 -320 456 -1564 -644 1745 -825 -2838 174 178 -1885 657 1399 -1983 -1573 434 -776 -1078
$$ packed form
1965A860k022O00l86l130J614M315j678k698J365m28j290L886R06m942l92K959
1981E39m18L24K430k143m627K467L712j392N90J23l800j172M822J698k676O77
1997A154j020l307K328M836j797k459O81j274q13L711K007l788j526J544j519
2012a242P82M114j404m112J184J664j718J531K285l054k032K930Oj625K113M72
2028A894l604P00K771j638r33K687j271k724K615J153k648J33K721k350r09K598
2044A195q84k029K011J145k639P19K098k423p65K667m24k386J557R88k756J042
2060h84K689k144j448K174n19j858K488R21k897j51K443j993l17K641l78k721
2076a954J634P76k020R20K389k570k013L012Mk063K542P42l382M10K007j210l02
$$ plain form
2093 -1078 1819 227 -2549 -384 1020 -1213 -257 1688 -803 -2294 699 825 -1078 999 1154 -1776
2109 -1776 -1321 1666 30 -375 1815 495 -1687 160 1936 -403 11 1814 -400 -1737 1246 1147
2125 1147 -760 907 1400 -1079 -446 1867 383 -699 1698 1064 -1511 596 2138 -289 -255 2121
2141 2121 -194 -1241 1557 1540 -776 755 1617 -1204 -31 2575 358 -848 1543 669 -1354 930
2157 930 2268 -799 -597 1456 -407 -1072 1873 1086 -1456 285 1142 -845 -261 1820 -577 -1602
2173 -1602 1048 560 -1309 184 1446 -1098 -281 1646 -324 -1885 311 488 -1210 1068 765 -2307
2189 -2307 -1862 1066 175 -399 1045 -632 -3386 -588 1940 -197 -439 503 -2292 -2808 1204 1790 -594
2206 -594 -530 -956 -2968 -903 2417 937 -1490 -607 -1495 -2210 1246 2293 -1046 -1792 -232 -802 -639
$$ packed form
2093a078K897j592k776K165J404k233R56J945k491j491K993J26j903K077J55k930
2109a776M55K987j636m05K190j320k182J847J776k339M14J803k214j337K983r9
2125A147j907J667M93k479O33K313j484j082K397o34k575K107J542k427L4K376
2141B121k315j047K798j7k316J531Q62k821J173K606k217j206K391q74k023K284
2157I30J338l067K02K053j863o65K945p87k542J741Q57j987N84K081k397j025
2173a602K650m88j869J493J262k544Q17J927j970j561K196J77j698K278l03l072
2189b307M45K928q91n74J444j677k754K798K528k137k42R42k795n16M012N86k384
2206e94O4m26k012K065L320j480k427Q83q88p15L456J047l339p46J560n70J63
$$ plain form
2223 -639 2162 544 -2470 -876 954 -361 133 1102 -1723 -1963 1911 1611 -954 -724 -443 -1929 647
2240 647 3902 775 -2272 -1353 -726 173 3286 3611 -2056 -3187 -1019 522 1875 4557 486 -4447
2256 -4447 -2246 1556 2166 3034 2504 -2314 -4034 686 2881 1679 1646 -99 -2869 -913 3178 2075
2272 2075 -541 205 -895 -1393 2048 2695 -1590 -1631 816 887 1411 2500 -672 -3842 -977 3261 2722
2289 2722 1811 -97 -4768 -3842 3067 5427 2301 -921 -3712 -5169 314 6635 4317 -1379 -3515
2304 -3515 -4805 -2140 4562 6429 -13 -4240 -3833 -2167 1728 5784 2269 -4068 -3966 -707 671
2319 671 2502 2590 -2068 -3908 -77 1782 231 12 -1180 -2952 230 3773 773 -3377 -2773 -1851
2335 -1851 276 5056 3553 -3966 -6718 -2829 1394 4878 5597 -1514 -8372 -5691 1737 5050 5762
$$ packed form
2223f39K801j618l014J594J830j315M94R69k825k40L874l00k565K30K81j486K576
2240F47L255l127l047R19O27Q99L113L25n667j131K168J541J353K682m071m933
2256d447K201L802O10Q68n30m818j720M720K195j202l3j745k770J956M091j103
2272B075k616P46j100m98L441O47m285m1K447P1N24J089l172l170K865M238n39
2289B722r11j908m671R26O909K360l126l222k791j457N483O321k318n696k136
2304c515j290K665O702J867o442m227M07J666L895M056l515o337J02L259J378
2319F71J831Q8m658j840L831J859j551k19j192j772L182L543l000m150O04R22
2335a851K127M780j503p519k752L889M223L484P19p111o858K681P428L313P12
$$ plain form
2350 5762 1431 -7196 -8359 -67 5904 5284 2052 -3470 -8089 -3237 4644 5416 1485 -1746 -4624
2365 -4624 -3861 2269 5413 797 -2083 -1810 -1608 877 3963 604 -3900 -1741 2400 2635 1965 -6
2381 -6 -4592 -3751 3697 6696 2723 -1747 -5665 -5292 1920 9413 6278 -2243 -6523 -6386 -1133 8381
2397 8381 9466 391 -7193 -6619 -2640 5100 10295 4156 -6094 -7417 -2364 2964 7317 5433 -3067
2412 -3067 -7171 -2318 2223 3616 3538 200 -4365 -1829 3300 2206 -248 -1203 -1654 -423 3718 3578
2428 3578 -2787 -5121 -1351 1845 4807 4798 -2590 -9119 -5294 3163 6822 6039 -491 -9351 -9300 1188
2444 1188 8822 7543 862 -7060 -10966 -2981 8099 9057 2112 -4976 -9162 -5809 4124 9224 3329
2459 3329 -3595 -6364 -4849 668 6443 3889 -3073 -4469 -2293 117 3058 2472 -2687 -4281 1010
$$ packed form
2350E762m331q627j163Q292N971o20l232n522m619M852P881P72l931l231k878
2365d624P63O130L144m616k880K73K02K485L086l359m504K159M141K35o70j971
2381fm586Q41P448K999l973m470l918L73P212P493l135q521m280J37N253R514
2397H381J085r075p584N74L979P740N195o139j0250j323N053N328M353j884q500
2412c067m104M853M541J393p8l338m565K536N129j094k454r55m51J231M141j40
2428C578o365k334L770L196K962rp388o529L825Q457L659p83o530q860N1J0488
2444A188P634j279o681p922l906P985J1080R58o945p088m186L353R933N100n895
2459C329o924k769J515N517N775k554o962j396K176K410K941n86n159j594N291
$$ plain form
2474 1010 3219 1043 -861 -3679 -4148 1186 6610 3213 -3439 -6042 -4777 364 8123 7369 -2199
2489 -2199 -8411 -6488 -553 6788 9699 1812 -8724 -8884 -1280 5435 9163 5124 -5656 -9965 -2942
2504 -2942 4480 6855 5276 -1948 -8159 -4416 3754 5761 2647 -336 -3945 -3512 2435 5229 561
2519 561 -2362 -2007 -241 2526 4341 84 -4999 -2867 2555 4387 4376 779 -6404 -6361 2204 7584
2535 7584 5757 752 -5959 -8529 -871 8779 8012 1075 -4946 -8377 -4153 6115 9702 3017 -4271
2550 -4271 -6778 -4978 2325 8558 4999 -3376 -5956 -3316 304 4647 4760 -1511 -5036 -1883 1551
2565 1551 2262 1753 -774 -4170 -1194 3911 2501 -1349 -3269 -3106 -583 4980 4884 -2298 -6108 -3613
2581 -3613 271 4589 6567 -66 -7731 -6774 -292 4399 6789 2555 -6479 -8977 -1849 5055 6035
$$ packed form
2474A010K209k176j904k818m69N334N424l397o652k603J265N141P759p54r568
2489b199o212J923N935P341K911p887j0536j60P604O715L728m039j0780m309P023
2504b942P422K375j579p224o211L743Q170K007l114k983l609M33N947K794m668
2519E61k923L55J766K767J815m257n083K132N422J832j1l597p183M3Q565N380
2535G584j827n005o711k570P658R650p67o937o021l431M224J0268L587o685p288
2550d271k507J800P303O233l559q375k580K640L620M343J13o271l525L153L434
2565A551P11n09k527l396K976N105j410l850j920J63K523N563r6p182l810K495
2581c613L884M318J978o633p665R57O482M691K390m234r034k498P128O904R80
$$ plain form
2596 6035 3324 -3227 -8770 -4678 3735 6139 3393 -1147 -5642 -5517 1159 5391 2193 -1553 -2776
2611 -2776 -3721 -193 4104 2428 -2448 -2431 -260 773 2315 1715 -2910 -3712 696 3466 1989 378
2627 378 -2682 -4757 -13 5453 4180 -704 -3364 -4599 -1684 4504 6467 823 -4467 -4542 -2048 2780
2643 2780 7079 2896 -3992 -5055 -1971 1865 4944 4576 -2012 -5291 -1757 1842 3418 3602 316
2658 316 -4330 -2434 2607 3073 1271 221 -2373 -2511 2314 3891 161 -1870 -1181 -1163 1131 4057
2674 4057 1202 -3506 -2556 357 1574 3113 2310 -2691 -4806 -67 2656 2722 2050 -1580 -4863 -2029
2690 -2029 3005 3304 1188 -761 -3729 -3401 1761 4000 975 -1492 -2156 -2554 -253 3603 1840 -1983
2706 -1983 -2214 -844 -412 1767 2182 -1431 -3364 -324 1039 511 847 -521 -3327 -1181 2141 1389
$$ packed form
2596F035k711o551n543M092Q413K404k746m540m495J25O676M232l198l746j223
2611b776r45L528M297j676m876J7K171J033J542o00m625q02M408K770j477j611
2627C78l060k075M744N466j273m884k660j235K915O188J963n644n290p5K494M828
2643B780M299m183o888j063L084L836L079l68o588l279L534L599J576J84l286
2658C16m646J896N041M66j802j050k594j38M825J577l730k031O89J8K294K926
2674D057k855m708R50K913J217J539q03n001k115M739K723O6o72l630l283K834
2690b029N034K99k116j949k968L28N162K239l025k467o64l98K301L856j763l823
2706a983k31J370M32K179M15l613j933L040J363n28L36j368k806K146L322p52
$$ plain form
2722 1389 -423 -745 -2129 -2333 1993 3064 26 -1870 -1658 -1702 -41 3284 1489 -2764 -2571 -649
2738 -649 -141 2191 2716 -1166 -3394 -973 804 1139 1876 282 -2947 -1874 1379 1165 541 707 -1112
2755 -1112 -2413 358 2107 162 -200 -11 -1308 -413 2093 1188 -1296 -338 677 -396 1101 1724
2771 1724 -836 -1657 654 1454 -1 922 198 -1954 -412 2265 1409 -56 303 -996 -1590 1543 2445
2788 2445 147 -580 -62 -928 -50 2699 1582 -1385 -539 327 -455 1157 2597 -132 -1861 276 102
2805 102 122 1384 921 -1927 -1016 946 333 -99 1241 -187 -1898 282 1285 -608 45 664 -1142
2822 -1142 -1001 1301 595 -1016 199 360 -1081 -347 1044 -680 -1497 388 65 -946 573 554 -1187
2839 -1187 -794 795 -502 -776 796 -410 -1386 174 464 -1136 -589 505 -1045 -1021 957 190 -1504
$$ packed form
2722A389j812l22j384k04M326J071l038j896K12m4J661L325j795m253J93J922
2738f49N08K332N25l882k228K421J777L35P37j594l229J073L253k14o24J66j819
2755a112j301K771J749j945l62J89j297Q95K506r05k484R58J015j073J497O23
2771A724k560q21K311Q00j455R23p24k152J542K677q56j465L59j299n94L133R02
2788B445k298p27N18q66Q78K749j117k967Q46Q66p82J612J440k729j729K137j74
2805A02K0J262m63k848R11J962o13m32J340j428j711K180J003j893O53O19j806
2822a142J41K302p06j611J215J61j441P34J391j724q17J885l23j011J519j9j741
2839a187L93J589j297k74J572j206r76J560K90j600N47J094j550K4J978p67j694
$$ plain form
2856 -1504 -63 2 -1293 -278 990 -667 -986 255 8 -1223 850 708 -1352 -499 681 -269 -563
2873 -563 1489 -274 -1776 -89 633 -542 293 1099 -1168 -1206 1143 451 -678 887 666 -1295 -465
2890 -465 1405 166 -296 1149 14 -1248 481 1574 -203 210 1091 -708 -534 1296 700 -855
2906 -855 456 965 -1026 266 1557 19 -467 865 136 -962 704 917 -414 -160 1208 -305
2922 -305 -716 1243 790 -713 514 768 -839 5 1184 -61 -496 1126 145 -989 569 847 -680
2939 -680 146 1075 -541 -824 997 345 -666 664 360 -1421 -332 995 -316 -826 1037 36 -1651
2956 -1651 311 898 -691 -95 915 -772 -1034 1040 99 -915 460 293 -1093 -468 1181 -167
2972 -167 -1236 109 -341 -1276 579 1006 -1052 -783 428 -840 -659 1007 268 -1276 39 125 -1088
$$ packed form
2856a504J441O5j295J015J268j657l19J241k47j231K073j42k060Q53J180r50k94
2873e63K052j763j502J687P22j175Q35Q06k267l8K349o92j129J565k21j961Q30
2890d65J870j239m62J445j135j262J729J093j777M13Q81j799J74J830n96j555
2906h55J311N09j991J292J291j538m86J332p29j098J666K13j331K54J368j513
2922c05m11J959m53j503J227K54j607Q44J179j245m35J622r81j134J558K78j527
2939f80Q26R29j616k83J821o52j011J330l04j781J089J327j311n10J863j001j687
2956a651J962N87j589N96J010j687k62K074r41j014J375j67j386O25J649j348
2972a67j069J345m50r35J855M27k058K69J211j268J81J666p39j544J315Q6j213
$$ plain form
2989 -1088 -219 1560 -479 -941 -79 -443 -791 638 657 -688 -506 281 -639 -358 1364 265 -1444 5
3007 5 470 -997 93 1314 -521 -1074 495 260 -616 589 1156 -900 -334 1151 -175 -684 1235
3024 1235 186 -1060 682 807 -1040 -198 1105 104 75 1410 219 -1570 171 1067 -96 587
3040 587 879 -1124 -1223 1121 1230 165 1139 -55 -1370 -58 1718 804 -188 439 -414 -1447 1003
3057 1003 1853 -157 -238 290 -1044 -198 1623 770 -876 -42 510 -686 432 1322 -784 -1385 785
3074 785 653 -207 307 -183 -1958 -112 1795 371 -505 -95 -1005 -1456 1382 1926 -525 -1195 -582 -1232
3092 -1232 592 2030 710 -2242 -1365 -269 -196 1645 1764 -1295 -2719 -788 110 240 1547 240
3108 240 -2178 -1605 830 339 -119 156 -850 -1798 231 1220 -452 -936 -103 -574 165 1586 -72 -2324
$$ packed form
2989a088Q69J779k039m62Q62l64l48J429J9j345J82P87r20K81J722j099j709J449
3007EM65j467J090J221j835n53J569k35q76J205N67k056N66J485j326n09J919
3024A235j049j246J742J25j847Q42J303j001k9J335j191j789J741Q96j163O83
3040E87K92k003r9K344J09j065R74j194j315J312J776r14r92O27q53j033K450
3057A003Q50k010q1N28j334Q46J821q53j646Q34N52j196J118Q90k106o01K170
3074G85j32q60N14m90j775J846J907j424q76M10r10m51K838N44k451o70O13o50
3092a232J824J438j320k952Q77J096P3J841J19l059j424J931Q98J30J307j307
3108B40k418N73K435m91m58K75j006r48K029R89j672m84Q33m71P39J421j658k252
$$ plain form
3126 -2324 -1040 386 656 1405 1079 -1991 -2634 464 1835 1294 972 -816 -3315 -988 2199 2373 934
3143 934 -251 -2518 -2571 1328 3351 1557 -504 -1459 -2261 17 3154 2183 -927 -1177 -1129 -626 1400
3160 1400 2631 -163 -2180 -420 563 294 1327 419 -1743 -536 1905 983 -51 98 -1320 -956
3176 -956 2272 2774 -249 -1869 -1291 -660 1283 4027 1220 -2773 -2610 -695 1081 3243 2671 -1839
3192 -1839 -3910 -1285 1238 2719 3207 73 -3886 -2680 1076 2352 2100 737 -2200 -3063 249 2479
3208 2479 1328 15 -1062 -2098 -716 2330 1295 -1240 -1278 -702 -16 1306 1361 -1819 -2530 -182 1855
3225 1855 1324 1040 -1246 -3813 -1199 2683 2437 345 -1579 -3461 -2849 1821 4296 1281 -1793 -3290
3241 -3290 -3379 639 4309 2846 -1533 -3372 -2731 -546 2737 3754 -311 -3511 -2106 -338 1671 2852
$$ packed form
3126b324J284J426K70P49l26l070o43L098J371n41l22j788k499K327L187J74j439
3143I34j185k267n3L899K023j794k061r55q02K278L137r71l110k50M8N03K026
3160A400J231k794k017J760R83k69J033r08k162J207K441r22j034J49j418L64
3176i56L228N02l023j620N78O31J943K744k807l993J63J915J776K162n72m510
3192a839k071K625K523J481M88l134l959J206L756J276k52j363k937q63L312K230
3208B479j151j313j077j036J382L046j035k535l8N76O86J322N5l180p11K348K037
3225A855n31k84k286k567K614L882k46k092j924j882O12M670K475l015l074j497
3241c290q9M018L670j463m379j839O41K185L283J017m065l200J405J768K009J181
$$ plain form
3257 2852 815 -2475 -2228 513 1175 1093 194 -1475 -1754 1005 2341 165 -1287 -1233 -1074 1288 3388
3274 3388 1168 -2559 -2346 -639 1252 3529 2556 -2051 -4183 -1207 1944 3316 3078 -762 -4820 -2858
3290 -2858 1757 3909 3001 253 -3382 -3854 788 4136 2657 155 -1887 -3064 -535 3474 2734 -198
3306 -198 -1528 -1527 -665 1849 2712 -223 -2224 -921 887 1459 1709 -284 -2957 -1301 1929 2324 820
3323 820 -1113 -2778 -1925 1986 3774 1305 -1628 -2755 -2746 699 4313 2585 -2018 -3159 -2380 -37
3339 -37 3692 3840 -968 -3983 -2504 112 2531 3478 685 -3318 -3105 252 1602 2112 991 -1785
3355 -1785 -2953 -80 2381 965 -307 -967 -2240 -3 2488 1238 -1703 -2085 -930 179 2410
3370 2410 1712 -1814 -3180 -780 1249 2339 1758 -1090 -4059 -2022 1528 3220 1664 -484 -3424
$$ packed form
3257B852k037l290K47K741O62q2q99j669k79K759J336k176j452N4J59K362K100
3274C388k220l727K13J707J891K277r73m607k132K976L151J372k38l840m058J962
3290b858M615K152r08k748l635m72M642L348j479k502k042j177K529M009p40k932
3306a98j330JQ62K514Q63k935k001J303J808N72K50j993k673J656L230L95j504
3323H20j933j665Q53L911J788k469k933j127RL445L614j728m603j141P79K343
3339c7L729J48m808l015J479K616K419R47k793m003K13L357J350N10j121k776
3355a785j168K873K461j416j272o60j273K237K491j250k941l82J155J109K231
3370B410o98l526j366K400K029J090n81k848k969K037L550J692j556k148k940
$$ plain form
3385 -3424 -3471 1046 3792 2032 -431 -2478 -3189 -526 3400 2946 -301 -2203 -2480 -1242 2016 3385
3401 3385 135 -1909 -1555 -440 972 2099 482 -2133 -1402 954 1628 895 306 -1371 -1777 1073
3417 1073 2476 786 -719 -1186 -1772 762 3520 1871 -1411 -1908 -1298 280 2823 2650 -1181 -3139
3433 -3139 -1266 718 2171 3208 293 -2956 -2133 960 2311 2001 1137 -2121 -3208 161 2476 1379
3449 1379 257 -786 -2098 -366 2112 1738 -408 -938 -1466 -511 1528 2144 -504 -2059 -918 446
3465 446 992 1573 223 -2604 -1465 706 1069 718 192 -1773 -2275 821 2062 922 -511 -1520 -2258
3482 -2258 -503 2270 2000 -627 -1618 -1232 -833 1413 2285 -96 -2234 -1178 -171 642 1690 459
3498 459 -2034 -1499 436 446 213 542 -1207 -2009 307 1289 431 -537 -552 -1511 -246 1496 845 -859
$$ packed form
3385c424m7M517K746j760k463k047p11K663L926m54l247j902k77J238L258J369
3401C385l250k044L54J115J412J127j617k615P31K356O74p33n89j677m06K850
3417A073J403j690j505m67n86K534K758j649l282m97O10J578K543j73l831j958
3433c139J873J984J453J037k915l249Q23L093J351l10q64l258j087L369K315j097
3449A379j122j043j312J732K478l74k146n30n28R55K039O16k648j555J141J364
3465D46N46N81j350k827J139K171L63l51n26j965n02L096J241j140j433j009p38
3482b258J755K773k70k627r91L86L99K246Q72k381k138J056J007Q13J048j231
3498D59k493N35J935J0k33L29j749q02K316R82q58r68j5r59J265J742o51j704
$$ plain form
3516 -859 -1006 -922 -468 1370 1780 -603 -1871 -673 161 654 1470 510 -2016 -1352 532 1017 1105 961 -1087
3535 -1087 -1795 231 1397 743 369 178 -1403 -380 1411 1412 -4 -164 -399 -680 717 1582 338 -955
3553 -955 -337 -218 467 1240 470 -876 -740 558 472 136 698 -560 -1104 472 1200 257 203 5 -815
3572 -815 -21 1257 686 -414 -321 -305 -212 900 1297 -500 -967 22 187 140 1170 595 -1352 -755 444
3591 444 396 500 1005 -322 -1198 156 945 296 165 306 -1118 -748 808 360 -549 5 -240 -966 435
3610 435 809 -242 -776 -70 -290 -404 816 610 -1015 -618 184 -466 -283 754 -375 -1040 -143 283
3628 283 -616 107 343 -751 -785 475 365 -583 275 -39 -638 -34 619 -121 -433 179 -76 -248 654 142
3648 142 -777 -354 258 -264 -284 524 -126 -945 387 370 -315 331 828 -467 -648 799 101 -50 513 398
$$ packed form
3516h59j47Q4M54J838M10k383j268J198Q34M93Q16r60k526O64J884M85Q8j44k048
3535a087p08K026J166o54l74j91j581J023J791Jj416j60k35k81J397Q65j244j293
3553i55O18J19O85P73p70j346J36J298q6l36N62j258n44J576P28r43n4j98q20
3572h15P94J278n71j100R3J6R3J112L97j797m67R89J65m7J030n75j947N97J199
3591D44m8J04N05j327q76J354P89o49j31J41j424L70J556m48r09N54k45p26J401
3610D35L74j051n34P06k20j14J220k06j625L97Q02o50J83J037j129o65Q97M26
3628B83q99P23K36j094l4J260j10r48Q58l14n99O04O53p40l12O12k55j72R02n12
3648A42r19M23O12n22k0Q08o50q19J332j7o85O46M97j295j81J447o98j51N63j15
$$ plain form
3668 398 -659 127 806 99 -170 377 -216 -253 724 385 -288 -21 435 -471 -117 1021 402 -287 449 215
3688 215 104 632 1019 -118 -318 375 -73 -460 693 449 -643 -37 625 -155 74 669 292 -551 334
3707 334 184 -211 252 556 -131 -285 596 -66 -672 498 137 -783 -308 599 -310 -513 564 -232 -589
3726 -589 23 247 -601 66 583 -363 -89 691 -392 -676 118 415 -288 30 197 -675 -398 738 -22
3745 -22 -520 -71 -71 -844 -385 456 -207 -711 54 -590 -552 528 549 -699 -161 232 -512 -337 581 -51 -826
3766 -826 176 283 -172 254 719 -863 -522 264 345 -363 241 -163 -653 -88 811 -69 69 830 33 -594
3786 -594 602 547 -164 249 348 -528 -352 483 -254 -283 616 259 -393 -10 433 -221 -75 553 94 -468 253
3807 253 506 -281 -15 705 -266 -103 472 145 -236 391 645 -548 66 498 -305 -403 872 84 -50 533
$$ packed form
3668C98j057P86O79p07k69N47n93l7R77l39o73K67M56r06L54J138o19o89P36k34
3688B15j11N28L87j137k00O93m48l87J153k44j092O06O62p80K29N95l77q43Q85
3707C34j50l95M63L04o87j54Q81o62o06J170l61r20M75R07r09k03J077p96l57
3726e89O12K24q48O67N17r46K74P80j083k84P94K97p03L18J67q72K77J136p60
3745b2m98M49%p73M59Q41o63n04P65o44L8J080K1j248N38L93p44J75R18o32p75
3766h26J002J07m55M26M65j582L41P86Q1p08O04m04m90N65Q99q80J38P61p97o27
3786e94J196n5p11M13R9q76J76Q35p37k9Q99l57o52L83M43o54J46O28m59n62P21
3807B53K53p87K66P20r71J63N75l27l81O27K54j193O14M32q03r8J275p88j34N83
$$ plain form
3827 533 327 -438 265 665 -58 -193 555 -81 -708 306 710 -500 -179 193 -607 298 836 141 -567
3846 -567 31 -38 -509 516 563 -407 -405 234 -47 -465 542 146 -790 -258 684 79 39 537 -400 -1207 81
3867 81 538 -121 21 -50 -468 -126 994 231 -660 -438 76 -625 481 870 -437 -1216 119 151 -47 652
3887 652 104 -966 -799 258 70 264 460 -983 -1441 -170 715 221 -130 -51 -1151 -320 1028 333
3905 333 -487 -157 -257 -440 483 829 -545 -736 43 26 177 892 -104 -1141 -227 780 598 713 -51
3924 -51 -1021 -752 797 1292 318 -128 -279 -1058 -29 2054 1063 -115 -434 -908 -429 1314 1702 -153
3942 -153 -655 -461 -317 351 1744 810 -1269 -743 282 341 850 919 -757 -1300 153 907 573 513 -32
3961 -32 -1054 -14 1112 672 -418 -253 -540 -72 952 1033 -521 -1337 -447 162 630 1552 177 -1917
$$ packed form
3827E33k06p65P03M00p23j35P48o36o27J014M04j210L21L72q00R05N38o95p08
3846e67N98o9m71J025M7r70KO39k81m18J007l96r36N32R42o05m0M98r37q07J288
3867H1M57o59J42p1m18L42J120p63q91K22N14p01J106L89j307p79J335L2j98O99
3887F52n48j070J67J057j88J94J96j443m58J271Q85m94l51P9j100Q31J348o95
3905C33q20L30j00j83R23L46j374j91P79j7J51P15r96j037R14J007j82J15p64
3924e1r70K69J549M95r74m46j51p79J029K083r91j178l19m74M79J743L88j855
3942a53n02J94J44O68J393r34k079N26J025N9N09O9j676n43J453P54l34o0n45
3961c2j022J040J126m40j090J65k87M68J024Q1j554q16Q90O09M68R22j375k094
$$ plain form
3979 -1917 -1095 702 1299 1282 321 -1595 -2226 296 1414 919 312 -1132 -2017 -727 1695 1286 -51
3996 -51 -883 -1637 -710 897 1777 46 -1139 -898 -347 275 1638 532 -1679 -1138 57 507 832 183
4014 183 -1363 -1335 482 1324 547 -329 -1194 -1860 -36 2018 1420 -595 -1473 -1778 -507 1747 2150 -489
4032 -489 -2327 -1393 -467 998 2217 650 -1989 -1896 -44 1334 1653 1121 -983 -2245 -401 1578 1378
4049 1378 671 -466 -1654 -297 1523 1134 -95 -849 -1263 -576 1515 1822 -377 -1458 -849 27 1299
4066 1299 1848 37 -1816 -1512 668 1561 1308 458 -1866 -1923 329 2049 2120 287 -1269 -2516 -533
4083 -533 2389 2336 239 -1393 -1841 -822 1760 2474 261 -1484 -1561 -1039 918 2262 1025 -1696 -1541
4100 -1541 -477 865 1214 1010 -1233 -1869 153 1610 1234 227 -1127 -2061 86 1774 1487 -550
$$ packed form
3979a917Q22J797N97j7r61j916o31K522J118m95o07j444q85J290K422m09j337
3996e1q32p54R27J607Q80j731j185K41N51O22J363j106k211N41J195M50L25o49
4014A83j546K8J817Q42p77q76q65o66J824K054n98k015q78l05J271K254M03k639
4032d89j838R34R26J465J219j567k639R3J852J378L19n32k104j262J844J979k00
4049A378p07j137j188J357J820l89j229p54m14O87K091L07k199j081O09Q76J272
4066A299N49j811j853L04K180Q93k53q50k324n7K252J720P1j833j556j247J983
4083e33K922n3k097j632m48J019K582P14k213j745p7N22J957J344j237k721J55
4100a541J064J342L49k04k243o36K022J457l76j007j354r34K147J688k87k037
$$ plain form
4116 -550 -1557 -1664 -661 2124 2371 -122 -1517 -1593 -183 1325 2459 115 -2285 -2387 -207 1332
4132 1332 1722 1155 -2002 -2842 -678 2080 1787 823 -1083 -2591 -940 1411 1979 3 -760 -1869 -1257
4149 -1257 1098 2069 -115 -1338 -1258 -642 921 1933 584 -1940 -1530 274 1091 1341 146 -1750 -2078
4166 -2078 336 1697 1577 283 -1491 -2435 -483 2270 1846 -5 -1183 -2101 -1076 1773 2543 249
4182 249 -1927 -1478 -692 1009 2777 959 -1358 -1642 -337 1057 2209 1301 -1119 -1960 -321 1624
4198 1624 1423 804 -863 -1779 -581 1610 1729 84 -878 -1572 -653 1423 2052 -6 -1437 -1363 -336
4215 -336 1020 2141 318 -1728 -1572 83 1180 1674 871 -1792 -2216 -122 1512 1473 697 -1243 -2267
4232 -2267 -749 1847 2178 471 -995 -1940 -1519 1028 2241 505 -1007 -1364 -701 734 2015 627
$$ packed form
4116e50j007j07J003K785K47k493j395p6J410J508J134k344k400j02K180J539
4132A332L90n67l157q40K164K758k93r64j906j508J651K351N68j976p63j109O12
4149a257K355R71k184j223Q0O16J563J012j349k524M10J804Q17K50j195j896l28
4166b078K414J361j20j294j774r44J952K753m24j851j178r18J025K849P70k294
4182B49k176M49P86J701J768j818k317k84J305J394J152r08k420q41J639J945
4198A624k01o19j667r16J198K191J19j645r62o94R19K076O29k058j431P4J027
4215c36J356J121j823k046J56J655J097M94q03k663m24K094J634l9p76j940j024
4232b267J518K596L31j707j466r45M21K547J213j736j512l57O63J435J281j388
$$ plain form
4248 627 -1412 -1587 -108 589 1167 597 -1274 -1715 -17 956 1023 797 -900 -1577 -828 1550 1360 90
4266 90 -700 -1501 -1003 1365 2032 -98 -1363 -1730 -727 849 1733 768 -1311 -1606 -279 845 1402 1222
4284 1222 -661 -2031 -390 701 882 1065 -487 -1790 -788 1239 1042 160 -469 -1196 -979 686 1323
4301 1323 -48 -976 -754 -403 607 1884 478 -1340 -894 -84 641 1086 725 -978 -1600 154 896
4318 896 857 351 -633 -1606 -487 1250 1196 392 -151 -1201 -924 826 1603 321 -494 -890 -1010 179 1268
4337 1268 671 -845 -794 -246 355 1091 990 -677 -1307 168 508 583 780 62 -835 -317 786 761 252
4356 252 -349 -856 -807 343 1005 -138 -797 -283 -756 194 1201 378 -719 -897 -302 34 664 1173 -971
4375 -971 -1223 44 184 584 390 -274 -1345 -638 758 170 211 253 -677 -714 200 762 -63 -440 -118 -841
$$ packed form
4248F27k039j75J479O97N78n70j871m41J698R73O7k26j697o77P49K378j90j270
4266I0p90q01M98K368O67k130j265l67J003J576Q84r65k079k95J327J124N57j80
4284A222j883j370J641J091J81J83j552j303J002K027j97q82o29p27K17J665O37
4301A323j371r28K22L51J010J277j406j818M46Q10P25M45l61j703o22J754P42
4318H96l9n06r84r73J119J737n4q04n43j050K77J750P77j282q15l96j20J189J089
4337A268n97j516N1N48O01P36j01j667o30J475L40P5J97p18q97N18J103k5n09
4356B52o01n07M9J150O62j143o59N14m73R50J007q23j097j78N95L36O30N09k144
4375i71k52J267J40M00j94o64j071P07J396n88M1M2r30l7R14N62q25l77L22p23
$$ plain form
4395 -841 152 727 292 -536 -359 -83 91 519 720 -430 -592 -35 -29 218 641 13 -808 -325 769 220
4415 220 -35 180 -435 -670 269 576 340 -83 257 -540 -347 741 477 -687 -330 -382 -513 530 864
4434 864 -193 -441 311 76 73 654 350 -399 -338 395 189 -44 518 -413 -571 203 638 210 -275 519 -391
4455 -391 74 630 197 -467 -106 59 -362 232 765 58 -334 183 68 -260 620 430 -532 -228 579 -61
4475 -61 -203 624 -77 -470 161 -38 -81 291 310 -420 -311 278 292 -308 267 184 -531 23 604 157 -7 427
4497 427 -140 -550 386 348 -501 29 227 -511 -422 556 123 -424 273 175 -357 75 541 -450 -348 166 -121
4518 -121 -544 265 125 -423 -233 439 -111 -236 52 -194 -397 325 249 -307 77 -9 -383 -130 505 166 -327
4539 -327 -4 301 -49 40 393 -238 -512 136 -8 -81 475 99 -451 -147 308 -178 -89 239 -340 -465 461
$$ packed form
4395h41R93N75m35q28J77K76J74M28K01j150j62N57OK47M23o28q21M83J094n49
4415B20k55K15o15k35R39L07k36m23L40p97J93J088k64j164L57n2j31J043L34
4434H64j057k48P52k35lN81l04p49O1P33k06k33N62r31j58P74M35m28m85P94r10
4455c91M65N56m33o64L61J65m21N94N33p07l92N17j15l28Q80j90r62L04Q07o40
4475f1j42Q27p01l93O31j99m3L72J9p30J09N89J4o00N75q3p15N54N81m47j64M34
4497D27n67m10R36l8q49N30J98p38Q9R78m33n47O97r8n32M32M66r91J02N14k87
4518a21m23Q09j40n48J90O72n50j25K88k46k03P22p6n56L84q6l74K53O35l39m93
4539c27L23L05l50Q9L53o31k74O48j44p3N56l76n50L04M55m86Q9L28n79j25R26
$$ plain form
4560 461 404 -212 -106 -101 -410 -306 618 -21 -466 -83 176 -367 216 748 -587 13 376 -43 -144 293 99
4581 99 -217 121 532 588 -83 402 30 -515 189 437 14 62 134 -316 -32 518 68 -461 88 119 -176 99
$$ packed form
4560D61n7o16J06Nl09J04R24o39m45L83K59n43N83N32j335O00L63m19j01M37j94
4581I9l16L38M11N6o71M85l72n45P04K48m23M8P2m50K84N50m50n29N49L1k95K75
$$ [...]
8191b01
##END NTUPLES=NMR FID
##END=
