##TITLE=1H_EC-3226(2)
 CDCl3, 8 sc, 
 4.3.2020
##JCAMPDX= 6.0         $$ Bruker NMR JCAMP-DX V2.0
##DATA TYPE= NMR FID
##DATA CLASS= NTUPLES
##ORIGIN= UXNMR, Bruker Analytische Messtechnik GmbH
##OWNER= root
$$ XWIN-NMR		Version 3.5
$$ Wed Mar  4 14:04:52 2020 Russian Standard Time (UT+4h)  she@DPX200
##.OBSERVE FREQUENCY= 200.1315
##.OBSERVE NUCLEUS= ^1H
##.DELAY= (6, 6)
##.ACQUISITION MODE= SIMULTANEOUS
##.ACQUISITION SCHEME= undefined
##.AVERAGES= 8
##.DIGITISER RES= 18
##SPECTROMETER/DATA SYSTEM= spect
##.PULSE SEQUENCE= zg30
##.SOLVENT NAME= DMSO
##.SHIFT REFERENCE= (INTERNAL, DMSO, 0, 15.7039)
##AUDIT TRAIL= $$ (NUMBER, WHEN, WHO, WHERE, WHAT)
$$ ##TITLE= Audit trail, XWIN-NMR		Version 3.5
$$ ##JCAMPDX= 5.01
$$ ##ORIGIN= Bruker BioSpin GmbH
$$ ##OWNER= she
$$ F:/spectra/data/she/nmr/H-F/1/audita.txt
$$ ##AUDIT TRAIL=  $$ (NUMBER, WHEN, WHO, WHERE, WHAT)
(   1,<2020-03-04 14:03:37.59 +0400>,<she>,<DPX200>,
      <created by zg, POWCHK disabled, PULCHK disabled
       configuration hash MD5:
       00 E9 B6 7A A2 85 ED C7 34 08 36 98 17 FE 4E 26
       data hash MD5: 16K
       1E 93 DB D9 B8 2F 00 45 1C 43 09 3E 82 B9 C6 31>)
$$ ##END=
$$ 
$$ hash MD5
$$ D7 2B 22 8F B9 A2 B9 A8 03 4B 06 72 6C BA EC 40
##$RELAX= 
##$RELAX= 
##$RELAX= 
##$RELAX= 
##$RELAX= 
##$RELAX= 
$$ Bruker specific parameters
$$ --------------------------
##$DU= <F:/spectra>
##$EXPNO= 1
##$NAME= <H-F>
##$PROCNO= 1
##$TYPE= <nmr>
##$USER= <she>
##$AMP= (0..31)
100 100 100 100 100 100 100 100 100 100 100 100 100 100 100 100 100 100 
100 100 100 100 100 100 100 100 100 100 100 100 100 100 
##$AQSEQ= 0
##$AQ_mod= 1
##$AUNM= <au_zg>
##$AUTOPOS= <>
##$BF1= 200.13
##$BF2= 200.13
##$BF3= 200.13
##$BF4= 200.13
##$BF5= 200.13
##$BF6= 200.13
##$BF7= 200.13
##$BF8= 200.13
##$BYTORDA= 1
##$CFDGTYP= 0
##$CFRGTYP= 5
##$CHEMSTR= <none>
##$CNST= (0..31)
1 1 145 1 1 1 1 1 1 1 1 1 1 1 1 1 1 1 1 1 1 1 1 1 1 1 1 1 1 1 1 1 
##$CPDPRG= <>
##$CPDPRG1= <>
##$CPDPRG2= <>
##$CPDPRG3= <>
##$CPDPRG4= <mlev>
##$CPDPRG5= <mlev>
##$CPDPRG6= <mlev>
##$CPDPRG7= <mlev>
##$CPDPRG8= <mlev>
##$CPDPRGB= <>
##$CPDPRGT= <>
##$D= (0..31)
0 1.2 0 0 0 0 0 0 0 0.06 0 0.03 0 0 0 0 0.0002 0 0 0 0 0 0 0 0 0 0 0 0 
0 0 0 
##$DATE= 1583316217
##$DBL= (0..7)
120 120 120 120 120 120 120 120 
##$DBP= (0..7)
150 150 150 150 150 150 150 150 
##$DBP07= 0
##$DBPNAM0= <>
##$DBPNAM1= <>
##$DBPNAM2= <>
##$DBPNAM3= <>
##$DBPNAM4= <>
##$DBPNAM5= <>
##$DBPNAM6= <>
##$DBPNAM7= <>
##$DBPOAL= (0..7)
0.5 0.5 0.5 0.5 0.5 0.5 0.5 0.5 
##$DBPOFFS= (0..7)
0 0 0 0 0 0 0 0 
##$DE= 6
##$DECBNUC= <off>
##$DECIM= 24
##$DECNUC= <off>
##$DECSTAT= 4
##$DIGMOD= 1
##$DIGTYP= 9
##$DL= (0..7)
0 120 120 120 120 120 120 120 
##$DP= (0..7)
150 150 150 150 150 150 150 150 
##$DP07= 0
##$DPNAME0= <>
##$DPNAME1= <>
##$DPNAME2= <>
##$DPNAME3= <>
##$DPNAME4= <>
##$DPNAME5= <>
##$DPNAME6= <>
##$DPNAME7= <>
##$DPOAL= (0..7)
0.5 0.5 0.5 0.5 0.5 0.5 0.5 0.5 
##$DPOFFS= (0..7)
0 0 0 0 0 0 0 0 
##$DQDMODE= 0
##$DR= 18
##$DS= 0
##$DSLIST= <SSSSSSSSSSSSSSS>
$$ [...]
##$SUBNAM2= <"">
##$SUBNAM3= <"">
##$SUBNAM4= <"">
##$SUBNAM5= <"">
##$SUBNAM6= <"">
##$SUBNAM7= <"">
##$SUBNAM8= <"">
##$SUBNAM9= <"">
##$SW= 24.9337058887773
##$SWIBOX= (0..15)
0 0 2 0 0 0 0 0 0 0 0 0 0 0 0 0 
##$SW_h= 4990.01996007984
##$TD= 16384
##$TD0= 1
##$TE= 0
##$TE2= 300
##$TE3= 300
##$TEG= 300
##$TL= (0..7)
0 120 120 120 120 120 120 120 
##$TP= (0..7)
150 150 150 150 150 150 150 150 
##$TP07= 0
##$TPNAME0= <>
##$TPNAME1= <>
##$TPNAME2= <>
##$TPNAME3= <>
##$TPNAME4= <>
##$TPNAME5= <>
##$TPNAME6= <>
##$TPNAME7= <>
##$TPOAL= (0..7)
0.5 0.5 0.5 0.5 0.5 0.5 0.5 0.5 
##$TPOFFS= (0..7)
0 0 0 0 0 0 0 0 
##$TUNHIN= 0
##$TUNHOUT= 0
##$TUNXOUT= 0
##$USERA1= <user>
##$USERA2= <user>
##$USERA3= <user>
##$USERA4= <user>
##$USERA5= <user>
##$V9= 5
##$VALIST= <valist>
##$VCLIST= <CCCCCCCCCCCCCCC>
##$VD= 0
##$VDLIST= <DDDDDDDDDDDDDDD>
##$VPLIST= <PPPPPPPPPPPPPPP>
##$VTLIST= <TTTTTTTTTTTTTTT>
##$WBST= 1024
##$WBSW= 4
##$XGAIN= (0..3)
0 0 0 0 
##$XL= 0
##$YL= 0
##$YMAX_a= 451962
##$YMIN_a= -350026
##$ZGOPTNS= <>
##$ZL1= 120
##$ZL2= 120
##$ZL3= 120
##$ZL4= 120
##$ABSF1= 10
##$ABSF2= 0
##$ABSG= 5
##$ABSL= 3
##$ALPHA= 0
##$AQORDER= 0
##$ASSFAC= 0
##$ASSFACI= 0
##$ASSFACX= 0
##$ASSWID= 0
##$AUNMP= <proc_1d>
##$AZFE= 0.1
##$AZFW= 0.1
##$BCFW= 1
##$BC_mod= 2
##$BYTORDP= 1
##$COROFFS= 0
##$CY= 11.3945322036743
##$DATMOD= 1
##$DC= 2
##$DFILT= <>
##$DTYPP= 0
##$F1P= 16.9975609425685
##$F2P= -3.02152046262296
##$FCOR= 0.5
##$FTSIZE= 0
##$FT_mod= 4
##$GAMMA= 1
##$GB= 0.15
##$INTBC= 1
##$INTSCL= 1
##$ISEN= 128
##$LB= 0.24
##$LEV0= 0
##$LPBIN= 0
##$MAXI= 10000
##$MC2= 0
##$MEAN= 0
##$ME_mod= 0
##$MI= 1.114404
##$NCOEF= 0
##$NC_proc= 0
##$NLEV= 6
##$NOISF1= 3.799351
##$NOISF2= 2.8
##$NSP= 1
##$NTH_PI= 0
##$NZP= 0
##$OFFSET= 15.70392
##$PC= 1
##$PHC0= -9788.269
##$PHC1= 17.20082
##$PH_mod= 1
##$PKNL= yes
##$PPARMOD= 0
##$PSCAL= 0
##$PSIGN= 0
##$REVERSE= no
##$SF= 200.130013532006
##$SI= 16384
##$SIGF1= 3
##$SIGF2= 2
##$SINO= 400
##$SIOLD= 16384
##$SREGLST= <1H.CDCl3>
##$SSB= 0
##$STSI= 0
##$STSR= 0
##$SW_p= 3612.71676300578
##$SYMM= 0
##$S_DEV= 0
##$TDeff= 0
##$TDoff= 0
##$TI= <>
##$TILT= no
##$TM1= 0
##$TM2= 0
##$TOPLEV= 0
##$USERP1= <user>
##$USERP2= <user>
##$USERP3= <user>
##$USERP4= <user>
##$USERP5= <user>
##$WDW= 1
##$XDIM= 8192
##$YMAX_p= 0
##$YMIN_p= 0
$$ End of Bruker specific parameters
$$ ---------------------------------
##NTUPLES= NMR FID
##VAR_NAME=  TIME,          FID/REAL,        FID/IMAG
##SYMBOL=    X,             R,               I
##VAR_TYPE=  INDEPENDENT,   DEPENDENT,       DEPENDENT
##VAR_FORM=  AFFN,          ASDF,            ASDF
##VAR_DIM=   8192,          8192,            8192
##UNITS=     SECONDS,       ARBITRARY UNITS, ARBITRARY UNITS
##FACTOR=    0.0002004,     1,               1
##FIRST=     0,             0,               0
##LAST=      1.6414764,     0,               0
##MIN=       0,             -350026,         0
##MAX=       1.6414764,     451962,          0
$$ Real data points
##PAGE= N=1
##DATA TABLE= (X++(R..R)), XYDATA
0 0 0 0 0 0 0 0 0 8 -8 8 -16 16 -17 24 -30 34 -42 49 -59 73 -82 97 -112 130 -151 171 -195 225 -251 287
30 287 -323 363 -408 457 -509 570 -631 704 -781 864 -959 1061 -1172 1301 -1441 1595 -1773
47 -1773 1974 -2201 2467 -2778 3147 -3601 4163 -4890 5871 -7267 9426 -13251 21996 -84075
61 -84075 140831 431798 234192 -82112 -326500 -267093 12266 248242 205157 53550 -86544
72 -86544 -180943 -165446 15273 163506 167881 63034 -88487 -196847 -105183 86684 145645
83 145645 68905 3304 -51454 -82792 -41931 9714 20457 68870 109957 21272 -110992 -127008
95 -127008 -49961 63352 171394 141785 -47855 -183195 -142720 -10178 140288 218262 91425
106 91425 -144624 -224409 -99846 85028 214833 175429 -47186 -216620 -148594 26964 139136
117 139136 155008 51494 -111089 -146297 -32848 62713 86589 71330 -5832 -84178 -52407
128 -52407 21022 27235 14808 17447 -3940 -7492 25037 -1235 -63931 -39466 37388 63844 55787
141 55787 11679 -89541 -123762 -10679 106877 113461 46755 -65748 -159812 -100316 71419
152 71419 154623 97170 -18623 -137408 -157496 -12446 141387 132066 21659 -79707 -134487
163 -134487 -80535 61513 121313 51709 -24098 -63069 -79996 -28955 52368 56858 14375 223
175 223 -24638 -56876 -28182 16778 17069 26835 44892 -2574 -66340 -60123 -20818 24667 86344
188 86344 80835 -32666 -117550 -86870 -3147 87100 133125 46924 -106267 -143743 -52280 55990
200 55990 130185 113687 -26930 -150632 -114582 9518 103827 129792 48132 -97149 -139111
211 -139111 -38740 65482 100932 75815 -17960 -103824 -70612 21345 57215 54975 34505 -29356
223 -29356 -67608 -20585 27320 26114 26940 19885 -18691 -25427 2914 -1934 -10727 25606 40001
236 40001 4982 -13425 -21036 -37336 -3570 60856 53371 -5704 -33911 -42848 -32276 32440 78410
249 78410 32803 -31139 -49059 -43729 -2569 67492 66666 -12235 -55021 -39578 -12918 32195 64356
262 64356 17971 -46219 -40026 -6396 11202 34741 30430 -22400 -41838 -3829 16004 11709 15845
275 15845 -5738 -36846 -9728 31772 15110 -12400 -11480 -18155 -12824 26405 30010 -14455 -28709
288 -28709 -13417 -9311 11018 37638 7261 -37876 -28064 -3309 5089 26769 26066 -24144 -44594
301 -44594 -6994 13808 10091 17456 1557 -32404 -20299 11882 6506 1048 11377 -6891 -24730
314 -24730 781 13797 -7277 -4927 9371 -5655 -7984 11781 -2679 -23037 1307 19884
326 19884 3193 -727 -270 -21941 -15862 22199 22546 -2008 -3096 -10032 -25912 843 35268 17652
340 17652 -8524 -9863 -18807 -15588 24202 36278 -169 -17817 -10573 -12436 3467 32973 17852
353 17852 -15531 -11045 -2579 -8020 13025 30254 1393 -19642 -2444 1927 -1292 17387 16175
366 16175 -12234 -9836 9265 388 -2080 15310 5921 -12587 2330 9066 -7328 721 15786
379 15786 -1955 -9589 9672 5180 -11634 3001 12003 -4295 -521 9315 -7926 -11068 12630
392 12630 9705 -8774 838 4144 -12426 -2581 16248 600 -9950 4492 -1166 -13875 4933
405 4933 13961 -6369 -8242 2892 -7247 -6539 12833 4499 -15407 -2370 5182 -9847 -3017 12328
419 12328 -3456 -13564 2224 103 -10484 5137 9407 -11779 -10226 6074 -3091 -7395 7739
432 7739 384 -14202 -126 6782 -10102 -4429 11025 -3455 -12671 2990 2334 -8838 3106
445 3106 7123 -10513 -6234 8472 -2933 -8420 7261 3288 -10884 880 7118 -8137 -2506
458 -2506 11700 -2571 -11067 5785 5019 -7930 2373 7986 -6722 -2539 9684 -2718 -7440
471 -7440 10014 6099 -9341 2312 9125 -5228 -1735 11735 -420 -7054 9158 5494 -8597
484 -8597 3440 11399 -3189 -2372 8641 -1302 -5174 11050 6483 -8473 3006 10076 -5269 -2665
498 -2665 11553 2131 -5190 6967 3035 -8515 4780 11943 -4418 -4055 7868 -1018 -5683 9032
512 9032 5684 -7625 2017 7062 -7034 -3156 12417 2082 -8498 2688 2245 -7062 3954 8971
526 8971 -6701 -5521 6618 -2518 -7085 7352 4317 -9996 -1778 4719 -6500 -2565 9335 -3115
540 -3115 -12345 2728 4531 -6860 -212 3832 -8406 -5044 7188 -2594 -8899 4037 1463 -10279
554 -10279 -261 6964 -6615 -6519 4493 -3672 -8058 6739 3251 -12187 -4273 5617 -3535 -2688
568 -2688 5887 -5504 -10785 4582 4738 -7071 489 4908 -9104 -6636 8009 2158 -6134 2011
582 2011 -1169 -9396 3406 10981 -4321 -7779 2960 -723 -2704 8739 3818 -10925 -2617 7527
596 7527 -970 374 9622 -2501 -11687 2462 8652 1806 5035 3261 -11641 -6017 12842 8838
610 8838 -983 2630 -2592 -10477 4541 16017 2283 -3834 2337 -4397 -5942 11587 12443 -3342
624 -3342 -3452 1341 -4021 2701 13788 2058 -8521 2597 5097 -3196 3475 7682 -4865 -3444
638 -3444 9602 3054 -5531 2260 1685 -5779 5225 12380 -2869 -9803 -996 -1253 1976 14301 6076
653 6076 -15124 -11661 2180 3759 8184 12098 -6194 -19770 -5676 6143 6579 10703 4628 -17790
667 -17790 -18494 3204 10000 6427 6312 -6196 -20458 -6947 11003 5917 528 1712 -9091 -13606
681 -13606 1918 7697 -1724 -405 1067 -8020 -5741 4660 -1924 -8075 3583 6414 -4204 -4255
695 -4255 -3094 -10504 -3413 13958 8561 -7389 -8835 -9565 -9727 8215 19796 4230 -11647 -13237
709 -13237 -13563 -1154 22039 19413 -7457 -18771 -12766 -5712 11426 24571 6775 -17068 -14792
722 -14792 -5360 971 15891 18392 -3904 -16138 -6919 -759 4600 15130 8393 -10002 -7644 2815
736 2815 -764 562 9082 4528 -2462 3223 667 -9524 -1527 10850 7227 4173 4860 -7823 -14847
751 -14847 1646 14740 11799 8887 -952 -19605 -15458 11311 22057 13104 1863 -13945 -22024
764 -22024 -2520 20545 18005 5782 -4114 -17908 -16536 8234 21875 10335 -870 -8322 -16979
777 -16979 -6262 14998 14046 -376 -3187 -4805 -8990 193 8354 1054 -1609 5084 -805 -8756
791 -8756 -2506 443 -3396 4926 11253 -1470 -11490 -8203 -6241 417 16290 13438 -9411 -19193
805 -19193 -11807 -2778 11542 21517 4331 -19262 -19325 -7691 3184 17426 17857 -6743 -23225 -14516
819 -14516 -2406 8496 18173 7932 -14803 -17886 -5468 597 7593 12990 1481 -12465 -8233
832 -8233 -2815 -3931 4489 10972 1476 -5832 -3246 -6798 -8865 4676 12792 6115 251 -6121 -16632
847 -16632 -10226 12085 18483 7530 -2010 -14105 -21120 -2576 21051 20315 5419 -8100 -21446
860 -21446 -17437 9534 27297 15913 -1523 -15056 -21577 -6261 19955 23190 6486 -5668 -14155
873 -14155 -15765 2074 20499 15608 1748 -5755 -12458 -10301 7484 16582 7441 1007 -1753 -9391
887 -9391 -7649 5274 9485 5739 7343 1026 -12154 -9773 3725 8027 9726 10254 -2910 -16299
901 -16299 -9446 3723 9390 14308 9894 -10571 -20205 -6920 7686 13685 14829 1296 -18823
914 -18823 -17005 964 10280 12266 9911 -6209 -19316 -9658 4829 9198 9661 3739 -11841 -15138
928 -15138 -871 6278 3554 4384 -7 -9617 -6774 1638 -207 -1011 4501 1344 -6118 -3080 -1162
943 -1162 -5322 -1146 6278 2446 -2820 -2603 -7357 -9426 3288 11042 3218 -4228 -6743 -10650 -4886
958 -4886 9775 10893 -521 -5880 -8494 -10021 1020 12661 7207 -3574 -6349 -8171 -5868 6636
972 6636 11312 833 -5120 -3006 -4326 -2234 6163 5445 -1543 -350 641 -4464 -1104 4685 1594
987 1594 -362 4743 2012 -5229 -2917 1784 1395 5731 8599 -1783 -9942 -3454 3479 6214 10248
1002 10248 5097 -8172 -9722 375 5726 8337 10300 280 -12374 -7150 4585 8313 9695
1015 9695 5665 -6836 -11353 -379 7635 6897 6454 1071 -8461 -6293 3680 5621 4366 4759 -1548
1030 -1548 -7738 -1590 5154 2193 1269 3131 -1500 -4129 651 851 -2202 2196 4942 -1475 -3762
1045 -3762 -1146 -2934 -1703 5843 4767 -3401 -4416 -2714 -4477 1005 8404 2440 -6343 -5509 -3547
1060 -3547 -1611 5807 7051 -3662 -8463 -3798 -1640 1218 6386 1837 -7218 -6526 -1292 -46 2765
1075 2765 4767 -3333 -8577 -2303 2306 842 1834 512 -6180 -4562 2282 1277 -1163 1006 -1146
1090 -1146 -4930 -746 3539 -502 -2150 433 -1823 -2666 2772 2169 -3482 -1949 1843 -467 -119 2730
1106 2730 -1200 -3503 1816 2744 -1786 288 2164 -2169 -1474 3821 2130 -1792 827 641 -1700 2135
1122 2135 4826 -855 -2685 1551 1410 528 3854 2159 -3507 -544 3730 1633 1152 3474 -160 -3821
1138 -3821 1476 4021 1319 2079 1807 -3450 -1769 5077 3929 -511 733 -191 -2466 1717 5592 1026
1154 1026 -1085 996 -797 -2031 2953 4245 -981 -1286 180 -1694 -40 4177 902 -2981 -58
1169 -58 1287 -1978 544 2751 -1321 -2437 1264 -647 -2656 1356 1623 -2391 -1230 1231 -1561 -2430
1185 -2430 1459 -271 -2710 1000 660 -3979 -1722 2027 -785 -2432 -103 -1538 -3690 628 1589
1200 1589 -2425 -1639 584 -2802 -2883 1960 762 -2244 -607 -679 -3589 -838 3076 -1316 -2815 35
1216 35 -672 -2739 962 1616 -2318 -1598 800 -1749 -1493 2568 820 -2975 -478 802 -1687 331
1232 331 2766 -1058 -2317 1401 697 -1745 1421 2474 -1474 -1304 1575 -484 -190 3224 1129 -2481
1248 -2481 781 2429 -510 488 2997 -204 -1411 2052 1334 -1006 2346 3047 -1272 -310 2769 601
1264 601 298 3151 1395 -1552 1471 2842 -815 283 3464 508 -1068 2090 1459 -829 1770 2421
1280 2421 -1174 -273 2847 167 -959 2156 1213 -1300 865 1573 -1341 -190 2737 -329 -1937 1625
1296 1625 934 -1680 533 1445 -1499 -894 1848 -856 -2030 1268 1107 -2346 -119 1226 -1826 -878
1312 -878 1296 -1262 -2459 1024 199 -2480 -314 1036 -1623 -1415 1104 -1511 -2333 696 -6 -2863
1328 -2863 -551 1083 -2261 -1641 1209 -1036 -2298 731 -211 -2813 -72 937 -2147 -1612 1451 -1053
1344 -1053 -2314 554 -79 -2465 208 1751 -2226 -2067 1006 -337 -1833 950 428 -1988 147 1463
1360 1463 -1432 -600 2485 -161 -2491 673 1313 -935 1199 1727 -1551 -1128 2350 929 -733 1970
1376 1970 752 -1682 499 2607 179 315 2403 -489 -1840 2677 2874 -425 554 1209 -1090 175
1392 175 3337 1122 -1125 1292 1155 -1009 1290 3343 341 -899 1786 611 -64 2738 1858 -2313
1408 -2313 -39 2553 658 628 2161 -118 -1861 1714 1925 -1211 608 1573 -1378 -888 2260 850
1424 850 -1181 357 781 -1983 765 2184 -1586 -2073 1179 563 -1048 548 -708 -3074 -341 2600
1440 2600 -969 -1591 165 -2015 -2784 1513 2142 -1380 -2181 -1202 -2893 -312 3620 780 -3625 -2926
1456 -2926 -1496 -1511 2007 2890 -2242 -4525 -1319 -493 21 2721 941 -4805 -3871 372 743 1288 1782
1473 1782 -2547 -4977 -654 2332 342 529 213 -3434 -2237 2004 1255 -1107 708 27 -2953 21
1489 21 2664 -739 -1749 1107 902 -553 1633 432 -2772 -260 3070 1139 -398 383 -2106 -1772
1505 -1772 3189 4477 246 -1277 -1079 -2116 909 5922 3553 -2178 -2757 -1123 290 4738 5720 -611
1521 -611 -4549 -1657 837 2852 5407 2724 -3737 -3291 1098 2751 3320 3749 -1322 -4883 74 3603
1537 3603 2811 1679 24 -3199 -1694 3380 3203 -456 -557 -667 -1578 1419 3657 -202 -3038 -294
1553 -294 425 704 2856 1184 -4203 -2768 1919 2384 1458 888 -3395 -4911 682 4518 956 -832
1569 -832 -2285 -4304 -1901 3751 2920 -1607 -2814 -3098 -2606 1772 4373 -907 -4732 -2687 -496 970
1585 970 3276 222 -5033 -3976 1069 1816 1132 609 -3183 -5187 156 3906 1390 -983 -2672 -5050
1601 -5050 -1905 4832 4096 -1655 -4202 -3899 -2002 3028 6259 308 -5316 -3931 -1266 1422 5627
1616 5627 3393 -3885 -5370 -861 1306 3785 4253 -1213 -5581 -2165 2963 2458 2124 758 -2884 -2723
1632 -2723 2661 2872 -116 -223 -273 -1149 1413 3625 46 -2690 -120 1771 1835 3576 960 -4411 -3013
1649 -3013 3183 4953 3314 987 -3974 -5160 1762 6842 4484 131 -3087 -5719 -1748 6277 7316
1664 7316 1016 -3390 -4706 -3614 3503 8606 3370 -3740 -4299 -2861 583 5887 5043 -2292 -4832
1679 -4832 -1593 37 2605 4081 463 -4449 -2244 1796 1225 966 528 -2484 -2317 2516 2873 -1792
1695 -1792 -2140 -1256 -1158 1974 3679 -1291 -5006 -2651 214 1792 3827 1306 -5528 -5601 -30 3136
1711 3136 3329 1794 -3933 -7698 -2329 4297 3697 748 -2006 -6201 -4625 2810 4871 672 -2296
1726 -2296 -3680 -4481 355 4829 2008 -2785 -3149 -2483 -514 3141 2679 -3025 -4231 -686 1305 1872
1742 1872 1794 -1629 -4703 -1066 3096 2508 773 -367 -3808 -2692 3409 4559 600 -1647 -2707 -2857
1758 -2857 1758 6051 1971 -2651 -2054 -1254 448 4143 4068 -1845 -3626 -552 1057 2314 3596 130
1774 130 -3765 -1330 3052 2551 1644 320 -2474 -1687 3577 3906 182 -1133 -1023 -1160 1875 4804 1012
1791 1012 -2916 -2043 215 1574 4678 3019 -3329 -4670 -127 2516 3817 3402 -1509 -5484 -2062
1806 -2062 3115 3487 2608 136 -3820 -4195 1293 4346 1989 370 -2014 -4248 -1252 3812 2471 -932
1822 -932 -1363 -1955 -2027 1182 2636 -939 -2136 -330 -410 -540 1043 -164 -2979 -860 1584 70 -914
1839 -914 -420 -2289 -1696 2379 2204 -1695 -2822 -1996 -1851 1332 3796 -233 -4096 -3230 -1249 506 3250
1856 3250 2327 -3222 -4578 -1528 852 2061 3003 -461 -5144 -3233 1647 2704 1825 507 -3122 -4297
1872 -4297 497 2932 1448 474 -627 -3258 -1313 2859 2109 -213 -281 -1082 -1990 1168 3100 208
1888 208 -1163 300 -316 -50 2035 1000 -1251 89 1832 316 112 1341 -46 -1208 1570 2020
1904 2020 -405 -171 753 -776 1054 3128 1049 -1719 -205 968 605 2441 2277 -1294 -2286 1232
1920 1232 1222 1132 2189 245 -2762 -880 2368 1393 1277 766 -1904 -2466 1587 2891 920 131 -528
1937 -528 -2227 -975 2786 1715 -736 -669 -944 -1731 1144 2948 363 -1768 -606 -967 -964 1813 1561
1954 1561 -2047 -1513 25 -873 -285 1652 -186 -2285 -641 -100 -1418 229 973 -1420 -1927 175
1970 175 -555 -1423 246 416 -1287 -677 602 -1557 -1626 1121 442 -1613 -361 -633 -1811 -342 1432
1987 1432 -17 -1055 -282 -1402 -1523 1089 1797 -514 -1351 -843 -1671 -442 2569 852 -1739 -1040 -156
2004 -156 -875 874 2371 -161 -1534 -478 -570 -582 2436 1947 -1036 -1457 519 -67 899 2527 420
2021 420 -1871 81 775 288 1422 2316 -546 -1725 646 667 561 2216 1270 -1421 -425 1116 517
2038 517 459 2025 509 -1508 105 1064 -93 913 2094 -81 -1427 741 574 244 1751 1593 -1197
2055 -1197 -662 1097 46 106 1779 546 -1746 -131 957 -254 764 1662 -757 -1694 523 515 -483
2072 -483 802 666 -1725 -1266 727 -170 141 1305 -240 -2244 -271 731 -119 407 836 -1495 -1882
2089 -1882 161 51 -639 621 -46 -2156 -1446 735 -371 -404 760 -1128 -2516 -244 1048 -948
2105 -948 -461 502 -1465 -2018 404 526 -550 401 -205 -2111 -923 1348 228 -664 609 -518 -2054
2122 -2054 -54 965 -696 54 577 -1082 -1402 623 666 -652 334 253 -1828 -131 1631 53 -507
2139 -507 859 -61 -1280 952 1550 -389 4 909 -748 -777 1607 764 -822 331 447 -838 371
2156 371 1773 214 6 1024 -18 -838 602 1599 -450 291 1088 -76 -169 1616 771 -593 840
2173 840 960 -632 348 1758 519 -437 919 131 -852 923 1465 -234 -159 941 -182 -249 1522 634
2191 634 -686 283 712 -1023 -210 1463 115 -985 242 -119 -982 519 923 -880 -831 352 -732
2208 -732 -901 930 319 -1172 -525 -338 -1212 -24 1198 -724 -1903 -285 -268 -598 692 607 -1374 -944
2226 -944 253 -899 -941 762 -308 -1899 -665 147 -1049 -110 659 -1342 -1481 500 367 -1237 -424
2243 -424 386 -1225 -383 990 -524 -1025 674 285 -1272 555 784 -1457 -1062 954 -211 -445 672
2260 672 -361 -1871 -204 1382 -270 135 637 -841 -1225 1235 726 -323 540 349 -973 -127 1668
2277 1668 294 -674 464 94 -331 1191 963 -346 -360 1030 161 -254 1370 520 -774 566 1449
2294 1449 -179 25 985 -540 -709 1656 1493 -570 -52 -64 -1072 1100 2363 275 -1154 -49 -164
2311 -164 12 1617 2035 -781 -1200 504 30 656 1767 499 -2196 -479 938 260 870 1057 -1357
2328 -1357 -1801 654 840 -177 539 -1 -1520 -943 1334 273 -705 66 -209 -1506 373 1365 -995
2345 -995 -1059 298 -570 -418 824 -304 -2087 -381 384 -649 15 338 -1601 -2083 474 950 -257
2362 -257 -552 -799 -2172 -419 1828 636 -1114 -730 -1631 -1264 1194 1718 -910 -1469 -627 -866 -163 1784
2380 1784 299 -2386 -1127 86 112 644 1007 -1453 -1965 691 1602 309 494 -132 -2031 -222 1649
2397 1649 1168 -476 -312 -811 -1033 1426 2281 -69 -1071 -255 -483 587 2614 1361 -1800 -1265 293
2414 293 935 1661 2002 -597 -2141 -79 1529 644 1668 980 -1909 -1087 1251 1582 809 928 -224
2431 -224 -1604 574 2174 217 -301 423 -148 -368 1455 676 -1166 -443 800 174 531 989 -963
2448 -963 -1750 856 1604 670 256 -559 -2279 -712 2771 1777 -490 -1441 -1912 -1783 1622 3153 317
2465 317 -1871 -1888 -2217 73 3180 2145 -1971 -2815 -1526 -527 1619 2858 -548 -3049 -1685 -154
2481 -154 380 1640 958 -2059 -2220 92 380 259 794 -886 -2353 -276 1374 -167 -711 -241 -1037
2498 -1037 -967 1429 689 -1680 -1137 -144 -221 567 1188 -1406 -2440 -525 1013 891 1294 -260 -2671 -1693
2516 -1693 1706 1923 868 14 -1621 -2458 681 2880 1283 -670 -1084 -1740 -599 2520 2419 -860
2532 -860 -1216 -890 -644 1592 2987 533 -2291 -963 405 1042 2413 1215 -1517 -1436 1102 1625 1175
2549 1175 912 -550 -2223 200 2430 1428 -75 -126 -1582 -666 2527 2488 59 -1006 -857 -742 1588
2566 1588 2876 359 -1922 -1205 153 593 2137 1531 -1430 -2218 202 1352 846 1115 -767 -2161
2582 -2161 -76 1886 999 -162 -380 -1273 -697 1842 1316 -1043 -1132 -561 -605 1061 1876 -421 -2330 -1310
2600 -1310 -41 866 1529 718 -2760 -2974 609 1575 1070 385 -1760 -3523 -916 2169 1657 264 -843
2617 -843 -2746 -2398 1341 2719 362 -1187 -2126 -2331 -211 2693 1061 -1377 -1516 -1032 -942 1243 1773
2634 1773 -931 -1803 -231 112 -66 1418 264 -2125 -797 1364 371 -373 233 -1119 -688 1514 1878
2651 1878 -895 -1362 -593 -652 880 2621 475 -1741 -1176 374 516 2113 1352 -1815 -2534 89 1615
2668 1615 1779 1642 -702 -2945 -730 1959 1808 573 212 -1699 -1899 1577 2481 692 -110 -588 -1715
2685 -1715 -162 2603 1541 -934 -348 -169 -516 1369 2285 -552 -1300 40 310 259 1266 620 -1619
2702 -1619 -386 906 520 379 424 -738 -1163 822 1801 -292 -506 -177 -868 61 1882 325 -1396
2719 -1396 -447 -51 -338 936 1129 -1220 -1841 98 282 -168 731 -208 -2020 -1324 1105 462 142 -142
2737 -142 -1818 -1804 767 1456 -401 -613 -687 -1657 -665 1626 922 -1096 -1040 -1026 -1138 952 1655 -735 -1742
2756 -1742 -675 -398 132 1498 514 -1589 -1172 440 294 63 988 -414 -1884 -8 929 -84 498
2773 498 346 -1252 -977 976 558 -1015 46 293 -715 214 1082 -412 -497 924 476 -515 704 204
2791 204 -882 71 1318 236 -106 261 -167 -924 1271 1546 252 -338 47 -785 -121 1895 944 -714
2809 -714 -208 229 -683 1180 1888 -279 -1131 223 29 -198 1691 1359 -823 -608 425 -41 539 1634
2827 1634 74 -1367 61 557 -89 607 1229 -579 -1167 414 218 -456 717 533 -1102 -452 689
2844 689 -288 -295 985 67 -1042 -37 175 -702 -40 948 -737 -892 447 122 -716 645 824 -1238
2862 -1238 -488 131 -979 -569 789 -255 -1632 -328 387 -868 -130 754 -880 -1174 323 -213 -734
2879 -734 511 392 -1405 -914 417 -461 -123 1002 -639 -1517 -349 421 -368 158 852 -673 -998 368
2897 368 390 -254 958 435 -1265 -662 707 6 181 893 -305 -1259 -63 742 -250 238 907 -531
2915 -531 -942 630 539 22 872 217 -966 -359 1190 417 104 896 95 -1137 435 1122 -41 536
2933 536 899 -820 -637 1127 889 -516 431 595 -1010 -237 1162 68 98 1292 239 -984 305
2950 305 1181 -159 287 894 -517 -695 923 699 -357 298 576 -677 -314 715 -61 -466 875 -268
2968 -268 -1196 77 807 -435 -88 762 -788 -1212 489 543 -624 94 228 -1598 -476 1022 37 -422
2986 -422 109 -349 -1259 270 1146 -627 -321 420 -1022 -938 960 628 -677 -145 -543 -1245 -422 1082
3004 1082 -95 -882 85 -305 -1084 495 828 -722 -550 176 -789 -794 831 696 -852 -194 -4 -1376
3022 -1376 -252 1171 -197 -562 283 -293 -983 800 1044 -515 -500 479 -407 -419 1074 520 -1204 53
3040 53 310 -569 235 1327 187 -650 826 272 -582 459 1305 -220 -158 1158 -237 -694 994 760
3058 760 -284 635 546 -606 111 1203 407 -143 896 -231 -1081 475 1672 -11 -172 485 -462 -597
3076 -597 1561 1333 -243 -104 -300 -871 312 1995 166 -628 -18 -3 -197 1062 1255 -892 -1020 463
3094 463 24 277 1160 251 -1563 -307 768 77 261 260 -1144 -1259 981 1073 -226 -307 -100 -1221 -211
3113 -211 1188 237 -1032 -120 -470 -805 1028 1136 -1080 -1190 42 -21 16 1204 -359 -2128 -400 798
3131 798 283 -482 298 -1055 -1353 642 953 -421 -39 -299 -1734 -279 1569 320 -1333 -383 -281
3148 -281 -694 1529 1109 -1313 -1576 272 250 375 742 -229 -2254 -676 889 710 696 454 -1911 -2018
3166 -2018 1065 1704 300 -106 -702 -1617 128 2417 1060 -799 -626 -603 -551 1696 2130 -557 -1221 -160
3184 -160 3 311 2076 370 -1749 -508 1149 809 966 1140 -1142 -1639 954 1726 396 520 -79
3201 -79 -1612 -7 2195 1053 -861 -638 -441 -466 1615 2321 -758 -2021 -349 316 962 2024 -242
3218 -242 -2216 -1109 1021 1383 1340 972 -1606 -2070 777 1811 789 298 -817 -2616 -577 2299 1403
3235 1403 -756 -1254 -1484 -974 1695 2198 -359 -1872 -840 -240 429 1601 323 -2192 -1475 435 731
3252 731 1145 671 -1602 -2276 377 1811 468 -205 -1228 -2772 -598 2013 1279 -955 -1534 -1778 -1171
3269 -1171 1477 2056 -356 -2145 -1686 -616 831 2625 1067 -2416 -2027 68 625 1323 1422 -1364 -2642
3286 -2642 -127 1356 1118 782 -249 -2215 -1154 2269 1673 52 -819 -1095 -1079 1109 2543 -228 -1192
3303 -1192 -614 -204 689 2404 771 -2104 -1398 1004 988 1678 1471 -1395 -2513 157 2429 1631 744
3320 744 -680 -2569 -807 2673 2618 131 -943 -1064 -1708 1401 3253 481 -1202 -1317 -763 76 2568
3337 2568 1675 -1390 -1841 -77 497 1509 1933 -723 -2548 -572 1580 1039 957 -156 -1988 -1132 1600
3354 1600 1307 53 -567 -1092 -1570 888 2492 239 -1780 -1211 -998 304 2366 1040 -2140 -1894 43
3371 43 303 1263 1354 -1326 -2697 -394 1336 945 682 -665 -2342 -1551 1420 1912 -205 -572 -1470 -1914
3389 -1914 792 2390 257 -1609 -1333 -953 12 2073 1144 -1714 -1932 -222 275 1143 1573 -856 -3082
3406 -3082 -779 952 1217 764 53 -2165 -1881 1420 1672 490 -72 -1130 -2051 616 2171 864 -743
3423 -743 -665 -1210 -761 2000 1772 -649 -1329 -379 34 869 1982 111 -1820 -396 902 456 1105 476
3441 476 -1112 -973 1541 1127 23 -6 -695 -1218 731 2345 615 -1172 -459 -429 157 2265 1697 -1313
3459 -1313 -1606 137 615 1223 1978 -141 -2279 -717 1184 1061 1122 546 -1847 -1934 823 1578 501 436
3477 436 -908 -1911 60 2056 1000 -562 -65 -1235 -587 1200 1672 -331 -1022 -155 -747 -186 1429
3494 1429 284 -1229 -610 -46 -533 456 761 -1478 -1325 770 639 -504 -14 -303 -1317 85 925
3511 925 -104 -875 -217 -497 -655 892 913 -1343 -1344 76 -346 -18 991 -465 -1978 -489 392 -117
3529 -117 676 181 -1303 -1538 824 1035 183 519 -661 -1960 -303 1592 742 -342 -184 -645 -1271 1014
3547 1014 1389 -112 -766 -56 -655 -109 1170 800 -1109 -585 225 -384 480 1278 -198 -1321 360 314
3565 314 -117 578 764 -715 -152 739 183 -212 1037 326 -510 511 736 -371 -198 1113 -328 -113
3583 -113 859 291 -799 149 1216 3 -51 526 -661 -456 999 930 -96 227 -26 -1344 76 1491
3601 1491 546 -527 260 -437 -631 1023 1584 -411 -595 67 -712 -153 1368 642 -944 -387 16 -867
3619 -867 334 1157 -139 -1236 -25 -51 -567 918 974 -1276 -669 471 -273 -264 732 82 -1007 -411 513
3638 513 -662 5 908 -687 -809 85 234 -711 384 485 -562 -707 321 -540 -371 700 205 -1447
3656 -1447 -597 245 -572 125 999 -362 -820 87 251 -880 755 736 -853 -940 425 -151 -34 1145
3674 1145 288 -1171 -364 420 -299 264 841 -311 -993 339 164 -412 854 789 -862 -869 734 -126 -261
3693 -261 895 189 -1071 -70 786 -273 152 990 -155 -1153 433 696 -87 247 569 -820 -661 711
3711 711 255 -155 878 432 -1049 -26 948 -4 162 1007 -300 -1026 706 588 -284 436 475 -1052
3729 -1052 -583 753 205 -151 865 -86 -835 64 597 -266 4 992 -747 -826 590 401 -555 241 178
3748 178 -1041 -471 853 -95 -630 578 15 -1161 -146 781 -407 -126 495 -685 -1229 525 421
3765 421 -354 545 266 -858 -703 629 141 -406 471 186 -1093 214 818 -254 -88 575 -748 -1060
3783 -1060 289 795 -851 -132 271 -1135 -375 896 34 -470 272 -108 -926 314 1226 -174 -311 302
3801 302 -606 -854 959 860 -338 -289 211 -628 -201 1068 538 -533 213 -119 -901 494 1212 -321 -230
3820 -230 653 46 -309 1067 1024 -669 -211 652 -293 -330 1086 712 -552 426 404 -609 251 1288 -103
3839 -103 -280 801 -218 -650 785 896 -746 1 577 -551 -384 1210 664 -610 271 -26 -501 477
3857 477 1308 -66 -334 327 -151 -769 899 923 -493 -107 448 -672 -242 1199 262 -671 -19 -66 -742
3876 -742 348 960 -324 -555 316 -157 -533 675 609 -716 -528 675 -216 166 604 -167 -869 268
3894 268 376 -900 59 747 -397 -573 537 -298 -535 257 653 -746 -211 556 -728 -639 1010 -13
3912 -13 -717 107 152 -799 355 1007 -276 -515 293 -29 -498 666 705 -938 -322 285 -410 -195 934
3931 934 -114 -873 -62 86 -465 359 741 -398 -495 603 306 -346 582 665 -577 -12 825 -37 -143
3950 -143 838 203 -1034 421 583 -654 48 831 -170 -273 1000 170 -663 871 456 -787 11 705
3968 705 -264 -122 895 58 -544 243 195 -417 21 802 -452 -953 746 322 -151 668 523 -1025 -202
3987 -202 964 -172 -75 559 -147 -1104 303 952 -307 256 850 -698 -812 691 259 -464 435 -6
4005 -6 -915 -144 877 -174 -490 499 51 -750 121 669 -847 -22 739 -575 -441 751 -57 -772 281
4024 281 469 -884 -86 535 -396 -123 636 -265 -802 176 464 -655 176 613 -795 -738 454 183 -307
4043 -307 713 341 -1179 -496 462 41 -408 735 109 -1236 369 726 -498 -149 456 -684 -468 797
4061 797 364 -464 192 320 -695 -6 801 18 -352 209 410 -294 778 590 -169 -128 1103 90 -278
4080 -278 696 56 -678 373 994 -315 31 350 -385 -49 1157 496 -474 -158 142 -545 390 1142 -199
4099 -199 -628 286 455 -335 814 334 -1188 -322 762 353 113 881 -278 -1053 57 1095 74 -152
4117 -152 220 -683 -499 837 247 -915 -132 291 -505 207 926 -443 -996 128 -83 -487 773 516
4135 516 -1109 -620 544 61 -429 367 -119 -1033 -121 783 -225 -397 230 -682 -808 848 745 -785
4153 -785 -29 324 -485 103 1057 -274 -1419 98 395 -282 718 197 -1155 -483 637 -10 4 542
4171 542 -505 -1453 399 907 -479 -482 231 -758 -355 1102 729 -525 -666 -121 -935 64 1210 -425
4189 -425 -1066 161 248 -243 819 727 -906 -296 707 534 -42 790 87 -1104 146 1204 35 -62
4207 -62 450 -454 -361 760 509 -617 321 414 -475 117 1251 -9 -1085 320 174 88 717 627 -819
4226 -819 -312 1034 590 92 358 -425 -810 362 1262 -7 -232 250 -841 -493 1222 960 -630 -416
4244 -416 -39 -953 81 1263 7 -1214 -80 126 -474 619 957 -1149 -708 461 31 -63 554 -9
4262 -9 -1173 -150 717 -229 95 210 -684 -786 893 389 -640 -316 39 -829 263 984 -513 -1021 -84
4281 -84 58 -484 493 602 -1005 -910 788 269 -144 560 -408 -1195 385 1125 -8 -183 184 -750 -591
4300 -591 1042 687 -470 -230 -14 -494 -227 907 282 -962 216 57 -141 655 735 -789 -1097 413
4318 413 129 -83 545 94 -1037 114 795 10 210 572 -233 -867 564 820 -139 29 473 -672 69
4337 69 1161 130 -648 280 308 -562 573 829 -610 -419 808 306 -58 846 119 -1190 99 646
4355 646 -17 -117 568 -225 -564 790 487 -236 -34 750 -618 -113 1137 62 -908 140 66 -579 652
4374 652 775 -616 -673 487 199 -343 527 419 -916 -24 972 -72 25 408 -675 -782 434 666 -434
4393 -434 305 386 -454 -394 736 100 -559 -165 291 -689 -129 662 -547 -652 467 -428 -478 548 471 -983
4413 -983 -207 658 -593 -377 692 -313 -986 263 222 -525 -231 244 -494 -415 752 24 -531 248 252 -687
4433 -687 439 654 -624 -620 476 92 -500 707 653 -877 -370 589 -324 -239 439 -315 -1029 373 464 -674
4453 -674 -195 398 -135 -276 678 336 -693 113 90 -799 69 726 -39 -467 913 119 -580 598 132
4472 132 -583 -35 661 -454 -216 869 198 -574 364 421 -404 37 834 -215 -502 544 228 -817 373
4491 373 608 -667 -173 562 -211 -398 517 201 -522 762 382 -666 -231 576 -190 -118 895 -58 -799
4510 -799 76 502 -402 -145 817 -310 -267 486 48 -479 381 316 -699 79 749 -172 -139 590 -572 -982
4530 -982 -2 930 -341 -88 616 -596 -499 561 500 -913 39 -68 -729 -220 644 -190 -808 257 -229
4549 -229 -521 -111 366 -655 -146 775 -137 -553 541 45 -859 -35 361 -586 -252 845 128 -698 347
4568 347 135 -722 92 431 -650 38 714 -289 -447 510 72 -749 361 609 -485 -306 645 -158 -205
4587 -205 589 10 -811 217 855 -377 -386 427 -4 -409 580 354 -378 306 528 -672 -235 706 -8 -244
4607 -244 767 301 -474 255 529 -753 -130 776 -92 -430 822 167 -563 255 565 -695 -17 543 -395
4626 -395 -592 587 220 -541 239 334 -456 -112 545 -276 -272 413 254 -575 354 363 -515 -55 505 -403 -727
4647 -727 368 219 -367 415 615 -350 -291 665 -133 -54 457 -9 -653 -18 510 -587 -232 394 -38 -405
4667 -405 282 91 -781 132 369 -515 -273 509 -415 -266 112 371 -624 130 342 -637 -657 623 -460 -375
4687 -375 292 181 -786 153 663 -435 -75 356 -178 -289 620 296 -243 127 561 -590 45 673 84
4706 84 -652 237 -57 -314 -22 432 -569 -398 841 154 -414 300 111 -599 143 462 -70 -297 335 -188
4726 -188 -100 615 609 -521 27 481 -384 116 902 -255 -431 610 452 -173 225 523 -632 -237 695 -147
4746 -147 -461 252 118 -317 89 924 -178 -248 130 -78 -149 546 231 -495 252 332 -391 -137 780 -298
4766 -298 -617 294 270 -10 133 286 -451 -492 454 287 -524 46 -232 -700 1 698 -466 -340 209 -172
4786 -172 -514 446 534 -566 -577 95 -395 -365 780 -182 -940 288 256 -463 251 594 -824 -573 288 138
4806 138 -528 281 267 -740 -179 673 -88 -294 133 -206 -467 611 245 -331 -169 540 -493 -91 605
4825 605 -112 -921 136 424 -127 191 338 -648 -667 496 174 208 318 142 -658 304 768 103 -129 339
4845 339 -74 -369 577 665 -71 -88 383 -123 -96 1046 53 -645 -33 250 -439 349 499 -471 -368 555 431
4866 431 -5 550 290 -712 89 701 -96 -84 461 -145 -402 386 561 -259 -73 301 -288 39 844 189
4886 189 -635 58 122 -278 234 666 -595 -456 425 256 -14 293 -54 -763 7 777 -15 -190 385 -132
4906 -132 -465 424 532 -570 -243 156 -265 -25 708 -41 -771 -120 106 -309 208 389 -243 -637 162 190
4926 190 -196 439 46 -665 -194 408 305 31 100 -785 -393 372 442 -276 -237 249 -388 52 695 470 -599
4947 -599 -298 64 -163 -150 705 -384 -471 366 280 -290 293 133 -483 -355 380 -126 -37 139 60 -403 356
4968 356 842 -145 -278 199 -132 -229 542 176 -561 49 409 -116 610 508 -283 -508 199 309 339 451 -167
4989 -167 -764 -49 905 267 -126 343 -223 -148 109 569 -98 126 96 -381 -507 503 513 -683 34 -25 -192
5010 -192 196 803 -202 -257 402 292 -24 93 257 -561 -464 698 -13 -82 147 -143 -458 136 386 -559
5030 -559 -308 48 -194 -54 636 112 -399 -12 281 -285 193 183 -506 -467 631 62 -580 -20 45 -663 -402
5051 -402 248 -28 -533 305 -408 -415 286 516 -450 -270 307 -341 -403 730 341 -453 -1 -28 -224 294 643
5072 643 -25 -997 150 62 134 55 268 -721 -368 309 139 -177 425 266 -474 84 325 -96 -229 581 -486
5093 -486 -596 579 459 -82 188 -25 -250 -135 204 -119 -180 509 163 -641 113 136 -167 -39 498 15
5113 15 -524 84 70 -358 483 717 0 -180 646 123 203 785 101 -499 195 343 -193 55 241 -287 -418
5134 -418 427 112 -177 358 469 -603 -92 476 152 -196 443 -206 -742 -34 438 -247 -358 -34 -314 -363
5154 -363 291 167 -370 58 43 -344 -37 399 -216 -212 19 -62 -392 170 289 -347 -159 82 -481 -425 397 1
5176 1 -477 -24 348 -624 94 168 -314 -422 177 132 -545 125 675 -159 -560 286 -421 -639 549 418 -406
5197 -406 133 136 -718 120 481 -248 -149 312 81 -476 238 521 -30 -337 50 -362 -160 535 287 -313 -177
5218 -177 -32 -413 146 281 2 -229 -59 -99 -411 348 488 -283 -550 329 71 -227 474 240 -673 0
5238 0 437 -94 43 643 -180 -415 -118 222 -85 -42 421 115 -374 424 -159 -332 225 480 -112 -145 342
5259 342 157 37 461 -88 -634 273 360 -304 147 424 -94 -77 301 -315 -369 701 527 -355 -32 211 -167
5280 -167 147 567 -452 -699 68 68 -287 -146 95 -184 -322 -17 59 -260 203 180 -729 43 446 -150 -245
5301 -245 186 -125 -425 -6 93 -220 255 319 -541 -273 412 488 -492 173 -251 -236 33 246 -412 -24 354
5322 354 -220 -896 -64 272 -321 218 91 -175 -450 452 -165 -227 205 602 -407 200 436 -97 119 154
5342 154 -148 -464 426 6 -173 194 391 -243 -188 395 77 -263 238 47 -336 -140 634 -246 -7 234
5362 234 -311 -186 276 214 -343 163 411 -63 52 264 547 21 386 350 -291 -86 419 -1 -188 515 3
5383 3 -326 327 267 -381 117 42 -182 -108 243 -1 -242 90 219 -392 -87 489 -125 -94 254 -154 -399 92
5405 92 378 -67 80 -29 -222 -484 563 436 -390 -128 103 -244 100 125 -183 -229 38 -34 -510 -2 313
5426 313 -291 -130 145 129 100 322 109 -323 130 110 41 -252 261 -199 -481 128 -236 -210 212 225 -438 -60
5448 -60 116 1 -243 -4 216 -222 267 298 -237 -335 264 -169 -65 145 -148 -231 217 491 -293 72 350
5469 350 -25 -195 132 232 -407 -3 0 -157 251 243 -43 -261 258 136 -91 -18 186 -448 -251 305 72 -215
5491 -215 463 84 -337 -48 191 -155 235 378 -84 -203 215 -69 -347 573 225 -248 45 54 59 -254 141
5512 141 27 -483 194 213 -139 -225 241 191 -294 -205 204 -409 296 253 -118 -26 308 184 -92 541 -207 -414
5534 -414 -79 -72 -206 -135 408 -181 -69 419 -200 -24 -17 222 -442 -103 259 -60 17 136 202 -195 -11 -57 -245
5557 -245 -300 26 -296 -672 162 158 -368 41 279 -280 -227 91 -117 -5 292 -59 -198 172 111 -366 150 43
5579 43 176 -93 217 167 -407 -70 424 -156 -311 80 145 1 153 -420 -568 129 446 -188 86 157 240 -194
5601 -194 106 476 134 382 176 -282 -74 481 -26 -163 -85 285 57 391 410 66 -206 101 63 -432 9
5622 9 41 -232 204 -55 -235 -225 215 -82 -192 203 277 106 126 460 117 90 79 -15 -429 342 345 -164 -156 193
5646 193 -102 -178 264 77 -132 295 127 -188 210 246 -90 -60 113 -50 -375 -47 319 -39 -5 108 -163
5667 -163 -128 58 193 -468 -83 -122 -107 146 452 -399 -10 188 174 -84 -105 240 -352 -193 137 -265 264 265
5689 265 -210 -241 -24 178 -56 -447 -92 -42 -161 91 250 -341 19 210 -161 109 28 -350 -146 289 122
5710 122 -303 243 205 -398 -185 440 42 -173 16 96 -24 318 229 -174 25 362 187 178 138 -1 -232 2
5732 2 223 -288 -308 -18 -64 -42 -19 81 -373 250 -68 -336 -51 -9 181 25 376 -267 36 28 110 -213 153
5755 153 355 237 -252 8 -89 96 84 167 -157 -5 459 -167 27 56 -51 -12 10 285 -311 351 353 -321 -64
5778 -64 -36 76 -202 -175 254 -106 83 -79 44 134 18 -7 -217 222 222 92 -198 -34 -106 -387 152 305 -291
5801 -291 165 239 -223 -83 172 -83 -301 221 -174 -179 88 178 -35 -27 146 93 -68 255 328 -316 -204 -220 -90
5824 -90 -162 204 211 -172 -83 -293 -303 -60 282 -70 170 244 -237 -65 -127 -50 -33 -166 330 -199 149 403 370 -75
5848 -75 157 315 -110 242 151 -459 -27 32 -165 -63 383 189 -259 139 231 42 52 -161 -7 -224 3 -138
5870 -138 -54 -101 224 -238 -13 227 180 -185 127 -74 -113 84 -83 250 -335 25 -70 -137 52 432 12 82
5892 82 253 -137 168 302 128 -51 5 139 -31 188 -84 -196 -48 527 -22 -306 171 124 -62 -263 167
5913 167 -213 11 336 36 -338 160 144 -150 171 292 -268 -92 143 242 -147 98 136 -232 130 58 -299
5934 -299 -34 175 149 -221 275 245 -159 -127 167 -259 -214 61 -84 -189 -14 250 -139 -41 -26 -146 11 361
5956 361 -118 -168 -139 -47 -194 192 264 -161 44 186 28 18 447 -287 -378 179 205 26 -270 96 153 -222 81
5979 81 18 161 -164 365 -114 -184 15 257 211 345 303 -421 -134 337 -372 -242 347 260 -86 4 32 -95 54
6002 54 -116 329 -192 299 -97 -159 309 40 63 72 40 88 129 536 161 -148 224 51 -160 -20 109 103 -62
6025 -62 300 158 -289 176 222 -72 -275 -29 275 128 53 -129 -218 -57 -218 126 58 194 -123 -333 49 104
6047 104 -15 278 -179 -134 -179 242 248 -198 188 7 -311 -170 151 127 -229 126 -150 27 366 -14 -269 87
6069 87 153 -187 -124 -167 -45 15 -203 -79 -261 12 19 1 54 81 -308 -215 355 6 190 86 100 -181 -214 66
6093 66 -116 13 113 50 -271 -229 44 -217 -197 224 -135 -129 269 -124 30 -151 29 -250 -110 137 -11 -62
6115 -62 53 145 -198 265 226 -170 -18 71 263 -271 -103 179 146 -48 -13 -263 143 163 -6 -268 89 215
6137 215 -147 109 160 -139 -265 135 36 -66 117 141 -133 -42 124 -293 -94 -34 20 -70 128 -107 -171 -88 164
6160 164 -321 -246 -153 -58 174 103 177 -567 -7 228 120 -34 371 -42 73 380 -39 -251 10 342 -109 -384
6182 -384 97 -456 -238 257 98 -397 -298 -32 -414 -161 504 -118 -158 -330 -190 -242 47 16 -154 -264 213
6203 213 142 -316 115 205 -174 24 122 -252 -131 391 -211 -280 93 -60 -197 49 242 -202 84 142 407 -412
6225 -412 -5 -109 -269 -243 290 187 42 109 -97 -108 386 379 -17 -221 -128 245 -179 330 -21 -119 -77 150 -194
6248 -194 72 172 56 -144 218 27 63 39 4 40 -211 169 -93 -212 289 -209 -150 -166 82 78 124 562 73
6271 73 168 95 81 -131 79 -159 -265 48 138 -220 -76 29 47 -55 134 -107 17 -315 56 12 -307 21
6293 21 -130 -386 210 10 -239 168 343 8 77 -26 16 -188 91 140 -146 266 43 -169 -456 133 -60
6314 -60 -132 -22 148 -356 161 76 -73 -225 540 -139 -73 365 175 -344 -202 464 -1 -93 -46 89 -152 163
6336 163 -100 -162 -142 239 -289 -22 110 22 -555 57 -54 -52 -13 -55 -5 -481 116 240 -328 26 61 78 335
6359 335 317 148 -126 237 -152 -58 -41 -21 -22 44 209 315 -136 242 179 -8 230 316 -90 102 386 -117 -176
6382 -176 245 -300 -74 203 252 184 -14 267 151 166 204 121 95 236 101 -301 101 13 176 83 -69 250 -286
6405 -286 205 155 -170 -108 -55 67 123 264 210 281 230 156 -459 -38 96 -43 -330 198 -22 -68 -66 114 -340 -1
6429 -1 143 20 -267 21 437 -71 180 44 23 125 249 -83 -20 -83 243 -457 12 -32 -286 -141 -124 -179 -254
6452 -254 -75 353 -63 -211 109 117 -69 98 -85 -124 254 91 -604 200 -18 43 -126 -194 65 24 175 198
6474 198 -224 -48 513 117 -149 215 -123 -199 136 128 -203 223 237 -243 5 128 33 -123 -34 65 137 60 142
6497 142 -121 -178 279 -25 -59 22 2 379 84 21 66 -128 270 -105 -391 -139 457 -226 40 -104 -217 -399
6519 -399 225 72 -135 67 -168 -177 46 35 -125 -60 177 -148 63 212 -25 -214 75 -66 -22 -84 -182 -109 -174
6542 -174 329 13 -161 -101 292 -152 82 150 18 -306 -160 -12 -206 122 344 -169 -159 361 8 3 -25 -64
6564 -64 -104 -10 166 260 -293 97 -44 -50 12 -79 125 342 -96 -211 -293 239 159 -207 -47 32 -369 -254 22 -63
6588 -63 -411 290 50 2 -29 186 213 -151 207 -104 82 130 237 -125 -168 188 -43 -266 -35 14 -147 131
6610 131 -106 -112 -125 -83 -64 -440 -65 18 -119 274 104 -231 -56 210 -144 -22 332 -132 210 229 -192 -127 124
6633 124 493 -371 124 148 -111 -172 -70 -121 101 129 -123 53 -215 370 73 48 -22 209 66 -251 219 151
6655 151 -180 52 -220 109 85 136 -75 -97 200 -24 -43 107 -26 -70 101 -142 119 -2 58 232 -242 77
6677 77 104 96 1 75 -152 -135 130 -228 299 40 147 3 22 61 -395 3 -87 -31 -328 51 -34 -163 -72 -22 133
6702 133 74 201 -92 -10 -85 286 33 27 -138 -406 7 163 24 -155 -31 -135 -284 295 278 -291 -168 -65
6724 -65 -230 177 297 -33 -82 39 26 -428 -88 -39 -88 -203 313 -81 -186 33 -157 24 131 338 -252 -38
6746 -38 277 159 12 10 305 265 110 63 -104 -66 -3 -152 -6 58 315 -314 -48 -41 -104 136 91 167 52 187
6770 187 -268 -198 -78 230 59 32 184 214 -123 204 19 36 -15 231 276 177 231 108 -288 72 80 141 302 -178
6794 -178 -312 42 124 173 25 246 76 154 159 179 -7 -339 -61 -66 -258 89 20 -391 78 -191 -23 -193 182
6817 182 -91 -241 416 -10 -365 -311 305 -3 -179 -5 -205 -266 147 341 -159 163 263 42 -25 -293 -25
6838 -25 19 162 106 -205 -107 138 -54 194 133 43 -1 2 97 -320 56 -46 -196 -154 275 174 460 249 -69 -111
6862 -111 -18 -114 -45 223 134 -151 84 131 -119 8 74 42 -95 -183 227 -87 103 279 312 -158 94 251 -199
6885 -199 144 67 -77 -216 27 -21 -112 -225 -42 -77 76 161 62 177 112 -10 -252 38 110 23 -143 63 -59
6908 -59 -456 169 -16 30 278 225 -83 -64 135 124 -78 300 -48 -188 -297 295 106 35 348 -105 -56 111
6930 111 47 -257 -108 129 33 -125 287 -42 159 -86 204 -101 -208 35 45 32 162 -324 -76 267 16
6951 16 -113 173 151 28 149 288 -121 -85 24 362 -5 0 178 -94 303 354 -138 -157 147 82 81 -125 114
6974 114 -35 -41 301 77 -306 -218 152 -33 -200 19 -9 -143 49 -132 94 173 -142 -50 -130 260 -224 35
6996 35 -19 -223 -206 105 -36 -39 -123 -40 12 -119 439 220 136 -262 -3 -211 272 131 -70 0 307 192 -12
7019 -12 -41 60 105 -156 14 -26 -54 138 167 -317 -6 120 -138 88 -33 11 125 148 58 -126 -199 -82 -127 48
7043 48 83 -12 200 0 104 103 -52 452 24 -87 -112 55 -155 292 -82 -410 185 -151 -319 -266 3 167
7065 167 -159 223 -13 -200 4 -78 52 -172 -9 -302 -207 -22 61 81 199 -3 -287 -79 -158 -17 56 -146
7087 -146 47 65 34 40 22 196 -32 149 -118 46 -55 -167 -195 -435 -130 183 175 88 -350 -17 78 102 147 -136
7111 -136 1 -15 248 -113 32 22 47 -344 -100 103 -24 117 247 3 -331 419 158 141 -38 -111 -116 -59 81
7134 81 103 70 -137 79 89 88 110 -174 206 156 80 281 -62 -285 137 86 39 -31 -73 234 264 148 139 -36 -106 109
7160 109 91 -22 -79 341 137 25 60 -110 13 107 286 78 -130 -84 86 -4 -123 -29 -196 8 108 -39
7182 -39 165 -186 143 -145 103 33 185 153 -1 -56 111 105 182 -148 73 -30 -146 -16 58 -163 -42 -52 -192
7205 -192 -17 11 -262 28 -31 30 -73 82 -34 -100 -52 304 -257 -35 -67 -14 -222 92 168 -77 133 143 84
7228 84 -94 10 -315 -216 -325 224 -180 -133 181 -111 108 229 231 -73 151 -50 164 -72 212 -32 -177 -19
7250 -19 251 31 49 -76 -51 18 -132 58 6 503 -9 -335 73 6 -143 -113 27 -93 1 288 -87 120 124
7273 124 407 -90 -89 155 29 -93 -194 -154 111 22 -153 307 56 -84 -194 26 -27 1 -400 140 -124 -40
7295 -40 -59 -137 -19 92 51 -63 -127 94 -83 -17 -38 56 -26 92 -163 218 107 -49 -49 384 -65 219 -168 263
7319 263 -200 63 57 -74 150 70 166 80 59 45 -120 -193 -14 187 -119 16 -198 -72 195 30 75 99 -275
7342 -275 -172 253 -72 -236 177 -70 -88 -75 -146 5 -39 -86 22 -48 270 76 -171 167 146 28 18 -52 -201
7365 -201 -207 124 -13 163 111 59 -101 -53 415 249 -174 38 -124 256 -28 116 -119 141 -107 37 380 178
7387 178 150 14 103 61 -199 183 431 -141 196 36 -17 241 -12 16 -335 131 -215 73 25 86 -55 -90 90
7410 90 115 188 144 216 218 72 117 -86 -199 236 21 17 -62 340 -255 -45 -205 -149 146 137 -138 -111 144 -22 -296
7435 -296 -36 115 26 -329 401 -164 -212 108 -23 228 132 258 79 -153 181 101 88 -227 41 -221 -115 -108
7457 -108 -49 240 -93 66 168 34 -24 218 -209 -104 -165 119 -87 20 207 -22 -161 -15 -51 103 6 77
7479 77 78 112 -202 -87 104 -217 61 70 -275 193 -125 -84 -65 1 -5 -39 207 39 184 71 -25 -27 -92 60 55 -51
7505 -51 -44 -47 59 286 -122 34 213 129 21 -322 -44 -101 97 88 54 -112 39 126 157 -107 -211 -30 -145 34
7529 34 392 -91 -108 33 32 -327 209 244 -212 79 127 -201 45 41 192 -191 -72 -3 -161 -252 174 -69 115
7552 115 160 -171 -96 20 -377 36 37 22 122 119 366 29 19 185 -19 292 94 218 -9 24 143 -26 -219
7575 -219 -175 404 170 -336 -187 -209 71 87 69 -8 158 319 -69 220 186 147 -9 68 -297 -185 107 51 -155
7598 -155 -38 -82 -46 145 216 -113 52 40 312 -79 -18 -20 191 90 211 -247 -191 -343 115 48 -175 63 60 51
7622 51 235 85 -224 318 -49 -50 188 67 77 346 -349 -15 236 301 31 92 129 392 127 -230 235 68
7644 68 19 -122 149 -128 205 -233 80 -37 16 289 -129 -61 93 38 -154 -98 -102 18 86 80 -205 -122 325 -304
7668 -304 -257 248 -211 -133 -16 158 119 -1 377 -257 -19 -8 74 -175 169 58 159 132 -148 -3 -11 251 64
7691 64 -74 102 242 -129 100 43 229 -64 -122 171 128 241 45 -140 -186 130 25 133 -44 183 -29 274
7713 274 66 124 26 -20 -6 54 -117 -111 -104 94 110 -200 83 193 113 -140 -58 -36 -183 -91 -151 -370 -11 154 -56
7738 -56 -122 199 -325 -260 84 31 -38 414 25 -190 -121 225 -184 -160 -50 139 107 139 71 297 -48 -98 -58 90
7762 90 104 74 79 -55 96 -123 40 11 71 66 -142 233 179 145 4 -159 51 73 -228 1 -17 -134 -70 68 44
7787 44 -306 -12 81 78 127 238 -138 -153 74 -51 19 48 112 171 -5 213 108 4 -41 180 -27 77 -91 221
7811 221 53 62 -189 -60 193 48 83 -82 138 -306 -177 -125 -65 -69 37 107 -186 -76 48 -129 -318 29 -22
7834 -22 -53 46 -29 376 321 238 -302 39 45 -79 -297 169 233 32 -55 227 95 49 182 -193 -166 14 104 -23
7858 -23 -15 112 212 -338 -119 26 -257 -88 61 119 59 45 -48 -166 -174 10 26 -213 -3 -303 147 114 -182 -344
7882 -344 94 50 -449 -17 3 -50 -22 125 272 10 -63 -64 -247 -154 103 178 -178 9 49 -89 238 213 -83 5
7906 5 -361 90 142 68 27 -381 -95 74 7 -15 193 -138 206 132 171 -155 -12 207 34 -39 81 -33 -7 -35
7930 -35 -167 40 24 182 -347 -166 -112 -198 -115 -27 92 10 135 111 -104 -39 180 -57 344 48 -240 -68 114
7953 114 -88 -544 131 -216 -19 212 -201 134 -81 -98 9 200 236 103 -9 -343 140 157 -47 36 -115
7974 -115 -33 126 -323 -192 84 -45 239 -143 -25 87 -329 -138 -38 57 -120 87 -24 -432 -160 -108 -118
7995 -118 -97 -131 -70 -229 250 -200 -284 21 -24 -151 69 -115 -53 -326 -101 -30 169 146 337 -74 -59 82 -232
8018 -232 78 -83 -229 -102 333 215 -91 85 83 -153 -56 176 126 16 28 -172 120 124 144 -328 -29 111 94
8041 94 162 208 439 -280 90 394 26 132 276 175 -325 77 37 -184 147 71 -285 -94 239 -97 -1 151
8063 151 28 -15 -11 70 79 69 -182 -152 -39 219 16 -301 -141 151 -52 -56 -59 -193 -62 379 194 203 -192 -98 -163
8088 -163 197 165 43 -254 235 121 -114 -69 -188 -134 -124 103 123 -566 102 17 -206 -202 -142 -86 -124 312 -17 -47
8112 -47 18 -187 -125 382 -33 -452 126 356 89 -164 -295 272 -228 104 -99 -45 -346 506 -176 -367 490
8133 490 71 -213 -183 -145 -40 21 253 306 33 -27 206 -326 -125 48 -42 -113 32 -1 -416 193 97 61 -68
8156 -68 146 190 -402 140 140 -91 396 49 -49 18 293 209 146 -142 123 -32 -54 -74 15 155 -149 82 37 87
8180 87 58 81 -27 -126 1 48 -17 -14 12 43 85
8191H5
$$ Imaginary data points
##PAGE= N=2
##DATA TABLE= (X++(I..I)), XYDATA
0 0 0 0 0 -1 8 0 8 -8 8 -16 17 -24 31 -33 41 -51 59 -73 87 -100 117 -138 157 -183 211 -239 275 -309 352
29 352 -399 448 -504 565 -632 704 -784 871 -969 1075 -1191 1319 -1460 1615 -1790 1982
45 1982 -2201 2446 -2725 3047 -3424 3867 -4404 5063 -5899 7004 -8528 10778 -14457 21515
59 21515 -40046 190672 451962 38914 -276114 -350026 -110672 188388 322215 132750 -95343
70 -95343 -186188 -151554 -51088 130101 206304 104859 -59001 -155749 -159227 -8414 167442
81 167442 160380 6575 -76381 -81418 -60596 2084 63534 54664 48007 47161 -39238 -134979 -84385
94 -84385 43857 124711 135539 40715 -136662 -194891 -56839 109207 177779 136688 -36006
105 -36006 -219596 -189298 25518 187447 191656 52918 -157439 -235180 -68104 137892 174818
116 174818 83144 -51682 -162157 -125091 36009 120551 77408 9719 -57004 -97023 -36568
127 -36568 51922 45892 2447 -2759 -13312 -20940 5658 -4724 -49972 -17753 60077 57965 4487
140 4487 -41770 -91973 -76876 49359 134863 71161 -41694 -115430 -125590 -18564 137287
151 137287 150192 14982 -108142 -146073 -84086 73929 176093 88005 -68754 -130485 -99746
162 -99746 -3438 115669 122502 984 -84828 -75810 -40128 19398 81098 57139 -15929 -35340
174 -35340 -30337 -36466 -1431 46846 35016 12441 13367 -23845 -67075 -31398 32846 59495 67412
187 67412 29077 -73840 -115786 -28717 74117 110849 82478 -26895 -141598 -110938 33698
198 33698 124867 116299 35414 -94739 -155728 -51082 97365 137280 77506 -31724 -134037
209 -134037 -110180 33272 123677 90844 12047 -69410 -106584 -33303 72059 81103 28697 -10682
221 -10682 -50905 -61631 3117 55675 33330 5779 -2694 -28249 -29216 8987 14549 -2210 19570
234 19570 28009 -14212 -34112 -18630 -12427 14407 57389 30847 -40332 -54304 -25176 2595
246 2595 46191 63206 -1871 -66234 -52084 -10550 28230 64895 38033 -47503 -73488 -21278
258 -21278 21845 42105 43598 -10448 -65387 -38078 17655 28219 23773 9045 -34838 -44108 6051
271 6051 29787 8231 -1661 -12335 -30992 -4223 35099 11538 -26108 -17505 -5196 -1152 23802
284 23802 21877 -24248 -35280 -1786 11205 15201 25443 -4550 -43733 -21464 18738 20619 18441
297 18441 10811 -29652 -40107 8638 33034 12510 3761 -5098 -28595 -12368 24839 17260 -3197
310 -3197 3603 -4303 -19388 5159 22249 -1451 -7113 10737 803 -8032 10267 4168 -15598
323 -15598 5243 25765 3257 -9912 -1413 -9604 -4835 27742 24138 -10962 -13844 -4235 -9716
336 -9716 10144 37151 11897 -22745 -15379 -5152 46 27527 31281 -12132 -29724 -6674 4174
349 4174 11023 27816 9547 -25966 -17147 6263 3996 11187 21698 -5973 -27661 -3051 11353
362 11353 2220 9429 9444 -16274 -15340 10122 5167 -5298 8106 3447 -16333 -3820 10081 -5605
376 -5605 -5171 10979 -2701 -15200 4212 5810 -12963 -2375 10592 -5435 -8696 4687 -6260
389 -6260 -12514 9484 9183 -13656 -7490 3968 -8917 -5139 13531 -433 -16544 -347 2562
402 2562 -11294 1887 13335 -7940 -14048 2721 -1174 -6107 9857 4571 -16834 -5818 9225
415 9225 -4751 -4561 11060 -1376 -14667 1757 6558 -6895 2722 10171 -9260 -11110 9251
428 9251 4008 -6313 6257 4467 -11295 -26 11547 -4203 -4611 12011 1435 -11999 4302
441 4302 9317 -4806 2104 9681 -5915 -5803 11654 3541 -7060 7376 7710 -8207 414 11405
455 11405 -2495 -3171 12343 1704 -10133 6375 10410 -5325 472 9933 -2932 -4066 10143
468 10143 1895 -6855 8312 8773 -8813 -919 11185 -2208 -4042 10159 1275 -8722 6013 7623
482 7623 -8639 -538 11748 -2714 -6919 6453 529 -6821 6854 6025 -10191 -2079 9307 -4438
496 -4438 -6489 8452 1921 -9806 1897 3914 -8642 133 9755 -5774 -9794 4962 390 -8237
510 -8237 3784 4469 -10370 -3943 5843 -6016 -6576 9053 424 -12777 -1416 3616 -6641 -181
524 -181 6879 -7339 -9827 5159 328 -8513 3435 4547 -11079 -5146 6213 -3746 -5202 7335
538 7335 -1927 -12867 1738 7466 -6249 -3408 4783 -5301 -5774 7461 715 -9045 2660 5109
552 5109 -7719 -1415 8964 -3521 -7385 5901 1797 -6371 5332 5879 -9415 -3526 10179 1114
566 1114 -3323 5333 -771 -7827 6096 9509 -4452 -1081 7046 -4239 -4594 10877 6633 -6346
580 -6346 927 3958 -4364 4407 12736 -2888 -8677 5415 5332 -998 7468 5403 -9118 -2127 11449
595 11449 2937 -1609 6671 -783 -10125 4008 12795 1248 -925 1135 -8136 -3757 14573 9667
609 9667 -6177 -3174 -957 -6148 5306 15078 -317 -10097 -463 -520 -3335 9511 10241 -8228 -9403
624 -9403 1662 -601 580 9042 -805 -12656 -1083 6048 -3758 -1497 5096 -5227 -7056 6341
638 6341 2130 -9274 -1785 2810 -4796 863 7883 -6404 -13735 -562 3771 1139 6807 -166
652 -166 -18197 -11386 8196 7858 2449 2324 -10702 -19417 -895 13658 6713 1236 -3343 -18204
666 -18204 -14063 10788 15230 1726 -3303 -9297 -16709 -1750 16713 7370 -5509 -3508 -7441 -9461
680 -9461 5471 11830 -1282 -4465 1243 -4818 -4198 6859 2821 -5926 3603 8152 -4769 -6181
694 -6181 1053 -2283 1815 14768 6764 -11628 -9832 -973 1668 12436 17855 -1702 -17725 -9743
708 -9743 536 9292 22143 13034 -15613 -21320 -2512 9443 16742 19284 -1279 -22930 -11741
721 -11741 7154 11977 15030 11213 -10212 -19004 -1423 9902 9052 11457 3696 -13273 -8747 6710
735 6710 5123 906 7173 3118 -6031 -1100 1083 -6197 729 12729 5365 -3860 -2783 -7933 -10703
750 -10703 6440 17482 6374 -4418 -9357 -16930 -7648 18120 21822 1011 -12916 -17251 -14851
763 -14851 6208 24353 11799 -9331 -15203 -15886 -8001 14491 21502 901 -13890 -13499 -11474 352
777 352 17158 11196 -9125 -11713 -5506 -5359 1640 8885 170 -5991 493 -2186 -9540 -2509 4050
792 4050 -229 2273 6429 -5575 -15057 -5495 2733 5683 12426 5784 -16242 -20179 -2275 9841
806 9841 14772 13569 -5804 -24668 -14593 6345 13960 15802 8477 -14684 -24282 -5007 12297
819 12297 14993 12877 41 -19208 -15481 4919 11814 9721 8771 -2930 -14556 -5864 5700 4798
833 4798 6777 9994 -1053 -9652 -2963 -333 -907 9195 14233 1904 -6926 -7016 -8382 398 18946
848 18946 18038 -1262 -11840 -12973 -9365 9100 26439 14513 -8169 -16597 -15655 -4085 20355
861 20355 27905 5336 -16082 -18996 -11475 6272 25687 18689 -6598 -17414 -13026 -5095 10691
874 10691 22432 8809 -10184 -13571 -9456 -2418 11854 16297 1023 -8950 -6895 -7461 -3784 8684
888 8684 10279 481 -2118 -4939 -12796 -6936 9262 10531 3379 -320 -9708 -16884 -4986 10803
902 10803 10967 5845 -2237 -17072 -18545 977 15664 11776 3180 -9526 -21619 -12005 10150 15827
916 15827 6486 -1526 -12692 -18678 -3975 13112 10592 2576 -4518 -14054 -12287 4837 11456 2873
930 2873 -1571 -3350 -9061 -4586 5733 3878 -1131 2393 446 -6589 -3294 1888 -1001 878 7237
945 7237 2026 -5430 -3202 -2861 -2568 6813 11946 640 -8686 -5788 -3453 2303 12857 9874 -4964
960 -4964 -9285 -4605 -1368 6713 14343 4712 -8484 -7544 -2303 1398 10117 11204 -1887 -8509 -1902
975 -1902 921 1646 7571 5979 -3118 -2445 1532 -1230 31 6677 3136 -1873 2197 1370 -4930 -1457
991 -1457 5456 3700 3009 4414 -4309 -10021 -204 8394 6769 4224 -958 -10418 -8420 4828 9540
1006 9540 5693 2744 -5794 -12890 -4192 9840 9388 3532 -2256 -10076 -10965 3026 10601 4268 -928
1021 -928 -4385 -9545 -5282 6316 6733 111 -1308 -4555 -8139 -1225 6027 1396 -2451 -324 -3048
1036 -3048 -5352 6 1716 -2194 -65 2899 -3132 -6022 -1089 -814 -639 3937 2380 -6375 -6022 -862
1052 -862 -666 2056 5858 -335 -9152 -5821 694 1846 5513 4141 -6262 -9385 -961 3502 2658
1067 2658 4318 387 -8256 -5448 3633 4296 2705 2978 -3417 -7907 640 6248 2791 397 259 -4201
1083 -4201 -2513 5086 4147 -1289 249 990 -2490 923 5754 1183 -2252 1395 888 -748 3461 3347
1099 3347 -2635 -1260 3692 1903 92 2793 363 -2433 2900 4489 -668 -491 2646 -53 -921
1114 -921 4083 2539 -2344 133 2202 -382 1388 4167 -1029 -3282 1940 2916 -58 2027 1088 -3780
1130 -3780 -1367 4078 1380 -1166 995 -1041 -3733 1336 4187 -31 -1035 -264 -3472 -2274 4523
1145 4523 2873 -3217 -2235 -815 -2570 401 3970 -729 -4220 -752 -876 -2412 1552 2719 -3067
1160 -3067 -3965 65 -848 -1204 2665 -246 -5086 -1542 1373 -2052 -1403 1418 -1763 -3827 286 126
1176 126 -2708 -9 1425 -2929 -2437 1281 -962 -2417 1063 486 -2773 -138 1076 -2907 -1689 3004
1192 3004 293 -2692 -143 283 -2110 961 2530 -1867 -1883 1360 -700 -1779 2429 2094 -1992 -503
1208 -503 1325 -1392 388 3850 492 -2643 921 1778 -537 2040 3180 -1042 -1386 2171 622 -536
1224 -536 3250 2090 -2298 -222 2538 596 702 3606 -208 -2121 2113 2491 -837 1664 3376 -555
1240 -555 -1219 2668 955 -180 2944 1822 -2518 462 3292 43 -363 2595 306 -1959 1737 1634
1256 1634 -1295 995 2412 -1361 -1680 2072 1020 -1170 1540 775 -2495 2 2455 -1234 -1375 2024
1272 2024 -308 -2613 339 1058 -1920 -199 1100 -2342 -1877 1441 -269 -2627 363 454 -2563 -1154
1288 -1154 857 -2285 -1590 1274 -866 -3289 -17 592 -2490 -979 707 -1997 -2185 912 -1094 -3034
1304 -3034 722 1114 -2812 -1428 1202 -1250 -2052 1004 -754 -3011 514 793 -2415 -613 1322 -1132
1320 -1132 -1771 1139 -185 -2144 1116 684 -2495 -351 2138 -1269 -1697 1550 502 -1582 1349 1238
1336 1238 -1490 50 2403 -422 -902 2164 905 -1393 1279 1879 -1041 701 3121 -622 -1097 2796
1352 2796 1690 -1012 1358 2122 -734 577 2726 88 -204 2613 825 -1933 1682 2948 -167
1367 -167 573 1856 -950 -675 3381 1761 -1181 1047 1466 -1478 -22 2989 343 -502 1589 -397
1383 -397 -1771 2153 2921 -1258 -1257 915 -425 -648 2501 590 -2366 4 1210 -1157 95 1689
1399 1689 -989 -2345 512 319 -1330 928 336 -3012 -1483 1753 -248 -1873 371 -744 -2497
1414 -2497 646 1491 -1855 -1423 649 -1586 -2119 1397 -214 -3094 -448 400 -1861 -828 1226 -1755
1430 -1755 -3071 1084 823 -1803 -458 -697 -2524 -610 2137 -479 -2662 -717 -451 -2004 1542 2189
1446 2189 -2040 -3097 -734 -792 647 3344 443 -4403 -2429 1205 735 2216 2052 -2414 -4158 547
1462 547 2720 1031 1929 510 -4173 -2277 2965 2598 902 922 -1761 -3503 1428 4046 1352 -162
1478 -162 356 -1459 -1195 3457 2832 -851 277 1138 -877 708 3540 489 -1682 1540 2089 14
1494 14 1179 1267 -1350 437 3979 1519 -1485 -483 -458 -282 3558 4088 -1207 -2978 -220 53 2080
1511 2080 4931 1680 -4256 -3191 191 2075 3894 3087 -3057 -5833 -439 3292 2700 2455 -104 -5256
1527 -5256 -3569 2641 3052 1481 217 -3018 -4862 235 4241 1116 -1460 -1930 -3362 -1469 3148
1542 3148 1905 -2905 -2647 -583 -1107 476 2310 -1588 -4217 -1046 903 355 920 -732 -4680 -2494
1558 -2494 2651 2013 -698 -1540 -3718 -3524 1699 4414 -171 -3766 -2341 -2118 -367 4093 2384 -3288
1574 -3288 -3799 -1702 -346 2763 3821 -1762 -5691 -1516 2159 1878 2140 -414 -4401 -2714 3403 3231
1590 3231 20 -602 -2110 -2953 1947 5192 1195 -2570 -1978 -2167 971 5991 3897 -3085 -4332 -1176
1606 -1176 1678 4974 5207 -1282 -6055 -2387 2903 3877 4833 1403 -4964 -4442 2163 4722 3472 1785
1622 1785 -1995 -4946 105 5497 3428 243 -953 -2347 -1187 3499 4123 -636 -1194 207 -184 1482
1638 1482 3327 -493 -3326 622 2916 1802 1027 -481 -4363 -1450 4452 4790 -159 -2607 -4016
1653 -4016 -3222 3594 6936 1765 -4309 -4681 -3887 538 6757 5032 -3090 -6627 -4131 -475 4504 6480
1669 6480 -590 -7146 -5203 -17 2543 4252 2090 -5096 -5958 -776 2170 1718 1898 -1414 -5546 -1987
1685 -1987 2610 1262 -736 -817 -2463 -1945 2164 1732 -2818 -3111 -320 434 1575 1682 -2572 -5268 -1250
1702 -1250 2958 2218 1894 -1067 -5956 -3933 2943 4985 1831 -979 -4705 -5361 785 6868 3609 -1636
1718 -1636 -3689 -4134 -1027 5329 5296 -873 -3667 -2564 -1210 2607 5897 1661 -4239 -2825 943 2359
1734 2359 3834 2215 -3240 -3193 1647 3848 1781 794 -1446 -3264 931 4943 2500 -730 -1337 -2351
1750 -2351 -252 4766 4713 -1339 -3132 -1430 170 3287 5424 577 -4665 -2077 1576 2325 3687 2424
1766 2424 -2777 -3948 789 3120 2261 1507 -937 -4202 -966 3770 2128 -235 -978 -2143 -1312 3061
1782 3061 3020 -1870 -2967 -648 -97 1827 3039 -716 -4751 -1823 1419 1599 2108 494 -4829 -4860 1416
1799 1416 3787 2127 -59 -3533 -5926 -952 4652 2858 -812 -2781 -4428 -3055 2784 4530 -200
1814 -200 -2875 -3000 -3290 -251 4254 1503 -2998 -3179 -1479 -660 1642 2325 -1835 -3173 -318 614 -450
1831 -450 572 -15 -2490 -782 2186 131 -1965 -502 -898 -757 2358 2334 -2441 -2970 -285 946 1997
1848 1997 3266 -816 -4473 -1796 2046 2374 2619 1348 -3360 -3955 1189 3768 2653 1780 -1293 -4181
1864 -4181 -1195 4172 3891 1216 -543 -2412 -2335 2404 4606 1151 -860 -971 -1766 -146 4043 2699
1880 2699 -1147 -974 -279 -206 1631 3287 -223 -1971 342 1212 133 1301 1107 -1595 -423 2076
1896 2076 485 -672 1211 5 -1115 1382 2360 -936 -1237 700 32 19 2022 87 -2700 -757
1912 -757 1426 133 855 601 -2162 -2617 899 1415 -40 253 -750 -2910 -848 2189 1440 -767 -842
1929 -842 -2220 -2268 1382 2748 -849 -2142 -1478 -1827 -314 2483 834 -2586 -1927 -659 -1147 675 2076
1946 2076 -1187 -3041 -1139 36 -80 1300 859 -2467 -2147 459 269 -300 941 -501 -2376 -637
1962 -637 1029 -206 -128 1192 -1026 -1741 627 636 -720 573 982 -833 -791 901 -518 -726 1687 993
1980 993 -1219 -419 520 -585 808 2554 101 -1262 241 498 -490 1618 2390 -592 -1127 344 212
1997 212 496 2746 1339 -1876 -860 1314 629 1414 2076 -544 -1792 355 891 752 2246 1597 -1790
2014 -1790 -1445 1331 1142 1095 2102 416 -1792 -29 2022 607 549 1568 -995 -1560 585 1391 385
2031 385 984 625 -1683 -1372 1527 847 0 670 162 -2089 -69 918 -66 122 1124 -1168 -1961 338
2049 338 800 -444 479 44 -1770 -1184 1020 279 -732 660 -330 -2369 -534 635 -407 -363 176
2066 176 -1631 -2383 261 703 -842 -178 123 -2020 -1323 658 292 -750 735 -710 -2093 -469 1350
2083 1350 -245 -636 16 -1363 -1674 609 780 -543 -153 247 -1628 -881 1473 371 -660 625 -518
2100 -518 -1789 358 1826 60 -654 617 -662 -1185 1142 1284 -399 277 469 -1348 -175 2118
2116 2118 837 -861 403 67 -721 867 2079 -124 -332 996 -185 -722 1443 1486 -466 47 983
2133 983 -716 161 2399 518 -776 709 556 -706 912 1852 -315 -291 722 -406 -351 1433 1390
2150 1390 -885 -179 938 -388 284 1617 207 -1198 545 101 -862 530 1625 -417 -547 586
2166 586 -308 -636 1161 681 -1472 -194 444 -431 -614 1106 -138 -995 514 298 -1356 -78 952
2183 952 -991 -1188 447 -223 -1284 293 154 -1331 -672 340 -1033 -527 876 -563 -1808 -231
2199 -231 -87 -927 396 919 -1285 -1484 152 -611 -819 687 367 -1765 -711 541 -366 -280 1253 -511
2217 -511 -1920 -55 449 -446 153 561 -1295 -1001 854 264 -529 782 203 -1225 -288 699 196 -66
2235 -66 966 -284 -873 1199 1028 -920 69 923 -602 -418 1236 426 -948 745 1015 -278 796
2252 796 1111 -834 -345 1462 796 115 704 314 -1050 557 2181 158 -368 858 314 -433 1367
2269 1367 1540 -232 -130 891 -340 217 2119 547 -1089 231 589 -127 667 1083 -648 -616 984
2286 984 670 -758 472 316 -1407 338 1320 -198 -711 525 -539 -840 1181 844 -878 -907 -137
2303 -137 -610 99 1481 -171 -1965 -554 551 -439 604 938 -1976 -2012 212 719 -113 757 -288
2320 -288 -2746 -1380 1210 237 -246 -54 -1700 -2075 741 1367 -89 -697 -214 -1537 -1324 1304 549
2337 549 -1455 -589 -524 -1247 167 1121 -827 -1544 425 187 -549 385 52 -1607 -453 1432 -66 -684
2355 -684 129 -855 -1510 1458 1517 -532 -707 15 -702 278 2078 623 -1640 -884 -72 97 1637 1765
2373 1765 -872 -1708 410 825 322 1559 721 -1837 -631 1598 923 808 573 -883 -1610 1173 2117
2390 2117 149 -501 108 -675 433 2446 1369 -1080 -646 196 -249 1477 2129 -476 -1790 -35 901
2407 901 1032 2076 505 -1893 -1347 1319 1033 799 808 -1130 -2168 468 2114 900 145 -252 -1979
2424 -1979 -1254 1762 1448 -681 -533 -783 -1534 825 1605 -282 -1296 -85 -562 -806 826 330 -1672
2441 -1672 -789 693 246 -464 308 -1480 -1686 676 1586 -118 -1445 -1098 -1844 210 2606 919 -1987
2458 -1987 -2290 -1497 -477 1556 2537 -614 -3086 -1541 -332 670 2706 890 -2721 -3019 -274 946
2474 946 1672 1612 -1295 -3292 -894 1374 1191 1001 -62 -2260 -1819 1197 1486 239 89 -751 -1711 268
2492 268 2007 314 -932 0 -93 -258 1311 789 -1720 -1048 1436 1038 575 830 -1235 -1928 969 2439
2510 2439 778 153 -349 -2021 -519 2824 2594 -57 -1222 -1328 -864 1788 3685 544 -1722 -1176
2526 -1176 -393 1064 2770 2003 -1608 -1998 -108 631 1536 2349 -182 -2723 -619 1517 1510 1039 112 -1912
2544 -1912 -1458 1573 1973 372 -448 -1400 -1701 397 2652 926 -1368 -1163 -1068 -255 2342 1745 -1562
2561 -1562 -2036 -293 301 1497 1712 -616 -3035 -1254 969 695 730 220 -2506 -2740 527 1412 140
2578 140 -498 -1074 -2275 -88 2116 364 -1347 -1066 -986 -750 1417 886 -1668 -2064 -288 -181 449 1188
2596 1188 -866 -3021 -831 1393 1243 691 -350 -2852 -2169 1468 2645 821 -785 -1828 -2440 637
2612 637 3220 1533 -1160 -1275 -1809 -653 2281 2867 -409 -2108 -1150 -566 1314 3174 800 -2024
2628 -2024 -1252 246 677 1417 1851 -792 -1663 696 1351 640 675 282 -1223 -67 1875 403 -504 15
2646 15 -184 -82 1979 1374 -1182 -1485 371 752 1394 1864 -35 -1897 -504 1543 1499 1441 706 -1967
2664 -1967 -1985 1373 2796 1144 59 -1199 -2641 -194 2700 1672 -565 -773 -1470 -980 1675 2591
2680 2591 -5 -1476 -1161 -990 419 1957 931 -1866 -1659 -260 -109 916 1472 -1330 -1762 152
2696 152 456 46 446 -303 -1908 -1064 1170 415 -715 -227 -1051 -1598 836 1514 -810 -1444 -303 -412
2714 -412 13 1138 -131 -2118 -830 374 55 423 237 -1405 -2076 440 834 -132 248 -443 -2241
2731 -2241 -547 1875 812 -1054 -541 -800 -984 857 1732 -675 -1135 -511 -676 433 1912 653 -1392
2748 -1392 -913 187 65 1005 1598 -729 -1764 -34 1203 539 959 513 -1600 -731 996 1060 370 820
2766 820 -349 -1514 899 1806 78 -47 644 -432 -618 1264 1113 -353 -22 799 -254 -243 1315
2783 1315 197 -782 967 888 -344 258 536 -735 14 1600 120 -616 421 -107 -312 1253 1450
2800 1450 -379 -669 151 -390 115 1593 691 -1461 -373 462 -95 672 1339 -611 -1860 -88 535
2817 535 -27 778 502 -1593 -1275 732 174 -86 281 -543 -1562 -150 358 -322 -306 699 -889 -1486
2835 -1486 441 566 -315 -287 155 -1268 -881 713 -346 -506 611 -170 -1711 -385 706 -706 -271
2852 -271 575 -1033 -1311 314 510 -607 310 598 -1274 -909 483 -146 -640 793 300 -1537 -298
2869 -298 520 -12 138 930 -811 -1237 517 599 -271 516 786 -988 -653 862 353 32 795 284 -1073
2888 -1073 213 1470 39 110 909 -354 -945 537 1006 234 622 960 -915 -510 1192 666 -120 863
2906 863 141 -950 173 1333 437 -218 907 -343 -959 1018 1410 -79 193 412 -713 -440 1275
2923 1275 599 -322 636 -48 -1100 456 1356 62 -371 519 -521 -677 876 746 -584 -31 398 -700
2941 -700 -410 708 -54 -622 505 -150 -1080 -145 898 -607 -367 496 -624 -1269 756 441 -1095 -75
2959 -75 115 -1402 -680 751 -84 -1107 37 -260 -1494 218 1043 -251 -699 264 -557 -1094 328 578
2977 578 -759 -339 122 -1054 -538 1026 53 -1257 -242 -314 -1270 375 1137 -709 -718 359 -356 -746
2995 -746 675 799 -530 -529 103 -1027 -240 1603 146 -887 -159 90 -662 616 1292 -465 -950 673
3013 673 -102 -388 1327 1251 -1064 -421 569 -330 391 1565 364 -960 551 666 -325 561 1533 -588
3031 -588 -773 530 243 -114 1307 686 -1086 -121 969 -231 224 954 151 -832 743 684 -485 475
3049 475 741 -154 -540 686 81 -861 945 916 -405 -131 656 -977 -481 1314 530 -415 -13 407 -523
3068 -523 304 1432 140 -908 70 -557 -798 1090 1015 -1291 -752 -121 -529 181 1569 -315 -1887 -344
3086 -344 221 -248 654 934 -1146 -1584 358 657 -297 546 -205 -1539 -769 1071 180 -380 41 -930 -1530
3105 -1530 393 918 -668 -770 -110 -701 -195 1260 -39 -1413 -241 518 -583 382 607 -1145 -1211
3122 -1211 675 425 -233 391 -242 -1397 -7 1303 427 -598 20 -561 -884 1170 1276 -556 -692
3139 -692 -83 -630 284 1887 459 -1358 -425 317 510 1245 1001 -1075 -1385 824 1323 533 761 -298
3157 -298 -1748 -215 1823 966 74 11 -792 -1131 1645 2572 111 -1114 -468 -669 746 2426 927
3174 927 -1480 -913 -7 345 1429 1541 -1130 -1884 366 581 1001 1284 58 -1886 -680 1598 898
3191 898 -1 161 -1077 -1235 1239 1638 -167 -1072 -583 -1062 -147 2144 469 -1642 -1071 85 19 1289
3209 1289 1153 -1483 -2249 -228 997 532 852 -704 -2751 -857 1571 1132 217 -629 -2149 -2111 988
3226 988 2277 17 -1378 -1228 -1867 -151 2633 1022 -1875 -1727 -831 -195 1529 1560 -1127 -2631 -289
3243 -289 826 609 897 35 -2240 -1322 1594 1109 217 -236 -1581 -1686 1040 2453 57 -1117 -1264
3260 -1264 -1103 470 2551 1443 -1846 -1544 -554 329 2069 2024 -945 -2448 -783 1163 1392 1952 20
3277 20 -2494 -1326 1200 1864 955 454 -1193 -1966 1055 2416 1030 -265 -545 -1183 -214 2376 1470
3294 1470 -1074 -1180 -497 -7 1638 2100 -792 -1923 -114 1142 1110 1612 -51 -2515 -1304 1466 1784
3311 1784 694 202 -1706 -2225 1048 2720 737 -783 -1377 -1882 -270 2966 2072 -1338 -1950 -1498 -63
3328 -63 2124 2365 -665 -2605 -1035 170 1002 1902 574 -2471 -2106 585 1154 1071 269 -1666 -2835
3345 -2835 -84 1935 459 -467 -1292 -1530 -848 1810 1623 -1148 -1228 -1146 -614 1283 2055 -423 -2486 -845
3363 -845 -5 663 1431 499 -2751 -1985 961 1480 747 384 -1368 -2361 545 2269 739 -440 -927 -1739
3381 -1739 -779 2291 1675 -740 -1187 -954 -404 921 2425 -87 -2370 -652 516 753 1719 544 -1812
3398 -1812 -1702 772 1379 1061 967 -966 -2441 210 2220 1410 -120 -763 -1776 -785 2176 2261 -484
3415 -484 -726 -695 -638 1080 2463 519 -1692 -684 -186 330 1983 1650 -1533 -1486 573 1036 883 1036
3433 1036 -605 -1699 297 1541 564 438 386 -1092 -796 1433 1615 -630 -633 -161 -464 858 2140 -386
3451 -386 -2191 -420 538 322 1445 570 -2063 -1946 685 1005 645 820 -1310 -2470 -67 1945 900
3468 900 63 -438 -2313 -1190 1372 1715 -381 -851 -1154 -1500 444 2123 194 -1276 -733 -527 -726
3485 -726 1383 1199 -823 -1376 -84 136 67 1073 -206 -1684 -488 772 -88 -153 453 -910 -1194 1056
3503 1056 777 -517 -541 58 -687 15 1340 144 -1371 -91 533 41 904 831 -1272 -859 781 636
3521 636 333 897 -44 -1629 38 1457 860 -124 115 -1058 -1096 856 1209 -107 -332 -430 -923 77
3539 77 2128 460 -1151 -446 -58 -432 1310 1783 -514 -1101 76 189 224 1294 395 -1455 -309 905
3557 905 71 239 1039 -198 -1322 613 972 -124 261 825 -790 -528 1180 308 -612 310 69 -908
3575 -908 184 754 -418 -599 817 166 -585 244 242 -974 65 955 -240 -362 25 -347 -718 855
3593 855 496 -562 -462 75 -917 -443 1454 -20 -1401 -290 -163 -616 672 975 -682 -1437 186
3610 186 -335 -220 943 546 -1313 -791 407 -146 151 856 -279 -1185 131 750 -45 321 402 -1078
3628 -1078 -890 699 168 -530 782 48 -1119 -361 744 -169 -106 523 -442 -1151 467 909 -430 19
3646 19 692 -583 -634 796 61 -128 682 -11 -1073 -384 1010 -350 96 1194 -270 -766 405 559
3664 559 -234 641 675 -555 -576 676 559 161 1058 519 -978 -114 638 347 199 1260 -226 -1154 327
3683 327 1165 -296 229 653 -1031 -627 695 555 -416 643 111 -1078 -119 1157 220 -77 667 -282
3701 -282 -1086 131 745 86 275 573 -695 -505 947 542 -475 367 282 -1088 -74 1217 -119 -197
3719 -197 230 -576 -1069 529 1056 -263 -168 208 -584 -483 989 350 -620 184 -72 -1317 -308 952
3737 952 -253 -611 301 -409 -1014 331 610 -559 -347 369 -795 -406 798 251 -687 -219 -161 -1194
3755 -1194 -216 1094 -262 -738 267 -236 -1149 348 764 -421 132 349 -1058 -497 1015 508 -536
3772 -536 228 0 -610 2 1103 -7 -599 286 -503 -754 837 942 -664 -174 559 -455 -322 937
3790 937 214 -540 -39 304 -514 235 1457 181 -796 481 -198 -442 1031 1188 -542 -635 301 -240 -88
3809 -88 1087 483 -1004 346 362 -898 479 1105 59 -840 515 197 -380 947 699 -505 -321 500
3827 500 -386 -235 965 411 -545 -86 144 -427 77 1061 -218 -920 318 238 -481 796 820 -758 -488
3846 -488 65 -272 -412 786 158 -651 -356 221 -600 269 901 -412 -1097 -120 -332 -610 646 678 -818
3865 -818 -946 293 -288 -401 924 -45 -1089 -329 386 -345 -197 947 -698 -1125 431 157 -440 446
3883 446 513 -977 -569 520 -176 -350 749 -81 -1173 120 550 -484 -44 783 -577 -521 722 174
3901 174 -933 97 559 -618 -437 638 -224 -417 966 112 -850 125 724 -696 94 982 -37 -621
3919 -621 646 486 -575 644 864 -500 -288 700 -45 -343 664 181 -837 277 980 -74 183
3936 183 736 -402 -948 724 853 -230 299 561 -881 -277 784 173 -643 647 378 -931 426
3953 426 930 -76 -223 532 5 -665 753 336 -624 191 795 -549 -482 728 -14 -694 693 -5 -858
3972 -858 191 481 -374 -184 668 -447 -1050 424 260 -521 -238 445 -906 -565 1018 85 -474 439
3990 439 -61 -1332 138 800 -272 -418 428 -599 -744 583 335 -448 -357 249 -923 -117 715 -211
4008 -211 -888 350 158 -671 -71 605 -776 -196 710 -442 -832 469 388 -821 -65 555 -426 -401 477
4027 477 7 -472 765 190 -777 124 804 -78 -269 781 -423 -924 731 809 -153 189 490 -692 -64
4046 -64 981 330 -514 232 -304 -621 420 1204 12 -479 566 -178 -356 724 743 -626 95 400 -392
4065 -392 -173 1365 -167 -660 578 714 -434 405 492 -582 -110 957 255 -678 337 99 -522 270
4083 270 480 -408 -417 455 351 -417 812 303 -1033 -544 665 -225 138 665 -339 -1311 476 647 -386
4102 -386 353 355 -1018 -508 1032 270 -563 315 -278 -1058 27 905 -207 -849 109 -368 -570 818 454
4121 454 -1059 -544 596 -171 -137 789 -220 -1204 13 347 -367 44 160 -1099 -859 1105 361 -433
4139 -433 225 -96 -888 197 1115 -542 -817 70 -90 -201 737 446 -844 -157 570 -106 60 922 -690
4158 -690 -1223 461 486 -159 498 253 -957 -350 1042 579 -488 31 11 -804 247 1066 -185 -651 31
4177 31 -91 -370 1057 575 -1033 -563 494 79 169 1037 -199 -1235 13 665 99 287 835 -858
4195 -858 -309 967 706 -49 340 -32 -904 362 1241 -215 -282 186 -375 -573 1179 453 -866 -423 539
4214 539 100 366 836 -632 -1359 411 905 -127 165 308 -725 -486 1232 523 -292 -9 -153 -818
4232 -818 -8 1248 193 -1105 242 -60 -516 877 629 -949 -639 -85 -204 277 1085 -238 -1604
4249 -1604 -367 453 -370 161 572 -1197 -935 847 136 -370 285 -362 -1007 30 764 181 -482 137
4267 137 -337 -582 913 778 -663 -512 519 -389 -251 713 -218 -1069 -12 603 -174 149 374 -1027
4285 -1027 -1037 841 492 -3 289 98 -859 -146 806 -253 -421 123 -396 -296 908 766 -1008 -686 511
4304 511 74 19 791 172 -966 -77 339 56 137 825 -615 -589 791 545 -297 110 283 -807 -58 1385
4324 1385 101 -380 227 -71 -515 725 807 -426 -467 531 74 -131 871 423 -1307 9 840 -317
4342 -317 241 546 -613 -626 751 570 -424 162 424 -933 -67 912 -222 -620 242 -55 -773 579 598
4361 598 -717 -627 351 -171 -313 737 -67 -901 53 528 -207 -83 516 -1134 -932 397 573 -391 28
4380 28 -134 -951 -146 1061 160 -505 124 -317 -867 282 730 -649 -606 81 -680 -499 752 304 -953
4399 -953 -27 135 -446 -240 619 -522 -332 466 243 -555 128 253 -599 -191 922 -337 -407 633 -194
4418 -194 -579 446 338 -413 -304 591 89 -208 1008 69 -555 322 621 -135 -135 846 -116 -354 519 459
4438 459 -316 295 383 -554 54 853 220 -662 425 171 -725 395 733 -316 -7 829 -208 -680 682
4457 682 461 -288 79 250 -520 -56 801 125 -492 544 471 -672 326 365 -657 -265 495 14 -495 425
4477 425 189 -908 -42 615 -466 -121 573 -72 -512 595 72 -842 57 526 -571 -192 694 -30 -706
4496 -706 162 264 -767 259 618 -559 -151 407 222 -601 342 97 -851 408 757 -487 -486 580 -122
4515 -122 -382 467 143 -893 247 482 -585 -283 683 -102 -609 91 182 -671 160 623 -459 -303 769
4534 769 -191 -747 250 355 -705 -196 529 -619 -312 624 130 -531 145 309 -547 350 429 -744 -55
4553 -55 541 -23 -623 671 499 -665 -192 493 -12 -49 472 148 -542 670 240 -479 -38 563 -137 -207
4573 -207 741 -66 -364 545 547 -772 -24 752 -289 8 400 -252 -545 413 273 -273 100 704 -166 -323
4593 -323 614 19 -764 364 124 -916 51 680 -692 -456 642 -186 -625 147 270 -365 204 568 -452
4612 -452 -534 496 -178 -884 136 192 -725 67 592 -436 -425 657 -148 -774 347 213 -477 -111 464
4631 464 -551 -373 406 231 -718 400 281 -562 -142 391 -662 -218 505 -218 -536 336 589 -570 8
4650 8 455 -414 -312 240 -43 -772 438 437 -378 56 423 -410 -369 387 87 -258 547 128 -682 120 489
4671 489 -402 -506 549 -322 -342 438 224 -513 -59 556 -457 -330 388 -19 -595 327 345 -424 101 759
4691 759 -255 -283 655 236 -464 367 485 -758 60 507 -221 -125 708 18 -390 323 463 -453 16 665
4711 665 -436 -459 470 353 -376 -39 335 -411 54 704 -403 -111 185 1 -406 400 418 -516 -52 474
4731 474 -93 -170 286 -116 -626 212 573 -386 27 427 -447 -260 680 161 -626 -86 295 -433 -239 702
4751 702 -644 -687 32 -269 -531 325 401 -688 -178 419 -519 -242 774 -157 -845 -74 407 -411 -43 518
4771 518 -296 -564 633 414 -257 187 98 -666 -36 584 -417 -604 183 8 -568 500 520 -649 -267
4790 -267 492 4 -281 516 107 -944 252 554 -27 63 370 -369 -210 738 240 -762 445 218 -516
4809 -516 89 822 98 -431 436 -200 -413 449 357 -417 -226 529 198 -85 697 -80 -498 312 645 220
4829 220 10 398 -427 -392 465 567 -246 -48 -100 -272 277 986 -302 -247 82 295 -521 10 582 -503
4849 -503 -93 290 -37 94 695 52 -556 -71 403 -158 241 376 -518 -538 506 228 -566 -27 94 -506
4869 -506 -5 662 -135 -356 -30 93 -492 129 374 -520 -599 136 -161 -125 735 -199 -813 -80 443 -150 -96
4890 -96 610 -697 -644 512 640 -55 -151 299 -701 -2 939 -313 -814 53 -173 -501 393 371 -846 -656
4910 -656 261 -79 -106 672 -52 -992 -101 696 -388 -161 194 -789 -784 478 783 -77 106 56 -607 -147 744
4931 744 -193 -754 472 82 -153 516 861 -72 -412 -116 -99 159 419 250 -469 -333 657 110 443 392
4951 392 -284 -281 273 526 -45 107 248 -320 196 536 115 -531 61 -129 -469 526 474 -366 -71 58 -292
4972 -292 25 318 197 -847 -135 711 -28 24 338 -99 -590 363 537 -133 203 63 -470 41 822 344
4992 344 -624 -117 -259 -188 467 645 -242 -771 21 -126 -137 555 239 -653 -192 188 78 -308 481 -457 -1065
5013 -1065 88 185 -12 51 438 -661 -43 566 -169 -361 199 149 -671 155 756 -336 -121 22 -520 -280
5033 -280 437 -169 -891 -293 390 -244 -139 324 -194 -476 88 252 -101 -238 358 -626 -161 688 186 -378
5053 -378 89 142 -319 182 465 -212 -577 398 135 -472 390 71 -622 -198 507 218 181 321 66 -870 148
5074 148 658 79 132 399 -541 -271 612 525 -8 376 143 -788 3 819 56 -241 273 -49 -306 247 446
5095 446 -344 -245 129 -288 144 404 328 -516 382 464 -499 -76 256 -263 -323 794 -134 -518 228 193 -461
5116 -461 9 511 -319 -331 77 166 23 335 -40 -710 -79 345 -168 -346 299 -365 -614 57 414 -242 -15
5137 -15 -98 -605 -478 694 260 81 -113 -163 -641 39 577 -94 -449 -51 -44 -357 366 391 -511 -266 -132 -55
5159 -55 -62 748 15 -503 -137 202 -486 -188 360 -522 -173 450 -246 -311 500 41 -161 -147 448 -176 51 504
5181 504 61 -457 318 209 -183 135 392 -94 -44 190 -144 -486 305 513 -151 106 593 -174 -314 431
5201 431 -63 -427 -160 243 -109 135 737 -39 -411 192 59 220 218 313 -465 -407 256 -339 -226 591 -58
5222 -58 -453 -218 195 -317 281 368 -154 -208 155 193 -162 546 75 -853 42 0 -222 -175 319 -233 -504 -288
5244 -288 289 -156 -74 98 -197 -465 232 7 -243 375 276 -326 -183 172 -158 -148 336 211 -501 74 113
5265 113 -377 -123 393 -207 -507 -165 77 -388 335 61 -397 -177 531 284 -60 292 185 -403 -86 408
5285 408 -95 56 243 -323 -802 459 3 -14 240 156 -463 1 178 -274 -82 60 90 -330 303 231 -107
5306 -107 -323 300 -377 -253 477 293 -202 159 168 -447 -212 474 156 -199 435 -179 -392 141 482 -122 35
5327 35 86 -350 -217 374 264 -112 243 75 -263 -125 304 -140 -70 310 47 -286 27 453 -6 -206 96
5348 96 67 -88 299 -67 -148 290 100 -435 -211 387 95 -427 115 167 -155 523 308 -241 -271 132 -229 -210
5370 -210 521 264 -141 208 -100 -307 -146 277 236 -179 170 163 -312 326 443 -455 103 76 -361 -317 175 -90
5392 -90 -398 -120 118 -254 -237 114 -56 -4 138 307 -408 177 291 -84 -519 -80 -16 -17 367 232 -237 -182
5414 -182 307 70 75 351 -125 -190 -31 82 -462 175 566 -136 -89 13 -107 3 92 -95 -316 -132 200 -308
5436 -308 43 156 -64 -463 105 0 -130 266 218 -293 62 266 -15 -174 170 80 -482 -34 405 -295 -78
5457 -78 429 -146 -125 9 -65 -150 263 475 -156 -85 176 111 -459 -42 188 -159 -126 130 60 -135 166 -293 -122
5480 -122 209 122 -330 162 145 -346 -209 527 -209 78 428 418 20 -350 -95 40 -64 233 28 -264 60
5501 60 203 -248 -202 346 -267 -202 168 -123 -359 170 -11 -175 -121 134 -58 -33 201 -258 -515 -88 -47 -409
5523 -409 -76 24 -299 -135 421 85 -260 65 217 13 -280 419 -244 -313 40 9 -220 -206 202 -287 -29
5544 -29 -111 -36 -28 277 235 85 307 12 -121 -40 587 -100 -156 382 -203 -131 -58 14 -6 132 60 111 -67 13 108
5569 108 -284 154 266 -403 -266 424 7 -35 28 121 -15 89 259 -196 166 369 60 104 348 250 -386 40
5591 40 146 102 70 340 16 -262 761 -170 2 401 189 -451 -111 170 -257 82 367 199 -157 5 -133
5612 -133 -353 155 178 -43 -159 252 254 -613 41 44 -49 50 77 79 -7 458 -133 -389 352 72 -42 11 377 -33
5636 -33 36 92 85 -37 41 38 -80 -150 361 -268 -402 -44 -45 -139 -179 56 -307 -332 -26 -38 -327 113 -307 -358 270
5661 270 61 -391 -346 106 31 -475 196 -101 -304 7 -141 14 -34 391 -242 -316 82 33 -155 96 91 -247
5683 -247 -85 183 -99 -338 204 142 -355 268 295 30 -413 -58 -77 90 314 250 -192 -102 122 -197 -183 283
5705 283 329 -176 173 198 -336 260 454 -216 -316 365 117 -133 215 90 -291 155 326 -338 24 152 220
5726 220 126 98 -31 -179 -327 217 -261 -167 263 -25 -123 8 -41 -181 127 208 -38 -203 188 136 -94 111
5748 111 -45 -83 -72 212 -99 1 176 -38 -114 368 33 -261 208 160 -103 -117 419 -187 -219 102 216 -105
5770 -105 -2 262 -86 204 330 35 -542 47 -16 -323 82 186 -176 -335 201 96 -160 222 211 -229 83
5791 83 273 118 182 252 -206 -15 169 73 -315 -150 266 -324 -165 135 9 -298 -39 271 -157 95 161 -81
5813 -81 -326 106 -174 -370 172 -245 -76 226 125 -120 170 190 13 -284 -125 84 -422 380 116 -52 -153
5834 -153 2 256 63 119 184 -153 -103 -43 -218 -125 483 -359 -193 127 56 -252 6 106 151 38 312 321 119
5857 119 405 126 -238 23 280 120 -247 207 -188 -165 405 173 -435 -81 73 -168 -166 -85 287 -181 -55
5878 -55 249 -175 -204 703 103 225 9 156 -440 -14 286 -220 -3 -123 -290 -180 149 197 -94 203 -1
5899 -1 -223 -86 -236 -127 -108 143 152 -171 -127 83 -225 -153 255 39 -325 23 -170 -453 100 37 -94 197 91
5922 91 -78 -104 358 -274 -384 148 289 -19 39 2 103 -372 181 426 -421 28 83 -152 38 409 -216 -294
5944 -294 275 99 -115 100 -144 -89 -5 83 69 -198 -113 2 -182 -23 88 -231 133 31 101 -420 -112 85
5966 85 217 -106 107 72 -5 8 -47 -4 272 333 49 253 -44 19 35 -58 -48 -175 107 -76 -262 155 109 -18
5990 -18 298 86 -53 -231 281 5 -437 -125 70 -110 -242 460 139 -23 -74 -229 -481 4 175 -217 -180
6011 -180 138 -2 74 159 78 -127 61 149 -423 115 -25 15 -344 34 151 -164 -90 124 -156 -211 65 10 -36
6034 -36 288 -54 -343 48 -12 -329 -69 192 -259 -319 149 157 38 279 87 24 78 368 49 -331 100 227
6056 227 -56 -202 -3 131 -442 -142 67 290 74 243 -384 -72 -36 -100 76 -142 207 -334 200 200 -89
6077 -89 -19 192 87 -122 293 388 -193 17 -89 -93 76 31 82 174 259 161 -235 -31 278 -56 137 26 -4 52
6101 52 138 112 -364 164 150 -101 -81 253 89 -18 526 -170 60 -256 76 -209 270 74 68 -157 -70 -5 63
6124 63 190 198 315 64 309 -355 -206 62 297 -138 -142 -67 -153 -28 113 31 -190 125 -134 98 -222 -22 48
6147 48 -162 101 -323 -112 78 -359 -176 -38 115 -6 3 203 5 -164 16 19 -181 8 -14 -133 83 323
6169 323 -30 -172 -53 -119 -23 -70 189 -233 64 144 26 -343 91 31 -208 166 -18 -198 174 219 -58 -299
6191 -299 342 -30 -234 405 87 -156 -83 -98 -128 -137 17 282 -148 -18 87 -208 106 393 -154 -442 -108 167
6213 167 -223 211 332 229 99 181 -41 -179 -54 171 -211 -121 99 -165 -198 182 166 -140 84 97 -365 105
6235 105 269 -11 -89 57 -33 231 -85 37 -153 394 155 119 -143 64 -137 -276 55 -238 -106 217 238
6256 238 -13 106 276 53 -383 215 142 -298 -268 580 150 83 290 110 3 274 21 -134 -144 -58 -308 -203
6278 -203 251 -246 -18 31 269 -394 -386 251 -31 -202 230 -133 -320 159 96 -60 -38 38 -333 -93 108 -368
6300 -368 28 -171 14 -179 -305 37 -31 -85 -206 120 23 205 394 -290 -198 81 -281 -55 427 72 -67
6321 -67 60 11 -167 5 304 -56 -261 273 -243 -104 -107 92 -105 -50 136 -253 183 240 156 102 323 61 -387
6344 -387 -23 -33 -170 -24 187 86 -239 387 119 -54 -35 154 -2 -134 340 -151 -108 285 291 -212 22 -85
6366 -85 -56 -219 135 -277 -35 183 227 -136 130 324 -66 -267 149 -141 -30 -11 74 146 -200 176 120 -260
6388 -260 -30 117 -163 237 -17 -21 -16 -160 -126 39 157 55 -283 154 129 -135 -121 -212 -192 -134 2 232 175 113
6412 113 213 -32 -96 -386 -83 -140 -170 -276 -64 -154 72 61 65 207 -369 -183 344 194 -215 102 102 193 398
6435 398 243 92 -244 167 -91 -404 258 297 -202 -484 214 241 25 306 15 -202 241 181 -385 18 176
6456 176 24 128 144 182 -344 -69 168 26 -8 324 -6 -23 28 127 -287 -29 142 -126 227 534 376 -141
6478 -141 -276 -223 -133 232 514 22 48 12 -67 -147 250 156 -205 110 191 -287 76 588 19 -149 302 -8 -29
6501 -29 350 -135 43 -13 -55 -83 -160 40 124 -286 -107 -77 100 -70 -169 -122 -86 400 -109 -142 -15 385 -62 -139
6525 -139 34 108 -171 -12 247 -198 207 184 -212 -217 88 52 -403 -17 5 -253 -124 -20 -374 -32 362 -121
6547 -121 -59 134 8 -248 28 -14 -281 117 115 -122 -202 -63 -72 -239 286 103 108 -348 194 78 109 457 156
6570 156 -55 303 401 -41 272 72 -152 -42 111 297 40 8 -60 -243 -12 157 -137 -181 428 -187 -135 124
6592 124 71 -73 -301 67 25 -77 73 -69 -199 104 290 -329 -38 -32 -209 182 -135 -58 18 202 -12 69
6614 69 -66 51 -383 -179 134 239 219 291 58 -228 86 -13 315 -20 384 -79 95 -20 -94 -127 194 32
6636 32 -199 -307 325 94 -236 20 -191 147 74 18 -153 342 299 -203 45 321 363 -299 -197 -162 -231 -197 -260
6659 -260 169 -245 -209 296 312 -156 137 -47 -186 -14 80 -144 -15 58 189 155 107 28 -446 24 -125 -324
6681 -324 39 45 5 95 32 124 65 166 291 -214 30 321 -235 -537 15 -40 13 -52 257 -17 -25 220 110 -97
6705 -97 41 -129 162 -165 -55 -136 6 48 -236 -136 -1 -8 -388 -129 3 -10 104 178 63 -225 273 -94
6727 -94 -391 -37 125 43 125 422 -205 -76 314 -84 48 59 383 -201 249 28 15 86 29 -158 55 80 216
6750 216 15 -14 389 -90 44 84 127 -125 117 331 -203 16 12 186 102 -55 -35 -122 369 -107 -216 -77 -93
6773 -93 21 275 207 -138 97 97 25 -380 -125 76 -187 -70 129 -160 -430 89 335 -69 38 32 -385 -142
6795 -142 -35 239 -120 134 -48 -95 116 197 53 13 164 -55 -132 143 36 -150 165 113 -57 229 32 -51
6817 -51 -516 485 24 -305 -212 16 -193 -307 249 53 -169 66 368 -174 -142 234 -70 -43 70 -91 -86 292
6839 292 59 134 -69 489 66 62 -122 -99 197 -74 3 -71 418 -233 -279 26 117 35 -185 190 108 -206 73
6862 73 2 -73 217 260 -240 -369 56 9 20 98 87 -187 71 80 156 -313 403 215 -19 8 66 -75 -1 -12 -73
6887 -73 -9 139 252 44 47 -174 -251 -209 90 -113 -104 103 176 38 -100 -178 98 -16 189 -37 -317 32 -274
6910 -274 -17 -95 -175 -161 116 229 -85 -225 12 130 38 -134 39 182 -307 387 -60 -25 -154 -158 -266 -22
6932 -22 205 -148 -210 33 -196 -8 180 37 237 -278 -40 -121 124 316 -194 -453 397 -67 271 -4 270
6953 270 -63 -173 18 215 -173 -88 111 22 -6 155 115 -67 235 116 -358 -48 -29 -390 20 210 167 -138
6975 -138 168 58 -119 126 -35 -62 -176 208 36 -102 -46 91 -91 97 49 -14 104 240 132 -101 153
6996 153 118 106 136 -199 -12 44 160 -76 -168 287 -88 -187 199 0 -185 122 183 221 54 45 328 87 -146
7019 -146 236 -212 46 367 211 -279 -4 185 -20 -8 101 -163 -135 135 84 -4 -59 138 -190 -334 41 -134
7041 -134 -2 -117 -261 35 -5 46 119 -43 144 29 -311 42 173 -155 95 144 -456 -15 -54 -102 10 -105
7063 -105 -153 -180 -138 9 95 163 39 -266 -322 -181 -201 -65 -26 -95 -190 325 -127 -230 155 96 -158 -244 21 -319
7087 -319 -367 171 -10 -34 240 171 -179 -172 116 204 -212 -87 37 -91 -79 249 -26 -167 -127 64 55 -9 17 -117
7111 -117 125 2 -191 -78 175 224 43 -33 -54 153 37 -92 -147 -56 181 55 -132 159 133 95 34 -9 -58
7134 -58 -281 -21 -146 212 11 -173 -104 36 -102 -120 -204 5 213 46 -84 49 -112 -57 -74 -268 267 -142
7156 -142 55 -113 93 266 -324 -295 -39 -402 -492 157 201 10 59 -48 -81 -278 -171 260 -1 54 -175 27
7178 27 -224 -132 -31 -222 33 130 53 -10 347 -439 -30 118 63 110 275 283 -165 241 -12 -3 -74 -98 -163 24 141
7203 141 -223 56 -116 -457 -1 -54 5 -121 22 -276 -72 25 -202 244 -129 -126 -78 49 73 199 106 -209 77
7226 77 -180 89 146 -56 -103 -15 -21 -226 -322 126 83 -87 64 317 210 31 98 -35 111 150 87 78 114 -93 -38
7251 -38 119 197 133 -8 -150 -188 52 209 182 -159 -149 -251 -122 -72 -130 1 -77 -156 331 158 -162 168 -56
7274 -56 -256 -251 246 57 271 327 -112 6 203 -64 -48 29 118 59 -22 -8 -182 60 -204 -256 226 162 147 -79
7298 -79 -302 -148 27 77 -20 43 -182 53 125 47 85 -357 37 -67 215 208 -3 -32 100 -13 119 29 -106 18
7322 18 36 -133 -211 318 -184 -3 -109 25 279 113 4 -411 -272 127 236 188 -297 -18 76 307 111 -159
7344 -159 101 175 -309 -170 188 233 -184 205 51 142 -99 229 89 -82 -31 -42 8 230 216 -54 151 374
7366 374 275 -20 47 -64 -232 287 238 -175 91 -334 124 72 243 147 27 -206 -94 75 213 186 131 18
7388 18 88 100 48 264 -46 55 -404 190 -55 157 100 -240 15 38 231 90 -97 -50 133 26 353 -53
7410 -53 157 115 156 -150 10 231 -64 -168 -60 -149 192 266 -68 -277 -225 -146 -83 -188 -26 287 9 197 -50
7433 -50 84 -42 -209 -97 218 89 20 85 -41 -3 -30 200 -182 103 163 -66 -25 185 -88 77 -526 -383
7455 -383 217 15 108 29 -156 -23 -7 220 116 -85 157 -348 -137 178 -56 -5 -304 160 74 115 118 56 -150
7478 -150 54 82 69 337 14 -286 75 41 -87 77 -235 158 56 79 103 151 -23 83 278 132 -156 -62
7500 -62 -12 150 10 147 -45 155 -154 115 80 195 63 108 33 -262 -171 48 324 112 21 -151 -237 271 259
7523 259 30 251 -100 87 -237 158 156 -210 -227 44 -244 -268 -3 -53 127 218 41 -111 87 -77 -68 -36 68
7546 68 -171 343 -158 9 -239 348 188 -95 203 216 -47 43 344 -28 -102 185 272 -24 -149 -179 75 61
7568 61 139 44 -247 -12 -142 -121 67 5 -228 101 48 -96 -88 110 68 -277 -68 237 -104 -5 162 66 -148 -165
7592 -165 91 -315 -65 -40 -116 -54 5 107 93 221 -86 -79 35 107 216 70 98 59 13 62 -16 114 -90 241
7616 241 219 -20 57 9 -249 -30 -162 -165 -137 -94 20 152 -190 230 -39 32 -170 -154 -85 -85 -157 218 -156 -186 -268
7641 -268 21 127 -116 252 -262 60 86 78 85 -109 164 -110 93 71 -164 -111 -311 101 295 -283 130 193 -25
7664 -25 76 128 -273 128 -92 -306 -212 242 62 112 -70 -155 281 -86 6 -165 -49 133 60 -110 179 2
7686 2 21 40 -65 -20 185 96 251 -279 -130 179 -315 95 -197 -209 -136 141 -96 -429 165 -72 20 20 146 15
7710 15 -153 318 143 -190 -39 313 61 -200 -189 -152 141 -1 195 33 48 237 144 -44 69 160 86 250
7732 250 129 -25 -82 -184 -84 -56 -42 100 73 -89 -26 122 136 -337 76 -94 -81 215 -116 -27 140 -47 112
7755 112 -56 248 36 38 68 -26 175 127 254 -294 227 13 114 61 123 -50 123 -116 -52 23 -40 -185 -298
7778 -298 320 -63 -175 88 -224 -181 14 -103 -99 -43 -46 283 -136 243 39 10 -30 -155 102 -477 -158 -38 -26
7801 -26 84 -42 -299 40 101 88 -226 -19 -316 -227 -65 115 -363 157 44 244 -52 27 -250 28 231 129
7823 129 276 76 -285 47 64 -11 117 -128 252 171 69 178 -95 186 -193 152 221 -113 203 146 114 10
7845 10 162 -38 -95 252 39 -152 211 -49 387 45 -288 -296 -308 214 183 23 191 -6 -129 -71 216 150 0
7868 0 36 -159 -150 -78 203 223 -111 -171 -121 126 279 -130 -139 -12 -132 -14 101 236 -88 -213 -10 -45 -169 337
7892 337 209 -166 -90 131 15 0 7 141 -140 98 426 -395 142 119 -34 6 78 21 -258 80 436 -59 -19
7915 -19 -134 287 -27 183 -40 -97 -32 -221 -98 -148 66 25 -1 172 62 -1 338 137 -176 -121 -174 154 105
7938 105 4 -76 -5 -265 89 -54 255 -103 -118 -261 1 -126 -214 -336 113 -198 -86 274 -136 -74 -149 -119
7960 -119 -21 -136 -170 251 -251 20 -4 140 42 -1 -391 15 86 76 -104 123 -357 -427 129 167 -33 129 -31
7983 -31 -62 -26 27 -61 -416 -33 45 -60 278 -24 66 -46 253 -104 79 86 83 -201 -111 117 -140 76 172 151 -473
8008 -473 -7 16 35 125 -26 301 78 58 -41 66 -34 315 -167 229 105 108 -144 115 -414 78 137 75 -9
8031 -9 64 446 69 -238 87 -236 -160 220 15 -46 110 47 98 119 -409 -28 -121 13 -162 143 -89 125 -94
8054 -94 -128 317 58 -375 -30 126 -215 324 -9 -350 -108 277 213 -65 113 -95 -24 -156 -136 2 311 -106
8076 -106 -61 -76 -52 33 -115 -59 347 -62 -57 -11 -91 -183 269 -136 -153 -1 -69 -100 19 76 -63 -22 -27 -101 -93 363 107
8103 107 -217 8 176 19 -1 189 -189 55 -132 -210 -47 120 331 1 -83 171 58 -65 207 266 -111
8124 -111 80 82 17 -124 207 70 -84 132 115 36 142 212 55 -213 282 262 -189 156 87 -295 -161 94 -213
8147 -213 121 362 146 -443 279 62 28 102 264 -32 25 179 51 203 105 380 -285 -71 -108 137 111 -38
8169 -38 112 -411 33 33 -293 -85 107 -133 -160 192 -216 -155 -260 230 -97 -25 60 -128 175 20 268 -71
8191g1
##END NTUPLES=NMR FID
##END=
