##TITLE=1H_EC-3226(2)-Z
 CDCl3, 8 sc, 
 4.3.2020
##JCAMPDX= 6.0         $$ Bruker NMR JCAMP-DX V2.0
##DATA TYPE= NMR FID
##DATA CLASS= NTUPLES
##ORIGIN= UXNMR, Bruker Analytische Messtechnik GmbH
##OWNER= root
$$ XWIN-NMR		Version 3.5
$$ Wed Mar  4 16:38:55 2020 Russian Standard Time (UT+4h)  she@DPX200
##.OBSERVE FREQUENCY= 200.1315
##.OBSERVE NUCLEUS= ^1H
##.DELAY= (6, 6)
##.ACQUISITION MODE= SIMULTANEOUS
##.ACQUISITION SCHEME= undefined
##.AVERAGES= 8
##.DIGITISER RES= 18
##SPECTROMETER/DATA SYSTEM= spect
##.PULSE SEQUENCE= zg30
##.SOLVENT NAME= D2O
##.SHIFT REFERENCE= (INTERNAL, D2O, 0, 15.7039)
##AUDIT TRAIL= $$ (NUMBER, WHEN, WHO, WHERE, WHAT)
$$ ##TITLE= Audit trail, XWIN-NMR		Version 3.5
$$ ##JCAMPDX= 5.01
$$ ##ORIGIN= Bruker BioSpin GmbH
$$ ##OWNER= she
$$ F:/spectra/data/she/nmr/H-F/1/audita.txt
$$ ##AUDIT TRAIL=  $$ (NUMBER, WHEN, WHO, WHERE, WHAT)
(   1,<2020-03-04 16:37:59.07 +0400>,<she>,<DPX200>,
      <created by zg, POWCHK disabled, PULCHK disabled
       configuration hash MD5:
       00 E9 B6 7A A2 85 ED C7 34 08 36 98 17 FE 4E 26
       data hash MD5: 16K
       27 1E FF CD AC 18 EC 1B D9 F0 D3 FC 7E 06 51 6B>)
$$ ##END=
$$ 
$$ hash MD5
$$ A9 93 DA 34 30 1B 2A 51 0C 54 09 E1 BE F9 D8 15
##$RELAX= 
##$RELAX= 
##$RELAX= 
##$RELAX= 
##$RELAX= 
##$RELAX= 
$$ Bruker specific parameters
$$ --------------------------
##$DU= <F:/spectra>
##$EXPNO= 1
##$NAME= <H-F>
##$PROCNO= 1
##$TYPE= <nmr>
##$USER= <she>
##$AMP= (0..31)
100 100 100 100 100 100 100 100 100 100 100 100 100 100 100 100 100 100 
100 100 100 100 100 100 100 100 100 100 100 100 100 100 
##$AQSEQ= 0
##$AQ_mod= 1
##$AUNM= <au_zg>
##$AUTOPOS= <>
##$BF1= 200.13
##$BF2= 200.13
##$BF3= 200.13
##$BF4= 200.13
##$BF5= 200.13
##$BF6= 200.13
##$BF7= 200.13
##$BF8= 200.13
##$BYTORDA= 1
##$CFDGTYP= 0
##$CFRGTYP= 5
##$CHEMSTR= <none>
##$CNST= (0..31)
1 1 145 1 1 1 1 1 1 1 1 1 1 1 1 1 1 1 1 1 1 1 1 1 1 1 1 1 1 1 1 1 
##$CPDPRG= <>
##$CPDPRG1= <>
##$CPDPRG2= <>
##$CPDPRG3= <>
##$CPDPRG4= <mlev>
##$CPDPRG5= <mlev>
##$CPDPRG6= <mlev>
##$CPDPRG7= <mlev>
##$CPDPRG8= <mlev>
##$CPDPRGB= <>
##$CPDPRGT= <>
##$D= (0..31)
0 1.2 0 0 0 0 0 0 0 0.06 0 0.03 0 0 0 0 0.0002 0 0 0 0 0 0 0 0 0 0 0 0 
0 0 0 
##$DATE= 1583325478
##$DBL= (0..7)
120 120 120 120 120 120 120 120 
##$DBP= (0..7)
150 150 150 150 150 150 150 150 
##$DBP07= 0
##$DBPNAM0= <>
##$DBPNAM1= <>
##$DBPNAM2= <>
##$DBPNAM3= <>
##$DBPNAM4= <>
##$DBPNAM5= <>
##$DBPNAM6= <>
##$DBPNAM7= <>
##$DBPOAL= (0..7)
0.5 0.5 0.5 0.5 0.5 0.5 0.5 0.5 
##$DBPOFFS= (0..7)
0 0 0 0 0 0 0 0 
##$DE= 6
##$DECBNUC= <off>
##$DECIM= 24
##$DECNUC= <off>
##$DECSTAT= 4
##$DIGMOD= 1
##$DIGTYP= 9
##$DL= (0..7)
0 120 120 120 120 120 120 120 
##$DP= (0..7)
150 150 150 150 150 150 150 150 
##$DP07= 0
##$DPNAME0= <>
##$DPNAME1= <>
##$DPNAME2= <>
##$DPNAME3= <>
##$DPNAME4= <>
##$DPNAME5= <>
##$DPNAME6= <>
##$DPNAME7= <>
##$DPOAL= (0..7)
0.5 0.5 0.5 0.5 0.5 0.5 0.5 0.5 
##$DPOFFS= (0..7)
0 0 0 0 0 0 0 0 
##$DQDMODE= 0
##$DR= 18
##$DS= 0
##$DSLIST= <SSSSSSSSSSSSSSS>
$$ [...]
##$SUBNAM2= <"">
##$SUBNAM3= <"">
##$SUBNAM4= <"">
##$SUBNAM5= <"">
##$SUBNAM6= <"">
##$SUBNAM7= <"">
##$SUBNAM8= <"">
##$SUBNAM9= <"">
##$SW= 24.9337058887773
##$SWIBOX= (0..15)
0 0 2 0 0 0 0 0 0 0 0 0 0 0 0 0 
##$SW_h= 4990.01996007984
##$TD= 16384
##$TD0= 1
##$TE= 0
##$TE2= 300
##$TE3= 300
##$TEG= 300
##$TL= (0..7)
0 120 120 120 120 120 120 120 
##$TP= (0..7)
150 150 150 150 150 150 150 150 
##$TP07= 0
##$TPNAME0= <>
##$TPNAME1= <>
##$TPNAME2= <>
##$TPNAME3= <>
##$TPNAME4= <>
##$TPNAME5= <>
##$TPNAME6= <>
##$TPNAME7= <>
##$TPOAL= (0..7)
0.5 0.5 0.5 0.5 0.5 0.5 0.5 0.5 
##$TPOFFS= (0..7)
0 0 0 0 0 0 0 0 
##$TUNHIN= 0
##$TUNHOUT= 0
##$TUNXOUT= 0
##$USERA1= <user>
##$USERA2= <user>
##$USERA3= <user>
##$USERA4= <user>
##$USERA5= <user>
##$V9= 5
##$VALIST= <valist>
##$VCLIST= <CCCCCCCCCCCCCCC>
##$VD= 0
##$VDLIST= <DDDDDDDDDDDDDDD>
##$VPLIST= <PPPPPPPPPPPPPPP>
##$VTLIST= <TTTTTTTTTTTTTTT>
##$WBST= 1024
##$WBSW= 4
##$XGAIN= (0..3)
0 0 0 0 
##$XL= 0
##$YL= 0
##$YMAX_a= 247997
##$YMIN_a= -281522
##$ZGOPTNS= <>
##$ZL1= 120
##$ZL2= 120
##$ZL3= 120
##$ZL4= 120
##$ABSF1= 10
##$ABSF2= 0
##$ABSG= 5
##$ABSL= 3
##$ALPHA= 0
##$AQORDER= 0
##$ASSFAC= 0
##$ASSFACI= 0
##$ASSFACX= 0
##$ASSWID= 0
##$AUNMP= <proc_1d>
##$AZFE= 0.1
##$AZFW= 0.1
##$BCFW= 1
##$BC_mod= 2
##$BYTORDP= 1
##$COROFFS= 0
##$CY= 11.3945322036743
##$DATMOD= 1
##$DC= 2
##$DFILT= <>
##$DTYPP= 0
##$F1P= 16.9975609425685
##$F2P= -3.02152046262296
##$FCOR= 0.5
##$FTSIZE= 0
##$FT_mod= 4
##$GAMMA= 1
##$GB= 0.15
##$INTBC= 1
##$INTSCL= 1
##$ISEN= 128
##$LB= 0.24
##$LEV0= 0
##$LPBIN= 0
##$MAXI= 10000
##$MC2= 0
##$MEAN= 0
##$ME_mod= 0
##$MI= 1.114404
##$NCOEF= 0
##$NC_proc= 0
##$NLEV= 6
##$NOISF1= 3.799351
##$NOISF2= 2.8
##$NSP= 1
##$NTH_PI= 0
##$NZP= 0
##$OFFSET= 15.70392
##$PC= 1
##$PHC0= -9946.139
##$PHC1= 15.80082
##$PH_mod= 1
##$PKNL= yes
##$PPARMOD= 0
##$PSCAL= 0
##$PSIGN= 0
##$REVERSE= no
##$SF= 200.130013532006
##$SI= 16384
##$SIGF1= 3
##$SIGF2= 2
##$SINO= 400
##$SIOLD= 16384
##$SREGLST= <1H.CDCl3>
##$SSB= 0
##$STSI= 0
##$STSR= 0
##$SW_p= 3612.71676300578
##$SYMM= 0
##$S_DEV= 0
##$TDeff= 0
##$TDoff= 0
##$TI= <>
##$TILT= no
##$TM1= 0
##$TM2= 0
##$TOPLEV= 0
##$USERP1= <user>
##$USERP2= <user>
##$USERP3= <user>
##$USERP4= <user>
##$USERP5= <user>
##$WDW= 1
##$XDIM= 8192
##$YMAX_p= 0
##$YMIN_p= 0
$$ End of Bruker specific parameters
$$ ---------------------------------
##NTUPLES= NMR FID
##VAR_NAME=  TIME,          FID/REAL,        FID/IMAG
##SYMBOL=    X,             R,               I
##VAR_TYPE=  INDEPENDENT,   DEPENDENT,       DEPENDENT
##VAR_FORM=  AFFN,          ASDF,            ASDF
##VAR_DIM=   8192,          8192,            8192
##UNITS=     SECONDS,       ARBITRARY UNITS, ARBITRARY UNITS
##FACTOR=    0.0002004,     1,               1
##FIRST=     0,             0,               0
##LAST=      1.6414764,     0,               0
##MIN=       0,             -281522,         0
##MAX=       1.6414764,     247997,          0
$$ Real data points
##PAGE= N=1
##DATA TABLE= (X++(R..R)), XYDATA
$$ plain form
0 0 0 0 0 0 0 0 0 -8 8 -8 9 -9 16 -23 24 -32 33 -40 49 -57 65 -81 90 -105 121 -137 159 -179 203 -231 260
31 260 -291 329 -368 411 -457 508 -563 625 -692 768 -850 940 -1044 1156 -1280 1424 -1584
48 -1584 1769 -1984 2238 -2541 2913 -3378 3986 -4812 6009 -7905 11393 -19934 84906 34420
62 34420 -226536 -233829 -72269 168501 245334 115772 -120141 -222716 -137726 58805 188580
73 188580 157301 -12463 -147043 -143873 -26850 89135 126598 56242 -46188 -90719 -58262
84 -58262 -4376 42113 59229 37978 -3963 -35684 -55728 -46651 6279 67220 75769 24908 -53177
97 -53177 -103212 -68191 39727 117872 91088 -14493 -113150 -120900 -16056 109243 130471 33217
109 33217 -87023 -130454 -59982 66487 126305 62934 -48723 -104372 -67882 25164 90413
$$ packed form
0@%%%%%%%qJ6j6J7j8K5l9M7n6O5p3Q9j06J22j46J71j95K26k58K96l38L82m34M91
31B60n51O20o97P79q68R65j071J188j317J460j618J790j984K200k436K704l008
48a584L353l753M222m779N454o291P364q798J0821j3914J9298l1327J04840n0486
62C4420k60956p293J61560K40770P6833j29562k35913j02575Q4990J96531J29775
73A88580l1279j69764j34580L170J17023J15985L7463p0356j02430m4531L2457
84e8262N3886M6489J7116k1251m1941l1721k0044R077N2930O0941Q549n0861p8085
97e3177n0035L5021J07918P8145k6784j05581r8657p750J04844J25299K1228r7254
109C3217j20240m3431P0472J26469N9818o3371j11657n5649L6490R3046O5249
$$ plain form
120 90413 61188 -25384 -70961 -41503 18753 52491 27908 -30470 -49757 -4241 45357 41646
132 41646 -9180 -60368 -55540 17357 84620 65357 -22575 -93347 -84280 6755 106115 109257 2825
145 2825 -107405 -119589 -26762 94721 136405 49977 -82652 -133673 -66665 52499 126319
156 126319 89030 -28188 -111267 -89430 526 80129 92395 27323 -55329 -78324 -36220 19642
168 19642 53093 49261 11323 -27291 -39526 -33072 -12077 26875 56348 43104 -4474 -55103
180 -55103 -73983 -29880 55498 101287 58471 -36955 -109368 -94726 11418 119529 121967 14704
192 14704 -106184 -139665 -50825 92176 154830 74495 -68657 -146649 -98791 35992 140852
203 140852 115361 -13337 -119730 -116317 -16256 94651 117939 32399 -73103 -101082 -42813
$$ packed form
120I0413k9225q6572m5577K9458O0256L3738k4583n8378j9287M5516M9598l711
132D1646n0826n1188M828P2897O7263j9263q7932p0772R067R1035R9360L142j06432
145B825j10230j2184R2827J21483M1684q6428j32629n1021O7008J19164P3820
156A26319l7289j17218q3079K1837Q9956P9603J2266o5072q2652k2995M2104N5862
168A9642L3451l832l7938l8614j2235O454K0995L8952K9473j3244m7578n0629
180e5103j8880M4103Q5378M5789m2816r5426p2413J4642J06144J08111K438j07263
192A4704j20888l3481Q8840J43001O2654q0335j43152p7992M7858J34783J04860
203A40852k5491j28698j06393L413J00061J10907K3288q5540j05502k7979N8269
$$ plain form
214 -42813 42671 85223 48626 -27491 -63962 -37962 8432 36601 31779 581 -22449 -14573
226 -14573 879 905 -3264 -960 5849 15915 14413 -11888 -35884 -23150 13833 39590 33985 -5528
240 -5528 -49801 -47685 3657 48959 47677 6056 -43787 -56713 -13210 41790 51216 14032 -31513
253 -31513 -49294 -20489 29611 44797 11528 -26528 -34064 -10457 23734 32704 1296 -31716
265 -31716 -25112 8368 32228 25243 -11400 -43982 -29522 20865 50785 31822 -17632 -57364
277 -57364 -45676 17451 67822 50968 -13026 -64863 -61097 1104 67816 69300 4535 -59676
289 -59676 -68948 -18796 50523 74256 26294 -41835 -65016 -32010 25419 60895 39525 -17903
301 -17903 -50039 -32379 6736 34738 32532 1634 -24780 -20133 -1142 8709 10133 6106 -656
$$ packed form
214d2813Q5484M2552l6597p6117l6471K6000M6394K8169m822l1198k3030P876
226a4573J5452K6m169K304O809J0066j502k6301k3996J2734L6983K5757n605l9513
240e528m4273K116N1342M5302j282m1621m9843j2926M3503N5000R426l7184m5545
253c1513j7781K8805N0100J5186l3269l8056p536K3607L4191Q970l1408l3012
265c1716O604L3480K3860o985l6643l2582J4460N0387K9920j8963m9454l9732
277e7364J1688O3127N0371j6854o3994n1837L766O2201O6712J484o4765o4211
289e9676r272N0152O9319K3733m7962o8129k3181L3006N7429L5476k1370n7428
301a7903l2136J7660L9115K8002k206l0898k6414M647J8991R851J424m027o762
$$ plain form
314 -656 415 4048 -5645 -16695 -7794 12163 23853 18984 -6131 -35536 -32427 7337 41944 39382
328 39382 2540 -42006 -52526 -9631 45155 55563 16442 -36061 -60043 -28929 33394 62812
340 62812 31009 -25326 -56956 -39159 16269 57326 39885 -14113 -48566 -38058 4640 43305
352 43305 38308 -5897 -38568 -29752 2347 28877 28295 -2271 -30290 -22450 7158 23494 15996
365 15996 -6762 -25349 -16244 13174 25411 8017 -15522 -24265 -10919 17045 28993 6610
377 6610 -22871 -26707 -6919 18385 29242 9698 -23375 -30996 -6647 20496 28125 10271 -20998
390 -20998 -32195 -7277 23042 26512 6118 -19236 -28319 -7152 23765 26540 1118 -21434 -23201
403 -23201 -3743 22754 26865 -424 -26310 -22958 1083 24705 27109 -279 -30662 -26748 4996
$$ packed form
314f56J071L633r693j1050Q901J9957J1690m869k5115k9405L109L9764L4607k562
328C9382l6842m4546j0520M2895N4786J0408l9121n2503k3982L1114O2323K9418
340F2812l1803n6335l1630J7797N5428M1057j7441n3998l4453J0508M2698L8665
352D3305m997m4205l2671Q816L2099K6530n82l0566k8019P840K9608J6336p498
365A5996k2758j8587R105K9418J2237j7394k3539q743J3346K7964J1948k2383
377F610k9481l836J9788K5304J0857j9544l3073p621K4349K7143P629j7854l1269
390b0998j1197K4918L0319L470k0394k5354r083K1167L0917K775k5422k2552j767
403b3201J9458K6497M111k7289k5886L352K4041K3622K404k7388l0383L914L1744
$$ plain form
416 4996 28945 26356 -200 -30086 -30261 3431 32317 27396 -757 -27734 -30367 -892 31769
429 31769 30100 -586 -26632 -27809 -3037 28124 30985 57 -27161 -24038 -138 23450 26307
442 26307 1039 -25541 -21936 3656 22017 20157 -486 -23119 -20739 6189 24211 15922 -5499
455 -5499 -21933 -18315 7426 27260 15369 -11954 -24260 -13976 9930 27376 16016 -14541
467 -14541 -28115 -12419 12914 26906 16534 -13818 -31637 -14447 16188 28441 14891 -13071
479 -13071 -31919 -17638 16746 31417 13611 -14532 -29610 -17910 13795 31446 14368 -15157
491 -15157 -27392 -15839 10230 28560 16165 -14539 -27351 -12612 10643 23638 14098 -12582
503 -12582 -25951 -9832 13600 19948 7860 -12213 -22058 -6960 16636 19087 1227 -15429 -18387
$$ packed form
416D996K3949k589k6556k9886j75L3692K8886m921k8153k6977k633K9475L2661
429C1769j669l0686k6046j177K4772L1161K861l0928k7218L123K3900K3588K857
442B6307k5268k6580L605K5592J8361j860k0643k2633K380K6928J8022q289k1421
455e499j6434L618K5741J9834j1891k7323j2306J0284K3906J7446j1360l0557
467a4541j3574J5696K5333J3992j0372l0352j7819J7190L0635J2253j3550k7962
479a3071j8848J4281L4384J4671j7806k8143j5078J1700L1705J7651j7078k9525
491a5157j2235J1553K6069J8330j2395l0704j2812J4739K3255J2995r540k6680
503a2582j3369J6119K3432O348j2088k0073r845J5098K3596K451j7860j6656k958
$$ plain form
516 -18387 -3592 18570 21351 -1647 -22308 -19004 1431 21810 23027 -2135 -27689 -23036 4537
529 4537 25785 24164 -602 -28744 -28158 2800 28919 25894 936 -25731 -30343 -2943 28301
542 28301 29010 2542 -23223 -27995 -6338 23722 28745 3859 -20575 -22519 -5330 17044 23782
555 23782 4668 -17813 -17498 -369 13762 15589 1976 -15308 -14006 5083 16324 9424 -5303
568 -5303 -15944 -10680 10017 21541 7589 -13672 -19622 -7723 13203 25133 10384 -17474 -26041
581 -26041 -8652 15564 27249 14243 -15894 -30919 -12960 16166 28357 15943 -11974 -30715
593 -30715 -17380 14104 28171 14881 -9365 -25146 -17696 8828 25095 13690 -8440 -19729
605 -19729 -13573 5848 20170 11141 -10023 -17062 -6632 7879 15130 6504 -12302 -17321 -1227
$$ packed form
516a8387J4795K2162K781k2998k0661L304K0435K0379J217k5162k5554M653K7573
529D537K1248j621k4766k8142N86L0958K6119l025k4958k6667m612K7400L1244
542B8301P09k6468k5765m772K1657L0060N023k4886k4434j944J7189K2374O738
555B3782j9114k2481L15J7129J4131J827j3613j7284J302J9089J1241o900j4727
568e303j0641N264K0697J1524j3952k1261n950J1899K0926J1930j4749k7858q567
581b6041J7389K4216J1685j3006l0137j5025J7959K9126J2191j2414k7917j8741
593c0715J3335L1484J4067j3290k4246j5781P450K6524J6267j1405k2130j1289
605a9729O156J9421J4322r029k1164p039J0430J4511P251q626j8806n019J6094
$$ plain form
618 -1227 14273 13360 113 -15033 -17599 249 19500 16376 -3335 -19084 -19017 -422 21976 21756
632 21756 -2664 -23071 -20796 -1173 20814 24424 1421 -23608 -22849 -1407 18511 22143 4792
645 4792 -19224 -22758 -2699 16314 18025 4724 -13824 -19644 -3428 15251 14582 277 -11843
658 -11843 -13128 -750 14225 11863 -5018 -13927 -7727 4976 14434 10024 -8158 -18377 -7101
671 -7101 10695 17481 9492 -8920 -21967 -11301 12925 23036 11143 -9446 -22847 -15076 10082
684 10082 25435 14388 -7900 -20824 -16129 4194 22169 16920 -4489 -17309 -13304 607 14649
697 14649 14833 -1086 -13203 -8571 2408 8322 6776 -2095 -8534 -2057 7903 6138 -2967 -8234
711 -8234 -6288 3817 14691 9979 -8439 -18332 -10108 7146 21071 17449 -6201 -26560 -20004
$$ packed form
618a227J5500r13j3247j5146k566J7848J9251l124j9711j5749O7J8595K2398k20
632B1756k4420k0407K275J9623K1987L610k3003k5029P59K1442J9918L632j7351
645D792k4016l534K0059J9013J711j3301j8548n820J6216J8679o69j4305j2120
658a1843j285J2378J4975k362j6881q909O200J2703R458m410j8182j0219J1276
671g101J7796O786p989j8412j3047J0666K4226J0111j1893k0589j3401P771K5158
684A0082J5353j1047k2288j2924M695K0323J7975n249k1409j2820M005J3911J4042
697A4649J84j5919j2117M632J0979N914j546q871o439O477R960j765r105n267
711h234J946J0105J0874m712j8418r893Q224J7254J3925l622k3650k0359O556
$$ plain form
724 -20004 5268 25490 25125 1091 -27528 -29984 -2890 24652 29581 10083 -19732 -33513 -14845
737 -14845 16499 29780 17523 -7979 -27858 -22660 3670 23104 19597 2369 -14790 -20475 -8056
750 -8056 9695 14459 7876 -170 -8272 -11850 -5920 2592 7029 9714 7440 -4143 -14694 -13359
764 -13359 -2580 11559 20935 11775 -12231 -26361 -17506 5533 26477 27084 558 -29230 -31705
777 -31705 -6475 23130 34668 16209 -19434 -37665 -20807 12356 33594 27358 -3694 -32593
789 -32593 -29955 -856 24937 28625 9380 -18158 -28544 -11439 12295 21368 13933 -2928 -16866
802 -16866 -14317 646 10134 9523 4681 -2345 -7022 -4169 -417 -556 1911 7181 6439 -115 -6345
817 -6345 -10201 -6518 6859 16262 9833 -4330 -14352 -14587 -1370 16225 18793 3944 -11969 -17477
$$ packed form
724b0004K5272K0222l65k4034k8619k456K7094K7542M929j9498k9815j3781J8668
737a4845L1344J3281j2257k5502j9879N198K6330J9434l507j7228j7159n685J2419
750h056J7751M764o583q046q102l578N930Q512M437K685k274j1583j0551J335
764a3359J0779J4139R376r160k4006j4130Q855K3039K0944O07k6526k9788k475
777c1705K5230K9605J1538j8459l5643j8231J6858L3163K1238o236l1052k8899
789c2593K638K9099K5793L688j9245k7538j0386J7105K3734R073p435j6861j3938
802a6866K549J4963R488o11m842p026m677K853L752j39K467N270p42o554o230
817f345l856L683J3377R403o429j4163j0022k35J3217J7595K568j4849j5913n508
$$ plain form
831 -17477 -9988 7707 19766 12352 -4605 -13812 -12122 -2063 10299 12897 3756 -4389 -6391 -6281
845 -6281 -2685 3654 5856 4923 4520 -540 -9737 -11322 -2778 8143 15669 12742 -5135 -22552 -19652
860 -19652 932 21648 26969 8741 -21772 -34420 -15546 16365 35158 26044 -7707 -38272
872 -38272 -34487 27 33014 38790 12419 -27266 -44380 -21144 18727 40575 29509 -5918
884 -5918 -37933 -36506 -3816 28514 36082 16346 -17074 -37160 -24877 6384 28760 28777 7803
897 7803 -20404 -32269 -17237 8856 26281 25845 5433 -21736 -31336 -15596 10607 29620 27613
910 27613 1170 -28643 -33765 -11485 19047 36430 24990 -10181 -37476 -31939 -551 31090
922 31090 38944 13089 -25957 -41069 -20030 15701 37951 29312 -5465 -35078 -31515 -2083 25828
$$ packed form
831a7477P489J7695J2059p414j6957r207J690J0059J2362K598r141q145k002J10
845f281L596O339K202r33m03n060r197j585Q544J0921P526k927j7877j7417K900
860a9652K0584K0716N321j8228l0513j2648J8874L1911J8793r114l3751l0565
872c8272L785L4514L2987N776k6371l9685j7114K3236L9871K1848j1066l5427
884e918l2015J427L2690L2330P568j9736l3420k0086J2283L1261K2376J7k0974
897G803k8207j1865J5032K6093J7425m36k0412k7169r600J5740K6203J9013k007
910B7613k6443k9813n122K2280L0532J7383j1440l5171k7295N537L1388L1641
922C1090P854k5855l9046j5112K1039L5731K2250q639l4777k9613L563K9432K7911
$$ plain form
935 25828 32242 12141 -18490 -30722 -14548 10657 23770 17927 -2039 -18742 -15988 -374 10331
948 10331 11373 5635 -3595 -7688 -3408 369 24 1513 4510 4316 2298 -1750 -8320 -8988 1448
963 1448 11808 12080 3539 -9345 -17130 -8741 9531 18261 11537 -3040 -16182 -16866 -1514 14787
977 14787 16593 6195 -7138 -16060 -11837 2857 12879 11430 4252 -5192 -12494 -9984 -49 7658
991 7658 11406 9873 -1205 -14675 -16463 -5372 10154 21181 16070 -6408 -25749 -23178 -1591
1004 -1591 23054 31648 12019 -22060 -37506 -20083 14121 38191 30948 -5947 -39658 -37423 -3109
1017 -3109 32744 41600 14794 -26942 -44648 -22311 16824 40102 30330 -5777 -37276 -34478 -2571
1030 -2571 27299 33243 12832 -18006 -32254 -17720 8281 23601 20808 3007 -16962 -21590 -8900
$$ packed form
935B5828O414k0101l0631j2232J6174K5205J3113n843j9966j6703K754J5614J0705
948A0331J042n738r230m093M280L777l45J489K997j94k018m048o570o68J0436
963A448J0360K72q541j2884p785Q389J8272Q730o724j4577j3142o84J5352J6301
977A4787J806j0398j3333q922M223J4694J0022j449p178r444p302K510R935P707
991G658L748j533j1078j3470j788J1091J5526J1027n111k2478j9341K571K1587
1004a591K4645Q594j9629l4079j5446J7423L4204K4070p243l6895l3711K235L4314
1017c109L5853Q856k6806m1736j7706K2337L9135K3278r772l6107l1499K798L1907
1030b571K9870N944k0411l0838j4248J4534K6001J5320k793j7801j9969m628J2690
$$ plain form
1043 -8900 6873 16270 15688 3289 -12481 -17279 -9826 2989 15787 18739 4961 -13979 -21136
1056 -21136 -12226 6755 23483 20792 -2026 -22651 -23086 -5033 18127 27589 11608 -15466 -26590
1069 -26590 -14121 8895 24927 19325 -4917 -23136 -17842 2113 17956 18063 1808 -15868 -15426
1082 -15426 189 12032 11350 1345 -9732 -10034 2143 11009 6079 -4299 -9639 -5618 6117
1095 6117 13939 5957 -9846 -15019 -5764 9183 17994 9883 -10163 -20614 -10406 8275 19331
1108 19331 14633 -4211 -20507 -16496 2430 16768 16482 3024 -13666 -17613 -4543 10048 13186
1121 13186 6497 -3776 -10841 -7531 1392 5078 4103 3441 928 -3297 -4990 -4843 -3051 4160 11216
1136 11216 7570 -4212 -13271 -13316 -1600 15545 19946 4129 -16358 -22968 -10598 12814 27373
$$ packed form
1043h900J5773R397n82j2399j5770m798P453J2815J2798K952j3778j8940p157
1056b1136Q910J8981J6728k691k2818k0625m35J8053K3160R462j5981k7074j1124
1069b6590J2469K3016J6032n602k4242j8219N294J9955J5843J07j6255j7676M42
1082a5426J5615J1843o82j0005j1077l02J2177Q866m930j0378n340M021J1735
1095F117P822p982j5803n173R255J4947Q811q111k0046j0451J0208J8681J1056
1108A9331m698j8844j6296M011J8926J4338k86j3458j6690l947J3070J4591L138
1121A3186o689j0273p065L310Q923L686r75o62k513m225j693J47J792P211P056
1136A1216l646j1782r059m5J1716J7145M401j5817k0487o610J2370K3412J4559
$$ plain form
1149 27373 15781 -12028 -28284 -19475 5528 27077 24809 -1913 -26603 -25757 -3159 21022 27323
1162 27323 8252 -18964 -26659 -9465 13131 22663 12722 -8929 -21199 -11709 6398 15004 10329
1175 10329 -2077 -12011 -9055 2559 8129 4265 -1380 -4134 -2536 2899 4199 -2132 -5801 -1014
1189 -1014 5088 6539 2445 -6157 -10496 -2591 9307 11495 3241 -7595 -13008 -5787 9106 15031
1203 15031 5524 -7722 -13495 -7540 6818 15650 7764 -7569 -13242 -6448 5711 13467 7585 -6927
1217 -6927 -12907 -4556 6968 11414 5646 -6917 -13062 -3829 9518 12051 3200 -8494 -13430 -4295
1231 -4295 11288 14836 2760 -10946 -14277 -4765 11024 16841 4599 -11830 -15428 -5277 9218
1244 9218 16504 7407 -10069 -16285 -6106 7849 14182 7908 -7072 -15019 -6522 7255 11707 5420
$$ packed form
1149B7373j1592k7809j6256Q809K5003K1549k268k6722k4690Q46K2598K4181O301
1162B7323j9071k7216p695J7194K2596R532r941k1651j2270R490J8107Q606m675
1175A0329j2406r934K956J1614N570l864n645k754J598N435J300o331l669M787
1189a014O102J451m094q602m339P905J1898K188q254j0836n413P221J4893N925
1203A5031r507j3246n773N955J4358Q832p886j5333n673O794J2159P756n882j4512
1217f927n980Q351J1524M446n768j2563o145R233J3347K533q851j1694m936R135
1231d295J5583L548j2076j3706l331R512J5789N817j2242j6429l598J0151J4495
1244I218P286r097j7476o216J0179J3955O333o274j4980p947Q497J3777M452o287
$$ plain form
1258 5420 -5335 -11655 -5468 6852 9748 2149 -5979 -8243 -2900 6638 9070 48 -8722 -7454
1272 -7454 522 7925 8462 -994 -11208 -8840 2795 10402 8227 -1654 -11805 -10421 2803 12489
1286 12489 8660 -2488 -11382 -10663 1411 12914 10100 -2760 -11640 -9758 919 12035 10775
1299 10775 -2767 -12396 -8634 2161 10843 9763 -2210 -12536 -8675 3769 10965 8142 -2244
1312 -2244 -11770 -9189 3977 12189 7575 -3207 -11098 -8894 3520 12900 7814 -4609 -10851 -7151
1326 -7151 3261 11873 8056 -4864 -11242 -5595 4342 10462 7029 -4589 -11774 -5185 6538 10759
1340 10759 5387 -5446 -12102 -5542 8283 12815 4176 -7383 -12261 -5844 8071 14724 5466 -8541
1354 -8541 -13422 -6388 6889 15227 8213 -7610 -14722 -7459 5454 13790 9739 -4629 -14120 -8385
$$ packed form
1258E420j0755o320O187J2320K896p599q128k264N343R538K432r022q770J268
1272g454P976P403N37r456j0214K368J1635P607k175r881j0151J384J3224R686
1286A2489l829j1148q894P19J2074J1503k814j2860q880J882J0677J1116j260
1299A0775j3542r629L762J0795Q682j080j1973j0326L861J2444P196k823j0386
1312b244r526K581J3166Q212m614j0782p891K204J2414R380n086j2423o242L700
1326g151J0412Q612l817j2920o378N647R937O120l433j1618p185O589J1723M221
1340A0759n372j0833o656O560J3825M532q639j1559m878O417J3915O653r258j4007
1354h541m881P034J3277Q338p014j5823p112P263J2913Q336m051j4368r491N735
$$ plain form
1368 -8385 4026 10863 8382 -1572 -10285 -7751 2456 7720 4840 -1004 -5651 -4509 2214 5402
1382 5402 564 -4161 -3007 1063 4794 4169 -3271 -9302 -4383 5955 10218 5214 -5688 -13917 -8759
1397 -8759 6868 15819 9377 -5318 -16624 -14064 3188 18632 15235 -2412 -17200 -17374 -1940
1410 -1940 16732 19230 2594 -15019 -18098 -6077 11359 18570 7223 -10352 -16079 -7448 5969
1423 5969 13871 8635 -5298 -12180 -6013 3670 7964 5131 -2585 -7118 -2430 4357 4004 -845 -3928
1438 -3928 -3209 2010 6904 3467 -5555 -8520 -2654 5776 10344 5692 -6649 -13288 -5863 7191 13336
1453 13336 8178 -5034 -14846 -9584 5584 14172 9534 -2489 -12526 -10959 2221 12536 9274
1466 9274 -1441 -9153 -8472 523 9411 7219 -2537 -7468 -3910 3056 7438 3721 -5761 -8718 -483
$$ packed form
1368h385J2411O837k481r954q713K534J0207N264k880n844m647J142O723L188
1382E402m838m725J154M070L731o25p440o031M919J0338M263n004j0902q229N158
1397h759J5627Q951o442j4695j1306K560J7252J5444l397j7647j4788j74J5434
1410a940J8672K498j6636j7613l079J2021J7436P211j1347j7575n727Q631J3417
1423E969P902n236j3933o882O167R683M294k833p716m533M688O787l53m849l083
1438c928P19N219M894l437r022k965N866Q430M568m652j2341o639P425J3054O145
1453A3336n158j3212r812N262J5168Q588m638j2023j0037J567J3180J0315l262
1466I274j0715p712O81Q995Q888k192r756m931L558O966M382l717r482k957Q235
$$ plain form
1481 -483 8312 8669 885 -9449 -11963 -827 13029 13714 1261 -12592 -16355 -4414 14090 19618
1495 19618 5600 -13178 -19901 -9350 10785 22174 11846 -9631 -20665 -13347 4814 19099
1507 19099 15921 -2612 -17187 -14809 -950 12299 14679 3458 -10141 -12053 -3464 4886 7751
1520 7751 4477 -2251 -4948 -1861 -12 -1334 -738 2174 4055 3813 -665 -8249 -9479 -155 10600
1535 10600 12249 3301 -10799 -17859 -7645 11666 20214 10340 -8920 -22080 -16032 6557 23505
1548 23505 17797 -3432 -21337 -21104 -1391 20416 22325 3375 -16867 -21552 -7809 13235 21505
1561 21505 8577 -10669 -17709 -9141 6128 15216 9271 -4953 -11513 -6081 2566 7233 4948 -2231
1575 -2231 -5529 -689 3907 2062 -2294 -4231 -1762 4807 8383 1708 -8487 -9910 -1502 9038
$$ packed form
1481d83Q795L57p784j0334k514J1136J3856O85j2453j3853l763J1941J8504N528
1495A9618j4018j8778o723J0551K0135J1389j0328k1477j1034P318J8161J4285
1507A9099l178j8533j4575K378J3859J3249K380j1221j3599j912Q589Q350K865
1520G751l274o728k697L087J849j322N96K912J881k42m478p584j230R324J0755
1535A0600J649q948j4100p060J0214J9311Q548r874j9260j3160O048K2589J6948
1548B3505n708k1229j7905K33J9713K1807J909j8950k0242m685J3743K1044Q270
1561B1505j2928j9246p040Q568J5269R088n945j4224o560N432Q647M667k285p179
1575b231l298M840M596j845m356j937K469O569L576o675j0195j423Q408J0540
$$ plain form
1589 9038 13027 4536 -10473 -15498 -4692 10045 15944 8157 -8163 -17742 -9281 7957 16650 10234
1603 10234 -4562 -15696 -11624 4440 14756 9843 -2681 -11547 -9468 2200 11263 7233 -3385
1616 -3385 -8235 -4728 3156 8187 3721 -6046 -8263 -429 7750 8134 319 -9894 -10974 906 12960
1631 12960 11681 -929 -13401 -14647 -1080 15397 16539 1313 -14643 -17544 -4905 13457 19722
1644 19722 6267 -12671 -18806 -8374 8980 18575 10164 -7913 -16825 -9549 4337 13233 10085
1657 10085 -2679 -11440 -7621 1748 6518 5087 -324 -4762 -2788 2216 2065 -2171 -3357 -332 4291
1672 4291 6141 819 -8597 -10239 -395 10461 12531 3098 -11612 -17363 -5394 12751 18903 7985
1686 7985 -10523 -21274 -12451 9428 22456 14157 -6291 -21245 -17606 2979 21158 18399 -896
$$ packed form
1589I038L989q491j5009n025J0806J4737N899p787j6320r579Q461J7238Q693o416
1603A0234j4796j1134M072J6064J0316m913j2524q866K079J1668R063m030j0618
1616c385m850L507P884N031m466r767k217P834Q179L84p815j0213j080J1880J2054
1631A2960j279j2610j2472j246J3567J6477J142j5226j5956k901J2639J8362O265
1644A9722j3455j8938o135J0432J7354R595q411j8077q912P276J3886Q896l148
1657A0085j2764q761L819R369M770j431n411m438J974N004j51m236j186L025M623
1672D291J850n322r416j642R844J0856K070r433j4710n751J1969J8145O152j0918
1686G985j8508j0751Q823K1879J3028q299k0448j4954L639K0585J8179k759j9295
$$ plain form
1699 -896 -17549 -18221 -3142 14950 18386 4138 -11617 -14974 -5731 7561 13376 6023 -5726 -9209
1713 -9209 -3871 2741 5650 3094 -2111 -2853 1263 2397 -1215 -3673 -2374 2415 7342 5556 -4025
1728 -4025 -10798 -6578 4206 12321 10554 -2349 -14988 -12991 2044 14972 14954 1602 -14714 -17557
1742 -17557 -2753 14342 17257 5077 -11340 -17849 -7081 10633 16811 7029 -7517 -14751 -8469
1755 -8469 6161 13827 6911 -5344 -10592 -5983 3800 9553 4496 -5329 -7742 -1593 4980 6244
1769 6244 688 -6844 -6931 1817 8543 5879 -2404 -9314 -8104 2454 11683 8599 -3312 -11736 -9801
1784 -9801 1195 12252 11461 -1379 -12178 -10928 -589 10129 11680 1609 -9854 -10416 -1794
1797 -1794 6726 8771 2799 -6034 -7813 -1207 4682 4336 158 -3633 -3302 1858 4719 355 -5123
$$ packed form
1699h96j6653o72J5079J8092L436j4248j5755l357R243J3292N815p353j1749l483
1713i209N338O612K909k556n205p42M116J134l612k458J299M789M927j786r581
1728d025o773M220J0784Q115j767j2903j2639J997J5035J2928j8j3352j6316k843
1742a7557J4804J7095K915j2180j6417o509J0768J7714O178r782j4546p234O282
1755h469J4630P666o916j2255n248M609R783N753n057r825k413O149O573J264
1769F244n556p532q7Q748O726k664q283o910J210J0558R229l084j1911q424J935
1784i801J0996J1057p91j2840j0799J250J0339J0718J551j0071j1463n62Q622
1797a794Q520K045n972q833j779O606N889l46m178l791L31N160K861m364n478
$$ plain form
1812 -5123 -4720 746 6612 7109 -815 -10266 -9403 1405 11216 11485 1095 -12525 -15249 -2321 13209
1827 13209 16477 5158 -11346 -18772 -8226 10832 19221 9883 -7406 -18149 -12872 4839 17759
1840 17759 13335 -2047 -14081 -13765 -1372 12255 13494 2410 -8305 -10590 -4296 5006 9061
1853 9061 4105 -2798 -4547 -2834 -430 1799 1964 914 1602 1925 -1412 -4835 -3788 902 5982 7647
1869 7647 1773 -7940 -10483 -2879 7542 12362 6616 -6683 -14816 -8313 5925 14416 10566 -2813
1883 -2813 -14657 -12729 1628 13655 12633 1046 -11583 -13817 -2507 10708 12339 2882 -7940
1896 -7940 -11360 -4178 7043 10226 2518 -5953 -7705 -2626 4779 7187 1234 -5743 -5517 188 4972
1911 4972 5064 -521 -6848 -5525 2329 7215 4707 -2055 -7836 -6524 2097 8797 6007 -2181 -7852
$$ packed form
1812e123M03N466N866M97p924r451Q63J0808R811K69j0390j3620k724J2928J5530
1827A3209L268j1319j6504p426J0546J9058Q389r338j7289j0743N277J7711J2920
1840A7759m424j5382j2034L16J2393J3627J239j1084j0715k285O294R302M055
1853I061m956o903j749J713K404K229J65j050O88L23l337l423J047M690N080J665
1869G647n874r713k543P604J0421M820n746j3299q133O503J4238Q491l850j3379
1883b813j1844J928J4357J2027j022j1587j2629k234J1310J3215J631r457j0822
1896g940l420P182J1221L183p708q471j752N079P405K408n953o977K26N705M784
1911D972R2n585o327J323P854M886k508o762n781J312Q621O700k790q188n671
$$ plain form
1926 -7852 -7032 312 7963 7231 -705 -6750 -6400 -1168 5205 6527 911 -4816 -4399 -620 2440 2910
1942 2910 446 -2429 -1097 1961 1427 -1529 -2908 -1783 2062 5669 3375 -3931 -7886 -4053 3630
1957 3630 9304 7325 -3033 -11902 -9049 2475 12024 11455 369 -12502 -13696 -1488 11687 14232
1971 14232 4705 -9425 -15617 -6709 8313 14786 8225 -4727 -13645 -10095 3243 12470 9532 -620
1985 -620 -9037 -9431 -1186 7654 8048 1619 -4087 -5583 -2784 2376 4342 1643 -913 -762 -554 -676
2001 -676 -564 -837 -23 2932 3637 -345 -4475 -4586 -947 4655 7222 2402 -5801 -8137 -3035 4447
2017 4447 8856 5396 -4076 -9918 -5746 3197 8818 6894 -1682 -9245 -7284 1711 7892 6479 -520
2032 -520 -7314 -6876 832 7075 5317 -1207 -5908 -5330 860 6541 4567 -2454 -6441 -4098 2006 6810
$$ packed form
1926g852Q20P344P651p32p936o045L50N232O373J322n616n727M17L779L060M70
1942B910k464k875J332L058n34k956j379J125L845L607k294p306l955L833P683
1957C630N674j979j0358q869K853J1524R549n69j1086j2871j194J2208J3175K545
1971A4232r527j4130o192Q908J5022O473o561j2952q918L550J3338R227k938j0152
1985f20q417l94Q245Q840L94o429n706j496K799N160J966k699k556J51K08j22
2001f76J12k73Q14K955P05l982m130j11L639N602K567m820q203k336N102P482
2017D447M409l460r472n842M172Q943N621j924q576p563J961Q995O181j413o999
2032e20o794M38P708O243j758o524m701N78O190N681j974p021l987K343O104M804
$$ plain form
2048 6810 4759 -3333 -8081 -4213 3288 7566 5185 -2895 -8998 -5781 3158 8260 5822 -1660 -8225
2063 -8225 -7178 1295 7908 6372 -268 -6395 -7035 -730 6136 5919 358 -4048 -4593 -1439 3081 3901
2079 3901 318 -2379 -1475 190 1004 719 -1125 -1709 1190 3319 1376 -2271 -4060 -2450 2541 6504
2095 6504 3823 -3556 -7466 -4468 2700 8438 6776 -2268 -9412 -7145 1446 8783 8869 440 -9196
2110 -9196 -9436 -655 7986 9451 2703 -6951 -9943 -2702 6575 8814 3275 -4539 -8242 -3677 4597
2125 4597 7299 2787 -3200 -5741 -2854 3132 5687 1729 -3452 -3922 -854 2981 4067 509 -4179
2140 -4179 -3565 1140 4140 3096 -906 -4750 -3674 1934 5404 2962 -1918 -5023 -3875 1673 6062
2155 6062 3711 -2474 -5598 -3553 1621 5753 3985 -2555 -6012 -3086 2170 5172 3333 -2421 -6057
$$ packed form
2048F810k051q092m748L868P501M278k381q080o103L217Q939N102k438p482o565
2063h225J047Q473O613j536o640o127o40O305O866k17n561m406n45L154M520Q20
2079C901l583k697R04J665Q14k85j844n84K899K129j943l647j789J610M991L963
2095F504k681p379l910K998P168N738j662r044p144K267Q591P337Q6q429r636
2110i196k40Q781Q641J465o748r654k992P241R277K239n539p814l703M565Q274
2125D597K702m512n987k541K887N986K555l958n181m70L068L835J086l558m688
2140d179O14M705L000j044m002l844J076N608L470k442m880l105J148N548M389
2155F062k351o185l124K045N174M132j768o540l457K926N256L002j839n754l636
$$ plain form
2170 -6057 -2812 3077 5126 2300 -2769 -5863 -2956 3621 6005 1827 -3822 -5867 -2666 3857 6772
2185 6772 2045 -4685 -6233 -2226 3828 6697 2643 -4747 -6839 -2034 3918 6167 2736 -4019 -6954
2200 -6954 -2360 4304 5950 2090 -3675 -6301 -2304 4490 6068 1237 -4027 -5442 -1744 4309 6113
2215 6113 925 -4810 -5210 -832 4337 5868 1293 -5151 -5802 -534 4713 5624 1426 -4761 -6014 -653
2231 -653 4931 5093 1058 -3801 -5218 -1062 4438 4599 401 -3225 -3781 -648 3584 3832 -462 -3610
2247 -3610 -2245 1055 3443 2609 -1701 -4526 -1568 3297 4542 1489 -3073 -5421 -2018 4508 6402
2262 6402 1799 -4286 -6618 -3018 4451 8173 3392 -4601 -7770 -4073 3494 8428 5079 -3630 -8181
2277 -8181 -4777 2387 7107 5576 -1696 -7126 -4942 1439 5437 4439 -532 -5272 -4184 1237 4266
$$ packed form
2170f057L245N889K049k826n069l094K907O577K384m178n649k045L201O523K915
2185F772m727o730j548M007O054K869m054p390k092M805N952K249l431o755k935
2200f954M594O664J646l860n765k626L997O794J578m831n264j415L698O053J804
2215F113n188n735m00M378N169J531m575o444o51N268N247R11m198o187j253N361
2231f53N584J62m035m859j417M156N500J61m198l626n56L133M232K48m294l148
2247c610J365L300K388q34m310k825K958M865J245l053m562k348L403O526J894
2262F402m603o085k332L600P469L722m781p993l169L697P567M934l349q709m551
2277h181L404P164M720j531p272n430K184O381L998r98m971m740J088N421L029
$$ plain form
2292 4266 2509 -1140 -3578 -2388 1707 3803 697 -3069 -3247 -273 3150 3977 7 -4803 -4469 512
2308 512 4686 4757 410 -5440 -6213 -356 5618 5803 1009 -4854 -6779 -1926 4862 6190 1704 -3573
2324 -3573 -5659 -2808 2965 5347 1913 -2411 -3586 -1887 1303 3139 1009 -2021 -1760 691 1779
2339 1779 724 -1446 -2907 -722 3566 4112 -34 -4253 -4940 -1081 5143 7273 1709 -5856 -7884
2354 -7884 -2981 4974 9522 5091 -4853 -10041 -5871 3219 9887 7949 -1633 -9751 -8176 409 7986
2369 7986 8739 2081 -6666 -8617 -2506 4779 7227 4010 -2380 -6329 -3934 1381 4026 3330 848
2384 848 -1927 -2620 -949 248 354 1503 2320 1053 -1176 -2812 -3151 -424 4203 5301 1308 -3872
2400 -3872 -6402 -3679 3198 8136 5186 -2709 -7987 -6701 503 8100 8324 376 -7549 -8296 -2265
$$ packed form
2292D266j757l649k438J190M095K096l106l766j78K974L423Q27l970m810L34M981
2308E12M174P1m347n850p73N857N974J85m794n863j925M853O788J328m486n277
2324c573k086K851N773K382l434m324j175J699L190J836k130l030K61K451J088
2339A779j055k170j461K185M288N46m146m219o87L859O224K130n564p565k028
2354g884M903P955M548m431r944n188M170R090O668j938r582q118J575Q585P577
2369G986P53o658q747j951O111P285K448l217o390l949K395N315K645o96k482
2384H48k775o93J671J197J06J149Q17j267k229j636l39K727M627J098l993n180
2400c872k530K723O877M938k950p895n278J286P204P597K24p948p925p47O031
$$ plain form
2415 -2265 5791 8816 3508 -5079 -8098 -3998 2826 6998 4734 -2061 -6287 -3794 1173 4087 3348
2430 3348 -386 -3522 -2362 1007 1875 478 -904 -1459 -93 2148 1534 -1672 -3199 -1410 1688 3877
2446 3877 2737 -2027 -5541 -3183 2092 5224 4183 -867 -5944 -5324 572 5360 5095 855 -4392
2461 -4392 -5976 -1623 3859 4986 2035 -1927 -4417 -2798 1491 3468 1750 -303 -1430 -1526 -407
2476 -407 625 30 -15 1317 1676 -155 -1920 -2676 -1490 2356 5008 2664 -2582 -5543 -4201 1170
2492 1170 6850 6562 -438 -7083 -7284 -1322 6373 9179 3260 -5836 -9253 -4476 3844 9331 6724
2507 6724 -2383 -8914 -6983 468 7214 7969 1676 -5994 -7530 -2374 3734 6409 3966 -1752 -5436
2522 -5436 -3708 368 3091 3626 1711 -1577 -2987 -1759 -432 985 2454 2297 196 -1884 -3075
$$ packed form
2415b265Q056L025n308q587l019M100O824M172k264o795m226K493M967K914p39
2430C348l734l136J160L369Q68j397j382n55J366K241o14l206j527J789L098K189
2446C877j140m764l514K358N275L132j041n050n077O20N896M788k65m240n247
2461d392j584M353N482J127k951l962k490J619M289J977j718k053j127r6J119
2476d07J032n95m5J332L59j831j765p56J186L846K652k344n246k961J342N371
2492A170N680k88p000o645k01N962P695K806n919r096l417M777Q320N487k607
2507F724r107o531J931P451O746P55o293p670j536N156O108K675k443n718l684
2522e436J728M076K723N35j915l288j410J228J327J417J469j57k101k080j191
$$ plain form
2537 -3075 -2580 715 4323 4139 36 -4086 -5387 -2282 3794 6702 3269 -3103 -6598 -4989 1188
2552 1188 6979 6131 -566 -6298 -6485 -1374 5168 7130 2109 -4667 -6414 -2847 2700 5886 3517
2567 3517 -2316 -5213 -2943 1036 3574 2944 -571 -3344 -2062 809 1901 1073 -570 -1851 -702
2582 -702 1640 1506 -759 -1998 -1287 535 2663 2098 -1327 -3593 -2114 1154 3385 3159 -552 -4223
2598 -4223 -3588 534 3732 3655 664 -3455 -4294 -551 3179 3439 1173 -1877 -3326 -1445 1912 2669
2614 2669 823 -770 -1359 -887 758 1154 -328 -998 316 1202 906 -173 -1987 -2197 807 3640 2696
2631 2696 -631 -3713 -3876 -140 4788 5267 516 -4477 -5767 -2119 4188 7253 3066 -3939 -6910
2646 -6910 -4068 2390 7348 5563 -1761 -6810 -5434 208 5655 6256 1068 -5009 -5671 -1616 3115
$$ packed form
2537c075M95L295L608j84m103m122j301L105O076K908l433o372l495J609O177
2552A188N791q48o697n732j87N111O542J962n021o776j747L567N547L186k369
2567C517n833k897K270L979K538o30l515k773J282K871J092q28j643j281J149
2582g02K342j34k265j239P11J822K128n65l425k266J479L268K231k26l711l671
2598d223O35M122L198p7k991m119q39L743L730K60k266l050j449J881L357P57
2614B669j846j593n89M72J645L96j482o70J314Q86k96j079j814k10L004K833r44
2631B696l327l082j63L736M928M79m751m993j290L648O307L065m187p005k971
2646f910K842O458M958j785p324n049J376N642N447O01n188o077o62M055M731
$$ plain form
2661 3115 5196 2782 -2235 -4553 -2351 965 2691 2426 295 -1977 -1670 -328 16 193 1003 1099 385
2678 385 -450 -1737 -2444 -226 2744 3148 847 -2399 -4461 -2720 2495 5493 3174 -1884 -5513 -4801
2694 -4801 711 6133 5379 -416 -5480 -5911 -1273 4953 6530 1481 -4442 -5911 -2578 3045 6033
2709 6033 2924 -3081 -5298 -2641 1837 4475 3043 -1681 -4239 -2011 1524 2958 1779 -1077 -2906
2724 -2906 -1218 1948 2349 224 -1698 -2138 -391 2481 2793 -508 -2937 -2329 370 2937 3154 -238
2740 -238 -3619 -2860 490 3048 3129 355 -3173 -3257 234 2962 2632 342 -2250 -2788 -26 2653 1979
2757 1979 -378 -1792 -1440 508 2415 1254 -1681 -2362 -204 2059 2618 708 -2769 -3695 -205 3703
2773 3703 3988 811 -3537 -5217 -1380 4430 5841 1730 -3764 -6270 -3170 3602 7070 3533 -3046
$$ packed form
2661C115K081k414n017k318K202L316J726k65k131k272L07J342L44J77Q10R6p14
2678C85q35j287p07K218K970M04k301l246k062J741N215K998k319n058l629P12
2694d801N512N422p54n795n064m31M638O226J577n049n923j469L333N623K988
2709F033l109o005k217K657M478K638j432m724k558K228L535J434j179k856j829
2724b906J688L166M01k125j922m40J747K872L12l301k429O08K699K567K17l392
2740b38l381P59L350K558Q1k774l528q4L491K728l30k290k592n38K762K679o74
2757A979k357j414L52J948J907j161k935o81K158K263N59j910l477r26L490L908
2773C703K85l177m348j680L837N810J411m111n494k506L100O772L468l537o579
$$ plain form
2788 -3046 -6556 -4476 1720 6712 5260 -1323 -5936 -5096 -199 4965 5565 712 -4332 -4627 -1237 2592
2804 2592 4087 1806 -2036 -3144 -1172 691 1439 1158 -135 -905 -145 101 -891 -1041 269 1303 1702
2821 1702 690 -2154 -3610 -1066 2710 3923 1955 -2237 -5288 -3244 2359 5577 3629 -1447 -5607
2836 -5607 -5104 607 5877 5094 -190 -5024 -5740 -1083 4951 5976 1120 -4185 -5231 -1981 3275 5321
2852 5321 1847 -3056 -4341 -1642 2143 3899 1824 -2346 -3465 -806 2091 2715 849 -2087 -2901
2867 -2901 -20 2837 2347 -372 -2539 -2501 310 3353 2831 -841 -3159 -2508 300 3274 3250 -400 -3459
2884 -3459 -2667 330 2793 3036 329 -2918 -2694 413 2405 2022 163 -1942 -1933 572 2168 901 -908
2901 -908 -1427 -694 1175 2212 297 -2417 -2084 387 2580 2744 128 -3557 -3713 338 3993 3982 469
$$ packed form
2788c046l510K080O196M992j452o583m613Q40M897N164O00m853n044k95L390L829
2804B592J495k281l842j108J972J863P48k81j293p70P60K46r92j50J310J034L99
2821A702j012k844j456K544L776J213j968m192l051K044N603L218j948n076m160
2836e607N03N711N270p83n284m834p16M657O034J025m856n305j046L250N256K046
2852E321l474m903j285K699L785J756k075m170j119K659K897O24j866k936q14
2867b901K881K857m90k719k167L8K811L043n22l672k318O51K808K974k4l650l059
2884c459P92K997K463K43k707l247K24L107J992l83j859k105RK505J596j267j809
2901i08n19P33J869J037j915k714L33K471K193J64k616l685j56M051L655j1l513
$$ plain form
2918 469 -4082 -5204 -904 4511 5303 1481 -3660 -5932 -2694 3576 6330 2897 -2736 -5849 -3992
2933 -3992 1714 5935 4097 -1459 -4953 -4122 60 4220 4243 45 -3507 -3239 -790 2002 2997 868
2949 868 -1844 -2059 -337 729 981 349 -730 -446 749 483 -947 -1332 -326 1073 2056 1102 -1867
2966 -1867 -3207 -1121 1838 3176 1999 -1568 -4274 -2720 1735 4181 3023 -817 -4383 -3965 717
2981 717 4581 3675 -179 -3804 -4175 -535 3984 4103 280 -3207 -3704 -921 2863 3917 680 -2833
2997 -2833 -2993 -631 2200 3171 708 -2640 -2701 83 2334 2358 301 -2466 -2540 359 2838 2078 -243
3014 -243 -2402 -2524 352 3108 2462 -665 -2649 -2350 197 2958 2850 -507 -2912 -2096 306 2394
3030 2394 2526 -119 -2632 -2063 514 2097 1874 -23 -2205 -1981 768 2152 1182 -638 -1862 -1397
$$ packed form
2918D69m551j122M300N415P92l822n141k272L238O270K754l433n633l113J857
2933c992N706M221j838n556l494Q31M182M160K3m198l552K68K449K792R95k129
2949H68k712k15J722J066K52o32j079K84J195k66j430l85J006J399R83r54k969
2966a867j340K086K959J338j177l567k706J554M455K446j158l840l566M18M682
2981G17L864r06l854l625l71L640M519J19l823l487m97K783L784J054l237l513
2997b833j60K362K831R71k463l348o1K784K251K4k057k767p4K899K479p60k321
3014b43k159j22K876K756o46l127j984K99K547K761j08l357k405Q16K402K088
3030B394J32k645k513N69K577J583k23j897k182K24K749J384r70j820j224M65
$$ plain form
3046 -1397 974 2486 805 -1615 -2081 -676 1491 2545 810 -2227 -2822 -360 2107 2726 1043 -2351
3062 -2351 -3610 -858 2622 3324 1052 -2265 -3913 -1692 2674 3826 1271 -2207 -3861 -2078 1994
3077 1994 4151 1759 -2046 -3574 -2093 1285 3813 2261 -1765 -3562 -1841 1116 3135 2226 -1244
3092 -1244 -3323 -1657 1167 2457 1629 -849 -2809 -1524 1377 2342 815 -971 -2049 -1201 1323 2292
3108 2292 360 -1686 -1731 -322 1526 2152 89 -2296 -1879 477 2086 1928 -106 -2641 -2362 768
3124 768 2953 2121 -442 -2761 -2778 486 3535 2809 -634 -3128 -2958 66 3539 3437 -262 -3323 -3012
3141 -3012 -154 3004 3657 407 -3185 -3111 -172 2491 3180 811 -2607 -3070 -179 2444 2422 412 -2007
3158 -2007 -2486 29 2502 1880 -381 -1973 -1664 427 2571 1754 -1196 -2596 -1219 1174 2805 1894
$$ packed form
3046a397K371J512j681k420m66J405K167J054j735l037n95K462K467O19j683l394
3062b351j259K752L480P02k272l317j648K221M366J152k555l478j654J783M072
3077A994K157k392l805j528J481L378K528j552m026j797J721K957K019r09l470
3092a244k079J666K824J290q28k478j960J285K901R65j527j786j078Q48K524R69
3108B292j932k046m5J409J848O26k063k385M17K356J609j58k034k535K79L130
3124G68K185q32k563k319j7L264L049p26l443k494J70L024L473j02l699l061L11
3141c012K858L158O53l250l592P4K939K663O89k369l418m63K891K623k2k010k419
3158b007m79K515K473o22k261j592L09K091K144q17k950j400J377K393J631r11
$$ plain form
3174 1894 -1529 -3545 -1564 1783 3361 2047 -1492 -3999 -2387 1894 3852 2293 -1247 -3787 -3011
3189 -3011 1055 3969 2638 -859 -3306 -2985 262 3361 2725 -544 -2698 -2220 32 2249 2126 -451
3205 -451 -2236 -1252 603 1390 844 -777 -1913 -447 1685 1577 -282 -1941 -1948 39 2707 2611 -713
3222 -713 -3353 -2667 268 3434 3683 -175 -4076 -3848 -76 3564 4295 920 -3858 -4835 -1000 3416
3238 3416 4478 1808 -2765 -4909 -2017 2705 4277 2017 -1710 -3906 -2306 1625 3424 1546 -1135
3253 -1135 -2415 -1595 973 2406 876 -1362 -1469 -97 1133 1454 -107 -2024 -1380 1175 2322 1163
3269 1163 -1116 -2771 -1720 1703 3586 1718 -1593 -3416 -2357 1236 4153 2890 -1372 -3850 -2854
3284 -2854 713 3835 3400 -518 -3812 -2946 330 3001 3070 141 -2980 -2555 381 2331 1945 -103
$$ packed form
3174A894l423k016J981L347J578j314l539k507J612M281J958j559l540k540P76
3189c011M066K914j331l497k447L21L247L099o36l269k154M78K252K217j23k577
3205d51j785R84J855P87n46j621j136J466K132j08j859j659pJ987K668r6l324
3222g13k640O86K935L166K49l858l901K28L772L640P31l375m778r77L835M416
3238C416J062k670m573k144K892M722J572k260l727k196J600L931J799j878k681
3253a135j280Q20K568J433j530k238j07J372J230L21j561j917O44K555J147j159
3269A163k279j655J051L423J883j868l311j823J059L593K917j263m262k478R96
3284b854L567L122m35l918l294Q66L276K671O9k929l121M25K936J950l86k048
$$ plain form
3300 -103 -2108 -1896 760 2380 953 -1166 -2017 -903 1510 2701 545 -2531 -2737 -316 2520 3358
3316 3358 747 -3159 -3994 -701 3152 4075 1454 -2973 -4909 -1871 2958 4678 2319 -2113 -4872
3331 -4872 -3007 1909 4550 2757 -1142 -3828 -3120 434 3519 2655 -442 -2447 -2252 -288 1842 1759
3347 1759 -205 -1366 -710 196 547 170 -876 -794 869 1754 310 -1681 -2164 -783 1829 3285 1273
3364 1273 -2502 -3795 -1670 2047 4348 2747 -2057 -4937 -3043 1514 4697 3969 -764 -5023 -4313
3379 -4313 608 4357 4256 442 -3893 -4565 -660 3443 3907 1127 -2446 -3721 -1331 2408 3154 920
3395 920 -1485 -2232 -924 1449 2055 177 -1508 -996 333 1259 1049 -697 -1866 -567 1564 1930 526
3412 526 -1451 -2347 -859 2108 2923 700 -1976 -2923 -1268 2003 3542 1334 -2058 -3126 -1283 1461
$$ packed form
3300a03k005K12K656J620j427k119q51J114K413J191k156l076k06K421K836Q38
3316C358k611l906q35L293L853R23k621m427j936L038M829J720k359m432k759
3331d872J865M916K641j793l899k686P08L554L085q64l097k005J95J964K130q3
3347A759j964j161O56R06L51l77j046Q2J663Q85j444j991m83J381K612J456k012
3364A273l775j293K125L717K301j601m804k880J894M557L183p28m733m259P10
3379d313M921L749j01l814m335o72L905M103M64k780l573j275K390L739P46k234
3395I20k405p47J308K373O06j878j685N12J329R26k10j746j169J299K131L66j404
3412E26j977q96J488K967Q15k223k676r47J655L271J539k208l392j068J843K744
$$ plain form
3428 1461 3244 1700 -1631 -2960 -1242 1216 2469 1446 -1152 -2629 -938 1529 2006 514 -1365
3443 -1365 -2103 -373 2131 1998 -379 -2271 -2016 213 2621 2568 -565 -3283 -2577 375 3064 3301 46
3460 46 -3694 -3677 -100 3336 3715 893 -3229 -4281 -1104 2953 3853 1515 -2152 -3949 -1971 1825
3476 1825 3317 1690 -1018 -2706 -2092 574 2289 1388 -431 -1277 -1055 23 928 431 -536 -229 578
3493 578 445 -227 -980 -1111 138 1972 1780 -473 -2364 -2162 -105 2680 3274 429 -3035 -3497 -916
3510 -916 2636 4179 1784 -2655 -4327 -1799 2094 4229 2715 -1504 -4333 -2758 1245 3745 3032
3525 3032 -301 -3456 -3114 364 3016 2624 105 -2245 -2572 -11 2293 1847 -80 -1505 -1345 -3
3541 -3 1581 1237 -630 -1380 -544 727 1341 710 -1084 -1748 -215 1553 1627 272 -1405 -2014 -419 1917
$$ packed form
3428A461J783j544l331j329J718K458J253j023k598j477J691K467M77j492j879
3443a365p38J730K504j33k377j892K55K229K408n3l133k718P06K952K689K37l255
3460D6l740J7L577L436L79k822m122j052L177M057R00k338l667j797J978L796
3476A825J492j627k708j688O14K666J715r01j819q46K22J078R05m97r67L07Q07
3493E78j33o72p53j31J249J834j92k253j891K02K057K785N94k845l464m62K581
3510i16L552J543k395m439j672K528L893K135j514m219k829J575M003K500p13
3525C032l333l155L42L478K652l92k519k350l27K561K304m46j927j425J60J342
3541cJ584l44j867p50Q36J271O14o31j794o64J533J768P4j355j677o09J595K336
$$ plain form
3559 1917 2085 195 -1549 -1987 -553 1607 2159 322 -1597 -1707 -482 1244 1941 396 -1634 -1622 77
3576 77 1389 1323 -44 -1706 -1589 619 1923 1065 -826 -2086 -1565 1002 2688 1512 -1318 -2801 -1850
3593 -1850 879 3300 2457 -1140 -3549 -2538 594 3310 3127 -281 -3617 -3319 -112 2884 3380 786
3609 786 -2748 -3547 -934 2153 3010 1405 -1428 -3001 -1544 1280 2177 1227 -504 -1677 -1326 247
3625 247 1038 494 -76 -158 -202 -41 0 -565 -423 653 1316 524 -752 -1623 -1390 640 2488 1883 -693
3644 -693 -2546 -2316 43 2944 3144 150 -2913 -3144 -678 2446 3780 1252 -2412 -3592 -1430 1858
3660 1858 3557 2104 -1594 -3501 -1846 1286 2879 2102 -644 -2820 -1871 812 2258 1529 -341 -1804
3676 -1804 -1410 622 1878 945 -690 -1332 -741 738 1697 447 -1322 -1541 -84 1246 1589 327 -1620
$$ packed form
3559A917J68j890j744m38J434K160N52j837j919j10J225J726O97j545k030J2J699
3576G7J312o6j367j662J17K208J304q58j891j260N21K567J686j176k830j483R51
3593a850K729K421q43l597k409J011L132K716j83l408l336K98L207K996M96k594
3609G86l534p99K613L087Q57j605k833j573J457K824Q97r50j731j173L51J573
3625B47P91n44n70q2m4J61M1n65J42J076O63p92j276q71K33K030J848o05k576
3644f93j853K30K359K901K00k994l063k31K466L124J334k528l664j180K162L288
3660A858J699j453l698j907J655L132J593p77k746k176R49K683J446p29j870j463
3676a804L94K032J256r33j635o42N91J479R59j250j769k19J457J330L43j262j947
$$ plain form
3693 -1620 -1837 24 1627 1569 301 -1547 -1993 -321 1732 1726 190 -1297 -1799 -528 1495 1652 -20
3710 -20 -1380 -1179 -126 1132 1249 -320 -1452 -748 615 1255 649 -721 -1769 -840 1344 1887 594
3727 594 -1352 -2380 -1113 1668 2881 1031 -1882 -3047 -1597 1462 3410 1922 -1649 -3437 -2154
3742 -2154 983 3351 2809 -671 -3403 -2702 262 2808 2998 289 -2742 -2888 -298 2090 2452 824
3758 824 -1615 -2279 -645 1257 1519 664 -576 -1190 -527 631 600 -107 -315 47 340 473 -158 -1122 -889
3777 -889 818 1687 852 -681 -1951 -1489 763 2619 1791 -695 -2433 -2237 223 2831 2710 -164 -2656
3794 -2656 -2626 -418 2518 3169 636 -2471 -2955 -691 2073 2998 1069 -1966 -2791 -766 1647 2461 1103
3811 1103 -1410 -2476 -805 1505 1962 636 -1141 -1890 -645 1452 1711 103 -1461 -1421 -186 1437
$$ packed form
3693a620k17J861J603n8j268j848m46J672K053oj536j487n02J271K023J57j672
3710b0j360K01J053J258J17j569j132P04J363O40o06j370j048R29K184N43j293
3727E94j946j028J267K781J213j850k913j165J450L059J948j488l571j788J283
3742b154L137K368n42l480k732P01K964K546J90k709l031j46K590K388L62j628
3758H24k439o64J634J902K62q55j240o14O63J158l1p07k08L62K93J33o31r64K33
3777h89J707Q69q35j533j270M62K252J856q28k486j738J96K460K608j21k874k492
3794b656L0K208K936O51k533l107m84K264K764R25j929l035q25K025K413Q14j358
3811A103k513j066J671K310M57j326j777p49J245K097K59j608j564M0J235J623
$$ plain form
3827 1437 1659 -143 -1818 -1399 275 1511 1623 -88 -1940 -1671 410 1771 1424 -144 -1858 -1735
3843 -1735 328 1872 1285 -406 -1585 -1447 256 1791 1162 -662 -1469 -907 473 1567 958 -933
3859 -933 -1778 -611 952 1640 767 -1216 -2142 -676 1563 1936 440 -1512 -2328 -821 1794 2506 597
3876 597 -1806 -2499 -1116 1677 2925 1134 -1823 -2759 -1225 1332 2852 1557 -1488 -2782 -1307 1200
3892 1200 2422 1549 -896 -2537 -1403 945 2052 1300 -478 -1905 -1292 749 1704 779 -588 -1359
3908 -1359 -698 782 1461 304 -1046 -1041 16 957 1154 -38 -1379 -1144 543 1510 1053 -290 -1676
3925 -1676 -1338 683 2015 1260 -686 -2002 -1560 629 2395 1687 -809 -2312 -1586 547 2436 1953
3941 1953 -624 -2503 -1760 459 2253 2097 -252 -2540 -2024 428 2143 1823 -88 -2154 -1998 292
$$ packed form
3827A437K22j802j675M19J674J236J12j711j852K69K081J361l47j568j714J23
3843a735K063J544n87j691j179J38J703J535o29j824q07N62J380J094o09j891
3859i33q45J167J563O88q73j983r26J466K239L73j496j952q16J507K615P12j909
3876E97k403o93J383K793J248j791k957r36J534K557J520j295l045j294J475K507
3892A200J222q73k445j641J134K348J107p52j778j427O13K041R55r25j367p71
3908a359O61J480O79j157j350NJ057R41J97j192j341K35J687R67m57j343j386
3925a676L38K021J332p55j946j316M42K189J766p08k496j503P26K133J889m83
3941A953k577j879P43K219J794j56k349k288N16K452J715l20j911k066J56K290
$$ plain form
3957 292 2032 1670 -181 -1750 -1799 142 1883 1479 -405 -1581 -1354 130 1663 1384 -450 -1662 -943
3974 -943 522 1445 999 -670 -1742 -817 990 1488 587 -788 -1691 -712 1207 1673 396 -1103 -1643
3991 -1643 -618 1145 1986 523 -1524 -1786 -555 1246 1978 680 -1570 -2037 -425 1322 1873 668
4007 668 -1336 -2116 -574 1387 1711 533 -1154 -1903 -626 1479 1816 237 -1268 -1674 -442 1398
4023 1398 1826 139 -1479 -1470 -142 1410 1714 208 -1689 -1583 90 1516 1573 184 -1635 -1708 97
4040 97 1741 1633 90 -1537 -1748 -55 1844 1648 -121 -1440 -1522 -199 1607 1708 19 -1495 -1337
4057 -1337 -42 1211 1515 54 -1399 -1136 229 1112 1059 -84 -1297 -989 495 1344 617 -497 -1216
4074 -1216 -860 690 1592 622 -959 -1443 -690 874 1863 913 -1221 -1931 -688 1091 1987 1020 -1162
$$ packed form
3957B92J740l62j851j569m9J941J741m04j884j176K27J484J533k79j834j212P19
3974i43J465R23m46j669j072R25J807M98r01j375r03R79J919M66j277j499n40
3991a643J025J763Q41j463k047k62J231J801P32j298k250m67J612J747N51j205
4007F68k004p80J542J961L24j178j687p49J277K105L37j579j505m06J232J840
4023A398M28j687j618RJ328J552L04j506j897J06J673J426N7j389j819p3J805
4040I7J644j08j543j627k11J693J899j96j769j319q2J323J806J01j689j514J58
4057a337J295J253L04j461j453K63J365Q83n3j143j213L08J484Q49p27j114p19
4074a216L56J550R02r70j581m84P53J564R89r50k134p10J243J779Q96r67k182
$$ plain form
4091 -1162 -2216 -919 1185 1961 1061 -859 -2192 -1364 940 2013 1123 -697 -1901 -1408 611 1949
4107 1949 1183 -600 -1496 -1088 345 1508 1019 -684 -1336 -674 447 1104 662 -691 -1304 -331 784
4124 784 896 293 -739 -1273 -227 1226 1178 -81 -1182 -1318 -106 1380 1494 -134 -1480 -1344 -181
4141 -181 1361 1729 223 -1577 -1605 -223 1294 1649 508 -1357 -1729 -219 1261 1472 437 -975 -1567
4158 -1567 -354 1235 1310 180 -837 -1237 -324 1084 1220 -85 -1049 -860 -18 1012 1076 -178 -1378
4175 -1378 -866 414 1226 1015 -201 -1480 -1117 578 1583 1090 -317 -1499 -1377 382 1793 1311 -368
4192 -368 -1452 -1379 104 1685 1511 -246 -1486 -1265 -109 1316 1500 39 -1330 -1107 34 958 1095
4209 1095 121 -1085 -927 270 887 581 -104 -882 -741 364 1060 352 -644 -881 -382 666 1213 308
$$ packed form
4091a162j054J297K104P76r00j920j333Q28K304J073q90j820j204M93K019J338
4107A949p66j783q96M08J433J163m89j703o52O62J121O57m42j353o13R73J115
4124G84J12o03j032n34J046J453m8j259j101j36J212J486J14j628j346J36J163
4141a81J542L68j506j800k8J382J517L55j141j865l72J510J480K11j035j412n92
4158a567J213J589P5j130j017m00R13J408J36j305r64J89Q42J030O4j254j200
4175a378N12J280Q12k11j216j279L63J695J005m93j407j182J22J759J411m82j679
4192c68j084P3J483J581j74j757j240K21J156J425J84j461j369K23J141R24J37
4209A095r74j206J58J197O17l06o85p78J41J105O96p08r96k37M99J048N47r05
$$ plain form
4227 308 -1054 -1215 -173 860 1273 496 -1182 -1662 -361 1141 1536 654 -1037 -1912 -722 1156 1757
4244 1757 744 -896 -1833 -1113 823 1763 820 -728 -1496 -1084 526 1565 922 -641 -1292 -795 321
4261 321 1271 809 -661 -1195 -388 584 879 429 -593 -1056 -282 876 837 69 -738 -1018 -235 1058 1157
4280 1157 -34 -1031 -1072 -123 1082 1378 61 -1361 -1149 -37 987 1329 259 -1100 -1354 -88 1041
4297 1041 1136 378 -870 -1265 -184 1074 1075 111 -763 -1048 -66 1052 1022 -167 -872 -672 172 1035 944 -332
4317 -332 -1187 -708 404 1187 1007 -328 -1566 -1019 614 1549 1001 -327 -1616 -1298 425 1731 1181
4334 1181 -255 -1448 -1457 45 1653 1462 -137 -1363 -1341 -239 1175 1506 125 -1151 -1104 -200 852
4351 852 1150 290 -842 -769 71 571 536 -27 -657 -539 343 732 92 -510 -615 -269 549 985 74 -1025
$$ packed form
4227C08j362j61J042J033M13p77j678m80J301J502L95q82j691q75J190J878O01
4244A757j013j640r37P20J936R40r43j548p68M12J610J039o43j563o51M97J116
4261C21R50m62j470n34Q07R72K95m50j022m63P74J158l9p68q07k80P83J293R9
4280A157j191r97m1R49J205K96j317j422K12J112J024L42j070j359k54J266J129
4297A041R5p58j248l95J081J258Jr64q74k85R82J118l0j189p05K00Q44Q63r1j276
4317c32q55M79J112P83j80j335j238N47J633R35n48j328j289L18J723J306n50
4334A181j436j193rJ502J608j91j599j226K2J102J414L31j381j276M7R04J052
4351H52K98q60j132P3Q40N00l5n63o30J18Q82L89o40o02j05L46Q18M36r11j099
$$ plain form
4371 -1025 -1013 -105 901 1258 156 -1232 -1510 -177 1142 1506 483 -1178 -1715 -518 1259 1558 574
4388 574 -907 -1692 -906 993 1613 651 -758 -1438 -889 729 1587 665 -741 -1176 -663 496 1296 630
4406 630 -735 -1186 -332 602 1042 484 -726 -1193 -247 909 999 241 -740 -1134 -289 1061 1143 167 -803
4425 -803 -1082 -312 908 1231 195 -901 -987 -278 672 1132 364 -785 -891 -13 659 783 265 -647 -770
4444 -770 157 783 454 -163 -675 -573 328 1001 378 -604 -889 -434 563 1248 654 -874 -1462 -539 787
4463 787 1457 837 -778 -1828 -919 814 1690 1120 -463 -1863 -1397 443 1701 1369 -170 -1542 -1575
4480 -1575 24 1499 1340 33 -1138 -1254 -375 1035 1193 109 -760 -843 -240 517 765 68 -617 -494
4498 -494 78 340 267 -90 -566 -180 548 614 -86 -601 -614 -87 784 926 -85 -1002 -874 -93 902 1133 127
$$ packed form
4371a025J2R08J006L57j102j388k78J333J319L64j023j661n37J197J777K99r84
4388E74j481p85P86J899O20r62j409o80N49J618Q58r22j406m35N13J159Q00o66
4406F30j365m51Q54R34M40n58j210m67R46J156R0p58r81l94Q45J350Q2r76r70
4425h03k79P70J220L23j036j096q6P09R50M60p68j149j06Q78O72J24n18r12j23
4444g70R27O26l29o17n12J02R01O73o23r82k85M55R97O85n94j528n88R23J326
4463G87O70o20j615j050R09J733Q76n70j583j400M66J840J258l32j539j372l3
4480a575J599J475j59j307j171j16Q79J410J58j084q69q3O03P57K48o97o85J23
4498d94N72K62p3l57m76L86P28O6p00n15j3N27Q71J42j011r17J28P81R95K31j006
$$ plain form
4519 127 -1121 -1228 -143 908 1217 374 -1012 -1341 -267 890 1221 381 -740 -1258 -401 876 1053
4536 1053 260 -670 -976 -341 806 1111 133 -830 -862 -151 784 1096 172 -1015 -939 60 977 1056 145 -1062
4556 -1062 -1191 50 1068 1074 195 -916 -1260 -292 1083 1163 314 -683 -1142 -524 758 1213 332 -619 -836
4575 -836 -439 399 927 356 -499 -535 -176 263 439 187 -327 -347 252 408 36 -329 -401 -175 612 742 -29
4596 -29 -769 -799 -113 763 1148 241 -972 -1219 -305 812 1302 693 -838 -1552 -688 738 1351 911 -513
4615 -513 -1581 -988 557 1343 931 -175 -1242 -1098 113 1202 840 -108 -851 -922 -121 887 772 -42
4633 -42 -629 -616 -50 610 621 -149 -694 -318 228 424 272 -265 -683 -181 460 463 85 -416 -662 -224 550 794
4655 794 -24 -660 -690 -242 555 899 187 -782 -809 -121 553 778 274 -749 -796 -21 595 686 218 -604 -808
$$ packed form
4519A27j248j07J085J051L09q43j386l29J074J157L31q40j121n18Q57J277J77
4536A053p93r30l06O35J147L05r78r63l2P11R35L12r24j187P6R99R17P9r11j207
4556a062j29J241J018Oq79j111l44R68J375Q0q49r97m59O18J282M55q81r51k17
4575h36L97Q38N28n71q55l6L59M39J76k52n14k0N99J56l72l65p2K26P87J30p71
4596b9p40l0O86Q76L85r07j213k47R14J117M90o09j531p14Q64J426O13m40j424
4615e13j068N93J545P86m12j106j067J44J211J089l62r48p43p1Q01J008j15q14
4633d2n87J3N66O60J1p70n45L76N46J96j52n37m18N02O41Ll78n01k46M38P74K44
4655G94q18o36l0M48P97L44p12r69k7O88O74K25n04j023m7P75O16R1m68q22k04
$$ plain form
4676 -808 -77 734 601 16 -598 -721 -99 737 811 -112 -779 -605 -15 750 859 -60 -983 -664 162 765
4696 765 878 63 -899 -877 73 831 823 179 -847 -990 -109 890 820 52 -623 -822 -137 743 870 57 -600
4717 -600 -650 -217 554 748 72 -616 -485 -33 432 637 107 -601 -426 192 508 401 -41 -498 -429 254 579
4738 579 258 -268 -544 -365 240 738 314 -400 -582 -262 321 771 404 -553 -933 -242 399 744 489 -463
4758 -463 -948 -357 512 798 375 -410 -1000 -594 498 933 377 -452 -855 -583 390 1011 493 -486 -860 -532
4778 -532 205 862 593 -423 -873 -377 268 595 448 -181 -766 -337 382 533 317 -231 -601 -281 470 608
4798 608 72 -338 -440 -115 502 708 6 -541 -456 33 590 710 138 -739 -732 86 626 736 165 -715 -892
4819 -892 -18 771 753 212 -519 -910 -240 659 823 170 -387 -697 -346 471 820 161 -490 -455 -144 297 514
$$ packed form
4676h08P31Q11j33n85o14j23O22Q36P4r23o67J74N90P65J09r19r23L19Q26O03
4696G65J13q15r62K2R50P58qo44j026j43Q81R99p0p68o75j99O85Q80J27q13o57
4717f00n0M33P71J94o76o88J31M52M65K05n30p08J75O18L16j07m42m57O9O83L25
4738E79l21n26k76J79O05M98m24p14j82L20N83M50l67r57l80O91O41L45k55r52
4758d63m85N91Q69K86m23p85n90M06J092M35n56q29m03K72R73O21n18r79l74L28
4778e32P37O57k69j016m50M96O45L27j47o29n85M29P19J51k16n48l70L20P51J38
4798F08n36m10j02L25O17K06p02n47Q5M89N57J20n72q77PQ18N40J10n71q80j77
4819h92Q74P89j8n41p31l91O70Q99J64o53n57l10L51Q17L49o59o51L5L11M41K17
$$ plain form
4840 514 93 -511 -338 172 415 329 -75 -507 -390 393 657 249 -321 -684 -426 336 962 466 -452 -919
4860 -919 -546 369 1142 738 -451 -1110 -638 211 904 837 -178 -1087 -851 146 758 738 95 -814 -807 -25 637
4881 637 570 109 -563 -697 -72 545 415 -101 -324 -341 16 471 252 -384 -494 -102 278 526 151 -505 -719
4902 -719 -84 573 704 139 -473 -769 -274 678 829 118 -613 -775 -393 629 923 318 -492 -801 -380 411
4922 411 891 352 -478 -708 -181 334 637 302 -351 -688 9 474 411 3 -422 -512 70 687 490 -199 -620
4943 -620 -528 62 814 683 -242 -884 -631 115 935 905 -57 -986 -803 71 804 906 180 -828 -1054 -138
4963 -138 742 910 270 -591 -974 -280 610 752 255 -310 -651 -311 398 506 50 -233 -249 -19 224 228 -173
4984 -173 -434 -66 315 292 86 -365 -552 -181 611 658 90 -576 -756 -257 661 908 150 -696 -854 -401 507
$$ packed form
4840E14m21o04J73N10K43q6m04m32J17P83K64m08n70l63K58P62O26m96r18m67
4860i19L73R15P73m04j189o59M72Q49O93o7j015r09K36R97O12k0o43r09PP82O62
4881F37o7m61o72j34O25O17j30n16k23j7L57M55k19o36j10L92L80K48l75o56k14
4902g19O35O57J31n65o12k96M95R52J51p11p31j62L82J022K94o05q10l09M21P91
4922D11M80n39q30k30N27N15L03l35o53l37O97M65o3m08m25r0N82O17j97o89m21
4943f20R2N90P52j31r25o42K53P46Q20l0r62r29J83Q74P33J02p26j008k26R16
4963a38Q80J68o40q61l83O94Q90J42m97n65l41L40P09J08m56k83j6K30K43Mm01
4984a73k61L68L81k3k06m51j87L71P92M7n68o66j80M99R18K47p58q46j58M53R08
$$ plain form
5005 507 987 541 -597 -953 -376 398 921 552 -448 -951 -505 399 744 498 -275 -833 -461 366 681
5024 681 272 -275 -676 -408 329 659 173 -475 -580 -305 458 709 187 -595 -712 -212 374 743 307 -583
5044 -583 -728 -161 462 656 314 -368 -758 -251 452 581 171 -333 -522 -237 386 493 38 -348 -287 -53
5064 -53 268 292 -81 -492 -231 233 352 271 -239 -561 -291 516 641 318 -382 -786 -478 440 922 458 -411
5085 -411 -882 -538 318 1046 637 -406 -900 -699 132 931 780 -201 -867 -675 112 727 757 103 -739 -756
5105 -756 89 588 531 103 -588 -555 72 548 358 -123 -330 -492 18 509 258 -316 -420 -172 238 498 336
5126 336 -378 -587 -120 380 537 162 -399 -629 -183 461 542 134 -354 -657 -230 469 615 96 -436 -555
5146 -555 -209 432 639 88 -570 -437 21 412 520 36 -649 -568 98 573 477 -24 -605 -685 76 768 619
$$ packed form
5005E07M80m46j138l56N77P74N23l69j000n03M46R04L45k46p73n58L72Q27L15
5024F81m09n47m01K68P37L30m86o48j05K75P63K51n22p82j17N00N86L69m36q90
5044e83j45N67O23J94l42o82l90N07P03J29m10n04j89K85O23J07m55l86O1K34
5064e3L21K4l73m11K61M64J19q1n10l22K70Q07J25l23p00m04L08R18M82m64q69
5085d11m71L44Q56P28m09j043m94K01Q31P99j51r81o66J92P87O15L0o54q42j7
5105g56Q45M99n7m28o91L3O27M76j90m81k07j62N10M91k51n74j04K48M10K60j62
5126C36p14k09M67N00J57l75n61k30M46O44Q1m08m88l03M27O99J46n19n32j19
5146e55L46O41K07n51o58J33M58L91J08m84o85Q1O66M75r6n01n81q0P61O92j49
$$ plain form
5167 619 -102 -715 -815 -12 832 804 -62 -719 -725 -247 673 887 142 -646 -774 -189 475 781 331 -552 -751
5188 -751 -177 359 599 362 -343 -560 -94 393 337 65 -158 -308 -15 390 231 -113 -272 -60 164 443
5208 443 243 -339 -469 -98 306 559 263 -413 -718 -181 566 710 230 -402 -815 -338 499 840 322 -401
5228 -401 -656 -504 345 864 451 -319 -675 -396 203 644 451 -299 -656 -273 200 508 320 -263 -671 -269
5248 -269 301 546 268 -257 -610 -197 463 663 167 -372 -595 -288 428 733 197 -538 -632 -225 327 644
5268 644 239 -397 -613 -207 307 520 307 -404 -627 -164 387 438 142 -228 -464 -205 385 426 -43 -316 -356
5289 -356 -51 357 442 -82 -475 -349 137 395 440 -110 -681 -345 267 690 467 -244 -684 -550 242 714 448
5310 448 -178 -677 -654 96 749 671 -96 -580 -618 -41 710 669 -29 -624 -523 -20 540 642 90 -591 -514 79
$$ packed form
5167F19p21o13j00Q03Q44k8q66o57oM78R20K14p45p88j28N85O64L06m50q83j99
5188g51N74N36K40k37p05k17M66M87n6k72k23j50K93M05j59l44j59K12K24K79
5208D43k00n82j30L71M04K53k96o76l05N37P47J44m80o32m13M77Q37L41n18p23
5228d01k55J52Q49N19m13p70l56K79N99M41j93p50l57L83M73L08j88n83m08M02
5248b69N70K45k78n25l53M13O60K00m96n39k23L07P16L05n36p35r4M07N52L17
5268F44m05o36k16M06N14K13k13p11k23M63N51N1k96l70k36K59N90M1m69k73m0
5289c56L05M08Q5n24l93J26M86K58M5n50n71L36O12M23k23p11m40J34P92M72k66
5310D48o26m99K3P50O53p8p67m84l8N77P51m1o98n95J01N03N60J02n52o81P7N93
$$ plain form
5332 79 469 481 -17 -487 -414 123 497 289 -151 -435 -318 163 605 238 -248 -413 -152 269 658 321 -321
5353 -321 -528 -173 345 564 269 -286 -640 -205 400 529 285 -308 -617 -276 472 693 168 -390 -625 -300
5373 -300 372 704 187 -364 -556 -268 344 608 172 -477 -593 -159 343 535 178 -383 -628 -103 499 463
5393 463 119 -413 -637 -175 530 567 53 -487 -543 -134 390 607 46 -476 -527 -113 404 555 133 -499 -492 7
5415 7 437 497 101 -509 -463 79 441 427 17 -437 -483 13 577 436 -214 -497 -394 60 558 471 -199 -574
5437 -574 -316 234 590 502 -203 -722 -343 198 630 429 -132 -645 -471 303 645 441 -116 -703 -500 214
5457 214 699 429 -236 -513 -479 128 635 414 -262 -597 -378 128 519 408 -125 -557 -293 231 425 359 -155
5478 -155 -546 -264 309 485 160 -264 -450 -220 283 513 89 -393 -478 -134 352 581 97 -478 -551 -65 426
$$ packed form
5332G9L90J2m98m70P3N37L74k08m40k84J17M81M42l67m86j65K61M21L89l37o42
5353c21k07L55N18K19k95n55l54M35O05J29k44n93l09L41P48K21n25n58k35L25
5373c00O72L32n17n51j92K88O12K64m36o49j16M34N02J92l57n61k45N25O02l6
5393D63l44n32k24M62P05L7n14n40n6M09N24K17n61n22n1M14N17J51m22o32PM99
5415GM30O0l96o10M6N42L62j4m10m54m6M96N64j41o50k83J03M54M98q7o70l75
5437e74K58N50L56q8p05n19L79N41M32k01n61n13J74P74L42k04n57n87K03P14
5457B14M85k70o65k77L4O07N07k21o76l35K19N06L91j11n33m32K64N24J94o6n14
5478a55l91K82N73J76l25m24j86K30N03K30m24m82q5L44M86K29m84n75p3M86M91
$$ plain form
5499 426 539 181 -521 -649 -9 502 529 143 -485 -679 -149 585 667 120 -406 -618 -223 442 619 140 -477
5520 -477 -587 -173 465 618 156 -464 -480 -36 403 593 172 -542 -586 8 505 448 50 -440 -532 8 531
5541 531 455 -44 -427 -503 -93 522 485 -113 -501 -439 38 542 438 -76 -488 -382 64 342 429 -61 -488 -339
5563 -339 173 416 321 -102 -470 -322 275 564 122 -322 -446 -213 241 588 201 -432 -603 -200 478 670
5583 670 278 -497 -815 -198 524 762 414 -436 -829 -450 474 811 393 -369 -823 -457 310 821 487 -238
5603 -238 -667 -525 149 676 502 -123 -530 -402 71 467 423 -130 -338 -227 111 253 181 -103 -303 39 194
5624 194 214 -48 -270 -225 81 449 270 -283 -498 -265 151 562 509 -203 -671 -422 177 618 510 -65 -671
5645 -671 -574 82 611 561 0 -621 -709 -36 534 547 86 -439 -578 -100 499 499 -28 -457 -382 15 433 371 -74
$$ packed form
5499D26J13l58p02j28O40N11K7l86o28j94N30P34Q2n47n26k12L95O65J77m79o17
5520d77j10M14O38J53m62o20j6M44M39J90m21p14m4N94M97n7l98m90r2N40N23
5541E31p6m99l83p6M10O15l7n98l88O2M77N04j04n14m12J06M46K78Q7m90m27J49
5563c39N12K43r5m23l68J48N97K89m42m44j24K33M54L47l87o33j71M03O78J92
5583F70l92p75l18O17P22K38l48q50l93L79R24L37m18p62m54L66P67N11l34p25
5603b38m29J42O74N27j74o25m07J28M73L96m4n53k08J11L38J42p2k84k00L42J55
5624A94K0k62k22M5L06L68j79n53k15K33M16M11n3p12m68K49N99M41j08n75o06
5645f71R7O56N29n0n61o21q8O73N70J3m61n25j39M78N99%n27m29P5L97M18o2m45
$$ plain form
5668 -74 -561 -298 180 451 404 -162 -633 -451 220 657 406 -80 -649 -538 185 619 444 -116 -633 -586 33
5689 33 653 596 -32 -460 -521 -150 442 529 62 -355 -345 -117 173 380 119 -136 -100 30 120 -22 -73 -119 43
5712 43 281 176 -201 -376 -198 178 579 402 -202 -649 -452 207 753 691 -87 -802 -750 57 776 801 117
5733 117 -650 -948 -197 657 906 373 -424 -904 -469 464 844 458 -201 -681 -556 189 622 443 -19 -437
5753 -437 -318 -3 341 340 -42 -205 -96 30 161 69 -151 -196 55 298 57 -147 -340 -258 158 432 233 -234
5775 -234 -464 -275 96 535 410 -166 -488 -406 124 419 424 -23 -520 -357 58 402 350 17 -429 -280 68
5796 68 306 211 -160 -283 -239 165 395 99 -315 -417 -126 312 498 177 -529 -619 -179 452 704 326 -387
5817 -387 -830 -364 495 753 499 -234 -858 -608 283 751 558 -46 -684 -661 -18 596 608 99 -407 -529 -247
$$ packed form
5668g4m87K63M78K71m7n66m71J82O71M37k51m86n69J11P23M34j75n60n17M7O19
5689C3O20n7o28m28o1L71N92Q7m67m17J0K28K90K07k61k55L6J30R0j42n1m6J62
5712D3K38j05l77j75J78L76M01j77o04m47J97O59N46o2p78p15N2Q07P19K5o84
5733A17p67k98P51Q54K49n33p97m80M35R33L80l86o59m80J25P45M33j79m62m18
5753d37J19L15L44jl82j63J09J26J31r2k20m5K51K43k41k04j93Q2M16K74j99m67
5775b34k30J89L71M39j25n76l22Q2N30K95Nm47m97J63M15L44n2l33m46J49L48
5796F8K38r5l71j23M4M04K30k96m14j02K91M38J86l21p06r0M40O31K52l78p13
5817c87m43M66Q59K58k54p33o24K50Q91M68j93o04o38K3O43O14J2n09n06j22K82
$$ plain form
5838 -247 331 558 127 -165 -244 -230 61 229 73 -52 -15 39 -17 -39 -145 -18 204 339 38 -265 -322 -141
5860 -141 312 519 341 -277 -544 -326 162 528 569 -137 -658 -532 89 596 618 78 -576 -727 -110 546 605
5881 605 252 -402 -649 -209 405 471 150 -236 -486 -167 337 458 82 -296 -304 -85 253 447 25 -380 -327
5902 -327 6 329 360 62 -411 -418 85 442 412 80 -425 -499 -20 377 371 2 -307 -440 -113 339 381 25 -156
5925 -156 -204 -178 72 234 43 -219 -90 47 113 -21 -94 -187 52 225 148 -62 -245 -250 5 460 415 -94 -494
5948 -494 -420 20 474 591 131 -574 -640 -78 446 678 324 -442 -760 -308 410 696 431 -317 -743 -432 230
5969 230 661 423 -55 -505 -467 82 461 327 -70 -309 -348 -38 288 262 -98 -246 -139 22 195 139 -169
5990 -169 -244 -23 203 139 31 -229 -243 -65 288 335 13 -264 -283 -62 364 307 -35 -334 -269 -57 289 352 -5
$$ packed form
5838b47N78K27m31k92p9J4K91J68j56j25L7N4n6k2j06J27K22J35l01l03n7J81
5860a41M53K07j78o18k67K18M88L66M1p06n21J26O21N07K2n40o54j51O17O56N9
5881F05l53o54k47M40O14O6l21l86k50L19N04J21l76l78qK19L38J94m22m05N3
5902c27L33L23L1k98m73pN03L57l0l32n05p4M79L97ol69l09j33L27M52M2l56j81
5925a56m8K6K50J62j91k62J29J37O6j34p3r3K39J73p7k10j83nK55M55m5n09m00
5948d94P4M40M54J17m60p05o6N62N24K32l54p66l18M52P18K86k65p48m26L11O62
5969B30M31k38m78m50L8N49L79j34l97k39l9L10L26k6l60j48J07J61J73n6l08
5990a69p5K21K26o4j08k60j4J78L53M7l22k77j9K21M26n7l42k99O5K12L46O3l57
$$ plain form
6013 -5 -347 -275 17 217 303 -5 -298 -256 63 320 180 -27 -289 -281 149 445 174 -118 -340 -236 228 511
6035 511 307 -260 -478 -294 122 465 452 -174 -653 -432 101 396 559 -56 -598 -462 8 429 391 82 -427
6056 -427 -484 -96 389 375 137 -271 -350 -172 213 205 4 -138 -137 -100 167 132 -123 -152 -41 125 122 64 -143 -268
6080 -268 -50 283 270 -42 -266 -248 -42 344 382 25 -298 -324 -101 355 444 128 -352 -362 -131 263 416 183
6102 183 -290 -419 -46 215 303 169 -283 -376 -55 202 310 88 -210 -326 -83 325 401 36 -268 -271 -132 360
6124 360 404 13 -334 -264 -11 320 419 133 -333 -384 -126 292 379 115 -228 -428 -100 229 348 89 -151 -349
6146 -349 -169 232 270 17 -102 -189 -93 146 184 13 -166 -103 48 143 104 -102 -296 -154 168 207 65 -182 -305
6169 -305 -80 238 299 79 -265 -382 -158 186 432 220 -286 -399 -261 100 415 220 -202 -421 -214 130
$$ packed form
6013el42P2K92K00Q6l08k93M2L19K57j40k07k62QM30K96k71k92k22J04M64K83
6035E11k04n67k18J84M16L43j3o26m79K21N33K95J63o15n42J36M70M21l8l09n09
6056d27n7L88M85j4k38m08p9J78L85qk01j42JL7K67l5k55k9J11J66ln8k07j25
6080b68K18L33j3l12k24J8K06L86L8l57l23k6K23M56Q9l16m80j0K31L94J53k33
6102A83m73j29L73K61Q8j34m52r3L21K57J08k22k98j16K43M08P6l65l04lJ39M92
6124C60M4l91l47P0K53L31R9k86m66n1K58M18Q7k64l43k00L28L29J19k59k40j98
6146c49J80M01L8k53j19q7R6K39L8j71j79O3J51R5l9k06j94J42L22L9j42k47j23
6169c05K25L18O1k20l44j17K24L44K46k12n06j13J38L61L15j95m22k19K07L44
$$ plain form
6189 130 377 203 -82 -379 -295 122 295 185 -87 -306 -217 122 270 59 -131 -307 -139 96 303 149 -194
6210 -194 -305 -75 157 328 142 -299 -250 -114 130 260 83 -169 -351 -140 194 283 106 -116 -303 -95 232
6231 232 303 119 -162 -233 -144 141 234 5 -240 -180 4 144 191 8 -161 -181 47 196 200 -45 -289 -194 117
6254 117 257 209 -115 -208 -265 51 360 263 -180 -342 -239 69 335 300 -25 -368 -300 -17 325 280 -4 -288
6276 -288 -284 35 249 253 9 -240 -273 -15 162 198 -27 -198 -246 66 234 95 -26 -172 -96 80 202 202 -153
6299 -153 -241 -68 106 235 157 -166 -293 -128 147 271 85 -56 -317 -194 175 228 147 -60 -363 -200 114
6320 114 272 49 -130 -228 -124 65 254 117 -193 -251 -31 128 249 124 -158 -216 -28 189 308 147 -153
6341 -153 -295 -6 290 252 50 -157 -260 -115 280 276 7 -202 -200 -49 164 307 91 -228 -320 -57 155 269
$$ packed form
6189A30K47j74k85k97Q4M17J73j10k72k19Q9L39J48k11j90j76J68K35K07j54l43
6210a94j11K30K32J71j86m41M9J36K44J30j77k52j82K11L34Q9j77k22j87K08L27
6231B32P1j84k81p1Q9K85R3k29k45O0J84J40M7j83j69k0K28J49Mk45k44R5L11
6254A17J40m8l24r3n7L16L09r7m43j62J03L08K66l5l25l43O8K83L42m5k84k84
6276b88ML19K14Mk44k49l3K58J77L6k25j71m8L12J68j39j21j46P6J76J22%l55
6299a53q8J73J74J29p8l23j27J65K75J24j86j41k61J23L69N3q1k07l03J63L14
6320A14J58k23j79r8J04J89J89j37l10n8K20J59J21j25k82n8J88K17J19j61l00
6341a53j42K89K96l8k02k07j03J45L95mk69k09KJ51K13J43k16l19r2K63K12J14
$$ plain form
6363 269 54 -243 -226 -54 177 214 52 -177 -266 -20 180 240 -3 -159 -195 -30 198 190 25 -243 -137 20
6385 20 199 211 -48 -284 -226 121 210 204 -66 -214 -164 71 247 178 -6 -237 -212 57 292 211 -16 -200 -227 30
6409 30 213 262 -106 -236 -96 14 156 186 -43 -291 -155 56 205 157 -88 -212 -148 65 200 83 -22 -250
6431 -250 -177 18 210 80 -85 -184 -143 135 206 96 -229 -196 -51 82 220 69 -97 -274 -45 173 202 47
6453 47 -203 -274 -5 197 280 55 -211 -262 -101 173 307 8 -232 -230 -206 100 329 152 -176 -225 -91 95 217
6476 217 102 -159 -285 -90 105 211 112 -95 -212 -99 105 151 58 -80 -129 -115 129 194 -24 -161 -103 6
6498 6 145 201 -78 -212 -105 134 103 159 -30 -250 -146 109 290 201 -67 -270 -233 103 275 169 -27 -273
6520 -273 -159 67 253 189 -4 -144 -148 39 204 148 -28 -197 -118 96 185 185 -53 -210 -168 133 252 65 -77
$$ packed form
6363B69k15k97J7J72K31L7j62k29q9K46K00O0k43j56l6J65K28qj65k68J06J57
6385B0J79J2k59k36N8L47Q9ok70j48N0K35J76o9j84k31K5K69K35q1k27j84k7K57
6409C0J83M9l68j30J40J10J42L0k29k48J36K11J49m8k45j24O4K13J35j17j05k28
6431b50P3J95J92j30j65r9M1K78P1j10l25L3J45J33J38j51j66j77K29K18K9j55
6453D7k50p1K69K02Q3k25k66n1J61K74J34k99k40KK4L06K29j77l28m9J34J86J22
6476B17j15k61j26J95J95J06r9k07j17J13K04M6r3j38m9J4K44O5k18j37N8J09
6498FJ39N6k79j34J07K39l1N6j89k20J04K55J81q9k68k03L7L36J72j06j96k46
6520b73J14K26J86o4j93j40mJ87J65n6j76j69P9K14Q9%k38j57M2L01J19j87j42
$$ plain form
6543 -77 -259 -92 130 259 100 -191 -221 -176 92 265 159 -109 -314 -186 37 288 158 0 -261 -138 -6
6564 -6 314 288 -27 -210 -152 58 112 94 25 -22 -148 -34 54 -13 -52 -63 1 103 82 -18 -175 -29 101 159 56
6589 56 -40 -283 -140 79 254 186 -63 -326 -210 118 329 226 -5 -276 -311 -6 365 411 -1 -283 -313 -67
6611 -67 214 388 41 -209 -280 -97 126 310 137 -167 -232 -45 76 186 138 -96 -132 6 86 73 -33 -52 -136
6634 -136 18 126 83 -57 -121 -80 68 178 109 -91 -193 -84 49 209 146 -56 -216 -154 17 204 207 -5 -203
6657 -203 -197 62 168 171 -30 -150 -96 67 164 7 -103 -136 -4 39 152 89 -146 -181 -46 116 160 64 -141 -262
6681 -262 1 233 230 116 -171 -296 -102 227 348 103 -215 -357 -174 185 374 237 -135 -402 -201 89 361
6702 361 268 -54 -230 -245 10 209 269 20 -184 -148 -62 65 71 44 -84 -82 -17 82 35 24 40 98 110 55 -118 -136
$$ packed form
6543g7j82J67K22J29j59k91l0M5K68J73j06k68k05J28K23K51j30j58k61J23J32
6564fL20k6l15j83N8K10N4j8o9m7j26J14Q8o7l9j1O4J02k1j00j57J46J30N8j03
6589E6r6k43J43K19J75o8k49k63J16L28K11j03k31k71l5L05L71M6m12k82l0K46
6611f7K81J74l47k50p1J83K23J84j73l04o5J87J21J10m8k34l6J38Q0j3j06j9q4
6634a36J54J08m3j40o4M1J48J10o9k00j02J09J33J60o3k02j60O2J71J87Lk12j98
6657b03OK59J06Lk01j20N4J63R7j57j10l3J32M3J13o3k35l5J35J62M4r6k05j21
6681b62K63K32lj14k87j25J94L29J21k45l18j42J83L59J89j37l72k67K01K90K72
6702C61r3l22j76j5K55J99O0k49k04L6Q6J27Ok7j28KO5R9m7j1J6N8J2n5j73j8
$$ plain form
6728 -136 -40 83 168 124 -133 -210 -117 208 241 100 -61 -307 -242 56 285 236 13 -254 -271 49 272 239 -4
6751 -4 -142 -207 -4 115 235 22 -153 -181 -13 110 195 -21 -210 -103 41 177 176 -38 -208 -181 13 177 153
6774 153 -66 -148 -104 42 218 90 -48 -199 -125 10 228 124 -97 -170 -164 -7 107 143 8 -173 -98 28 107
6797 107 128 -12 -115 -139 66 121 64 -16 -137 12 64 129 -18 -64 -141 -39 106 105 28 -146 -159 54 121 182 -12
6822 -12 -195 -240 -29 185 208 34 -95 -220 -39 189 222 88 -125 -225 -100 136 282 72 -87 -199 -157 111
6844 111 215 86 -107 -130 -85 97 221 105 -91 -183 -49 80 84 111 -90 -126 -22 176 123 3 -81 -109 -67 151
6868 151 119 12 -114 -171 -53 99 196 -19 -204 -104 2 68 69 -13 -137 -123 62 165 81 -26 -140 -109 114
6891 114 227 92 -44 -88 -172 72 207 106 -60 -183 -60 24 164 100 -56 -157 -86 107 133 113 -62 -236
$$ packed form
6728a36R6J23Q5m4k57p7R3L25L3j41j61k46O5K98K29m9k23k67j7L20K23l3k43
6751dj38o5K03J19J20k13j75k8J68J23Q5k16j89J07J44J36jk14j70K7J94J64k4
6774A53k19q2M4J46J76j28j38j51P4J35K18j04k21p3OJ57J14L6j35j81P5J26P9
6797A07K1j40j03k4K05N5n7q0j21J49N2O5j47m6p7J02J45jp7j74j3K13O7O1j94
6822a2j83m5K11K14K3j74j29j25J81K28L3j34k13j00J25K36J46k10j59j12M2K68
6844A11J04j29j93k3M5J82J24j16j96r2J34J29MK7k01l6J04J98n3j20q4k8M2K18
6868A51l2j07j26n7J18J52R7k15j85J00J06O6Jq2j24J4J85J03q4j07j14L1K23
6891A14J13j35j36m4q4K44J35j01j66j23J23Q4J40o4j56j01P1J93K6k0j75j74
$$ plain form
6913 -236 -118 57 171 118 -9 -107 -116 13 195 64 -64 -149 -83 46 199 69 -145 -134 -106 87 121 64 -163
6936 -163 -140 -82 107 191 114 -96 -209 -87 166 208 71 -102 -216 -121 144 176 44 -56 -202 -134 30 165 68
6959 68 -39 -102 -131 97 114 133 -95 -138 -58 82 59 47 -117 -84 30 25 83 -11 -108 -77 48 144 156 2 -205 -126
6985 -126 34 168 165 -56 -156 -122 100 182 166 -23 -154 -143 32 194 156 7 -163 -151 -5 152 170 26 -233
7008 -233 -201 11 206 141 23 -144 -71 -68 131 185 4 -127 -122 5 118 179 7 -147 -118 44 183 128 9 -140
7032 -140 -103 69 123 111 -63 -150 -105 6 229 136 -30 -105 -107 23 162 114 65 -104 -23 37 83 81 -31 -70 -25 57
7058 57 40 28 -96 -90 1 100 68 -121 -140 -38 39 199 103 -96 -243 -150 39 178 199 -30 -292 -200 38 237 232
7083 232 55 -247 -347 -111 129 327 137 -160 -277 -188 61 315 164 -104 -213 -178 12 159 81 -7 -88 -50
$$ packed form
6913b36J18J75J14n3j27r8rJ29J82j31j28q5O6J29J53j30k14J1K8J93L4n7k27
6936a63K3N8J89Q4p7k10j13J22K53M2j37j73j14R5K65L2j32j00j46O8J64J35r7
6959F8j07o3k9K28J7J9k28m3Q0J40k3j2j64L3J14nN8r4r7L1J25R6J2j54k07P9
6985a26J60J34lk21j00L4K22Q2j6j89j31J1J75J62l8j49j70J2J46J57J8j44k59
7008b33L2K12J95o5j18j67P3LJ99N4j81j31NJ27J13O1j72j54K9J62J39n5j19j49
7032a40L7J72N4j2j74q7M5J11K23r3j66p5kJ30J39m8m9j69Q1O0M6kj12l9M5Q2
7058E7j7j2j24OR1R9l2j89j9J02P7J60r6j99j47R3J89J39K1k29k62R2K38J99n
7083B32j77l02j00K36K40J98j90k97j17Q9K49K54j51k68j09L5J90J47p8q8q1L8
$$ plain form
7105 -50 0 112 49 -12 -93 -38 11 16 19 -66 -40 41 43 47 -28 -42 -65 61 212 53 -64 -217 -64 24 111 143 -2 -174
7133 -174 -108 42 155 179 29 -171 -107 -8 128 166 28 -75 -110 100 140 47 -20 -116 -49 53 162 64 -83 -73
7157 -73 -65 66 252 111 -151 -203 -73 119 247 86 -148 -255 -172 159 231 216 -53 -252 -199 92 240 236 0
7180 0 -282 -281 -50 169 160 81 -105 -177 -129 54 216 21 31 -101 -65 6 92 -1 27 -9 -2 -24 -54 -26 -24 122 132 35
7208 35 -143 -180 -92 156 230 104 -80 -224 -167 75 271 177 -24 -334 -220 -27 201 289 85 -251 -232 -57 160
7231 160 286 68 -145 -226 -82 123 176 142 -64 -162 -73 74 109 63 -43 -94 -117 109 172 12 -95 -157 -3 81
7255 81 106 -15 -154 -188 60 117 110 39 -49 -160 -59 177 138 -13 -78 -103 -12 108 153 -16 -57 -142 4 46 122 5
7281 5 -26 -5 62 33 40 -46 -24 -21 94 37 -101 -206 -68 -7 179 180 24 -219 -140 40 101 253 2 -207 -219 -47
$$ packed form
7105e0N0J12o3o1q1N5M9NLq5K6Q1KMp5j4k3J26J51j59j17j53J53Q8Q7L2j45j72
7133a74O6J50J13K4j50k00O4R9J36L8j38j03l5K10M0r3o7r6O7J02J09r8j47J0
7157g3QJ31J86j41k62n2J30J92J28j61k34j07Q3L31P2j5k69j99N3K91J48mk36
7180@k82JK31K19rp9j86p2M8J83J62j95J0j32L6P1Q6r3K8l6Pk2l0K8KJ46J0r7
7208C5j78l7Q8K48P4j26j84j44N7K42J96r4k01l10J14J93K28Q8k04l36J9J75K17
7231A60J26k18k13q1J44K05N3l4k06r8Q9J47L5m6j06n1k3K26O3j60j07o2J54Q4
7255H1K5j21j39l4K48N7pp1q8j11J01K36l9j51o5k5R1J20M5j69m1q5J46M2P6j17
7281El1K1O7k9Pq6K2LJ15n7j38j05J38O1J86Jj56k43P9J80O1J52k51k09j2J72
$$ plain form
7307 -47 145 229 166 -125 -300 -95 103 278 203 -114 -285 -190 59 241 226 -2 -93 -260 -28 178 231 41 -109
7330 -109 -135 -59 163 89 -20 -68 -38 13 49 47 -22 -115 6 62 65 11 -72 -122 15 67 74 -8 -110 -111 -42 231 183 24
7358 24 -180 -134 -5 116 150 -2 -208 -169 23 207 130 -7 -169 -187 -2 119 80 32 -142 -153 6 206 139
7381 139 -2 -128 -179 23 194 133 -53 -151 -118 18 183 155 -8 -141 -130 53 77 139 38 -169 -209 34 120
7404 120 124 22 -112 -135 -19 153 81 -10 -135 -138 40 92 105 -76 -47 -61 1 124 68 -80 -104 -41 42 32 16 -45
7430 -45 -151 -23 73 47 -12 -38 -152 -65 90 156 65 -126 -172 -59 113 221 47 -123 -159 -46 78 172 81 -161
7454 -161 -145 -96 85 156 52 -103 -207 -85 82 156 75 -66 -91 2 85 105 7 -92 -93 -41 105 146 49 -111 -116 -96
7480 -96 100 160 27 -108 -95 6 85 142 100 -62 -104 -4 90 103 12 -79 -69 -20 111 59 -31 -134 -71 39 94 114
$$ packed form
7307d7J92Q4o3k91j75K05J98J75p5l17j71R5K49J82j5k28r1j67K32K06N3j90j50
7330a09k6P6K22p4j09m8L0N1L6ko9r3J21N6Ln4q3n0J37N2Pq2j02jO9K73m8j59
7358B4k04M6J29J21L4j52k06L9J92J84p7j37j62j8J85J21l9m8j74j1J59K00o7
7381A39j41j26n1K02J71o1j86r8L3J36J65k8j63j33J1J83K4O2j01k07m0K43Q6
7404A20Mj02j34k3J16J72p2r1j25lJ78N2J3j81K9j4O2J23n6j48k4O3Q3j0j6o1
7430d5j06J28R6k6n9k6j14Q7J55O6r1j91m6J13J72J08j74j70l6J13J24R4r1k42
7454a61J6M9J81P1j04j55j04J22J67P4q1j41k5R3Q3K0r8r9jN2J46M1r7j60nK0
7480i6J96O0j33j35J3J01P9N7m2j62m2J00R4J3r1r1J0M9J31n2r0j03O3J10N5K0
$$ plain form
7506 114 14 -192 -154 48 104 186 -29 -146 -160 76 197 110 -24 -159 -99 -7 180 115 -11 -136 -138 117 139 110
7530 110 -28 -160 -121 -40 143 193 -23 -30 -75 65 159 132 -90 -90 -60 45 117 133 -90 -156 -84 96 193 29 -84
7555 -84 -128 -69 123 169 73 -162 -149 -74 81 130 58 -84 -163 -50 40 172 85 -131 -112 -10 61 173 58 -47 -148
7580 -148 -90 99 86 97 -47 -66 -111 89 104 -67 -55 -70 -16 92 138 44 -89 -96 -36 87 77 1 -188 -111 78 100
7606 100 122 -24 -147 -197 -2 146 111 29 -105 -73 -8 158 187 57 -93 -136 -4 71 126 -46 -128 -110 -29 143
7630 143 56 -78 -91 -118 63 130 90 19 -85 -79 120 168 146 -62 -181 -42 18 189 128 -34 -142 -123 43 188
7654 188 146 -32 -202 -75 -55 134 127 12 -182 -141 45 166 118 -42 -158 -140 36 177 77 -10 -87 -24 9 136
7678 136 56 -52 -66 -44 -13 119 -11 -111 -33 14 89 115 35 -134 -134 -17 138 97 8 -96 -91 -36 154 142 44 -87
$$ packed form
7506A14j00k06L8K02N6Q2k15j17j4K36J21q7j34j35O0R2J87o5j26j25kK55K2k9
7530A10j38j32L9Q1J83N0k16pm5J40R4k7k22%L0J05P2J6k23o6P2J80R7j64j13
7555h4m4N9J92M6r6k35J3P5J55M9p2j42p9J13R0J32q7k16J9J02P1J12j15j05j01
7580a48N8J89j3J1j44j9m5K00J5j71J2j5N4J08M6r4j33pO0J23j0p6j89P7J89K2
7606A00K2j46j23n0J95J48l5q2j34L2O5J66K9j30j50m3J32P5N5j72q2J8Q1J72
7630A43q7j34j3k7J81O7m0p1j04OJ99M8k2k08j19J39O0J71o1j62j08J9J66J45
7654A88m2j78j70J27K0J89pj15j94M1J86J21m8j60j16J8J76J41j00q7p7O3L3J27
7678A36q0j08j4K2L1J32j30j00P8M7P5K6q0j69%J17J55m1q9j04NN5J90j2r8j31
$$ plain form
7704 -87 -126 15 125 72 87 -119 -222 -110 100 92 52 -79 -194 -11 133 140 54 -21 -126 -9 123 77 16 -67 -141
7729 -141 -27 70 126 15 -140 -102 -53 128 163 10 -59 -69 -42 125 133 -27 -73 -123 12 126 119 74 -133 -104 -17 145
7755 145 41 1 -54 -62 -7 106 79 -50 -78 -41 12 61 131 -23 -185 -109 32 106 106 29 -164 -61 89 124 76 -74
7781 -74 -92 -81 86 152 71 22 -47 -65 94 121 66 -29 -178 -62 43 159 57 -53 -152 -64 109 124 108 -128 -90
7806 -90 -66 113 70 35 -32 -193 -36 108 197 13 -139 -139 -25 83 150 118 -49 -119 -68 112 182 92 -169 -133 34
7831 34 66 140 93 -66 -142 -45 32 88 -7 -61 -97 -21 119 135 52 -53 -47 18 103 48 -48 -114 -129 39 121 100 -49 -152
7859 -152 -125 -6 130 129 0 -143 -137 59 164 128 -11 -81 -34 28 134 74 -33 -137 -71 -12 124 92 -78 -100 -38
7884 -38 40 139 65 2 -131 -43 57 133 109 -86 -153 -54 73 218 35 -63 -145 -144 73 194 124 -124 -165 -93 62 124
$$ packed form
7704h7l9J41J10n3J5k06j03J12K10qm0j31j15J83J44Pq6p5j05J17J32m6o1q3p4
7729a41J14R7N6j11j55L8M9J81L5j53o9j0K7J67Qj60m6n0J35J14pm5k07K9Q7J62
7755A45j04m0n5qN5J13k7j29k8L7N3M9P0j54j62P6J41P4%p7j93J03J50L5m8j50
7781g4j8J1J67O6q1m9o9j8J59K7n5r5j49J16J05J16j02j10r9Q8J73J5j6k36L8
7806i0K4J79m3l5o7j61J57J44Q9j84j52%J14J08O7l2j67p0N1J80P0r0k61L6J67
7831C4L2P4m7j59p6R7P7N6r5n4l6P6J40J6q3j05OO5Q5n5r6o6j5J68Q2k1j49j03
7859a52K7J19J36jj29j43OJ96J05l6j39p0M7O2J06o0j07j04O6N9J36l2j70k2O2
7884c8P8R9p4o3j33Q8J00P6k4j95o7R9J27J45j83r8q2JK17J21p0k48m1P2J55O2
$$ plain form
7910 124 169 1 -168 -147 8 89 156 10 -147 -105 -2 102 87 40 -68 -74 39 75 50 2 23 -66 41 44 54 -63
7936 -63 -75 89 112 77 -51 -190 -51 90 99 127 -2 -137 -185 -5 192 178 -1 -200 -224 24 227 158 -11 -83
7960 -83 -129 -80 129 155 58 -159 -155 -106 59 175 70 -112 -150 1 92 117 106 -82 -152 -16 95 43 -27 -75 -66 -49
7986 -49 48 97 -5 -78 -41 25 93 96 15 -131 -46 -25 150 114 53 -77 -173 -39 106 125 -9 -73 -149 -42 26 41 -35
8013 -35 -60 -34 -50 58 32 -79 21 11 80 104 -46 -162 -130 93 123 78 4 -202 -191 -26 220 178 67 -183 -303
8038 -303 -114 118 317 136 -136 -232 -116 94 320 177 -70 -249 -229 45 227 192 0 -163 -153 -54 159 177
8060 177 94 -26 -74 -41 23 120 97 -44 -54 32 -34 -23 -32 29 52 98 51 -104 -97 -2 70 116 84 -84 -175 -92 97 110
8088 110 105 -32 -166 -75 58 210 159 -58 -129 -148 -11 225 141 -23 -164 -94 -72 143 138 -77 -131 -45 -25 120 130
$$ packed form
7910A24M5j68j69K1J55Q1O7j46j57M2J03J04j5m7j08oJ13L6k5m8K1q9J07LJ0j17
7936f3j2J64K3l5j28j39J39J41RK8j29j35m8J80J97j4j79j99k4K48K03o9j69p2
7960h3m6M9K09K6r7k17MM9J65J16j05j82l8J51R1K5j1j88p0J36J11n2p0m8RJ7
7986d9R7M9j02p3L7O6O8Lq1j46Q5K1J75l6o1j30r6J34J45J9j34o4p6J07O8J5p6
8013c5k5K6j6J08k6j11J00j0O9K4j50j16L2K23L0m5p4k06J1J65K46m2j11k50j20
8038c03J89K32J99j81k72r6J16K10K26j43k47j79K0K74J82l5j92j63J0R9K13J8
8060A77q3j20m8L3O4R7k3j41j0Q6o6J1rO1K3M6m7j55PR5P2M6l2j68r1Q3J89J3
8088A10nj37j34R1J33J52n1k17p1j9J37K36q4j64j41P0K2K15nk15n4Q6K0J45J0
$$ plain form
8113 130 -13 -148 -51 104 92 68 -78 -152 -40 1 157 124 -23 -131 -56 68 177 164 -24 -129 -196 17 105
8136 105 132 1 -140 -59 -52 75 227 129 -34 -135 -75 25 108 115 -51 -99 -27 -47 7 9 80 49 38 -45 -84 -114 16
8163 16 109 143 61 -116 -124 -119 149 188 130 -1 -259 -235 57 172 257 43 -200 -274 -12 227 219 56 -151 -230 -128
8188 -128 117 178 103
$$ packed form
8113A30j43j35R7J55j2k4j46p4J12M1J56l3j47j08P5J24J09j3j88j05o7K13Q8
8136A05K7j31j41Q1PJ27J52r8j63j01O0J00Q3Pj66m8P2k0N4KP1l1j1q3l9l0J30
8163A6R3L4q2j77qNK68L9n8j31k58K4K92J15Q5k14k43p4K62K39qj63k07p9J02
8188a28K45O1p5
8191A03
$$ Imaginary data points
##PAGE= N=2
##DATA TABLE= (X++(I..I)), XYDATA
$$ plain form
0 0 0 0 0 0 0 0 0 0 0 8 -8 8 -11 16 -16 21 -24 26 -32 40 -44 51 -58 69 -80 90 -105 116 -131 149 -167 188
32 188 -212 237 -264 294 -327 363 -403 445 -494 545 -606 671 -742 824 -918 1021 -1144 1287
50 1287 -1454 1659 -1912 2232 -2660 3254 -4143 5621 -8525 16446 -83388 -281522 -149142 82053
64 82053 247997 189241 -25766 -221607 -205174 -18809 168278 197714 66071 -118449 -184328
75 -184328 -88062 66488 140405 99620 -14304 -103099 -95952 -16029 48963 66511 45145 -16
87 -16 -42779 -52425 -36551 -3890 43382 72009 39856 -30893 -83207 -77492 -5090 89168 111439
100 111439 28373 -82568 -124339 -62982 59932 138055 87607 -45083 -130469 -99271 14944
111 14944 117064 111975 1008 -101861 -100944 -14873 74619 94268 24927 -63587 -76662 -13007
$$ packed form
0@%%%%%%%%%Qj6J6j9K7l2L7m5N0n8P2q4R5j09J27j49J70j95K21k47K80l16L55
32A88m00M49n01N58o21O90p66Q48r39J039j151J277j413J566j742J939k165K431
50A287k741L113l571M144m892N914p397R764j4146K4971r9834j98134J32380K31195
64H2053J65944n8756k15007j95841J6433J86365J87087K9436j31643j84520o5879
75a84328R6266J54550P3917m0785j13924q8795P147P9923O4992J7548k1366m5161
87a6m2763r646J5874L2661M7272K8627l2153p0749n2314N715P2402R4258K2271
100A11439q3066j10941m1771O1357J22914P8123n0448j32690q5386L1198J14215
111A4944J02120n089j10967j02869R17Q6071Q9492J9649o9341q8514j3075O3655
$$ plain form
123 -13007 48398 54004 8027 -43423 -41587 14327 51250 23457 -31844 -55985 -22030 47832
135 47832 79893 24363 -64806 -92305 -32652 63048 113126 58201 -63172 -128401 -71168 50247
147 50247 129483 97491 -26917 -130349 -109921 8927 112345 117842 24017 -91168 -120809
158 -120809 -39738 65532 104249 59512 -28823 -88947 -67105 7275 59287 58877 22725 -24382
170 -24382 -49880 -36193 -5560 20573 42073 43357 6904 -41904 -62894 -40312 20565 81430
182 81430 77565 -2351 -86939 -101865 -31685 76166 129011 63999 -65647 -138766 -92287 35138
194 35138 140012 122593 -11224 -134607 -134106 -19213 109387 143960 48441 -91335 -141851
205 -141851 -64868 59422 126181 82066 -34676 -113688 -83136 13468 84047 78242 7142 -65061
$$ packed form
123a3007O1405N606m5977n1450J836N5914L6923k7793n5301k4141L3955O9862
135D7832L2061n5530q9169k7499N9653R5700N0078n4925j21373o5229N7233J21415
147E0247P9236l1992j24408j03432K0428J18848J03418N497r3825j15185k9641
158a20809Q1071J05270L8717m4737q8335o0124K1842P4380N2012m10l6152m7107
170b4382k5498J3687L0633K6133K1500J284l6453m8808k0990K2582O0877O0865
182H1430l865p9916q4588j4926P0180J07851N2845o5012j29646p3119M6479J27425
194C5138J04874j7419j33817j23383N01J14893J28600L4573r5519j39776n0516
205a41851P6983J24290O6759m4115j16742p9012L0552R6604P0579n805p1100p2203
$$ plain form
217 -65061 -69145 -11596 39418 45382 17424 -18569 -32489 -12945 9320 8281 266 2102 6566
230 6566 8171 1353 -18563 -28504 -4153 30909 36961 10256 -28649 -49593 -23449 32459 57370
243 57370 26237 -25660 -54584 -36983 18121 58039 38748 -15033 -48354 -37829 5695 45572
255 45572 38580 -8607 -39929 -26614 8214 32450 24723 -11618 -34921 -13925 22785 32010 8772
268 8772 -25136 -38153 -8026 38607 46076 5256 -40644 -51328 -13908 45769 66620 18982
280 18982 -47957 -68125 -27250 40538 76850 40364 -37080 -76283 -43874 24473 71563 55927
292 55927 -13384 -68300 -55122 4489 53707 56294 9928 -45566 -53735 -11053 32102 40815 17512
305 17512 -17826 -34044 -15337 11325 17036 8931 676 -5721 -4951 -285 -5084 -10809 1179 18246
$$ packed form
217f5061m084N7549N1014N964k7958l5993j3920J9544K2265j039q015J836M464
230F566J605o818j9916r941K4351L5062O052k6705l8905k0944K6144N5908K4911
243E7370l1133n1897k8924J7601N5104L9918j9291n3781l3321J0525M3524L9877
255D5572o992m7187l1322J3315L4828K4236p727l6341k3303K0996L6710R225k3238
268H772l3908j3017L0127M6633P469m0820m5900j0684L7420N9677K0851m7638
280A8982o6939k0168M0875O7788L6312l6486p7444l9203L2409O8347M7090j5636
292E5927o9311n4916J3178N9611M9218K587m6366n5494q169M2682M3155Q713k3303
305A7512l5338j6218J8707K6662N711q105q255o397P70M666m799n725J1988J7067
$$ plain form
319 18246 18096 1775 -20112 -32311 -13555 26794 43689 17535 -25186 -49200 -31840 20089
331 20089 57588 37819 -17875 -55346 -45884 4291 55025 53730 -1513 -52428 -52957 -9077 42676
344 42676 56568 14163 -41472 -52767 -15767 30091 47539 20279 -27844 -44933 -15545 22343
356 22343 33966 15667 -17280 -33420 -12352 20209 25969 5621 -16746 -23275 -5366 21443
368 21443 23115 -2946 -23156 -18243 2971 23821 22333 -6262 -29555 -19002 9397 26436 20853
381 20853 -5314 -30273 -23222 9815 29952 20532 -5803 -28161 -24010 8095 31832 19980 -9092
394 -9092 -26036 -19402 7370 29976 19636 -12169 -26856 -13621 10666 26778 17554 -12957 -29758
407 -29758 -12395 16281 27912 14896 -14463 -32675 -14524 20852 32464 12509 -16993 -32505
$$ packed form
319A8246j50j6321k1887j2199J8756M0349J6895k6154m2721k4014J7360N1929
331B0089L7499j9769n5694l7471R462N0175N0734j295n5243n0915n29M3880N1753
344D2676J3892m2405n5635j1295L7000M5858J7448k7260m8123j7089K9388L7888
356B2343J1623j8299l2947j6140K1068L2561N760k0348k2367o529J7909K6809
368B1443J672k6061k0210M913K1214K0850j488k8595k3293J0553K8399J7039n583
381B0853k6167k4959P051L3037K0137r420k6335k2358M151L2105K3737j1852k9072
394i092j6944O634K6772K2606j0340l1805j4687J3235K4287J6112r224l0511j6801
407b9758J7363K8676J1631j3016k9359j8212J8151L5376J1612j9955k9502j5512
$$ plain form
419 -32505 -16838 19648 36350 14206 -19030 -32128 -17028 15816 35996 18046 -18445 -32930
431 -32930 -16120 13664 32483 19632 -15840 -33315 -14433 15063 27471 15366 -12755 -29542
443 -29542 -13458 16130 25158 9608 -12966 -24884 -11675 16246 25262 5498 -17167 -22047 -7378
456 -7378 16577 25347 3962 -22680 -22999 -1395 19470 23246 2737 -24476 -25640 803 23412
469 23412 22347 1360 -24037 -27885 -584 27219 24493 -1079 -24551 -27310 -2598 27896 27991
482 27991 -1858 -26744 -25371 -2094 25043 28360 416 -26906 -24574 -813 21678 25605 3384
495 3384 -24631 -25168 575 21676 21152 2165 -20650 -22885 1214 22276 17187 -2878 -18173
508 -18173 -16895 3043 21815 14883 -8326 -19410 -10928 7226 21237 14019 -11402 -24419 -9324
$$ packed form
419c2505J5667L6486J6702k2144l3236j3098J5100L2844K0180j7950l6491j4485
431c2930J6810K9784J8819j2851l5472j7475J8882K9496J2408j2105k8121j6787
443b9542J6084K9588R028j5550k2574j1918J3209K7921R016j9764k2665m880J4669
456g378K3955Q770k1385k6642l19K1604K0865L776k0509k7213j164K6443K2609
469B3412j065k0987k5397l848K7301K7803k726k5572k3472k759K4712L0494R5
482B7991k9849k4886J373K3277K7137L317k7944k7322K332K3761K2491L927k2221
495C384k8015n37K5743K1101n24j8987k2815k235K4099K1062n089k0065j5295
508a8173J278J9938J8772o932k3209j1084Q482J8154J4011p218k5421j3017J5095
$$ plain form
521 -9324 14197 23839 12208 -13853 -28571 -11282 19129 28680 11481 -15440 -30346 -15252 18749
534 18749 33545 13902 -16034 -30097 -17880 13684 34300 18987 -14478 -30315 -17852 9886
546 9886 30248 20841 -10812 -28324 -15704 8370 23113 17303 -6503 -23364 -13028 9418 17868
559 17868 9604 -6279 -17128 -8981 11269 16935 2494 -12120 -14106 -2620 14670 17724 -1898
572 -1898 -20170 -15433 3620 19069 18393 -2500 -24912 -21026 5080 24128 20584 -1511 -25677
585 -25677 -26408 1505 27100 23965 -424 -24111 -27580 -3519 25523 26219 678 -21948 -23926
598 -23926 -5465 19178 24580 3060 -19261 -19844 -3668 14241 19227 3221 -16881 -16301 1293
611 1293 13670 12112 -992 -15489 -13323 6067 17486 7882 -8335 -16355 -9846 9046 20980
$$ packed form
521i324K3521R642j1631k6061j4718J7289L0411R551j7199k6921j4906J5094L4001
534A8749J4796j9643k9936j4063J2217L1564K0616j5313l3465j5837J2463K7738
546I886K0362r407l1653j7512J2620K4074J4743n810k3806j6861J0336K2446Q450
559A7868q264j5883j0849Q147K0250N666j4441j4614j986J1486J7290L054j9622
572a898j8272M737J9053J5449o76k0893k2412L886K6106J9048l544k2095k4166
585b5677p31K7913K5595l135k4389k3687l469K4061K9042O96k5541k2626j978
598b3926J8461K4643N402k1520k2321n83J6176J7909M986j6006k0102N80J7594
611A293J2377j558j3104j4497K166J9390J1419r604j6217q020O509J8892J1934
$$ plain form
624 20980 8736 -13432 -20614 -8798 11172 23733 12435 -14496 -25989 -10528 13000 24553
636 24553 14795 -11312 -27715 -14091 12773 24418 14332 -7650 -23839 -15904 9367 22834
648 22834 12797 -6054 -18155 -13953 5920 19982 10940 -7672 -14655 -7561 6378 15539 7316
661 7316 -10304 -14098 -1255 10996 12680 2674 -12764 -15581 1181 17017 14248 -864 -15439
674 -15439 -17765 -639 20547 19954 -1039 -19051 -19824 -2856 19636 23825 2758 -19270 -20801
687 -20801 -4971 14796 22693 7787 -15064 -20076 -5787 10104 16558 8765 -8574 -16139 -5012
700 -5012 8125 9513 2885 -5416 -8501 -408 8282 3752 -6249 -7882 -1423 7063 11289 2317 -14008
715 -14008 -16222 -577 15249 17912 4844 -17062 -25972 -7750 18933 26831 11103 -15377 -31654
$$ packed form
624B0980j2244k2168p182J1816J9970J2561j1298k6931j1493J5461K3528J1553
636B4553r758k6107j6403J3624K6864J1645j0086k1982j6189P935K5271J3467
648B2834j0037j8851j2101M202J9873J4062r042j8612o983P094J3939R161q223
661G316j7620l794J2843J2251J684j0006j5438k817J6762J5836k769j5112j4575
674a5439k326J7126K1186n93k0993j8012p73J6968K2492M189k1067k2028j531
687b0801J5830J9767P897j4906k2851n012J4289J5891O454p793j7339p565J1127
700e012J3137J388o628q301l085Q093Q690m530j0001j633O459Q486M226q972j6325
715a4008k214J5645J5826K663j3068k1906q910J8222K6683P898j5728k6480j6277
$$ plain form
728 -31654 -18214 14617 32333 19282 -8991 -29945 -26270 2638 29516 26768 990 -22815
740 -22815 -27782 -9337 18206 27384 10429 -11852 -21254 -14799 3255 17912 14459 168 -8979
753 -8979 -11102 -8115 1154 9409 9146 4934 -666 -9656 -13740 -4983 8553 16088 14010 -1111 -20630
768 -20630 -22562 -2300 20215 26954 12374 -16272 -33643 -18718 14236 33499 25011 -4367 -32531
781 -32531 -32078 -641 30365 33358 9397 -22259 -35836 -15807 18692 33349 18744 -8585 -27945
794 -27945 -23128 3262 24289 20801 2409 -14039 -18892 -7599 9834 15156 6857 -2112 -7106
807 -7106 -7718 -1892 3801 3309 2846 5147 2206 -5263 -8204 -5725 952 10999 13461 1249 -12792
822 -12792 -14927 -5813 8497 18692 11886 -7577 -18841 -13315 1141 15289 17865 2909 -14454
$$ packed form
728c1654J3440L2831J7716j3051k8273k0954L675K8908K6878k748k5778k3805
740b2815m967J8445K7543R178j6955k2281r402O455J8054J4657l453j4291r147
753h979k123K987R269Q255k63m212n600q990m084Q757J3536P535k078j5121j9519
768b0630j932K0262K2515O739j4580k8646j7371J4925L2954J9263q488k9378k8164
781c2531M53L1437L1006K993k3961l1656j3577K0029L4499J4657j4605k7329j9360
794b7945M817K6390K1027l488j8392j6448m853J1293J7433N322q299q969m994
807g106o12N826N693m92m63K301k941p469k941K479O677J0047K462j2212j4041
822a2792k135R114J4310J0195o806j9463j1264N526J4456J4148K576j4956j7363
$$ plain form
835 -14454 -16376 -5524 6741 13647 9524 -3328 -10699 -7605 -2349 2256 6619 5972 1195 -1815
849 -1815 -4934 -9302 -6105 5054 12443 10875 1296 -14008 -21312 -7942 14929 25023 14842 -9268
863 -9268 -30180 -25688 4356 31005 30488 4973 -26963 -39133 -15825 23373 40950 23360 -13083
876 -13083 -40596 -34461 3644 38187 37832 6769 -28543 -41369 -18980 20386 39975 25201 -7056
889 -7056 -32847 -33231 -5234 26638 33799 14822 -12743 -30794 -25197 1702 25825 28000 11086
902 11086 -13220 -30023 -22784 4194 26778 28796 10310 -18132 -34751 -21249 11108 33223
914 33223 29742 3236 -28888 -38074 -12914 23029 39081 24343 -11068 -39438 -32725 3578 34715
927 34715 35961 8757 -26111 -38947 -16156 19537 35234 21796 -7574 -30462 -26284 1458
$$ packed form
835a4454j922J0852J2265O906m123j2852p371L094N256M605M363o47m777l010
849a815l119m368L197J1159P389j568r579j5304p304J3370K2871J0094j0181k4110
863i268k0912M492L0044K6649n17k5515l1936j2170K3308L9198J7577j7590l6443
876a3083k7513O135L8105L4543l55l1063l5312j2826K2389L9366J9589j4774l2257
889g056k5791l84K7997L1872P161j8977k7565j8051N597K6899K4123K175j6914
902A1086k4306j6803P239K6978K2584K018j8486k8442j6619J3502L2357K2115
914C3223l481k6506l2124r186K5160L5943J6052j4738l5411k8370O713L6303L1137
927C4715J246k7204l4868j2836K2791L5693J5697j3438k9370k2888M178K7742
$$ plain form
939 1458 24656 23985 5683 -14898 -22311 -9499 9895 16047 8512 -1742 -8855 -8762 -1155 4198
953 4198 2712 1919 3288 1315 -2365 -4777 -6591 -3515 6596 12524 5871 -5802 -13604 -12353 883
968 883 16180 16127 1005 -13370 -17318 -8543 8878 19187 11210 -5070 -15027 -14312 -3280 11273
982 11273 15381 5815 -5249 -11123 -11320 -3288 7766 11544 7552 551 -9261 -15770 -9123 6462
996 6462 17031 16076 2184 -18022 -25644 -9630 15523 28490 19360 -8028 -33078 -29693 1796
1009 1796 31795 35215 9445 -27318 -42726 -18749 22337 42823 27223 -11060 -41625 -36012
1021 -36012 2630 37203 38383 8668 -27635 -41083 -17783 20483 37757 22807 -7972 -31083
1033 -31083 -28005 -729 24451 26283 8925 -12061 -23536 -15822 4287 17955 16855 6282 -8086
$$ packed form
939A458K3198o71j8302k0581p413J2812J9394O152p535j0254p113R3P607N353
953D198j486p93J369j973l680k412j814L076J0111N928o653j1673p802J251J3236
968H83J5297n3j5122j4375l948Q775J7421J0309p977j6280r957P15J1032J4553
982A1273M108r566j1064n874j97Q032J1054L778l992p001r812o509O647J5585
996F462J0569r55j3892k0206p622J6014K5153J2967r130k7388k5050L385L1489
1009A796K9999L420k5770l6763j5408K3977M1086K0486j5600l8283l0565N613
1021c6012L8642L4573J180k9715l6303j3448K3300L8266J7274j4950l0779k3111
1033c1083L078K7276K5180J832j7358k0986j1475P714K0109J3668j100j0573j4368
$$ plain form
1046 -8086 -17856 -13112 1705 13589 16856 9683 -7207 -20377 -15817 1741 17958 22179 8150
1059 8150 -15650 -26207 -12537 11017 25425 19845 -3957 -25788 -22929 647 21423 23774 6488
1072 6488 -17503 -25330 -8217 14438 21418 10087 -9019 -19791 -10553 8361 15711 7098 -5527
1085 -5527 -11937 -6807 6124 11522 2218 -8448 -8591 -413 8869 10573 -787 -13891 -11855 2696
1099 2696 14296 13431 -315 -16921 -17905 -146 17023 17678 3462 -14440 -21162 -7553 13292
1112 13292 19851 8590 -8265 -18427 -12889 4788 16239 11050 -1517 -10300 -11200 -3174 6647
1125 6647 7857 2591 -682 -2635 -5048 -4329 -947 2117 6291 8235 1026 -10100 -12720 -4794 8048
1140 8048 17515 12132 -7614 -21919 -15802 4165 21894 22463 1218 -23814 -26219 -4216 20561
$$ packed form
1046h086r770M744J4817J1884L267p173j6890j3170M560J7558J6217M221j4029
1059H150k3800j0557J3670K3554J4408n580k3802k1831K859K3576K0776K351j7286
1072F488k3991p827J7113K2655O980j1331j9106j0772R238J8914P350q613j2625
1085e527o410N130J2931N398r304j0666j43Q178R282J704j1360j3104K036J4551
1099B696J1600q65j3746j6606r84J7759J7169O55j4216j7902o722J3609K0845
1112A3292O559j1261j6855j0162N538J7677J1451n189j2567q783r00Q026R821
1125F647J210n266l273j953k413P19L382L064M174J944p209j1126k620P926J2842
1140H048R467n383j9746j4305O117J9967J7729N69k1245k5032k405K2003K4777
$$ plain form
1153 20561 28065 11421 -17273 -30605 -14272 13858 28218 18621 -7260 -27304 -20959 5136
1165 5136 23589 19753 506 -18364 -20096 -2222 15848 16257 3356 -9298 -13026 -4615 7941
1178 7941 10183 1967 -4548 -4620 -987 3685 3605 -2364 -4715 1200 6227 4073 -1934 -7397 -6914 2689
1194 2689 11798 8019 -3816 -11228 -9319 1441 13166 12067 -2111 -13276 -11196 217 11854
1207 11854 13484 576 -13285 -12203 374 10941 11566 1157 -11649 -11796 1103 11174 9111
1220 9111 -790 -10596 -10568 1795 12742 8848 -3845 -11967 -9626 2607 14080 10693 -5177 -15187
1234 -15187 -10022 3633 14634 12221 -4037 -16839 -11888 3554 14344 12655 -1281 -15655 -13965
1247 -13965 1871 13744 11891 -7 -12459 -13465 -91 12466 10557 -873 -9834 -10047 -263
$$ packed form
1153B0561P504j6644k8694j3332J6333K8130J4360r597k5881k0044O345K6095
1165E136J8453l836j9247j8870j732J7874J8070M09j2901j2654l728Q411J2556
1178G941K242q216o515p2L633M672q0n969k351N915N027k154o007n463M83R603
1194B689R109l779j1835p412J909J0760J1725j099j4178j1165K080J1413J1637
1207A1854J630j2908j3861J082J2577J0567O25j0409j2806j47J2899J0071k063
1220I111r901r806K8J2363J0947l894j2693q122K341J2233J1473l387j5870j0010
1234a5187N165J3655J1001k413j6258j2802M951J5442J0790j689j3936j4374J690
1247a3965J5836J1873j853j1898j2452j006J3374J2557j909j1430q961k13R784
$$ plain form
1260 -263 10240 8684 -2502 -8895 -5985 1744 8286 6619 -3724 -9969 -4172 5257 8768 4424
1274 4424 -5280 -11175 -4315 8112 11104 3041 -7085 -11476 -4851 8631 13251 3458 -8614 -11624
1288 -11624 -4563 7588 13701 5156 -8820 -12472 -3992 7445 12742 5780 -8249 -13149 -3364 8448
1302 8448 11492 4514 -7314 -12590 -3542 9475 11487 2726 -7501 -11229 -3772 9149 12335 2216
1316 2216 -8728 -10587 -3095 8544 12573 2606 -9858 -10714 -1500 8276 11030 2811 -9447 -11060
1330 -11060 -514 9003 9284 1556 -8570 -10665 -259 10392 9082 -766 -9348 -9868 91 11643
1344 11643 10316 -2418 -11709 -9585 1012 11884 11752 -1707 -13591 -11112 1234 11833 12485
1357 12485 504 -13431 -13502 -164 11671 12502 2458 -10897 -14115 -2596 10172 11282 2735
$$ packed form
1260b63J0503j556j1186o393K910P729O542j667j0343o245N797R429L511m344
1274D424r704n895O860J2427K992q063j0126m391O625J3482M620r793j2072l010
1288a1624P061J2151O113q545j3976l652Q480J1437N297o962j4029m900R785J1812
1302H448L044o978j1828n276R048J3017K012q761j0227l728P457J2921L186j0119
1316B216j0944j859P492J1639M029r967j2464q56R214R776K754q219j2258j613
1330a1060J0546R517K81p728j0126k095J0406J0651j310r848q582n20R959J1552
1344A1643j327j2734r291K124J0597J0872j32j3459j1884K479J2346J0599O52
1357A2485j1981j3935p1J3338J1835Q31j0044j3355l218J1519J2768J110q547
$$ plain form
1370 2735 -7203 -11101 -4041 6869 8854 1759 -4797 -6162 -2504 3940 5307 -811 -5004 -1885 2781
1385 2781 3963 1156 -4937 -7331 -145 8868 8039 -1042 -9637 -11040 -1219 12405 14197 1121 -12791
1400 -12791 -15415 -4678 12048 19261 6861 -12534 -19287 -8885 9215 20326 12519 -8236 -20214
1413 -20214 -12481 5186 17651 14820 -2065 -16742 -13887 1308 12937 12992 2102 -10776 -12173
$$ packed form
1370B735r938l898P060J0910J985p095o556j365L658O444J367o118m193L119M666
1385B781J182k807o093k394P186R013q29r081q595j403R821J3624J792j3076j3912
1400a2791k624J0737J6726P213j2400j9395o753J0402J8100J1111p807k0755j1978
1413b0214P733J7667J2465k831j6885j4677K855J5195J1629N5j0890j2878j397
$$ [...]
8191a65
##END NTUPLES=NMR FID
##END=
