##TITLE=1H_EC-3226(1)
 CDCl3, 8 sc, 
 4.3.2020
##JCAMPDX= 6.0         $$ Bruker NMR JCAMP-DX V2.0
##DATA TYPE= NMR FID
##DATA CLASS= NTUPLES
##ORIGIN= UXNMR, Bruker Analytische Messtechnik GmbH
##OWNER= root
$$ XWIN-NMR		Version 3.5
$$ Wed Mar  4 14:10:31 2020 Russian Standard Time (UT+4h)  she@DPX200
##.OBSERVE FREQUENCY= 200.1315
##.OBSERVE NUCLEUS= ^1H
##.DELAY= (6, 6)
##.ACQUISITION MODE= SIMULTANEOUS
##.ACQUISITION SCHEME= undefined
##.AVERAGES= 8
##.DIGITISER RES= 18
##SPECTROMETER/DATA SYSTEM= spect
##.PULSE SEQUENCE= zg30
##.SOLVENT NAME= DMSO
##.SHIFT REFERENCE= (INTERNAL, DMSO, 0, 15.7039)
##AUDIT TRAIL= $$ (NUMBER, WHEN, WHO, WHERE, WHAT)
$$ ##TITLE= Audit trail, XWIN-NMR		Version 3.5
$$ ##JCAMPDX= 5.01
$$ ##ORIGIN= Bruker BioSpin GmbH
$$ ##OWNER= she
$$ F:/spectra/data/she/nmr/H-F/1/audita.txt
$$ ##AUDIT TRAIL=  $$ (NUMBER, WHEN, WHO, WHERE, WHAT)
(   1,<2020-03-04 14:09:06.73 +0400>,<she>,<DPX200>,
      <created by zg, POWCHK disabled, PULCHK disabled
       configuration hash MD5:
       00 E9 B6 7A A2 85 ED C7 34 08 36 98 17 FE 4E 26
       data hash MD5: 16K
       99 7B 7D 82 87 21 99 D4 51 4C E5 DB 64 30 57 41>)
$$ ##END=
$$ 
$$ hash MD5
$$ E4 6A B3 DE 32 3B AC 10 BA 88 E5 CD 7A F8 B5 00
##$RELAX= 
##$RELAX= 
##$RELAX= 
##$RELAX= 
##$RELAX= 
##$RELAX= 
$$ Bruker specific parameters
$$ --------------------------
##$DU= <F:/spectra>
##$EXPNO= 1
##$NAME= <H-F>
##$PROCNO= 1
##$TYPE= <nmr>
##$USER= <she>
##$AMP= (0..31)
100 100 100 100 100 100 100 100 100 100 100 100 100 100 100 100 100 100 
100 100 100 100 100 100 100 100 100 100 100 100 100 100 
##$AQSEQ= 0
##$AQ_mod= 1
##$AUNM= <au_zg>
##$AUTOPOS= <>
##$BF1= 200.13
##$BF2= 200.13
##$BF3= 200.13
##$BF4= 200.13
##$BF5= 200.13
##$BF6= 200.13
##$BF7= 200.13
##$BF8= 200.13
##$BYTORDA= 1
##$CFDGTYP= 0
##$CFRGTYP= 5
##$CHEMSTR= <none>
##$CNST= (0..31)
1 1 145 1 1 1 1 1 1 1 1 1 1 1 1 1 1 1 1 1 1 1 1 1 1 1 1 1 1 1 1 1 
##$CPDPRG= <>
##$CPDPRG1= <>
##$CPDPRG2= <>
##$CPDPRG3= <>
##$CPDPRG4= <mlev>
##$CPDPRG5= <mlev>
##$CPDPRG6= <mlev>
##$CPDPRG7= <mlev>
##$CPDPRG8= <mlev>
##$CPDPRGB= <>
##$CPDPRGT= <>
##$D= (0..31)
0 1.2 0 0 0 0 0 0 0 0.06 0 0.03 0 0 0 0 0.0002 0 0 0 0 0 0 0 0 0 0 0 0 
0 0 0 
##$DATE= 1583316546
##$DBL= (0..7)
120 120 120 120 120 120 120 120 
##$DBP= (0..7)
150 150 150 150 150 150 150 150 
##$DBP07= 0
##$DBPNAM0= <>
##$DBPNAM1= <>
##$DBPNAM2= <>
##$DBPNAM3= <>
##$DBPNAM4= <>
##$DBPNAM5= <>
##$DBPNAM6= <>
##$DBPNAM7= <>
##$DBPOAL= (0..7)
0.5 0.5 0.5 0.5 0.5 0.5 0.5 0.5 
##$DBPOFFS= (0..7)
0 0 0 0 0 0 0 0 
##$DE= 6
##$DECBNUC= <off>
##$DECIM= 24
##$DECNUC= <off>
##$DECSTAT= 4
##$DIGMOD= 1
##$DIGTYP= 9
##$DL= (0..7)
0 120 120 120 120 120 120 120 
##$DP= (0..7)
150 150 150 150 150 150 150 150 
##$DP07= 0
##$DPNAME0= <>
##$DPNAME1= <>
##$DPNAME2= <>
##$DPNAME3= <>
##$DPNAME4= <>
##$DPNAME5= <>
##$DPNAME6= <>
##$DPNAME7= <>
##$DPOAL= (0..7)
0.5 0.5 0.5 0.5 0.5 0.5 0.5 0.5 
##$DPOFFS= (0..7)
0 0 0 0 0 0 0 0 
##$DQDMODE= 0
##$DR= 18
##$DS= 0
##$DSLIST= <SSSSSSSSSSSSSSS>
$$ [...]
##$SUBNAM2= <"">
##$SUBNAM3= <"">
##$SUBNAM4= <"">
##$SUBNAM5= <"">
##$SUBNAM6= <"">
##$SUBNAM7= <"">
##$SUBNAM8= <"">
##$SUBNAM9= <"">
##$SW= 24.9337058887773
##$SWIBOX= (0..15)
0 0 2 0 0 0 0 0 0 0 0 0 0 0 0 0 
##$SW_h= 4990.01996007984
##$TD= 16384
##$TD0= 1
##$TE= 0
##$TE2= 300
##$TE3= 300
##$TEG= 300
##$TL= (0..7)
0 120 120 120 120 120 120 120 
##$TP= (0..7)
150 150 150 150 150 150 150 150 
##$TP07= 0
##$TPNAME0= <>
##$TPNAME1= <>
##$TPNAME2= <>
##$TPNAME3= <>
##$TPNAME4= <>
##$TPNAME5= <>
##$TPNAME6= <>
##$TPNAME7= <>
##$TPOAL= (0..7)
0.5 0.5 0.5 0.5 0.5 0.5 0.5 0.5 
##$TPOFFS= (0..7)
0 0 0 0 0 0 0 0 
##$TUNHIN= 0
##$TUNHOUT= 0
##$TUNXOUT= 0
##$USERA1= <user>
##$USERA2= <user>
##$USERA3= <user>
##$USERA4= <user>
##$USERA5= <user>
##$V9= 5
##$VALIST= <valist>
##$VCLIST= <CCCCCCCCCCCCCCC>
##$VD= 0
##$VDLIST= <DDDDDDDDDDDDDDD>
##$VPLIST= <PPPPPPPPPPPPPPP>
##$VTLIST= <TTTTTTTTTTTTTTT>
##$WBST= 1024
##$WBSW= 4
##$XGAIN= (0..3)
0 0 0 0 
##$XL= 0
##$YL= 0
##$YMAX_a= 827015
##$YMIN_a= -698621
##$ZGOPTNS= <>
##$ZL1= 120
##$ZL2= 120
##$ZL3= 120
##$ZL4= 120
##$ABSF1= 10
##$ABSF2= 0
##$ABSG= 5
##$ABSL= 3
##$ALPHA= 0
##$AQORDER= 0
##$ASSFAC= 0
##$ASSFACI= 0
##$ASSFACX= 0
##$ASSWID= 0
##$AUNMP= <proc_1d>
##$AZFE= 0.1
##$AZFW= 0.1
##$BCFW= 1
##$BC_mod= 2
##$BYTORDP= 1
##$COROFFS= 0
##$CY= 11.3945322036743
##$DATMOD= 1
##$DC= 2
##$DFILT= <>
##$DTYPP= 0
##$F1P= 16.9975609425685
##$F2P= -3.02152046262296
##$FCOR= 0.5
##$FTSIZE= 0
##$FT_mod= 4
##$GAMMA= 1
##$GB= 0.15
##$INTBC= 1
##$INTSCL= 1
##$ISEN= 128
##$LB= 0.24
##$LEV0= 0
##$LPBIN= 0
##$MAXI= 10000
##$MC2= 0
##$MEAN= 0
##$ME_mod= 0
##$MI= 1.114404
##$NCOEF= 0
##$NC_proc= 0
##$NLEV= 6
##$NOISF1= 3.799351
##$NOISF2= 2.8
##$NSP= 1
##$NTH_PI= 0
##$NZP= 0
##$OFFSET= 15.70392
##$PC= 1
##$PHC0= -9786.222
##$PHC1= 13.80082
##$PH_mod= 1
##$PKNL= yes
##$PPARMOD= 0
##$PSCAL= 0
##$PSIGN= 0
##$REVERSE= no
##$SF= 200.130013532006
##$SI= 16384
##$SIGF1= 3
##$SIGF2= 2
##$SINO= 400
##$SIOLD= 16384
##$SREGLST= <1H.CDCl3>
##$SSB= 0
##$STSI= 0
##$STSR= 0
##$SW_p= 3612.71676300578
##$SYMM= 0
##$S_DEV= 0
##$TDeff= 0
##$TDoff= 0
##$TI= <>
##$TILT= no
##$TM1= 0
##$TM2= 0
##$TOPLEV= 0
##$USERP1= <user>
##$USERP2= <user>
##$USERP3= <user>
##$USERP4= <user>
##$USERP5= <user>
##$WDW= 1
##$XDIM= 8192
##$YMAX_p= 0
##$YMIN_p= 0
$$ End of Bruker specific parameters
$$ ---------------------------------
##NTUPLES= NMR FID
##VAR_NAME=  TIME,          FID/REAL,        FID/IMAG
##SYMBOL=    X,             R,               I
##VAR_TYPE=  INDEPENDENT,   DEPENDENT,       DEPENDENT
##VAR_FORM=  AFFN,          ASDF,            ASDF
##VAR_DIM=   8192,          8192,            8192
##UNITS=     SECONDS,       ARBITRARY UNITS, ARBITRARY UNITS
##FACTOR=    0.0002004,     1,               1
##FIRST=     0,             0,               0
##LAST=      1.6414764,     0,               0
##MIN=       0,             -698621,         0
##MAX=       1.6414764,     827015,          0
$$ Real data points
##PAGE= N=1
##DATA TABLE= (X++(R..R)), XYDATA
0 0 0 0 0 0 -8 8 -1 16 -14 16 -24 25 -33 43 -49 63 -76 87 -106 125 -144 171 -196 227 -265 301 -343 394 -443
29 -443 503 -568 635 -715 801 -891 996 -1110 1229 -1367 1517 -1678 1860 -2057 2276 -2525
45 -2525 2799 -3108 3460 -3860 4327 -4873 5523 -6320 7311 -8588 10317 -12776 16600 -23389
59 -23389 38993 -148865 234982 798364 491286 -127580 -629882 -530528 -14378 456832 450306
70 450306 154809 -196597 -391625 -314761 29652 304219 332675 146500 -132680 -354262
80 -354262 -286426 10723 283041 359084 195647 -187129 -465975 -307805 154670 460928
90 460928 363124 -54809 -424109 -367118 44278 324460 253956 34999 -127245 -175311 -100786
101 -100786 4082 64198 132540 171054 32626 -188464 -230288 -65032 143334 257946 164403
112 164403 -104948 -275989 -173154 62416 231862 222093 -4359 -247767 -205486 64086
122 64086 214400 115274 -78196 -165842 -38509 161901 134296 -108810 -209671 -32885 181183
133 181183 208606 25129 -212611 -239707 -1787 213207 193890 38219 -118084 -202634 -121424
144 -121424 75016 180516 129824 13472 -115486 -177749 -88518 57736 126366 138359 91540
155 91540 -83595 -255628 -204823 48823 287934 304965 16495 -351209 -380773 -17996 325973
166 325973 334027 65984 -232627 -313156 -113115 133139 203029 139701 31269 -117750 -207616
177 -207616 -133480 30028 165493 216526 104050 -141610 -290189 -197262 46754 284812
187 284812 333333 61343 -332058 -427810 -115981 300264 453629 191066 -270426 -458939
197 -458939 -186555 206399 341486 192029 -68465 -243804 -201699 -21845 114970 169337
207 169337 149754 6344 -176949 -204412 -60669 113129 214305 160326 -50326 -223213
217 -223213 -188561 -10601 171607 242983 98792 -170602 -266442 -85941 150087 221140 94049
228 94049 -110145 -177099 -37119 96088 61786 -12518 -3217 30467 23752 -27142 -89064 -59318
240 -59318 83175 152873 41309 -98753 -123043 -49045 69326 142005 69161 -74797 -118779
251 -118779 -47571 49535 110665 63698 -73671 -117688 4267 110459 64988 -51669 -111841
262 -111841 -44834 104797 143610 -14094 -159459 -102959 52155 129114 83258 -39404 -118882
273 -118882 -61226 39107 50888 22659 22969 2089 -41525 -46794 -26864 -2584 53135 84587
285 84587 21858 -67440 -100192 -74337 23632 151786 141994 -44076 -198197 -156566 29368
296 29368 199291 180380 -41434 -217384 -140879 54288 138301 85443 -15561 -81472 -57568
307 -57568 311 -1175 -9785 44634 74473 10785 -66239 -92456 -59874 41225 135257 95260
319 95260 -43399 -136816 -125476 -10238 150646 182112 8015 -175664 -166689 -5378 145679
330 145679 155458 5607 -135324 -98294 25971 60149 23446 7165 8884 7283 -9119 -54592
342 -54592 -61168 33488 114958 61334 -50707 -99513 -69361 22424 114509 94237 -24455 -101506
354 -101506 -82055 -1604 95575 113532 -3498 -116014 -76098 40737 89921 44634 -42150
365 -42150 -76096 3098 84836 32056 -67157 -56278 30754 75962 41746 -43993 -91606 -17832
377 -17832 86758 72747 -18880 -61153 -42464 3525 57497 53500 -18563 -59030 -26967 18837
389 18837 48207 41791 -29290 -81418 -16251 76254 62757 -22903 -77413 -52144 41238 100497
401 100497 22892 -92371 -74357 33665 76729 29243 -41204 -67543 -8514 66335 40487
412 40487 -42821 -52873 -384 31780 34734 7922 -45938 -53687 8958 52912 36344 -5594
424 -5594 -55369 -67804 9246 91119 51762 -52824 -86927 -30406 53593 83375 4401 -91485
436 -91485 -59079 50520 70457 -3291 -57310 -43667 18978 66678 22950 -62878 -58653 20008
448 20008 54754 28943 -11550 -49941 -44348 20563 60674 27289 -22323 -47442 -42138 18342
460 18342 77372 34823 -58963 -68363 3934 60303 51814 -19414 -77903 -27698 71364 64038 -32352
473 -32352 -71070 -19102 47643 66222 7704 -71215 -55712 37575 70592 19700 -28252 -44248
485 -44248 -26765 28709 60293 18218 -32880 -37992 -16691 25101 60242 20224 -55687 -48771
497 -48771 27376 58098 19637 -35307 -53488 2722 75512 44094 -58913 -75476 9736 74185
509 74185 55331 -19814 -81358 -47656 52290 80005 10545 -46108 -43863 -16011 27632 52026
521 52026 14434 -35159 -33629 -5937 17557 33796 10536 -39381 -29457 31723 38341 -15220 -46026
534 -46026 -23529 32073 67508 13282 -83177 -76233 34151 93133 39574 -46740 -84325 -36053
546 -36053 55980 74917 -2031 -54734 -33695 -445 18756 27182 2188 -28499 -14016 11653
558 11653 7271 -2887 -10270 -22589 40 46184 26873 -47804 -66437 -6194 60618 71763
570 71763 806 -93911 -80363 39097 99771 35396 -49703 -70314 -25200 43203 56468 -3993
582 -3993 -42016 -12144 13930 4076 -1109 -2329 -8256 6887 22251 -398 -24695 -17158 -3371
595 -3371 18208 45472 18869 -52479 -62268 9351 66700 52866 -12748 -73376 -49325 45873
607 45873 78892 5492 -55799 -32841 20220 43493 17507 -36156 -40114 24662 56831 9350
619 9350 -37911 -34536 -5964 33412 52954 11602 -46057 -46606 -5400 37027 60431 25192 -55635
632 -55635 -73563 4475 69453 50735 -12258 -59024 -40106 34862 61674 -2402 -51227 -15501
644 -15501 32931 30771 -4499 -38575 -28840 30097 54164 1275 -44661 -27327 4906 23454
656 23454 30918 6038 -31588 -27872 2590 16915 21036 10940 -25200 -33784 12320 35631 -1496
669 -1496 -33268 -20189 15751 42530 15904 -55031 -65796 20197 82330 36963 -46020 -77138
681 -77138 -32810 49706 78386 9452 -63391 -50817 2532 31579 35395 8240 -34460 -34731 4894
694 4894 24140 14109 -3135 -26164 -24021 23190 44520 -7543 -54117 -30936 25401 56769
706 56769 30349 -44051 -75090 -7934 63464 45654 -13109 -38145 -26420 4164 24677 6305
718 6305 -11930 10576 22443 -14258 -37884 -14940 17980 39260 36232 -9688 -56125 -41508
730 -41508 9166 46668 59751 23979 -56620 -87245 -15123 70996 80636 18301 -59892 -78046
742 -78046 -3892 66411 41831 -17925 -23319 3300 11800 -2810 -27202 -21178 35902 69789 13784
755 13784 -61534 -67435 -14931 49372 85628 45310 -47563 -93424 -53181 27346 95484 89149
767 89149 -13010 -108763 -85381 15615 82471 75224 11444 -55408 -60723 -17066 9818 24123
779 24123 53130 47704 -20657 -81640 -70979 3128 89869 101764 1914 -102418 -94794 -5839
791 -5839 68181 85476 34827 -50759 -84520 -39555 22822 57901 52684 -1203 -56352 -43732
803 -43732 4265 16654 7999 12981 18553 10652 -15214 -56889 -55980 28036 102509 60196 -49162
816 -49162 -106658 -66624 35936 107665 65750 -40118 -86202 -50623 6327 51861 59523 9986
828 9986 -44807 -47973 -17295 14461 37593 24160 -15852 -23378 591 -1813 -18458 -4317 23143
841 23143 28770 10426 -27684 -48572 -8739 45914 34239 -14175 -23987 -2327 10574 3936 -17709
854 -17709 -23104 20480 58995 20974 -50143 -64291 -18973 43109 79017 44404 -42001 -87337
866 -87337 -50983 22677 84661 85304 -2782 -98701 -88548 7142 81342 78937 13124 -57956 -61105
879 -61105 -6656 22167 15438 25403 38478 10541 -39187 -65763 -40875 38824 104786 66636
891 66636 -41529 -101530 -72449 6409 88615 105129 25789 -75042 -107086 -58044 39645 118820
903 118820 92425 -23869 -104977 -86886 -14311 61039 95252 55335 -23471 -79182 -90789 -41316
915 -41316 68397 140123 75782 -69043 -150627 -99661 42129 152686 114935 -31895 -129316
926 -129316 -103150 -8075 82330 107373 38501 -58246 -91816 -53478 13264 70057 66725 2414
938 2414 -47404 -43837 -25833 -8633 25184 51769 39571 -5660 -63029 -84926 -18349 84391
950 84391 98238 9997 -76595 -88972 -27301 55375 78981 22887 -34623 -45551 -33101 -7615
962 -7615 31049 43409 13872 -16300 -30244 -29446 -2930 27571 23852 5041 995 -12237 -32594
975 -32594 -17299 22086 35800 16768 -14985 -36996 -15576 30347 28273 -18970 -29535 9716
987 9716 37082 21570 -24553 -58325 -24988 53124 75465 13462 -52620 -66819 -29562 38758
999 38758 81498 46208 -29263 -71864 -58425 3987 75292 79730 1713 -65519 -59379 -12756
1011 -12756 31554 51301 31898 -2006 -20230 -37729 -48100 -4880 68733 82253 15196 -67067
1023 -67067 -95962 -38121 65852 106677 42911 -44381 -80966 -61239 2511 71879 79954 20501
1035 20501 -46527 -77489 -53924 20585 80765 62591 -371 -46389 -64249 -46015 15233 72894
1047 72894 73081 17795 -63108 -110078 -54128 71589 127663 55014 -60913 -116665 -69435 40200
1059 40200 104477 61355 -23220 -66182 -59589 -17859 40427 62389 26494 -20846 -44896 -42108
1071 -42108 -6201 35532 36345 8696 -6682 -20641 -38682 -24157 21006 48125 34912 -11345
1083 -11345 -60471 -52421 19280 64736 31124 -23724 -41159 -21545 12194 27656 5326 -15103
1095 -15103 -1311 9249 -5252 -11640 -2278 2785 6869 12910 922 -12627 -8740 -3809 -1879
1108 -1879 14349 20147 -6172 -23468 -4897 12830 9051 -2710 -12451 -3516 25910 24990 -23763
1121 -23763 -48860 -8670 43531 51134 10831 -46275 -60615 -5242 54078 50135 7795 -26915
1133 -26915 -43661 -27600 18664 47099 32212 -120 -31214 -43582 -11844 33498 37615 12065
1145 12065 -4834 -17196 -30459 -19243 12513 37997 43689 10750 -52951 -71661 -6221 66068
1157 66068 67792 10483 -52094 -67245 -15411 46031 50153 14140 -12681 -30567 -34443 -6762
1169 -6762 27110 32531 17981 -5689 -32845 -32528 352 22785 22936 20841 3191 -34240 -45807
1182 -45807 -10522 35032 53354 25186 -40001 -70990 -20812 47401 52918 9016 -31482 -40503
1194 -40503 -12892 22001 20771 -414 -1682 225 -13126 -15794 -411 8481 10564 10247 -4555
1207 -4555 -19109 -11333 486 3991 14704 18681 -9125 -32853 -16057 15540 27841 14579 -18264
1220 -18264 -35365 -4006 33138 18289 -18397 -23119 -1937 16862 18538 -5333 -27453 -9572
1232 -9572 20620 16390 -4349 -8441 -8037 -5541 7408 11497 637 -3289 -2603 -7899 -815 14451
1246 14451 4813 -13643 -4674 14180 9992 -4829 -16122 -12476 15636 35220 5490 -35220 -26845
1259 -26845 12691 31846 19915 -9309 -30728 -12284 20860 19336 -2809 -6126 -1000 -3111 696
1272 696 5651 84 -786 5384 683 -3092 3240 -1291 -11846 1571 20977 10709 -13061 -20433
1286 -20433 -8627 16284 30867 4687 -32578 -22417 16431 25883 5645 -14513 -18702 -304
1298 -304 21601 10373 -16089 -13689 6708 9057 2603 -102 -7841 -9227 3414 8196 1858 846
1312 846 -3687 -14531 -4566 17476 11389 -11947 -17011 -3536 11281 16772 -2681 -27185 -12102
1325 -12102 22868 21260 -9747 -23778 -11971 9411 22849 6888 -22340 -18607 7958 13293
1337 13293 933 -3028 -5484 -6913 2210 7048 -1405 -3539 -690 -6232 -1910 13330 6871 -16239
1351 -16239 -15253 5353 16124 10950 -6967 -24188 -9283 22620 20033 -11502 -19795 -1575 12572
1364 12572 11566 -3062 -18977 -6717 21691 18214 -10742 -19836 -7059 5920 17535 16308 -4609
1377 -4609 -19752 -12588 -235 13702 26314 11313 -24175 -29799 104 22983 21793 4762 -16503
1390 -16503 -17051 5095 11018 -4506 -2530 16677 14055 -8643 -23236 -18640 9215 38737 25321
1403 25321 -19294 -36435 -14255 10725 25001 24797 1387 -23651 -23058 -7294 10597 28060 22873
1416 22873 -11507 -30267 -13419 6877 12504 13911 8214 -3201 -7742 -14826 -21437 2265 39582
1429 39582 34148 -12926 -46202 -35447 7540 48010 40130 -11885 -44596 -28160 1885 22489
1441 22489 29752 11989 -19081 -28704 -14477 3537 21791 23599 -2111 -23942 -13500 1765
1453 1765 1528 3922 10454 7737 -548 -12992 -24962 -9962 26877 32803 -2947 -30285 -23068 45
1467 45 20720 19448 -4942 -17063 -3274 3827 -5311 -3073 6579 6341 1771 -2181 -11250 -9960 4894
1482 4894 9437 3934 5482 -20 -17127 -16322 8082 21251 12382 -6674 -22860 -14684 15887 24598
1496 24598 -3517 -20647 -4210 13474 13128 -2055 -19355 -14694 16443 29173 3700 -19985
1508 -19985 -18771 -6648 10370 25524 16474 -8943 -22375 -19016 -3234 25178 35137 3753 -29024
1521 -29024 -25757 -2807 15324 23216 12937 -6051 -12064 -10833 -14839 -873 30227 33386 -1284
1534 -1284 -33854 -35728 -4851 36524 43957 3274 -33502 -28978 -6115 12946 26462 19717 -4722
1547 -4722 -19709 -18757 -10139 9933 26923 15620 -9170 -15235 -11865 -10652 1442 19921 22974
1560 22974 8997 -15792 -40991 -28397 25597 56434 24670 -28560 -51240 -30189 18897 49883
1572 49883 27864 -15630 -33448 -26367 -8031 20372 35600 15221 -16096 -30368 -24459 1691
1584 1691 30358 26833 -3981 -20296 -17045 -12247 835 19587 21236 4091 -15908 -28951 -18685
1597 -18685 17980 37450 10864 -22588 -25064 -7266 10661 16735 3007 -9779 -1458 5992 -6918
1610 -6918 -13300 895 12308 11722 4384 -11085 -20019 -6357 11937 14158 11235 1675 -19496 -25888
1624 -25888 1107 27674 23723 -667 -25287 -26863 4920 32157 16737 -14582 -18100 -2638
1636 -2638 8904 10283 761 -9352 -1945 10085 2725 -6728 -9 3690 -1941 86 5069 3097
1650 3097 1063 -1854 -9332 -3927 13285 12951 -3706 -7986 -3204 -3106 498 8257 8757 6210 -506
1665 -506 -17370 -20431 8697 33746 18404 -14874 -30588 -18139 13861 34052 14233 -17903
1677 -17903 -21249 -5470 4174 10439 11725 1245 -7747 -5916 -5356 -2631 7857 8579 -2027 -1686
1691 -1686 3437 -6043 -14898 -4565 13230 20785 11183 -17649 -36750 -12203 28430 33187 5145
1704 5145 -21098 -28725 -13064 14246 23251 10296 -1458 -11070 -23221 -16330 12112 28624 17249
1717 17249 -6222 -27009 -27751 328 27034 22856 4151 -11654 -25201 -22962 5250 30665 25962
1730 25962 -2 -28156 -34869 -4690 32973 29205 -3351 -20916 -15842 -3142 8021 8617 1266
1743 1266 3042 7086 -6920 -20993 -9023 12118 19119 13459 -3307 -22209 -19605 1906 16949
1756 16949 20324 13986 -10895 -33534 -19840 16176 33570 20185 -9094 -32128 -21597 12357
1768 12357 26149 10674 -2667 -6384 -10262 -8557 1703 10154 14592 11796 -9110 -25390 -10130
1781 -10130 16676 20368 7173 -6629 -15247 -9032 6936 11523 4750 2446 -2650 -11139 -5439 10085
1795 10085 10133 -2555 -7025 -3593 4321 11112 834 -16619 -9115 15461 18524 -1129 -15715 -14562
1809 -14562 1028 17901 13026 -7939 -13085 -828 3313 544 2943 2146 -2001 -31 -367 -4879
1823 -4879 -1468 3370 -1546 -709 8345 4903 -11731 -15007 -1846 12914 18279 4294 -20352 -22792
1837 -22792 2420 17608 10262 804 -5230 -10167 -8274 -2958 1783 12640 18416 -1003 -26400
1850 -26400 -23122 2794 21862 23690 5075 -22088 -28380 -7870 13062 22897 20591 -2144 -30702
1863 -30702 -29849 2136 28525 28204 4927 -25311 -29485 -2378 18404 14248 5419 1314 -7243 -13714
1877 -13714 -10749 -1110 14819 25556 8998 -22569 -28612 -6109 15952 24688 16234 -7248 -24396
1890 -24396 -17462 -107 15483 25948 14407 -16611 -30640 -11189 13987 23304 15154 -5414
1902 -5414 -18941 -10546 1992 3906 8162 16026 6619 -14015 -20395 -8665 12483 27092 14272
1915 14272 -16253 -25700 -5438 13074 14933 9201 -3682 -13300 -7976 2578 6274 8197 6173
1928 6173 -6679 -12025 1194 10095 2671 -4743 -4813 462 8639 7009 -9215 -13479 3432 13772
1942 13772 4366 -6158 -6655 -1988 4726 3847 -5750 -5690 8135 9183 -5017 -11117 -5815 1511 9822
1957 9822 10354 -1677 -11035 -8828 -4878 1760 14532 14825 -6024 -21222 -15242 3129 18043 17385
1971 17385 -2532 -18386 -11801 1109 2288 4778 11094 6591 -6319 -16499 -17160 -266 25277
1984 25277 25474 -4794 -27344 -22172 -2153 18596 25692 8791 -15280 -23264 -15615 1494 23513
1997 23513 27170 824 -26087 -24350 -3708 16158 22529 8588 -10625 -14366 -8241 -5588 3378
2010 3378 19195 18831 -2358 -21827 -23733 -4483 24191 30346 3325 -22591 -21752 -5482 10210
2023 10210 20070 14180 -3693 -15372 -14181 -5773 11145 21949 8840 -11981 -14848 -5008 3292
2036 3292 8511 8515 2398 -914 -3065 -10909 -9281 10313 21008 7334 -12206 -17698 -7327 11421
2050 11421 19033 3682 -11846 -7606 1590 2704 3532 3828 99 -2120 -482 -2280 -1333 4375 1879
2065 1879 -4706 -487 7286 1593 -6542 -6060 -474 6423 9134 -1787 -12002 -3578 7570 3145
2079 3145 -4726 -1825 2930 4828 910 -9599 -11569 5128 16533 5991 -9232 -12040 -7380 2384
2093 2384 11786 8991 -2099 -7896 -9934 -8725 4292 17203 9248 -9084 -14629 -7782 2896 10606
2107 10606 6787 -3218 -3935 -466 -6765 -9365 3581 14995 10473 -4217 -17644 -17082 4759 21923
2121 21923 12945 -7316 -14490 -10087 -2042 9577 12178 4092 -4818 -9411 -10831 -772 14196 12043
2135 12043 -2856 -9590 -6008 -1401 3184 4905 1965 2388 2976 -6553 -13463 -851 14857 12814
2149 12814 -1019 -12633 -12974 1387 15314 8845 -5559 -6566 -821 -86 1341 3905 2101 446
2163 446 166 -3415 -3653 4276 5627 -1651 -1895 3616 1795 -3063 -3020 -420 4865 7954 -529 -11494
2179 -11494 -4339 9903 8670 -2622 -7462 -3677 4640 9598 518 -10341 -5105 6955 6582 -304
2193 -304 -2447 -3910 -3271 2003 4017 1554 1968 -973 -8091 -4734 6955 8405 -990 -5875 -4955 -683
2209 -683 4836 2857 -4657 -2361 6349 1926 -8161 -6530 2883 8132 6071 -4393 -12400 -4960 9159
2224 9159 7714 -2488 -4726 -2546 -916 1125 1373 -1343 132 2321 -2296 -4308 1604 2446 -3607
2239 -3607 -2509 3596 3888 -305 -5468 -7975 491 12597 7717 -8837 -12301 -1356 7268 7540 489
2254 489 -7099 -4414 4424 3281 -4193 -2771 3820 2834 -299 -1817 -3625 -1549 3296 2693 -7 2622
2270 2622 795 -7143 -6473 5142 10015 4895 -3226 -9873 -6195 6114 9912 653 -3183 681 -983
2285 -983 -5223 -3282 3308 9226 9524 -2928 -16749 -9945 9752 16110 6831 -4258 -11755 -9424
2299 -9424 2965 11112 8058 3136 -4058 -11749 -8259 7217 13826 4971 -4584 -8501 -4998 4612
2313 4612 7200 -1035 -3059 4711 4364 -5528 -8468 -1670 6822 11484 3621 -10981 -11647 1394 7872
2328 7872 5301 2497 -752 -6150 -5246 -937 2872 6612 6647 -4028 -11761 -3950 5666 5321 1801 -197
2344 -197 -3177 -2963 -1528 -2817 158 8537 5611 -7887 -10873 -1067 7073 6675 -422 -8682 -5844
2359 -5844 6054 6771 -4066 -7743 -1107 4165 4944 1237 -6287 -8172 -436 4723 4882 5200 -135
2374 -135 -11275 -11518 2969 13482 10932 -1313 -14580 -14178 3006 14901 7106 -3479 -5583 -4384
2388 -4384 -2971 820 3667 5005 6541 -629 -12016 -10235 4504 11922 7106 -532 -7608 -9096
2402 -9096 -1624 4787 5505 6478 4158 -6510 -13191 -4024 8455 10928 6420 -2947 -10259 -6461 1784
2417 1784 3583 5568 10003 3877 -11441 -15898 -4209 12341 20784 9732 -14330 -23172 -5951
2430 -5951 13276 17548 9365 -4855 -15965 -11817 2639 11956 13312 6116 -9343 -17317 -5254
2443 -5254 10885 12811 4353 -4775 -9201 -4103 3361 2632 26 4766 5101 -4719 -9938 -3822 4649
2458 4649 9324 5833 -5013 -10205 -2007 4926 1967 231 2211 251 -3055 -3772 -3028 1106 7525
2473 7525 4315 -5513 -6663 -773 794 1314 3545 2292 -2270 -4640 -5193 -2059 7571 9285 -3419
2488 -3419 -12523 -4712 6360 8762 2489 -7917 -9890 1863 10667 3043 -6421 -6327 -2100 2499 6351
2503 6351 3513 -3819 -6281 -4155 -1576 6224 10796 926 -11896 -10067 1227 9452 9388 552 -9399
2518 -9399 -7599 1502 3470 1947 5146 4240 -4413 -8830 -5438 2993 11450 10055 -4678 -14131 -5692
2533 -5692 5444 7983 5605 483 -5223 -5155 -1369 555 3816 7968 3474 -6519 -7572 -466 3000
2548 3000 4380 5029 929 -2391 -3162 -6193 -3986 8602 15424 3410 -12567 -15212 -3922 12157
2562 12157 17936 4280 -13143 -13565 -2395 6064 10025 8673 -878 -10010 -9579 -2312 6425 13154
2576 13154 6543 -9021 -12638 -2646 5694 6763 4653 -739 -5125 -3809 -2727 -1417 5925 9815
2590 9815 310 -10659 -8087 1403 7805 7313 -1120 -8904 -3729 3994 2262 -2299 478 2171 167
2605 167 -1745 -3505 -3230 2533 5869 -144 -4016 -1188 -884 -2732 1395 4854 2096 -2634 -6195 -5837
2621 -5837 2775 10693 3675 -9066 -9000 1062 7094 5469 -1521 -8217 -4172 4832 4447 -1518 -1513 -694
2637 -694 -2255 -1456 2333 2479 1565 -917 -5453 -4593 4845 7770 -121 -4975 -3040 -1446 1577 3504
2653 3504 1896 205 -56 -3719 -7330 799 10631 7713 -3594 -9898 -7344 3022 12194 6957 -5471
2668 -5471 -7427 -1462 653 2257 4781 2963 -549 -2355 -4633 -3459 4390 8282 1808 -3704 -2862
2683 -2862 -2554 -1817 2401 5805 4893 1594 -5941 -11354 -2786 12301 12904 -42 -10442 -10865 -1951
2698 -1951 9335 10169 1043 -4581 -4283 -4832 -2950 5515 9364 3999 -3972 -9482 -7814 2823 11612
2713 11612 6501 -2878 -5533 -5461 -4200 2755 8496 6164 -514 -7646 -11002 -2663 11087 11143 -1671
2728 -1671 -9307 -6791 -733 4905 5214 -646 -2566 588 -1939 -5857 -1255 5812 5261 309 -4627
2743 -4627 -6796 -2473 4784 4476 54 -743 -1842 -5386 -3569 3980 6357 2421 -3173 -7709 -4088
2758 -4088 5938 7709 -1159 -5811 -1793 1680 1351 116 -2197 -872 3543 1561 -4907 -3409 2893
2773 2893 3037 -503 -1308 -1280 345 2806 426 -3993 -800 3645 1385 -1681 27 73 -2078 -859
2789 -859 1025 2873 4585 507 -8316 -6939 4716 10384 4227 -4130 -8116 -4542 4384 7823 1868
2804 1868 -1869 -378 -2594 -4700 -241 5880 5839 2417 -4036 -9078 -3654 6221 7358 2493 82
2819 82 -3471 -7338 -3576 4634 8996 7268 -796 -11881 -11017 3757 13201 8039 -2067 -7384 -7791
2834 -7791 -1307 5265 5061 3289 2751 -3734 -10677 -5496 5554 10679 7050 -2500 -11462 -9633 2020
2849 2020 8692 6855 3384 -2717 -10447 -9264 2061 10623 9553 981 -10513 -13024 -605 10409
2863 10409 7636 38 -3646 -5407 -4682 -410 2160 4254 5428 399 -9564 -9168 1798 8470 6530
2878 6530 667 -6179 -8029 -1420 4106 3362 3546 1735 -5108 -8250 -1581 5311 5978 2041 -4007 -7066
2894 -7066 -1164 4862 1722 -1988 806 2477 -1158 -3054 -2728 644 5234 4651 -3788 -6728 -126
2909 -126 4409 1632 -324 -1072 -1528 970 1399 -1902 -1233 2831 1366 -1684 276 1994 -725 -2329
2925 -2329 -1034 1141 4452 4385 -3525 -8222 -967 7132 5418 385 -3111 -3822 -512 2859 1002 -55
2941 -55 3768 2596 -4400 -6007 -40 4657 5969 3081 -4514 -7006 -1054 3285 3264 4162 3202 -3946
2957 -3946 -8118 -3589 3674 8478 6687 -2912 -10827 -5178 4622 5791 2437 931 -2402 -3836 -2846
2972 -2846 -1160 2126 7734 6010 -5292 -11143 -4156 4819 8165 5890 -2413 -8459 -5468 548 3264
2987 3264 5420 5200 -2230 -9227 -5946 2125 6650 6035 -834 -7599 -4926 2608 2977 33 1313 1928
3003 1928 -1740 -3913 -3768 -831 5378 6841 -1295 -8344 -4103 2258 3581 2654 285 -3340 -2472 -109
3019 -109 -891 752 4427 1698 -4409 -4018 622 2335 2049 410 -2299 -1132 2120 86 -3538 -262
3035 -262 4100 1460 -2453 -2743 -1238 2661 4435 -1113 -5212 -318 4558 1944 -1749 -2379 -1196 1658
3051 1658 3775 897 -2521 -1148 217 -1493 1644 4739 1713 -3563 -4012 -1448 3367 6959 2131
3066 2131 -6059 -5027 2267 3556 1174 350 -348 -215 109 -1613 -2657 2674 6378 997 -4864 -3673
3082 -3673 -162 2603 3958 1132 -2811 -1631 76 -1845 -801 4584 3546 -1635 -3786 -2703 -71
3097 -71 3554 3063 -1779 -2081 842 -706 -3568 453 4734 3608 -855 -5733 -6363 1214 8644 4361
3113 4361 -4445 -5771 -2232 1150 3768 2959 -1214 -1967 -1128 -2334 -1129 3795 3468 -2265 -3992 -824
3129 -824 1448 1549 11 -2681 -1349 3533 2128 -4230 -3784 1387 2931 1752 -614 -3593 -2128 1945
3145 1945 1162 -1938 228 3030 -74 -3492 -2589 131 3056 3996 -550 -5166 -2071 2265 1310 461
3161 461 1696 -191 -2613 -2043 -858 1771 4381 1774 -4409 -3861 2391 3733 274 -1564 -977 1109
3177 1109 3266 216 -5194 -1796 4792 4417 -656 -3089 -2914 -993 3573 3994 416 -710 -1480 -3681
3193 -3681 -1805 5012 6008 282 -4594 -4907 -1079 5097 5965 -810 -4132 -904 633 -427 712 2246
3209 2246 1596 133 -1804 -3973 -90 5527 3340 -2766 -3490 -210 1401 1594 230 -1713 -309 2412
3225 2412 454 -3064 -585 1478 635 46 1314 -394 -1317 -1037 -1689 572 4970 2790 -4663 -6236
3241 -6236 -200 4788 5035 329 -5569 -4872 1289 4229 316 -1271 316 -592 -1800 -927 -253 898
3257 898 2235 -121 -3367 -1043 1907 -189 -1784 710 2468 520 -1465 -3623 -2812 3105 5369
3272 5369 -59 -4262 -2212 -48 876 1600 1185 478 249 -2472 -5251 -950 6411 5765 -1454 -6049
3288 -6049 -4863 -153 5681 5467 -904 -4244 -2605 -1475 668 4796 4519 -998 -4769 -3544 -80
3303 -80 4955 5259 -1490 -5463 -645 2572 1122 -547 -444 410 1843 931 -3137 -3092 2790 4440 481
3320 481 -1758 -1279 -994 493 1701 987 570 1373 -1251 -3958 183 4625 2646 -947 -2345 -2490 689
3337 689 3514 1179 -1921 -294 1194 -1692 -1883 1590 2541 991 -1361 -3596 -1755 4065 4402 -2078
3353 -2078 -5086 -867 2443 3337 1254 -2731 -3539 519 2656 487 434 572 -2884 -3478 614 3587
3369 3587 2775 -129 -4547 -5121 1741 6268 2233 -3555 -3071 -596 760 1364 354 -806 1026 751
3385 751 -3384 -3213 1904 3918 1063 -1696 -2639 -2448 1010 2419 -85 -491 1261 -1179 -3786 -1433
3401 -1433 2844 3334 1574 -2234 -4612 -1645 2957 2192 -339 572 206 -2616 -3238 -50 3194 4955
3417 4955 2087 -5567 -7410 244 6410 4797 -398 -3802 -4551 -604 3528 3377 1221 529 -2521 -4586
3433 -4586 -422 4779 3933 -375 -2987 -3286 128 4224 2155 -1694 -803 1869 -62 -2040 -174 1279
3449 1279 2362 1456 -1866 -3489 737 3958 1263 -1775 -903 -169 508 551 -639 -726 1454 1912 -1856
3466 -1856 -1535 1984 1877 -666 -759 -381 478 1593 -22 -2387 90 2940 518 -2413 -629 2124
3482 2124 1062 -350 -2593 -2610 2142 4981 -10 -5101 -2997 1126 3045 2624 -508 -3514 -2542 252
3498 252 532 1798 3690 118 -5056 -4663 795 4139 4247 -40 -5286 -4283 843 2457 737 975
3514 975 1145 -2256 -3705 -2082 1040 4731 4653 -2278 -7507 -3702 2916 4359 3171 -643 -3582 -3440
3530 -3440 -389 681 2041 4264 1177 -4644 -5488 -398 3455 3865 1747 -2612 -3891 -1310 295
3545 295 283 2736 4410 -302 -5384 -4868 77 5383 6614 72 -6620 -5099 1312 3836 3346 1936
3561 1936 -1242 -3565 -2200 -458 1845 4564 3140 -3407 -5375 -994 2619 3125 1813 -796 -2717
3576 -2717 -765 -73 -346 1580 4062 1279 -4208 -3448 170 3681 3860 285 -4107 -2174 2047 1836
3592 1836 -811 -346 659 1 -25 -958 -1026 1104 2549 -447 -2124 582 1419 -602 -858 343 832
3609 832 1185 88 -2404 -1776 2364 1703 -1354 -1460 892 1183 -237 -1899 -2131 731 4262 1571 -3937
3626 -3937 -3612 203 1836 2101 1120 -1281 -2192 -1185 -1010 -159 3287 3336 -1820 -4907 -2647 566 3257
3643 3257 3313 -595 -3223 -2215 -860 -1005 1817 4641 1730 -3537 -5910 -2882 3078 7357 3576 -4217
3659 -4217 -6704 -2162 2030 3462 3504 872 -3035 -3573 -2935 -54 4419 5796 -217 -5657 -4325 -319
3675 -319 2889 4408 2296 -1906 -2877 -2879 -1982 1358 6312 4165 -3019 -6514 -4025 1712 6361 4926
3691 4926 -1739 -5071 -2285 -70 1415 3231 3267 -192 -2891 -4121 -1925 2702 6058 2193 -3586
3706 -3586 -3964 -1282 1018 2785 2949 442 -1423 -2194 -3235 36 4702 4688 -1223 -4671 -2431 805
3722 805 3429 2449 -1000 -2602 240 833 -821 -309 1981 1533 -330 -1443 -1681 -71 2694 1137
3738 1137 -1863 -817 1042 21 -862 -27 620 641 363 -1209 -1884 1032 1885 -1303 -1938 607 1764
3755 1764 530 -1401 -2936 -791 2867 2995 -1312 -3060 -930 282 499 796 684 -75 -258 -1579
3771 -1579 -2683 346 3772 2096 -1832 -3162 -1885 202 2055 2154 402 -764 -1239 -3532 -1714 3178
3787 3178 4934 672 -3956 -4950 -1952 3691 5229 699 -3516 -2243 -1047 -457 1330 3388 1705
3802 1705 -729 -2915 -3644 -23 4814 3659 -679 -2810 -2104 -1303 1011 3055 2388 867 -1460 -3996
3818 -3996 -3231 2496 6023 2445 -2824 -4261 -2384 1456 4052 1912 -864 -575 -1038 -2200 -627 3090
3834 3090 3327 749 -2168 -3962 -1560 3426 3940 73 -1514 -1283 -1210 -602 1338 2475 1293 -435
3850 -435 -2451 -2921 845 4085 1193 -2291 -1536 -82 1006 921 -575 -1349 1398 2280 -1099 -2314 39
3867 39 1748 1094 149 -978 -1159 355 1196 -1071 -548 1572 735 -1692 -1308 263 895 536 -289 -1637
3885 -1637 40 1620 -77 -2610 -405 1979 1316 -281 -2130 -2003 641 2493 476 -1643 -57
3900 -57 348 -1027 -1163 418 1264 1982 -295 -3219 -3023 1511 3447 1113 -906 -1628 -2072 -1092 1332
3917 1332 2016 1999 757 -2991 -4750 -161 4654 3960 -322 -3564 -3285 -278 2930 1501 -746 -541
3933 -541 3 -1660 -1834 639 2242 2064 329 -2691 -2995 321 2498 1259 37 548 -679 -2394
3949 -2394 -935 1027 2643 2784 -474 -3948 -2488 2219 3167 1001 -406 -954 -1486 -147 457 845
3965 845 2197 2206 -2091 -4046 -1072 2743 3432 1671 -1569 -3557 -481 2052 1378 385 573 -211 -2155
3982 -2155 -884 744 1749 1367 -214 -2353 -778 2097 1315 -1727 -697 653 1642 -1 -1638 -2338
3998 -2338 422 3150 1306 -1999 -1923 121 -97 495 851 242 -49 73 -1649 -1526 1798 2890 -481
4015 -481 -2444 -1212 -306 899 1118 -399 -881 755 -122 -1786 -759 1900 1697 -162 -1431 -1430 414
4032 414 1850 116 -1819 -138 1556 186 -1872 -1503 270 2358 1835 -877 -3429 -1326 1453 1398
4048 1398 919 858 -807 -2547 -1389 287 2133 2766 -135 -3894 -3449 1996 3746 1479 -1331 -2184
4064 -2184 -1182 647 1513 -241 466 1770 -183 -2442 -911 1340 1846 1168 -778 -1986 -359 1625
4080 1625 438 -614 1017 1325 -433 -1487 -1105 318 2188 1981 -1173 -2123 277 1127 11 313
4096 313 1602 809 -754 -1788 -1902 1174 4213 1351 -3225 -3121 -184 1939 2255 980 -1618 -1963
4112 -1963 119 392 -96 1428 1371 -1062 -2292 -214 836 1409 1057 -1439 -1601 981 1675 -834 -1481
4129 -1481 584 1653 423 -824 -2098 -886 1775 1762 -901 -1029 389 -321 -872 140 594 898 806
4146 806 -1212 -2438 -184 2600 1163 -1025 -1507 -858 -155 859 754 -332 175 135 -2012 -1104 1450
4163 1450 1972 -169 -1817 -1671 32 2013 1301 -1758 -1904 1188 999 -639 -1344 -302 293 1058 480
4180 480 -1250 -1046 926 236 -431 824 1326 -296 -1517 -738 239 1846 1666 -1394 -2560 194 1891
4197 1891 918 -436 -220 -660 334 316 -756 15 1872 1076 -2253 -1704 673 1803 1274 -190 -1788
4214 -1788 -921 1491 1264 -552 -258 870 -35 -531 252 312 377 962 -444 -956 604 1518 -647 -1577
4232 -1577 209 1801 1197 -278 -1588 -1269 1737 2628 -548 -1840 -355 789 787 451 -347 -982 724
4249 724 341 -1032 95 1458 140 -1622 -763 203 672 613 -538 -1519 246 1967 134 -1380 -208
4266 -208 631 116 -330 -724 -349 1238 669 -1363 -1595 1239 1588 -117 -1064 -1142 -92 1509 1114 -1617
4284 -1617 -1664 402 634 -652 -93 457 -330 -689 -303 -373 561 1359 -613 -2235 -113 1685 457 -1015
4302 -1015 -1309 -281 804 1203 -1159 -2094 562 1780 -6 -1085 -130 102 286 572 -756 -666 1153
4319 1153 842 -1084 -756 679 721 -238 -339 -612 528 1447 -104 -1450 -204 1727 570 -1194 -385
4336 -385 276 891 943 -729 -1468 988 1981 -570 -1658 -35 1422 876 274 -1123 -1384 1187 1734 -368
4354 -368 -511 277 53 -489 278 808 924 534 -927 -1666 -12 2542 1020 -1089 -801 302 709 812
4372 812 -51 -957 476 1138 -681 -1549 731 1760 935 -754 -1379 -1067 1001 1648 132 -797 242
4389 242 460 -1282 -572 940 1051 453 -675 -1501 -292 1885 982 -936 -733 346 -149 -625 -31 164
4407 164 1339 1113 -1512 -2805 -233 2651 1217 -169 -1509 -1714 135 1310 580 -264 271 4 -1665
4424 -1665 -951 1011 1410 354 -865 -1403 -764 1211 1107 -761 -566 742 119 -1018 -619 466 1047
4441 1047 617 -843 -2382 -165 1979 804 -1026 -673 210 68 569 -657 -835 771 1270 -330 -1226
4458 -1226 -250 856 -197 15 -269 -176 298 21 -1069 -315 1831 924 -1148 -933 221 872 946 0
4476 0 -1182 -2 1710 169 -1574 -123 1310 1098 -119 -1124 -1361 174 1403 626 -605 306 423
4493 423 -894 -588 825 1114 645 -306 -1990 -1144 1326 2228 111 -696 -294 -654 -651 17 549 977 1377
4512 1377 -783 -2811 -929 2389 2020 457 -1575 -2091 -486 1135 1251 64 218 152 -1395 -1631 312
4529 312 1070 948 -100 -2131 -1851 651 1347 -146 -548 246 -308 -1377 -1205 427 1370 2163 -261 -3077
4547 -3077 -1974 1495 1896 493 -297 -889 -995 144 300 -7 811 902 -1161 -1965 -274 1286 1199 331
4565 331 -726 -1315 181 822 -466 -277 888 480 -1403 -1171 79 612 1327 -109 -1847 -743 1091
4582 1091 1248 -792 -796 390 647 445 -290 -1046 -87 1490 647 -928 -335 596 217 -242 -171 520 670
4601 670 323 -562 -1133 827 1475 -140 -904 259 633 172 128 -554 69 1500 873 -1555 -1342 397
4619 397 1439 898 -84 -1442 -789 599 558 -56 304 968 -667 -1899 -444 802 1539 1035 -936 -1991
4637 -1991 -385 1250 266 -26 398 64 -1197 -1012 -558 710 2348 888 -2372 -2408 784 1853 855
4654 855 -492 -889 -745 -13 -21 -603 713 1207 -15 -1408 -851 446 644 912 -5 -1167 -121 843
4672 843 -501 -549 1356 1510 -820 -1589 -897 198 1604 1308 -1219 -1780 60 831 233 -206 426 -110
4690 -110 -108 -199 -687 83 1733 525 -1186 -993 452 372 99 271 -458 471 812 -342 -1300 230 1205
4709 1205 189 -735 43 25 328 73 -526 -471 1134 1231 -959 -1375 536 1677 1195 409 -1391 -1022 653
4728 653 1010 -161 16 512 -315 -721 -82 661 933 695 -632 -1455 30 1508 505 -410 175 471
4746 471 -29 -248 -863 -185 1387 1463 -795 -1750 -333 622 469 342 -269 -615 204 270 -663 -150 1718
4765 1718 846 -1405 -1356 -180 852 939 413 -1232 -797 357 5 -600 848 918 -402 -1313 -867 36
4783 36 1234 1406 -1140 -1916 63 1538 121 -439 -741 -161 460 400 -811 -855 607 526 -286 -335 138
4802 138 8 -306 -153 -235 431 878 -678 -1673 -68 1684 932 -559 -1031 -627 579 1104 -47 -809
4820 -809 246 935 -766 -647 277 947 532 -336 -1132 -844 973 1242 -302 -955 -27 65 -276 -108 203
4839 203 281 969 211 -1073 -436 1159 465 -712 -191 514 -259 -2 -336 -738 1130 2113 -516 -2057
4857 -2057 -747 840 1165 707 -719 -1507 -227 1283 452 317 539 316 -767 -618 648 1164 866
4874 866 -606 -1968 -541 1426 1085 -277 -577 -294 71 176 117 -81 483 718 -520 -1754 40 1280
4892 1280 854 -324 -793 -817 281 1098 -468 -1067 87 765 -491 -713 213 392 192 153 -771 -348 1116
4911 1116 503 -805 -277 210 61 -1083 -474 8 902 1137 -623 -1869 -408 1980 934 -382 -1072
4928 -1072 -695 80 1126 111 -323 -16 21 -690 -648 624 950 -103 -808 -1196 -512 1019 885 -1126
4946 -1126 -1211 734 345 -132 -234 -200 204 18 -118 -803 321 1055 -2 -1394 -436 1140 1020 572 -876
4965 -876 -1435 -37 1508 322 -580 -240 371 -148 -161 340 678 294 105 -1052 -616 1210 1321 -625
4983 -625 -655 -27 184 881 285 -526 277 1068 258 -1736 -893 1467 958 612 -497 -1475 -458 1257 755
5002 755 -23 518 393 -1566 -1459 393 1306 1250 -161 -1669 -1819 507 1828 675 -94 -369 -784 -981
5020 -981 82 847 1100 810 -1124 -2453 -795 1906 2087 386 -1284 -1226 -883 1233 1163 188 -136 -322
5038 -322 -1428 -1079 626 1278 886 33 -1377 -1334 525 1136 375 -279 326 89 -874 -668 60 885 1016
5057 1016 -314 -1850 -1426 1074 1681 268 -707 -602 -529 81 493 -80 616 814 -723 -1690 -361 1019
5075 1019 543 -82 -646 -1167 105 1089 13 -388 307 380 -495 -480 177 922 471 -302 -868 -259 1505
5094 1505 1068 -1280 -1085 -18 601 908 11 -864 -911 656 834 -325 389 443 -419 -686 239 788 889
5113 889 515 -1282 -1656 273 1630 780 -139 -187 -184 -227 255 -76 374 1127 -44 -1786 -1497 1134 1693
5132 1693 836 -265 -1570 -1091 141 847 89 291 492 -846 -1617 -225 1230 1577 921 -836 -1849
5149 -1849 -679 834 919 668 590 -286 -1449 -1045 70 1283 1795 506 -2253 -2355 266 1842 1330
5166 1330 -85 -941 -1563 -295 688 326 565 939 -580 -1800 -543 865 1333 522 -635 -1411 -398
5183 -398 716 554 -240 336 -90 -858 -985 -500 976 1156 452 -1444 -1357 119 1156 141 -332 -260 222
5202 222 -38 -89 -143 -223 883 611 -975 -603 483 524 -81 156 -113 -140 758 -113 -616 115 925 -8 -851
5223 -851 122 285 294 -91 -794 -269 808 1307 -441 -1020 -314 609 911 111 -371 -1022 157 511 69 -1
5243 -1 1126 88 -892 -695 217 688 993 61 -1240 -636 447 635 206 372 678 -587 -661 -374 593
5262 593 1504 978 -804 -2254 -452 1035 978 213 -457 -942 -511 503 151 103 1304 468 -781 -1012
5280 -1012 -18 765 691 195 -900 -899 171 223 -140 124 756 -347 -1348 -608 51 1157 1206 -658 -1822
5299 -1822 -641 946 409 170 88 -205 -332 -67 -404 -14 898 538 -559 -1243 -275 621 581 145 -408
5318 -408 -530 71 100 -283 159 592 -101 -1128 -602 483 813 1054 -458 -1117 15 877 497 -520 -300
5337 -300 -6 57 127 -389 -596 443 879 -216 -636 375 446 124 -471 -93 -217 415 -63 -650 -133 818
5357 818 403 -889 -274 447 578 68 -354 -790 369 1404 423 -862 -244 521 469 318 124 -186 151
5376 151 591 -743 -237 705 945 112 -767 -185 272 447 616 -268 -807 102 347 -416 294 1077 53
5395 53 -472 -969 -447 616 1334 235 -1463 -581 477 560 417 -65 -111 -181 294 -453 -300 513 1182 -369
5415 -369 -1053 -427 -44 280 246 8 -632 67 11 -725 -52 967 420 -785 -1124 -94 463 980 592 -950
5435 -950 -863 557 345 -57 -70 563 306 -81 -924 -640 753 1136 -21 -1251 -558 133 249 495 -91
5454 -91 -316 -193 59 -507 -73 1148 575 -347 -844 -49 144 562 100 -794 -451 791 185 -986 -402
5473 -402 511 522 200 -640 -707 298 1021 215 -800 -384 539 185 -93 273 17 110 355 -715 -412 997
5493 997 695 -194 -692 21 298 256 -36 -569 -39 851 876 -792 -554 297 837 177 -216 10 272 586
5513 586 -372 -886 -249 754 544 -394 -514 -257 288 671 61 -607 257 86 -407 -523 805 891 -232
5532 -232 -914 -830 -127 859 704 -610 -932 306 92 -73 -195 289 408 -8 -329 -1389 -135 1178 670
5551 670 -603 -703 -100 119 429 297 267 122 -332 -1161 -773 899 1480 126 -731 -1251 -540 768 812
5570 812 233 -641 104 -222 -751 -160 894 316 134 -936 -1193 -239 1300 978 -596 -931 -362 -325 174
5589 174 241 -18 44 -443 -811 -926 716 1133 45 -994 -723 44 564 352 -127 -563 653 403 -931
5608 -931 -497 630 850 91 -168 -527 -481 617 909 -276 -224 291 59 -341 168 472 494 194 -513 -927
5628 -927 82 787 174 -748 -122 273 288 66 -223 -262 507 411 -433 -331 355 199 -167 -424 -354 177 1248
5649 1248 27 -887 -663 486 1102 100 -374 -435 -362 -302 407 562 144 181 -678 -1054 239 1224 695 -449
5669 -449 -833 -618 281 928 98 -661 -47 -89 -706 -557 193 620 807 -115 -1183 -834 309 1165 62
5688 62 -292 -39 -568 -207 -89 142 775 536 -666 -1212 -331 1032 959 -117 -529 -812 -326 642 294 -47
5708 -47 342 96 -956 -1034 419 935 643 -369 -1306 -976 582 1190 131 -273 -209 -292 -521 225 380 201
5728 201 79 -371 -801 105 1090 490 -595 -440 -56 103 238 232 -713 29 593 -110 -452 311 762 125
5748 125 -143 -143 -69 531 678 -583 -592 135 625 102 -187 258 -63 -29 167 -531 162 1005 173 -827 -509
5769 -509 425 872 473 -67 -645 -179 -99 -338 -176 685 665 -481 -912 -992 362 1106 1143 -293 -1310 -858
5789 -858 602 597 663 316 -448 -755 -506 109 544 1295 103 -1249 -1199 306 817 648 -21 -885 -475 -65
5809 -65 30 23 459 670 -549 -1405 -632 405 1056 560 -819 -1085 -104 746 -48 188 160 84 -454 -182 -240
5830 -240 600 895 190 -967 -779 224 150 -18 257 205 -42 -54 -179 -636 155 586 -45 -1190 -628 224
5850 224 464 211 -206 -826 -169 1150 -95 -321 137 252 -458 -50 370 318 372 -194 -720 -166 1122 548
5870 548 -492 -602 -317 256 865 276 -486 -452 -200 -211 -262 570 724 359 -1099 -911 -115 871 1471 356
5890 356 -1005 -701 342 146 543 987 -18 -487 -709 -391 188 1152 799 -797 -988 -601 360 657 370
5909 370 -203 -218 -436 -433 -474 486 1293 525 -855 -1135 -443 454 1142 638 -892 -801 -476 -108 387 981 540
5930 540 -401 -992 -749 -123 987 1271 -394 -1024 -287 -14 325 452 274 16 -390 -459 -427 175 836 241
5950 241 -942 -1039 -9 671 589 116 -550 1 216 258 -454 -35 306 -358 -186 -291 -307 88 237 -491 -377
5971 -377 130 655 -58 -679 -270 548 472 299 -305 -267 440 118 -669 -122 652 402 -113 -478 -632 181 1056
5992 1056 355 -653 -455 85 -93 -12 179 489 41 -115 -655 -556 826 1004 -4 -888 -593 -361 -185
6011 -185 328 422 28 -226 -645 -727 5 1268 1259 -44 -894 -923 165 847 985 32 -584 -141 -252 -72 773
6032 773 746 -112 -408 -631 -326 772 1335 84 -440 -348 35 230 367 338 36 -302 -123 -659 -421 1120
6052 1120 949 -273 -637 -588 -62 726 455 -86 -229 89 215 -515 -132 508 539 -150 -298 -670 250 877
6072 877 -81 -704 -174 317 -139 -243 138 277 35 -65 -216 -335 528 424 -35 -740 17 275 330 77
6092 77 -487 -49 226 706 -271 -264 20 -125 -99 128 -118 179 -61 -500 -941 -67 715 467 -326 -472 -205
6113 -205 77 392 -75 83 273 451 -579 -394 652 629 175 -403 -860 -384 456 745 -257 -403 230
6132 230 -241 -273 -81 362 583 457 -203 -749 16 619 309 -136 -126 -88 -87 -342 -29 132 127 231 -527 -850
6154 -850 155 883 430 -242 -708 -311 377 591 -47 -434 377 117 -38 -18 280 518 239 -230 -344 -194
6174 -194 670 325 -588 -221 69 -190 -224 154 -89 8 362 -205 -451 49 443 -124 -478 -315 165 441 77
6195 77 -425 -571 -98 319 -353 -358 -74 19 50 -255 -182 -89 84 200 -859 -141 298 41 -271 -345 -14 21 230
6218 230 -182 -333 75 439 86 -514 -199 454 135 120 -244 -697 195 370 108 -374 131 178 -323 -122 -33
6239 -33 353 432 -115 -550 -460 755 446 -130 -379 68 -210 52 -76 -142 -11 369 -101 -777 19 530 197
6260 197 -183 -614 -426 -35 417 15 -450 356 159 -190 -166 503 -76 258 153 -275 -11 105 -34 -198
6280 -198 -403 341 94 222 -96 75 315 16 -350 -420 173 556 288 -594 -75 95 -66 407 2 -703
6300 -703 -127 378 238 -203 7 -55 -165 90 -308 -56 729 298 -486 -355 -94 40 -71 -31 120 111 -78
6321 -78 64 -240 -45 643 -22 -698 -367 202 314 278 -61 -418 -333 428 -90 -391 165 133 -208 -303 -283 181
6343 181 192 276 -420 -228 67 259 -266 -390 -87 -10 265 26 -340 36 705 -191 -195 -162 517 348 -2 38
6365 38 -392 -196 345 -77 -481 3 181 20 -15 93 3 215 310 -340 -379 209 627 -306 -507 84 327 19
6387 19 178 -5 263 122 -1 -155 60 338 359 -106 -461 -202 359 738 147 -825 -328 251 -128 -195 126
6408 126 177 50 244 -238 -277 418 632 -153 -358 -157 157 339 -21 -330 377 511 427 -151 -305 521 115
6429 115 -223 -349 -37 -130 236 11 -509 152 316 -96 -681 -193 465 160 83 -117 -407 85 245 -234 -298
6450 -298 117 209 46 -198 -49 -47 155 -255 -677 -366 336 48 -76 -565 -208 51 -91 -172 -501 -142 488
6471 488 499 -354 -129 102 54 52 -230 -262 -234 -75 -267 -211 300 404 -264 -431 -106 375 19 120 -139 -267
6493 -267 37 217 -110 -11 317 227 363 -317 -179 221 595 113 -498 -440 145 36 83 121 -35 266 171 -134
6515 -134 -483 221 385 49 -347 244 240 69 101 -523 -2 386 1 -432 -440 230 507 51 -383 -392 -138 198
6537 198 479 -362 -495 128 390 -242 106 -144 196 -97 14 -79 -200 265 25 -520 -90 250 306 -358 -199
6558 -199 -160 288 319 35 -622 -74 165 19 -241 116 215 380 -245 -275 -198 471 384 -182 -490 -127 308 -148
6580 -148 275 -141 -487 -383 189 -320 77 329 -261 -397 -202 -162 101 251 -258 -422 135 230 -61 -251 62
6601 62 188 110 107 -377 -147 504 354 -98 -177 17 293 -129 -19 42 95 -36 -492 -250 -292 302 269 -454 -677
6624 -677 -31 133 278 -311 35 -15 693 -165 -277 55 156 239 -98 -254 -40 697 75 -150 -54 469 751
6645 751 -13 -191 -53 -278 -13 161 -269 -152 511 -189 -493 -215 115 233 -133 -503 -420 107 513 423 -124
6666 -124 -293 423 -103 -185 -20 -12 76 128 -95 -362 28 383 148 -62 362 6 -114 116 -273 -185 403 -13
6688 -13 -352 -68 400 162 197 -325 -225 -62 286 244 22 -309 395 -227 -295 134 502 539 355 -488 -397 323
6710 323 559 -56 -316 -34 -257 172 115 -106 16 7 -231 -235 -18 454 -218 -384 -433 135 57 178 -111 -373
6732 -373 -198 512 254 -35 -1 200 195 -193 -168 -64 -22 123 -231 -465 283 297 165 -227 -133 52 132 228 241
6755 241 -131 205 0 -435 -530 202 158 310 97 -294 -99 239 194 -108 403 141 213 -329 -7 -11 628 273
6777 273 -54 -573 -333 559 284 221 -372 -108 -270 35 -137 336 198 -155 -417 -547 171 622 300 -140
6797 -140 -222 -174 175 169 -126 -128 371 172 -435 -229 600 223 148 -142 -492 11 474 314 -106 -248 60 61 -243
6820 -243 -40 -268 133 309 -386 -428 295 115 53 102 -84 -154 -20 3 -206 -136 152 -32 -276 -212 245 5
6842 5 -112 -338 -96 189 157 345 -138 -152 125 18 -251 59 -106 -53 286 -3 -443 228 334 -20 -269 -329
6864 -329 -303 -32 -10 -237 -312 244 177 -357 -40 266 -140 -62 -87 -92 116 304 -105 -426 53 -202 323 -137 -259
6887 -259 19 26 73 -83 47 27 210 147 -425 149 79 157 -195 -332 34 381 411 -323 -193 29 -135 -212 -192
6910 -192 -59 9 231 191 -117 -156 160 -5 -161 145 44 114 -94 -120 23 -8 361 51 -300 262 326 308 44
6933 44 -9 58 187 330 -149 -172 65 164 -182 -121 -67 -142 75 -248 -289 203 344 324 -171 -273 387 -68 86
6956 86 326 -260 -286 115 -196 -232 173 121 106 -80 -242 242 543 2 -109 -342 -196 -77 198 -627 19 -84
6978 -84 -22 -192 -124 -51 260 104 -200 -141 148 117 -36 53 -248 274 131 -6 -275 -50 218 128 -245 85 265
7001 265 -131 -200 53 -127 41 180 -126 -189 -106 88 -290 -347 259 279 391 161 -62 -123 312 186 -282 -87
7023 -87 26 8 -321 -137 -134 -37 111 -95 -177 99 239 132 -126 -425 75 235 425 154 12 -279 189 -222
7045 -222 147 46 -202 56 -67 -186 139 438 185 -319 -608 -45 168 52 266 -116 -305 -36 -161 -262
7065 -262 85 485 47 55 -25 -42 24 193 -137 -264 73 236 91 103 332 308 -224 -239 -434 -481 429 306 -36
7088 -36 -291 -161 95 143 195 -9 -60 38 75 72 25 290 38 -571 -248 -72 249 486 76 -403 -77 321 -54
7111 -54 77 -186 312 257 -52 -243 -75 212 194 102 -222 128 343 -235 -355 -267 -48 -7 121 22 -103 -54 -77
7134 -77 -103 283 240 128 59 -522 -91 -185 389 73 -280 -68 44 -32 138 47 45 -112 -8 -361 -377 574 608 35
7158 35 -182 -177 -2 111 161 267 -61 -65 36 -583 -68 404 213 204 -456 -446 225 174 550 -263 -400 -105 49
7181 49 83 274 393 256 -368 -431 -48 150 531 -42 -417 -221 -180 -13 353 6 377 -23 -180 -444 -321
7202 -321 309 98 83 -51 -401 -244 524 -150 63 -71 166 -20 -164 -90 36 82 -175 -81 -280 15 228
7223 228 22 -202 -167 -1 -10 53 -98 106 47 129 -164 154 297 35 -226 -432 360 251 290 -64 -118 -144 116
7246 116 257 -22 -120 188 -177 -196 9 398 314 208 -180 -523 -181 341 258 138 -224 -249 -362 192 3 -54
7268 -54 -21 -122 -381 -149 546 467 -71 -268 -117 -237 259 385 -12 -58 140 -243 -183 -5 203 477 51 -198
7290 -198 -356 105 463 454 143 -285 46 -194 141 286 215 -73 -138 -380 -253 304 187 48 -113 -13 -76 324
7312 324 158 -134 71 -11 -222 -372 20 471 144 99 -386 -298 -95 354 196 -88 215 90 -88 -51 -60 -262
7334 -262 -74 120 -55 -224 75 474 124 -6 -239 95 203 -22 -109 -113 0 67 -107 -307 158 84 140 4
7356 4 -71 -124 -26 18 -310 -238 -225 251 126 -164 -242 -161 274 36 -75 63 90 -162 -114 352 277 221 106 -13 -237
7381 -237 -133 2 -50 -21 -53 -152 -107 -81 352 101 434 62 -502 -259 -113 282 0 239 56 -154 -223 81
7403 81 88 356 -24 -226 -338 134 200 372 -106 -3 -30 -6 98 -170 35 -33 68 -113 -244 -9 414 573
7425 573 -187 -438 -171 87 378 260 56 136 33 -163 19 0 226 221 -57 -108 -155 228 110 125 -16 -91 -133
7448 -133 63 117 -48 170 93 -248 16 150 309 73 102 -271 -273 328 161 -55 -166 -98 -50 -4 200 265 94
7471 94 196 -8 109 -6 196 251 -342 -116 206 127 374 -14 -426 3 219 204 94 261 17 105 -8 184
7493 184 18 229 158 130 -5 -14 112 -187 -106 -88 9 -97 -217 -293 -213 312 195 -12 -147 -110 -265 122 216 -224
7517 -224 17 53 87 -450 238 250 124 -96 -87 116 222 59 22 -109 -301 390 -3 50 90 192 151 -187 -2
7540 -2 -90 282 49 31 64 -44 -213 -117 157 52 26 -4 157 -79 41 16 223 101 -90 319 234 -20 111
7563 111 65 99 79 31 -324 220 -41 144 145 -182 -200 -177 -91 74 -167 308 -150 -133 100 55 166 130 146 -234
7587 -234 74 16 114 -345 -7 347 387 -19 -98 -172 145 496 -114 -60 38 73 -68 -244 -92 248 154 12 -168
7610 -168 -8 153 -97 17 31 50 -112 2 -105 -458 -113 22 111 -289 -187 -23 19 -226 -209 47 102 53
7632 53 269 118 93 145 156 -99 -50 -53 67 -10 -5 -212 -35 -275 20 232 116 116 -238 -45 323 -312 19 -284
7656 -284 -229 -99 -112 85 -153 -312 -264 -149 -172 15 -275 70 -105 206 -172 41 181 -43 -230 39 -190
7677 -190 281 47 -186 -290 -73 -14 105 -160 -209 -110 -40 -22 -145 -16 260 113 -41 288 243 5 -151 -98
7699 -98 -169 30 168 19 -140 -192 281 370 -140 -43 -12 11 -52 -276 -159 270 186 109 -90 -7 -37 -136 -99 57 209
7724 209 59 96 -146 59 -9 67 334 15 -63 81 74 229 -276 -105 21 -134 88 -335 247 -253 122 -33
7746 -33 -399 176 96 207 -17 -8 -40 -63 -88 -144 18 345 -105 -98 28 256 -64 -120 21 9 47 79 55 -52 -63
7771 -63 -36 12 -74 392 135 51 176 122 -314 -98 -99 -14 -61 -4 137 48 -74 50 -139 43 45 -237 -30 135 -27
7796 -27 -206 11 100 184 86 -245 -238 -75 -63 68 -633 180 204 297 30 -63 -83 142 -170 -98 -27 -42 214 4 -107
7821 -107 -150 108 -98 60 -114 -99 226 12 -105 -144 -65 218 -52 227 110 30 187 144 -231 -180 -69 71
7843 71 117 6 -195 47 0 -225 32 -113 145 -16 -224 -101 134 -144 207 -170 -23 51 79 -20 128 28
7865 28 262 61 2 253 -153 20 -34 -343 54 296 83 -159 -102 213 65 -69 254 -233 -3 18 -59 5
7887 5 38 -78 -97 -196 -17 -129 259 -194 -239 -229 405 276 101 -233 101 219 103 -141 -115 198 206 -14 -384
7910 -384 -236 148 14 12 -166 -355 212 106 235 -45 253 83 71 -127 -66 -20 26 202 -206 15 -22 281
7932 281 -105 -112 54 75 -252 -173 -104 -129 62 84 170 -47 -182 -49 -114 -54 -70 -3 133 46 -142 -65 5 12 -299 96
7958 96 135 -2 145 -222 -155 266 165 31 -80 -72 165 208 145 -252 -150 -48 -15 60 105 119 106 134 2 304
7982 304 188 -154 151 -205 -29 -71 28 190 3 -93 -196 -67 71 177 147 29 80 44 -47 37 29 176 5
8005 5 -127 150 126 -128 88 -167 -129 258 -48 -150 45 33 26 -12 -37 -211 258 -128 309 -62 72 -387 -324
8028 -324 119 264 253 -210 -72 -123 131 319 -197 -233 -85 16 -83 168 168 159 28 -132 23 73 104 202 117 -444
8052 -444 -220 -187 163 92 327 46 200 55 324 40 64 77 -162 124 -33 333 145 96 258 -140 -30 -61
8074 -61 -97 -15 -80 83 -284 -460 231 -29 -283 -149 311 54 512 72 -84 439 40 -154 -64 -14 169 -79
8096 -79 347 -41 158 43 129 -37 -240 -31 -16 367 -113 -11 133 43 7 -273 222 80 -217 236 -314 46
8118 46 248 277 -454 -105 133 -375 58 9 69 -226 -249 100 229 -4 50 99 -230 -254 194 69 46 43 264 -137
8142 -137 -127 127 -234 338 68 230 -168 -108 14 179 243 122 -80 -127 -10 -34 119 299 216 92 -185 -260
8164 -260 48 129 194 -66 215 -217 -49 27 46 95 -8 -147 -24 -147 -15 -213 115 35 -192 37 -18 -207
8186 -207 99 62 81 -284 52
8191E2
$$ Imaginary data points
##PAGE= N=2
##DATA TABLE= (X++(I..I)), XYDATA
0 0 0 0 0 -8 8 -1 16 -16 16 -26 32 -36 50 -59 73 -90 106 -124 150 -174 206 -239 274 -320 367 -418 478 -541
28 -541 612 -696 778 -875 985 -1096 1226 -1367 1517 -1686 1871 -2071 2296 -2543 2814 -3115
44 -3115 3453 -3830 4259 -4745 5308 -5963 6735 -7670 8821 -10278 12199 -14854 18780
57 18780 -25205 37550 -70050 334664 827015 117538 -505171 -698621 -244935 341888 615697
68 615697 305070 -148930 -408387 -350405 -88288 269355 391973 210393 -95673 -295831
78 -295831 -321398 -89585 233083 367969 219440 -62997 -347101 -394300 -60938 380259
88 380259 462414 130253 -303656 -466604 -194769 264609 413321 153742 -148195 -233075
98 -233075 -152453 -3027 113852 126491 96478 55717 -80433 -222776 -153325 80136 230060
109 230060 195358 6664 -222768 -265582 -44624 199411 243251 95139 -140657 -275470
119 -275470 -123167 166660 234548 36986 -154666 -156202 11121 164469 84441 -146871 -180075
130 -180075 47646 214579 125957 -98182 -244423 -151567 120869 262580 119052 -101902
140 -101902 -195287 -155040 -5000 168173 186070 37884 -105761 -162380 -125882 13952 148355
151 148355 143158 52579 -39897 -156529 -210903 -57793 195784 294494 137957 -176656 -390156
162 -390156 -228773 195931 415694 215071 -145721 -339019 -239079 57314 266918 209790
172 209790 23646 -107998 -174747 -155196 -5362 158499 197802 116306 -50357 -229380 -238202
183 -238202 -22627 220164 301078 164207 -150145 -400580 -280937 138971 437680 339589
193 339589 -64227 -426123 -385766 39648 388969 328249 14719 -236895 -272456 -97592
203 -97592 128129 206844 138013 26398 -109088 -205188 -126419 75831 202579 175104 27873
214 27873 -163952 -232624 -82613 133072 225545 154810 -46728 -245613 -214061 47284 242902
225 242902 186160 -21807 -187114 -163168 26718 148530 67346 -42982 -31277 13628 -101
236 -101 -39616 -58324 -7618 101531 115698 -28939 -146870 -97807 26957 112867 111439 -462
248 -462 -126287 -112630 10410 94948 90546 8099 -102429 -101843 38606 119416 29992 -88233
260 -88233 -94164 5785 115702 96751 -70818 -169106 -50755 115997 130387 19111 -96821
271 -96821 -121483 -21883 84288 68670 -146 -16415 -22083 -47390 -33442 9805 32463 50967
283 50967 46214 -27525 -97124 -74394 1760 82029 132572 58609 -121950 -197993 -61604 135928
295 135928 207179 86569 -137949 -228756 -63082 150006 165360 31717 -80670 -101363 -36894
306 -36894 38834 38813 9933 34983 44105 -27867 -86329 -58983 11379 87441 116656 27691 -109256
319 -109256 -138265 -44588 82969 166423 110220 -84715 -206147 -100441 98218 183417 99872
330 99872 -72652 -164208 -66644 83213 94382 14323 -18603 -9372 -8478 -16793 -31741 -18136
342 -18136 58877 101024 13304 -96009 -93116 -9426 75533 110547 42798 -80339 -114589 -34532
354 -34532 59906 104974 66195 -56079 -129542 -43078 83795 92535 6048 -69256 -66394 20391
366 20391 82435 14907 -78677 -44868 52492 69201 3152 -66982 -73132 14519 97262 50223
378 50223 -57931 -76729 -17269 34487 56757 27840 -43650 -65323 -7016 41395 40292 9852
390 9852 -45405 -67974 6166 83106 39671 -56927 -77960 -16993 62866 80198 -12695 -106432
402 -106432 -54903 65286 79847 -2071 -64127 -54689 13954 69713 25654 -58506 -51100 21109
414 21109 44834 18635 -14690 -46326 -33743 31308 59600 14650 -35162 -53018 -33004 38440
426 38440 88110 21671 -79748 -76229 12142 77435 62941 -25424 -93938 -34796 74986 69974
438 69974 -26046 -66238 -21013 40949 59609 2845 -68517 -42390 45903 63840 7335 -35642
450 -35642 -43565 -16519 42494 61632 5817 -45449 -41049 -7907 40829 68155 9881 -73038
462 -73038 -54316 35901 71455 28073 -40695 -66981 -3379 80515 49949 -53690 -69953 8664
474 8664 64426 46827 -20750 -73853 -32948 60106 70178 -7805 -53939 -37031 316 42364
486 42364 50042 -5230 -52231 -33099 9251 36687 42902 -3474 -63320 -37848 44263 56797
498 56797 -4488 -49657 -38378 19956 66941 19514 -73098 -63658 37341 80108 22937 -53367
510 -53367 -76575 -16742 72316 69700 -22903 -72150 -35346 13031 39751 38492 -8296 -51250
522 -51250 -30645 13091 26774 21462 -4789 -40995 -23054 35044 32569 -27392 -44479 -2885
534 -2885 41383 45009 -14624 -83340 -47681 65010 91891 1944 -78515 -70814 3911 77046
546 77046 62903 -29539 -72409 -22435 26972 30142 17812 -7924 -30891 -11026 19887 10883
558 10883 -7942 -8195 -8051 7717 35534 10763 -51846 -48000 26842 71974 41977 -35154 -90764
571 -90764 -42276 75051 101050 1516 -80383 -59531 11861 64105 49667 -20217 -51772 -6398
583 -6398 29055 10867 -3900 37 -1476 6268 16729 -4152 -24657 -7043 15819 23680 26909
596 26909 -2206 -54426 -41793 37901 72729 24391 -43814 -69529 -19468 65854 71497 -18913
608 -18913 -71075 -21568 39049 40844 708 -40329 -29733 33056 51619 -8416 -51578 -23847
620 -23847 18781 39628 33089 -13822 -57111 -33299 23912 49102 36753 -9614 -67052 -55167
632 -55167 32929 78624 26068 -45295 -61942 -18192 48426 54201 -19049 -60580 -8970 41314
644 41314 21727 -21586 -37506 -13482 35769 42876 -17387 -55953 -18215 25345 28771 14624
656 14624 -11431 -37484 -21181 17299 24821 10229 -4464 -27034 -25438 18485 35241 -8168
668 -8168 -36129 -8986 25594 30353 -4178 -53529 -42168 42300 79563 7024 -72343 -64275 6852
681 6852 70698 62821 -21790 -79429 -36368 33975 47402 21668 -11783 -39488 -25166 20986
693 20986 33440 7004 -13394 -20787 -9772 27307 35934 -17062 -51218 -9160 45746 49071 2138
706 2138 -55562 -56593 21551 78423 33322 -39090 -46378 -9976 22308 31192 6802 -15323 2112
719 2112 15195 -15671 -31125 3649 35094 32833 9637 -29903 -53312 -16339 41306 55227
731 55227 30289 -16158 -68809 -61328 26900 92385 56664 -28591 -80259 -56010 29914 81416
743 81416 30986 -40659 -36033 5676 14335 -3955 -16778 -4054 36826 47271 -17131 -76559
755 -76559 -46097 28783 70079 58705 -6416 -81783 -83103 -3108 73410 88491 33456 -66950
767 -66950 -117500 -44393 69849 99043 38799 -40170 -80383 -49951 16760 43528 32649 27892
779 27892 6447 -51806 -78651 -27229 53610 94686 53816 -54499 -120964 -59290 53628 96540
791 96540 56647 -19653 -83270 -74752 2766 62918 60178 19554 -35565 -66631 -30374 29820
803 29820 36478 9059 2214 3148 -9198 -26417 -38216 -15944 54011 89466 13807 -89585 -96450
816 -96450 -9168 84221 102579 19461 -84079 -90321 -10833 53456 64494 35984 -22337 -61710
828 -61710 -36669 13960 38279 35865 9033 -28374 -28676 4860 10811 -6508 4346 26156 17898
841 17898 -9442 -32555 -31411 12337 54490 27062 -29425 -31293 3728 15898 4261 -10624
853 -10624 -8440 24207 43406 -3544 -61851 -45856 21662 65721 58031 -816 -72447 -77007 -3653
866 -3653 68701 83415 36003 -53748 -107897 -50147 61327 100903 46144 -36815 -81271 -49074
878 -49074 23618 49532 22171 8600 9784 -17722 -51394 -43735 5176 65675 84481 11684
890 11684 -89691 -101850 -19966 66474 99374 58496 -40526 -111775 -83263 10125 91015 106870
902 106870 29774 -86617 -120735 -43422 52410 92993 69892 -3464 -77265 -89114 -42594 28943
914 28943 100789 105680 -2362 -128314 -135675 -18083 114617 149131 43187 -108794 -147526
925 -147526 -48917 68781 113917 72919 -24977 -101269 -83231 -1884 62792 77533 36141 -38445
937 -38445 -71174 -35053 8741 25126 38403 39236 4724 -40703 -63765 -43108 32188 100663
949 100663 66873 -43217 -102449 -59743 26933 86003 66417 -14114 -65955 -45030 -3360 24300
961 24300 43123 33419 -8424 -36036 -28949 -8636 17479 36450 19691 -10424 -14716 -13472 -18712
974 -18712 635 34721 32484 -2068 -28123 -30159 -437 37322 25702 -23094 -27456 16494 34289
987 34289 3834 -34554 -40976 4745 65320 56092 -24035 -74290 -47064 14930 64969 66747 4101
1000 4101 -66754 -71785 -17349 46929 80387 44736 -43095 -86197 -39560 28463 55835 43174
1012 43174 3588 -33963 -38448 -26485 -12963 26852 70925 47307 -36400 -90637 -65490 18866
1024 18866 95946 85654 -12903 -91054 -78486 -13648 51535 82793 47321 -32524 -80428 -63201
1036 -63201 -5766 60282 81937 26619 -49639 -71209 -44247 201 52425 74227 32459 -39013
1048 -39013 -86719 -75593 9162 108614 105422 -10704 -111937 -103712 -7823 90988 104173 16371
1060 16371 -73379 -79843 -27603 27280 62012 50853 -6337 -50610 -46460 -15456 23338 48207
1072 48207 28502 -13698 -27745 -22749 -20140 1693 38974 43428 6729 -36918 -55778 -22253
1084 -22253 46394 67499 9621 -48152 -41883 -1882 28860 30335 860 -20572 -4499 11220
1096 11220 -2407 -10207 3546 10353 7275 6786 -3198 -14461 -5480 6685 6608 12203 12687 -11039
1110 -11039 -23113 725 19622 9057 -6040 -8812 899 19481 12981 -28054 -37605 11904 53223
1123 53223 32889 -20159 -56003 -40384 24479 67160 33794 -25818 -46772 -32862 -315 38405
1135 38405 45973 9043 -28472 -40051 -26355 11696 46022 31377 -10491 -26786 -22398 -17871
1147 -17871 1250 29372 35189 15625 -21169 -59079 -45933 28681 79419 42247 -32874 -71399
1159 -71399 -47666 19058 65360 40749 -16048 -38992 -32122 -15439 14404 38014 24567 -5859
1171 -5859 -25777 -33242 -17401 19357 34258 15629 -2308 -16471 -35708 -27993 16360 48277
1183 48277 35889 -8856 -56141 -55458 10646 67012 43407 -20003 -48732 -31358 7111 35137
1195 35137 21856 -9316 -13046 -3346 -8951 -9077 8539 15181 7235 908 -9947 -17797 -4528 12041
1209 12041 10961 9686 7229 -14975 -28489 -2810 28085 25271 128 -24995 -26872 8213 37846
1222 37846 13228 -25977 -21122 9077 21596 11596 -11128 -23633 -1223 26707 15358 -11616
1234 -11616 -13097 -2735 2327 10137 11130 -2740 -7646 -2007 -2044 2049 12862 3953 -13912 -4001
1248 -4001 14855 7070 -10036 -13047 -1957 18544 25404 -6424 -38315 -17019 26994 33163 4862
1261 4862 -22462 -28363 -2374 27761 18626 -11155 -13744 -917 123 786 5196 458 -3387 2742
1275 2742 509 -5837 70 620 -7267 2182 17002 2854 -20221 -17389 3119 19952 20246 -7753
1289 -7753 -35362 -15585 25276 25741 -5564 -22607 -14654 6270 20511 5536 -20532 -13982 10886
1302 10886 11451 -2251 -5835 -7121 -5967 5621 9482 -1590 -5262 -4118 -8726 -221 17035 7822
1316 7822 -16431 -15530 4072 14374 9694 -7946 -23040 -5022 26447 17326 -18010 -24255 -1303
1329 -1303 17937 19069 -1321 -24561 -14336 15935 18159 -2600 -8193 -4064 -2317 4910 8646
1342 8646 -992 -5259 603 -414 288 10755 4334 -15303 -10033 12699 17789 3072 -12491 -18227
1356 -18227 -84 25788 16725 -17031 -20638 5112 17342 7892 -7329 -14920 -864 22397 13502
1369 13502 -16902 -20381 2456 15141 15375 6111 -12971 -21055 -3944 12871 17026 15420 -2414
1382 -2414 -28667 -22648 14250 30220 13513 -9346 -21823 -13627 10283 15863 -2521 -4795 10805
1395 10805 6258 -15808 -21108 -4200 19822 31958 7917 -33708 -36124 1329 26942 24508 9034
1408 9034 -15435 -30482 -16297 9236 20998 21219 5934 -24352 -32228 -3343 20356 16128 6091
1421 6091 -2867 -12887 -12978 -8533 -5555 12765 34255 14788 -33113 -46683 -12895 30997 48254
1434 48254 18710 -35078 -50520 -12190 25485 30770 18060 -6606 -30540 -25956 1368 19322
1446 19322 22329 12069 -13905 -28505 -8779 12602 9599 4296 6492 845 -8810 -13446 -12623 4257
1460 4257 30307 23338 -17274 -35552 -12097 16790 25822 12907 -12589 -20900 -998 10456 193
1473 193 -1465 8050 5491 -2996 -5306 -7564 -3699 10413 13005 835 -2524 -3309 -12778 -7246 15989
1488 15989 22099 2607 -15548 -19005 -3969 21726 22258 -8762 -23316 -424 17923 9160 -7807
1501 -7807 -16093 -5333 20801 24190 -7002 -27620 -12915 7974 18774 20280 3370 -20840 -23401
1514 -23401 -5602 13074 26816 21915 -12543 -37093 -18091 14129 24788 17222 -450 -18168
1526 -18168 -17415 -5355 -53 9649 26960 17518 -20840 -40182 -19722 17573 42260 28088 -19481
1539 -19481 -45724 -21491 13600 25275 21026 4298 -19484 -25601 -10450 5495 18256 22267
1551 22267 2651 -22114 -20509 -4534 2713 10224 19532 11758 -9950 -26160 -29059 -4371 39711
1564 39711 47379 -2257 -50223 -45427 -2159 41047 47217 6574 -38018 -38480 -9455 14885 29553
1577 29553 26640 -3376 -31673 -28704 -5829 19539 33396 15860 -19152 -29007 -10801 4209
1589 4209 12732 21343 12357 -10221 -23102 -19524 -393 28235 32438 -3108 -33375 -21372 7253
1602 7253 20293 14880 -1981 -13866 -3608 6660 -3156 -8747 6342 15724 6426 -4800 -13271
1615 -13271 -13419 3920 19817 13713 -107 -8950 -18217 -14319 13756 31622 13263 -15838 -28008
1628 -28008 -14260 17374 33918 8381 -24809 -19499 5156 14903 8364 -2570 -9846 -1753 10071
1641 10071 2580 -8201 -1297 5579 -429 -924 4144 1018 -3172 -3220 -5178 -203 13076 8613 -9656
1656 -9656 -12276 -1185 2486 3164 7733 4663 -3151 -7744 -13679 -9646 15979 29929 4108 -28456
1670 -28456 -28455 -2298 24954 29486 785 -29729 -22564 4454 14151 10649 5239 -5888 -12925 -6104
1684 -6104 314 2523 7843 6613 -5446 -7412 640 -3805 -10076 2334 16095 13053 -3574 -23745
1698 -23745 -26658 4103 37069 25837 -13136 -32204 -21403 3502 25067 22524 -669 -15413
1710 -15413 -15417 -14045 -1705 22435 26906 2831 -21150 -27085 -12466 16903 33061 14635 -13030
1723 -13030 -22221 -18861 -5798 20031 32444 12081 -18558 -32226 -19714 14199 39529 20718
1735 20718 -19064 -28723 -9089 8979 15150 9657 -1277 -2836 1649 -7207 -14899 855 20299
1748 20299 16988 1098 -13547 -20893 -9275 15254 23369 12282 -2338 -19974 -27299 -3899 30083
1761 30083 31666 2915 -24737 -30428 -7585 25386 28381 1749 -15814 -11673 -6276 -1273 8632
1774 8632 12924 7966 -662 -15407 -21320 70 24233 18091 -4703 -15674 -13640 -2443 11952
1787 11952 12532 -44 -5400 -5400 -8321 -1702 11563 7943 -6956 -9213 -1071 5349 6649 -2937 -14740
1802 -14740 -4927 17092 14135 -9746 -19759 -8163 8715 17902 6574 -14652 -15763 2242 7774
1815 7774 1321 536 188 -3559 -2190 -129 -2967 -797 4261 467 -2017 4413 1211 -12201 -10673
1830 -10673 6501 15882 10760 -5824 -22341 -15279 12859 22955 5975 -9041 -10217 -8507 -2911
1843 -2911 5327 7974 9683 7964 -9814 -25666 -11603 18028 27142 12715 -10653 -28060 -19901
1856 -19901 8686 25832 19963 4556 -15979 -30765 -15289 20407 34941 16165 -13338 -31450
1868 -31450 -20522 12836 28343 12539 -5089 -8269 -9731 -9796 -781 10117 16788 15036 -4550
1881 -4550 -28371 -21164 10192 27403 19668 627 -19232 -24417 -6634 15459 21822 16275 -1589
1894 -1589 -25420 -25947 3005 26195 21326 1958 -16205 -20601 -4549 11210 10731 6217 6871 -3315
1908 -3315 -18463 -15151 4241 20065 20518 785 -25479 -23303 5299 21833 13229 -1113 -11151
1921 -11151 -14416 -3543 8625 8589 3851 -327 -9009 -10634 3603 11109 982 -7943 -4106 2304
1935 2304 6240 2490 -9760 -10720 6491 14384 55 -10939 -6757 994 5117 3294 -5292 -4977
1949 -4977 6810 6642 -8062 -11501 -619 7519 8660 4416 -7547 -13204 -4960 3760 7587 11442
1963 11442 6376 -12875 -21553 -5129 14232 19505 8745 -11726 -21256 -6774 10418 9581 4585
1976 4585 5508 -393 -11964 -13764 -4866 11725 24844 13736 -17501 -30610 -10456 15519 25277
1989 25277 17448 -5175 -24778 -19837 -160 16751 24396 15090 -13637 -31161 -14709 12876 24951
2002 24951 17115 -2992 -19530 -15253 80 6420 10375 16260 8182 -13890 -23811 -11641 11564
2015 11564 28981 20342 -11778 -30787 -15774 9124 19733 17190 3225 -14587 -17970 -6957
2027 -6957 6508 15941 16673 -865 -19637 -14630 3000 10481 9062 4113 -3268 -6529 -4759 -5845
2041 -5845 -1818 13011 16907 -2214 -19247 -14595 1884 16400 14976 -3839 -17124 -7816 5770
2054 5770 5492 1663 1028 -2428 -3900 -1005 -862 -875 2918 1179 -4988 -1329 5626 17 -8057 -4215
2070 -4215 3004 6586 4707 -5320 -11835 -1910 9916 3590 -5899 -2527 3531 2337 -2150 -8298
2084 -8298 -6039 8623 14798 -116 -14840 -10883 621 8484 11308 3869 -8565 -10933 -5330 -340
2098 -340 9177 14983 2508 -14905 -13849 -37 9969 11636 3502 -7320 -7069 -259 -1555 -3351
2112 -3351 7583 14194 2937 -11655 -15829 -6291 13760 22526 5521 -16149 -16319 -2438 7478
2125 7478 12608 9947 -2352 -10407 -8576 -3271 6253 14972 8269 -9266 -12406 -2322 4545 5818
2139 5818 5254 496 -1310 -491 -5756 -8083 4526 16381 7987 -9213 -14536 -6917 7849 16203
2153 16203 4991 -10883 -9054 1382 2947 1972 3336 774 -2036 -1696 -2508 -2140 3982 5318 -3325
2168 -3325 -3619 2754 1506 -3744 -2487 1749 4149 3729 -3445 -10525 -1996 10881 6462 -7039 -8720
2183 -8720 -1069 6210 6603 -2294 -11342 -3357 9050 5765 -3374 -5371 -3230 -1223 3603 4161 -544
2198 -544 -2091 -2345 -5907 -2270 8234 7268 -4367 -8314 -2999 2476 4958 2310 -4699 -3027 4795
2213 4795 987 -8171 -4146 6329 7773 1325 -7130 -10301 -508 11733 6963 -5636 -6635 -773
2227 -773 1611 2070 1904 -963 -1078 1876 -1223 -3722 1785 3512 -2177 -2121 4129 3172 -2650 -5255 -3055
2244 -3055 4118 11524 3750 -11741 -10532 4444 11073 5442 -2496 -7583 -3259 5985 4729 -3939
2258 -3939 -2374 4960 3014 -2175 -2604 -1531 690 4552 3343 -1458 -507 124 -5117 -2876 7749
2273 7749 9279 -79 -7220 -8410 -1698 9192 9466 -1965 -6669 -901 -47 -3143 101 5855 7145
2288 7145 2757 -7852 -14794 -3205 15400 14961 -1020 -12183 -11817 -3502 8583 12522 3452 -4966
2302 -4966 -8133 -8764 -2077 11281 12490 -1113 -10810 -8475 -813 6765 6647 -2469 -5324 1972 2571
2317 2571 -6326 -6407 2511 8323 6701 -2825 -13095 -9398 5896 11487 2633 -3406 -4492 -6322 -3147
2332 -3147 3448 5247 4352 1407 -6731 -10468 -180 9085 5110 -1542 -3182 -3840 -2580 223 940
2347 940 1832 5896 1942 -9475 -9100 3911 9919 4322 -3673 -8470 -3205 7235 6874 -5380 -7809
2362 -7809 1673 6396 3478 -1403 -6147 -5759 3221 7911 3978 1 -3630 -9642 -5766 8589 14725
2377 14725 4735 -8821 -14487 -6699 10128 16896 3263 -9668 -7737 -1837 1232 4501 5570 3237
2391 3237 1155 -4129 -10350 -4686 10332 13323 2351 -6870 -9165 -5525 3345 9086 5280 1299
2405 1299 -1698 -8347 -9508 2569 12703 9319 -445 -8218 -10044 -2622 6972 6997 3712 3232 -2557
2420 -2557 -13015 -10858 4702 16932 14620 -2153 -20951 -19484 4873 21485 14185 -1844 -13925
2433 -13925 -15719 -4881 10829 14583 6311 -4020 -13907 -14299 1860 16178 10714 -3486 -10136
2446 -10136 -8510 -826 6644 4339 -901 593 1398 -6440 -8487 730 7889 7415 318 -8746 -9563
2461 -9563 1294 7908 2634 -2248 -87 -953 -3947 -2300 438 3110 5575 1966 -7411 -6567 1894
2476 1894 3994 1972 1937 356 -4038 -4301 -1399 2008 7186 5508 -5947 -11814 -1021 10116 7276
2491 7276 -1984 -8738 -6512 5566 11204 689 -9154 -4986 2727 5190 5204 958 -5809 -5460 -134
2506 -134 3506 6840 6817 -3425 -12656 -5933 7796 11404 4907 -4605 -10775 -5116 5756 6968 1653
2521 1653 1505 374 -5645 -7534 270 7982 10037 4050 -9559 -13716 -677 11766 8906 591
2535 591 -4661 -6689 -3819 2298 4245 3695 4365 -673 -8552 -6312 3283 6421 3802 1412 -2390 -4889
2551 -4889 -3286 -1715 865 8806 10444 -3732 -16493 -10547 5386 16194 12408 -4499 -18132
2564 -18132 -11187 5191 11758 7983 1802 -7430 -12246 -5426 4931 9915 9078 -808 -13426 -11479
2578 -11479 2702 9974 5916 54 -4968 -7113 -2764 1238 2271 5132 5519 -3981 -11958 -5062 6329
2593 6329 8828 3828 -4881 -9262 -2629 6261 3557 -2586 -852 1737 -1017 -2912 -1809 -452 3459
2608 3459 4868 -1613 -5647 -1323 1126 -222 1679 4390 323 -4507 -4770 -1567 5559 8988 410
2623 410 -10972 -6869 5494 8705 3078 -4238 -7376 -1328 6978 4935 -2910 -3215 273 -469 294
2638 294 3007 2464 -417 -2186 -3827 -1720 6262 6954 -2255 -6846 -2022 1998 3284 3756 859 -2281
2654 -2281 -1497 -2201 -3165 3310 9940 3666 -8031 -9363 -1930 7534 11283 2886 -9202 -8366 1448
2669 1448 4846 3155 2959 565 -3623 -3602 -2710 -279 5265 6835 -1103 -6960 -3408 147 670 3790
2685 3790 4882 891 -3564 -6801 -7073 2492 13907 8618 -7512 -13842 -6340 4418 11509 7227
2699 7227 -4315 -9216 -4146 -702 1072 6626 6953 -1647 -8535 -8293 -2469 6962 10916 1999 -8677
2714 -8677 -8059 -2384 1329 5468 7464 1995 -5881 -8596 -6167 3027 12505 7520 -7087 -12116 -4029
2729 -4029 4224 6973 3900 -2531 -4530 -408 -572 -3187 1067 6700 3545 -3629 -5597 -4286 1137
2744 1137 6613 4055 -2649 -3337 -1906 -2925 -611 6134 5682 -1066 -5560 -5588 -393 7543 7109 -3269
2760 -3269 -7152 -186 3903 1711 -415 -1505 -247 3235 1379 -4205 -2398 4381 3920 -1541 -2229
2775 -2229 -269 944 2152 571 -3039 -300 4218 1343 -2677 -244 1211 -1343 -377 2194 2433
2790 2433 1550 -1617 -6693 -3573 7846 9895 -179 -8015 -7301 -620 6886 7557 -715 -5080 -2094
2805 -2094 -1124 -1936 2300 6336 3449 -2390 -6399 -6743 293 8865 6676 -1896 -5024 -4749 -4292 383
2821 383 7219 7432 845 -6648 -11258 -5762 9327 13767 2580 -8802 -9700 -4184 3425 7882 4451
2836 4451 -790 -2356 -5319 -7954 -1137 9598 9753 348 -8063 -11445 -4577 7443 10676 3258 -3509
2851 -3509 -6645 -8676 -3512 7702 11746 4359 -6294 -12270 -7996 5846 13357 5114 -5731 -6853
2865 -6853 -4220 -1162 3395 4777 3202 1594 -3036 -9334 -5485 6609 10387 2998 -4436 -7637 -5493
2880 -5493 2876 7191 3794 318 -1570 -5059 -5691 2392 7946 4577 -1746 -5654 -4807 1371 6394
2895 6394 2035 -2925 -205 1705 -1440 -2732 -609 2852 4741 2400 -4721 -5981 2104 6309 1299
2910 1299 -1818 -1234 -694 914 1587 -1038 -1330 2785 1775 -2272 -484 1917 -512 -2490 449 2606
2926 2606 2913 1360 -4704 -6696 1768 8511 3888 -3644 -4875 -2752 1309 3869 1491 -949 1482
2941 1482 485 -4967 -4618 2730 6575 3663 -1361 -6664 -6203 1598 6016 3309 482 -911 -5605 -6814
2957 -6814 362 7134 6739 1230 -6931 -10313 -1626 8380 6426 -423 -3162 -4058 -3640 -759 2302
2972 2302 3085 4646 1210 -8032 -9760 508 9084 7278 430 -6239 -8808 -2488 5205 5474 2841
2987 2841 692 -5142 -8692 -1941 6863 7741 2609 -4632 -8142 -2958 5572 4882 -387 -520 429 -2380
3003 -2380 -3323 -936 2246 5681 4172 -4122 -8798 -1560 5692 5116 1153 -1570 -3491 -1996 1396
3018 1396 1443 1251 3359 647 -4925 -3166 2561 3625 1228 -578 -2473 -918 2477 773 -2558 233
3034 233 4361 1003 -3007 -2204 578 3225 3461 -2004 -5134 213 5531 1360 -3320 -1943 242 2307
3050 2307 2870 -508 -3420 -873 1743 340 1191 3200 -51 -4844 -3167 1560 4458 4420 -920 -6870
3066 -6870 -4043 4122 4582 -281 -1702 -1062 -1194 -78 -515 -1326 2456 4498 -1295 -6329 -2823 2513
3082 2513 3654 2503 -903 -3633 -2176 927 -188 -21 3665 1598 -3874 -4544 -577 2243 3463
3097 3463 1728 -3144 -3865 515 381 -2034 1044 4304 1398 -3725 -5587 -3011 3597 7771 1787
3112 1787 -7309 -6175 923 3652 3346 1129 -2543 -3331 -498 -27 708 3235 2374 -3409 -4087 1037
3128 1037 2503 1321 -381 -2085 -638 3097 1796 -4153 -3224 2821 3879 314 -1838 -2880 -473
3143 -473 2937 1861 -1687 -398 2542 -709 -3505 -1170 2359 3202 2171 -2372 -4880 -402 4265
3158 4265 2225 -199 533 -414 -2084 -862 1348 2396 2950 95 -4794 -2946 3611 4593 -1052 -2663
3174 -2663 -497 1268 2478 -549 -4094 -742 5483 3550 -3076 -4610 -1018 1520 4190 2995 -1691
3189 -1691 -3247 -1489 -1455 476 5172 4084 -2967 -6161 -2997 1677 5660 3833 -3220 -5430 -439
3204 -439 2627 410 169 1526 241 -1773 -2326 -2430 1128 4872 1840 -4508 -4133 900 2528 909
3220 909 -393 -2019 -849 2021 11 -3234 -664 2393 494 -905 3 -594 -1379 -716 -205 1344
3236 1344 3980 711 -5863 -5284 2540 6328 2635 -2344 -5826 -3412 3618 5124 -511 -2705 -318
3251 -318 -370 -1165 216 1520 814 1121 -818 -3247 -658 2673 306 -1898 1144 2201 -193 -2164
3267 -2164 -2482 -278 3902 4661 -1536 -5235 -1409 2356 1553 1424 599 -860 -1146 -1745 -2921 1292 7094
3284 7094 3770 -4518 -6443 -1919 3737 6407 3550 -3471 -5586 -1262 1629 2354 3971 2337 -3262
3299 -3262 -4783 -1365 2833 5151 3109 -3338 -5607 115 4341 1567 -1718 -399 582 1194 223 -2870
3315 -2870 -2328 3062 4065 -1169 -3370 -1133 438 1277 1892 322 -902 -141 -1328 -3038 812 4651
3331 4651 1414 -3151 -3113 -1029 1555 3466 346 -2995 -1292 1319 -650 -1597 1780 2086 -225 -2559
3347 -2559 -2998 -415 4038 3120 -3806 -5505 434 3992 2190 -892 -3580 -3036 1312 3465 280 -1425
3363 -1425 -767 -2052 -2363 1785 4246 948 -2779 -4582 -2912 3303 5970 351 -5455 -3049 1064
3378 1064 1922 1313 504 -1284 -168 453 -2065 -2053 2813 4046 -514 -3307 -2442 -458 2110 2846 -90
3395 -90 -938 32 -616 -2786 140 4248 2392 -777 -3125 -3207 408 4402 2867 -1367 -969 -54 -2098
3412 -2098 -1603 2058 4173 2876 -951 -5863 -4953 3796 8135 2944 -3713 -5086 -2461 2014 4985
3427 4985 2792 -870 -2161 -2344 -2888 1726 5451 2720 -2601 -3976 -2133 2027 4512 1560 -2742
3442 -2742 -1947 1713 201 -1430 152 2006 1247 5 -2375 -2867 1581 4068 365 -3183 -1035 1054
3458 1054 984 303 -502 -890 1137 1029 -1725 -2105 1461 1541 -1086 -1407 -151 745 763 0 -1741 247
3476 247 2708 -14 -2804 -682 2142 789 -1192 -2346 -1204 2682 3827 -1653 -5731 -1520 3073
3491 3073 3256 759 -1780 -3726 -1787 2047 1980 1518 1386 -1409 -5075 -2344 3416 4883 2091 -2298
3507 -2298 -5437 -2642 3483 3842 656 -912 -255 -2759 -2824 299 3462 3912 1674 -4072 -6916 -856
3523 -856 6312 5037 249 -2794 -4197 -2161 2003 3049 1803 2021 -833 -5014 -3340 2426 5083
3538 5083 3248 -889 -3700 -3607 109 2736 1944 2047 1982 -2429 -5882 -2442 3858 6246 3589 -3115
3554 -3115 -7940 -3225 4762 5581 1880 -944 -2779 -3337 -605 2074 3046 3146 386 -4794 -5154 1669
3570 1669 4560 2918 -190 -2288 -2664 -577 1356 861 1416 2175 -853 -4523 -2521 2439 3734 2090
3586 2090 -1961 -4466 -1603 3363 2286 -1306 -742 837 59 -756 -556 -606 1119 1685 -794 -2403 460
3603 460 1653 -718 -1182 334 651 368 -497 -2062 -1203 2104 1923 -2109 -1803 1240 1314 -766 -1693 -1020
3621 -1020 1829 3427 166 -4694 -3112 2245 2806 1048 -319 -2576 -2098 -190 787 978 2344 1935
3637 1935 -2952 -4821 -388 3382 3398 1583 -2043 -4103 -1464 1578 975 1772 3009 -478 -4698 -4053
3653 -4053 613 5265 5930 316 -6461 -6048 1029 5083 3846 1475 -1620 -4189 -2761 431 2904
3668 2904 4712 3738 -3172 -6423 -2276 2800 4513 3149 -327 -3724 -3559 -778 792 2855 4903
3683 4903 1478 -5269 -6277 -485 4832 6466 2247 -4982 -5639 -745 2744 2678 2161 1431 -2344 -3700
3699 -3700 -2255 756 4031 4560 -204 -5817 -3402 760 2713 2695 1539 -997 -3094 -2170 -837 1703
3715 1703 4379 2597 -3854 -5105 -974 2980 3416 1065 -2599 -2975 402 1467 -617 -544 1622 672
3731 672 -1485 -1706 -1049 795 2185 715 -2604 -1115 1244 291 -928 -196 858 151 -274 -1260 -1109
3748 -1109 1021 2048 -1228 -2197 707 1969 -359 -1931 -1698 130 2920 2200 -2460 -3698 51 1901
3764 1901 968 446 123 -539 -673 -893 -1126 1524 3810 465 -3672 -3133 107 1719 2272 1397 -1245
3781 -1245 -1748 -1189 -1339 463 4171 3781 -1577 -5268 -3294 1232 5330 4445 -1795 -4733 -2032 1243
3797 1243 1488 2102 2529 47 -2160 -2566 -1580 1788 4993 2676 -2814 -4028 -1217 933 2217 2927
3813 2927 1088 -1247 -2235 -2784 -819 4219 5311 -142 -5197 -4030 136 3587 4064 742 -2754 -2007
3829 -2007 -288 -883 321 3226 2377 -1353 -3537 -2775 376 4142 3521 -1464 -3472 -1348 49 588
3845 588 1891 1742 -301 -2013 -2134 -1702 2171 3862 -78 -3454 -2015 618 1467 345 -906 -1305
3861 -1305 644 1476 -1744 -2539 530 2146 467 -852 -1561 -968 804 1144 -837 -855 1080 441 -1884
3878 -1884 -1153 1070 874 337 -542 -1278 -251 1364 -675 -2471 -86 2506 883 -1596 -1939 -1272 1388
3895 1388 2692 351 -2027 -678 902 -714 -661 1376 1616 700 -996 -2876 -1769 2921 3587 144
3911 144 -2580 -1666 -1008 299 2454 2400 390 -1184 -2936 -2813 2093 5233 2317 -2879 -3936 -1536
3927 -1536 1941 3882 1802 -1522 -1250 225 -819 -543 1253 2663 724 -1210 -2596 -1983 1775 3373
3943 3373 644 -1330 -432 -777 -1375 522 2282 1960 749 -1821 -3947 -839 3677 3325 -201 -1682
3959 -1682 -1401 -1077 456 1323 744 1391 503 -2746 -3541 489 4050 2429 -897 -3196 -2827 718 3014
3976 3014 1256 -1117 -398 -578 -1546 -60 1724 1351 128 -1516 -2302 -434 2041 1206 -1843 -962 1492
3993 1492 598 -789 -1632 -1477 1263 2881 304 -2822 -1809 498 1205 323 59 -146 -730 -458 -1281
4010 -1281 -521 1905 2086 -1155 -2997 -728 1000 1235 782 -655 -1020 191 428 -1371 -381 2094 1225
4027 1225 -1554 -1680 -344 1065 1853 267 -1848 -382 1884 81 -2142 -573 1653 2179 1400 -1793
4043 -1793 -3121 1 3050 1918 41 -638 -1005 -1982 -221 1936 2329 926 -1530 -3836 -1684 3668
4059 3668 3913 118 -2234 -1921 -282 1544 1671 0 -345 722 -758 -2126 -107 2166 1739 206
4075 206 -1546 -2233 112 2214 561 -604 481 708 -936 -1330 -284 1290 1849 844 -1769 -2211
4091 -2211 497 1651 -122 9 912 -335 -1519 -1435 175 2019 2952 -25 -3991 -2947 1462 2778
4107 2778 1355 -774 -2507 -1669 890 1212 203 340 720 -1571 -2139 562 1547 1165 62 -1483 -1182
4124 -1182 1157 1601 -1078 -1773 715 1180 -237 -1045 -1505 -92 1983 1413 -1646 -1600 602 393 -677
4141 -677 49 601 697 -182 -1162 -2402 667 2884 1047 -2019 -1586 100 353 804 594 -502 -385 -234
4159 -234 -1485 -560 2079 1960 -1072 -2359 -759 1204 2154 888 -1988 -1623 1543 1622 -595 -1329 176
4176 176 656 1331 113 -1510 -931 1324 570 -638 268 572 -710 -1569 -62 1086 1623 691 -1630
4193 -1630 -2366 674 2742 494 -1066 -658 -463 333 573 -342 -204 1231 685 -1973 -1209 1029 1790
4210 1790 198 -1164 -1548 -425 2000 1093 -1166 -972 857 165 -217 -203 171 -245 166 -325 -803 901
4228 901 1577 -817 -1614 608 1355 464 -1020 -1689 -655 1955 1996 -1354 -2273 115 1642 583 -163
4245 -163 -933 -770 588 387 -828 -182 1192 160 -1519 -729 1008 778 -118 -784 -1495 479 1739
4262 1739 -272 -1430 82 949 -77 -683 -919 -41 672 428 -1172 -1372 1324 1943 -584 -1807 -643
4279 -643 694 1373 402 -1744 -1448 1215 769 -215 -418 579 -325 -653 -49 -44 625 1088 -694 -1642 609
4298 609 2069 277 -1590 -587 428 1237 1197 -1126 -1478 1177 2045 -378 -1588 16 680 661 50
4315 50 -476 -334 915 755 -1184 -393 1242 741 -282 -355 228 275 1187 84 -1096 126 1820 42
4333 42 -997 -176 865 813 272 -939 -984 1151 1729 -814 -1839 255 1601 650 -761 -993 -1084 940
4351 940 1295 -290 -1104 302 438 -269 84 892 271 -435 -712 -901 387 2372 417 -1881 -1221 628
4369 628 646 439 -92 -839 -34 752 -569 -1465 897 1837 -44 -1365 -1282 -239 1294 1594 -626 -1848
4387 -1848 50 604 -405 27 937 646 -552 -1270 -1029 89 2102 1033 -1774 -1179 211 263 -381
4404 -381 525 477 496 180 -1684 -2275 778 2903 794 -1594 -1886 -468 881 1693 549 -630 52 329
4422 329 -1150 -336 1892 1443 -675 -1270 -965 165 1545 1350 -896 -945 759 171 -768 126 943 725
4440 725 678 -559 -1485 457 2614 688 -1512 -772 711 562 186 71 -285 536 1232 -856 -1390 601
4458 601 1011 212 -208 -20 -114 245 208 -759 79 1525 735 -1711 -1330 943 968 879 -443 -1087 43 1540
4478 1540 51 -1908 -43 1805 546 -618 -1101 -1047 398 1691 404 -1298 -280 402 -1002 -122
4494 -122 1282 1156 221 -669 -1553 -788 1838 1577 -810 -1488 -620 7 -163 521 443 381 88 -1057 -2274
4513 -2274 -53 2856 1398 -959 -1941 -1470 349 1825 1150 -797 -649 -124 -1488 -690 1480 2095 396
4530 396 -1300 -1541 -960 1332 1578 28 -692 329 -240 -1035 -339 1165 1301 991 -1424 -2735 -658
4547 -658 2817 1940 -442 -1315 -1239 -456 686 843 195 158 604 -1137 -1676 545 1938 919 -165 -1142
4565 -1142 -634 571 1724 119 -614 795 623 -1239 -782 849 1409 799 -459 -1615 -582 1682
4581 1682 1357 -1314 -920 885 737 -93 -414 -676 189 1603 637 -1337 -412 793 -26 -242 192 314
4599 314 -171 -15 -607 -1075 1158 1164 -799 -1096 146 649 -173 -181 -258 22 1150 315 -1899 -1419 1063 1632
4619 1632 314 -993 -929 -855 1077 832 -334 19 255 -765 -1659 288 1525 1000 86 -1622 -1993 91
4637 91 2036 358 -708 334 160 -1151 -703 472 913 1398 -447 -2268 -1982 1091 2353 57 -1012
4654 -1012 -1092 -499 404 589 -107 -172 848 -622 -1862 -509 1195 864 130 -496 -922 -219 506 317 -240
4673 -240 1057 933 -1171 -1773 -211 1228 1714 623 -1861 -1903 660 1616 348 -520 262 58 -253 45
4691 45 -174 403 1121 586 -1376 -669 892 803 -127 -10 198 279 492 -352 -432 830 1366 -171 -1291 -358
4711 -358 638 318 428 -411 -460 1008 772 -1124 -1364 751 1609 442 -787 -1268 -542 1007 1190 -198
4729 -198 -234 285 -366 -821 294 1016 761 -242 -864 -1260 527 1714 -97 -1014 -258 579 -63 -650 -613
4748 -613 -324 1139 1089 -1209 -1799 203 1575 388 -824 -814 -702 -395 148 -269 86 1274 248 -1905
4766 -1905 -1106 538 1059 598 -401 -1301 -662 474 503 -421 374 933 -588 -1384 -334 478 1226 635 -1590
4785 -1590 -2064 258 1583 54 -963 -214 86 471 461 -578 -562 773 858 -462 -651 225 153 -319 198
4804 198 186 467 520 -342 -1549 595 1993 757 -987 -1191 -277 758 1133 146 -864 342 713 -273
4822 -273 -609 493 945 154 -555 -840 -340 1284 1126 -470 -1077 83 637 -285 6 165 341 608 -121
4841 -121 -987 -406 1417 630 -856 -323 538 106 -184 -356 -81 1074 970 -851 -1835 -100 1506 1208
4859 1208 -124 -1147 -1295 139 1423 326 -826 -29 -666 -966 -522 722 868 17 -1016 -1399 -275
4876 -275 1947 929 -1227 -1026 -5 442 61 79 -286 251 268 -834 -1409 506 1680 53 -1221 -902
4894 -902 -169 712 868 -195 -1141 54 527 -344 -730 316 747 -45 -93 -765 -296 624 580 -654 -673 620
4914 620 -96 -958 -323 740 725 77 -1004 -1939 100 1894 772 -1139 -1282 -263 755 789 25 -814
4932 -814 -123 209 -465 -260 979 1077 -460 -888 -201 402 1094 731 -890 -1048 600 1039 -286 -138 95
4951 95 -68 193 274 -223 374 1177 -103 -1689 -312 1199 932 64 -906 -704 470 1437 96 -785 -307
4970 -307 421 36 -266 642 153 41 -290 -757 -192 1272 819 -805 -945 168 441 -42 132 -560 26
4989 26 931 -138 -1480 60 1258 972 -261 -1419 -1050 156 1298 1017 -673 -613 -254 -1025 -902 1129
5007 1129 1418 500 -947 -1919 -1333 1324 2115 185 -1051 -1006 -491 -395 930 1017 588 -267 -1093 -1969 327
5026 327 2460 1878 -1091 -1923 -1100 282 1878 1369 -503 -694 -290 -1013 -440 1045 1271 85 -1170
5043 -1170 -1286 -738 865 1515 -235 -990 -518 306 -783 -459 840 902 399 -833 -1867 -664 1780
5060 1780 1839 -417 -1321 -775 -165 283 617 -142 -74 244 -570 -1029 503 1511 410 -235 -836 -704 801
5079 801 957 82 -651 137 508 -341 -455 911 521 160 -144 -685 -80 1385 546 -1380 -956 736 1013
5098 1013 107 -494 -1066 -250 1079 935 -455 -629 82 -539 -290 437 1121 412 -205 -1513 -1086 653
5116 653 1750 291 -1029 -562 -309 -386 237 427 458 386 -108 -1425 -671 1245 2042 23 -1210 -1263 -802
5135 -802 705 1270 37 -84 11 -962 -1256 63 1437 1025 12 -1859 -1717 3 1734 1137 -50
5152 -50 -338 -591 -1310 -606 993 1360 488 -368 -2480 -1545 1454 2516 351 -976 -1352 -950 699 1123
5170 1123 949 -22 -156 -843 -1450 -21 1494 854 -204 -1311 -1277 3 1257 1015 -391 53 -248 -1017
5188 -1017 -668 845 905 1057 -67 -1321 -856 1088 1263 53 -796 -114 304 60 22 -54 108 700 77
5207 77 -695 -386 500 747 -208 -132 -325 13 377 141 -565 236 541 -209 -567 166 570 300 -138 -442 -312
5228 -312 784 1024 -488 -1246 -48 998 652 -78 -520 -462 189 459 -93 221 495 -90 -1107 -427 737
5247 737 1230 440 -547 -1290 -705 1207 718 -598 -153 354 -620 -642 -2 812 1050 405 -1090 -1973 305
5266 305 1587 867 -104 -874 -829 -102 517 205 380 457 10 -1461 -801 840 978 586 -355 -964 -711 389
5286 389 438 -27 -45 345 -564 -1325 -401 863 1110 674 -1217 -1641 112 1025 806 -381 -646 -560 -366 189
5306 189 147 169 1089 -52 -1311 -927 348 1069 63 -142 -310 -400 697 291 -66 158 260 -48 -1063
5325 -1063 -432 975 632 307 -639 -1093 162 1328 190 -1004 -455 663 564 29 -125 -46 433 801
5343 801 -317 -369 247 335 89 -92 141 433 419 371 -472 -336 903 273 -523 -420 379 465 92 -326 -221
5364 -221 369 1225 6 -1148 -347 1038 550 -72 -359 -226 126 143 -412 -237 833 693 -500 -1086 146
5383 146 735 623 248 -811 -647 150 286 -242 -203 663 95 -993 -642 -94 806 1049 -221 -1448 -544
5402 -544 751 440 -76 -317 -223 -176 -44 -374 -260 499 897 -606 -1125 41 443 381 367 -227 -249 -144 377
5423 377 -330 88 691 220 -887 -800 184 682 1153 -83 -1305 -588 670 294 176 -139 254 -79 -424
5442 -424 -145 -250 1041 1007 -301 -1407 -366 678 329 354 -98 -374 -52 351 -189 -143 914 739 -1000
5461 -1000 -804 426 815 505 62 -531 -406 592 363 -684 -110 839 515 -538 -724 -7 756 1096 346
5480 346 -697 31 740 27 -98 -182 38 85 182 -741 -281 536 489 -478 -870 307 639 170 -89 -627 -71
5501 -71 440 329 -708 -432 460 326 74 -48 -212 132 345 -239 -666 -25 958 -27 -798 -556 353 271
5521 271 394 -329 -415 -164 -9 -290 21 646 491 -551 -1083 -474 223 1063 439 -831 -827 55 560 140
5541 140 -132 -78 82 -73 -300 -619 241 1095 579 -505 -670 163 364 195 308 -22 -46 -13 -811 -526 1106
5562 1106 925 -348 -1193 -690 63 858 911 -154 -663 -384 -114 -258 438 891 223 -387 -1121 -627 439
5581 439 1426 712 -1119 -1064 -195 318 524 473 173 -395 -348 -310 -151 855 1305 -166 -781 -720 468 453 355
5602 355 -257 -334 306 359 -450 -245 468 763 32 -505 -598 49 1126 630 -236 -806 91 177 -308 106 753
5623 753 105 52 -401 -363 282 765 -356 -784 168 751 355 70 -291 -324 435 265 -86 -402 353 544 -425
5644 -425 -105 211 486 379 -428 -842 -308 690 832 -176 -488 -369 45 225 292 124 -80 -277 -705 -1005
5664 -1005 611 1445 133 -864 -1037 -67 454 1000 -75 -440 -288 -29 -513 -296 621 678 116 -524 -1002
5683 -1002 -633 888 1150 -169 -531 -384 -201 -56 89 331 314 64 -749 -1196 258 1166 917 -424 -581
5702 -581 -923 87 855 288 169 125 -47 -945 -312 961 1179 364 -739 -1269 -340 1014 1223 -173 -537
5721 -537 -339 -222 142 473 424 -216 -322 -215 -523 616 1116 520 -970 -467 579 477 426 -159 -550 -122
5741 -122 641 72 -288 223 434 -360 -607 -220 352 541 79 -268 -621 524 730 -46 -220 -130 -137 -172 -68
5762 -68 -76 -49 940 1 -974 -357 629 689 128 -432 -642 -353 130 -46 -241 795 258 -615 -964 -335 681
5783 681 865 575 -674 -1600 -72 911 955 -23 -123 -459 -681 37 656 602 624 -762 -1755 -635 1092
5802 1092 1315 306 -473 -712 -641 203 819 88 450 330 -648 -1116 -63 1054 744 169 -595 -951 -117
5821 -117 939 201 -301 -84 -198 -307 10 445 578 439 182 -932 -640 478 754 -90 -55 70 -73
5840 -73 171 80 -41 584 828 -47 -882 -275 895 559 112 -730 -412 314 597 186 -579 -516 78 -236 164
5861 164 371 49 -40 -399 -185 -55 873 566 -889 -1187 21 630 589 289 -527 -491 -84 404 -13 726
5881 726 734 -240 -1027 -422 450 1123 1048 -336 -1200 -716 854 725 418 -62 -515 -986 -476 -118 677 1016
5901 1016 225 -901 -1140 93 721 428 152 -531 -773 -274 28 -147 316 836 -341 -1561 -911 158
5919 158 931 1136 -22 -981 -889 -98 629 482 660 50 -736 -1116 -194 382 1081 520 -1126 -1186 -279 480
5939 480 426 231 64 -365 -527 -531 -144 460 1137 73 -1085 -784 165 659 630 -65 -600 -348 490 319 -230
5960 -230 227 286 -245 -399 -270 -13 532 342 -32 -367 459 652 -246 -786 -155 639 305 -191 -462 -271
5980 -271 305 269 -415 -255 614 487 -236 -676 -113 105 718 301 -975 -396 26 303 179 426 303 -125
6000 -125 -490 -381 -268 824 831 -302 -1130 -732 319 583 382 19 -409 -558 64 -454 565 783 465
6019 465 -1008 -1126 -501 465 1107 500 -582 -1000 87 334 360 554 622 -368 -922 -384 70 1183 947
6038 947 -322 -1188 -413 2 226 -120 254 -357 -404 -81 -568 181 679 584 -534 -812 -359 497 586 188
6058 188 -469 -669 -71 72 -249 -65 593 277 -311 -512 -124 106 704 -61 -839 -437 15 10 -169 77 150
6079 150 39 292 -313 -317 621 468 -559 -682 176 503 191 145 -311 -87 645 698 -396 -582 36 64 -94
6100 -94 72 417 35 -312 -249 -358 418 1184 258 -939 -454 114 557 577 -3 -166 -40 -13 -721 -321 456
6121 456 637 -145 -624 -589 242 432 682 -214 -547 -42 151 -452 63 462 -30 -155 -310 -568 14 719
6141 719 212 -551 14 67 61 -2 342 202 56 -355 -447 -705 261 787 -43 -672 -525 120 594 221 -339 -529
6163 -529 -3 30 -475 -19 401 415 -333 -268 -421 -163 568 -52 -738 -197 496 218 -195 -248 46 -27 282 -224
6185 -224 -497 -141 215 -130 -738 -44 360 -8 -164 -498 -477 414 1011 -243 -599 -244 47 57 37 74 -215
6206 -215 339 -130 -374 -153 715 420 100 -131 166 309 98 -93 -114 36 225 -90 -739 156 661 471
6226 471 -222 -286 -538 106 624 -34 -482 -105 492 -281 -74 111 253 221 -60 -358 -221 681 459 -168 -301
6247 -301 143 -12 -8 -73 -125 87 120 -231 -336 415 855 373 -197 -248 -22 432 272 -275 -548 66 248 -142
6269 -142 -119 -67 150 -187 153 -336 -202 545 141 -479 -301 294 299 82 -163 -326 167 124 -240 -399 11 549
6291 549 246 -618 -251 137 424 224 -323 -582 -97 477 -289 -309 -172 149 -63 -284 -67 -181 575 59
6311 59 -673 -200 192 467 -10 -332 -440 174 78 -149 -350 3 238 34 -581 -225 595 144 9 -398 -632
6332 -632 148 752 242 -422 -172 111 302 -347 175 22 127 54 -492 -271 260 447 -66 -254 146 295
6352 295 58 43 -300 -247 648 -24 -511 -309 329 56 -212 -105 -228 41 715 -170 -287 186 242 -142 -262
6373 -262 47 525 -172 43 88 -95 403 341 -362 -544 -142 55 397 -101 3 -161 109 370 -480 178 263
6394 263 -105 -282 -440 20 501 288 169 -528 -255 194 125 -173 26 77 -58 -7 -88 -136 306 240 -339 -377
6416 -377 -37 448 199 -301 -213 122 205 50 -269 -72 415 339 -224 -127 -175 170 428 11 -145 13 504 -171
6438 -171 -230 -129 251 290 -261 -416 -151 237 598 -33 -415 -274 102 -63 -212 227 -23 6 -30 -187 122
6459 122 416 329 -255 -385 233 239 -52 -358 -46 136 593 46 -659 -394 174 361 -132 256 94 35 -228
6480 -228 -71 27 512 370 -223 -478 -220 487 27 74 -278 -209 -13 218 -63 -136 217 47 -62 -213 -133 278
6502 278 280 153 -352 -202 353 124 -140 -505 -41 -51 215 249 -47 338 341 -78 -107 -169 321 27 -258 -119 -109
6525 -109 256 -42 -258 -155 549 355 -315 -443 134 -59 249 431 -292 -273 53 325 -402 -200 16 134
6545 134 64 153 -213 -60 545 91 -440 -3 39 94 -277 -285 -46 3 304 -284 -232 -173 398 -354 -190 95 266
6568 266 279 145 -237 154 549 363 -388 -524 157 422 406 -427 -99 -251 476 303 -211 220 340 -314 -580
6589 -580 -207 -233 345 169 -474 -190 322 446 -172 52 36 -70 -40 -316 -138 -173 490 261 62 -525 435
6610 435 422 220 111 55 -56 560 -7 -354 66 329 -120 -444 -173 272 276 -112 -73 -302 115 246 174 -287
6632 -287 153 581 -153 -71 47 -24 487 -54 -464 -326 478 815 367 -396 71 -164 123 195 -54 -115 -195 91
6654 91 -77 -140 704 137 -388 -446 -513 274 502 55 -202 -64 145 -452 -218 160 -245 346 -63 -36 -248 457
6676 457 598 -132 -288 -247 -167 161 446 4 -121 -69 41 -190 -11 444 241 -77 -377 109 78 220 119
6697 119 -679 67 289 -14 -554 -5 261 174 -108 -502 -228 361 450 29 -561 -80 194 183 37 -56 -12 -229
6719 -229 -328 -71 -304 241 328 -416 -304 140 279 362 -222 -679 -110 503 371 -183 -81 168 -200 -343 -309
6740 -309 68 183 322 -105 -98 346 409 391 -377 -186 -259 205 281 -72 -178 47 327 -131 -98 147 144 82 -310
6763 -310 -397 181 141 5 -26 -163 68 -89 -264 -231 161 374 121 -462 -770 -231 530 31 -256 11 -376
6784 -376 -231 97 157 -196 -66 -43 -523 -101 358 543 -104 -80 -150 -155 174 325 -87 8 159 2 -215 -23
6806 -23 247 11 223 -207 -453 75 346 153 -301 -181 -138 -65 -115 -319 77 -26 -6 -317 -363 34 169 -60
6828 -60 29 -212 107 188 -81 -246 322 247 156 -427 -189 354 224 368 -350 -445 -223 681 -253 -690 61 188
6850 188 92 -217 -35 213 221 10 -79 -191 182 241 -349 -191 -63 322 145 317 57 -374 214 287 -299 -227
6872 -227 33 -8 -150 -12 209 239 294 -11 -578 -176 706 196 -688 -73 -144 33 139 212 -102 89 229 -197
6894 -197 -25 301 277 98 -290 -18 -85 141 91 -60 -64 183 143 -64 -195 -77 216 92 -60 -112 -22 -44 81
6917 81 -391 50 89 228 -220 -135 -12 34 245 62 -303 162 471 -106 49 -44 9 137 2 -254 -452 540
6939 540 32 -368 -30 102 238 -58 -104 -338 -73 78 184 -554 -526 234 240 7 -76 -298 -258 -50 223 124
6961 124 14 193 67 -346 206 127 111 237 -147 -176 77 440 -125 -297 6 207 -71 -144 -225 79 220 202
6983 202 -411 -193 339 -3 134 -201 -44 312 324 -77 -1 -269 463 112 -23 -359 48 -115 28 8 -37
7004 -37 206 217 -89 -377 140 226 304 -277 -22 31 64 73 -150 -224 42 140 -226 -262 -89 271 95 57 -400 -33
7028 -33 92 1 -248 269 -147 -87 -64 108 85 207 137 -26 -407 66 598 210 -13 311 142 -206 127 -321
7050 -321 -72 146 541 -191 -87 -30 83 70 110 -237 -285 15 234 -67 -135 330 -316 -287 -543 271 616 233
7072 233 -158 -542 -194 127 -102 102 271 20 -90 -322 -168 -255 357 156 -288 -260 -280 175 173 -19 -37 -349
7094 -349 -118 173 -199 -13 118 -340 -145 -464 119 318 34 -78 -121 -100 228 -84 83 -219 184 71 66
7115 66 185 121 -184 -219 -270 -140 108 106 -127 -338 -106 172 28 209 -41 -322 -12 -115 156 129 333 73
7137 73 -329 -358 -74 242 239 138 -339 -436 286 53 410 336 9 -43 -346 -224 61 590 260 -185 -428 -205
7159 -205 -64 162 318 82 -380 -263 178 -223 344 87 164 -189 -261 5 317 586 -58 -477 -350 -326 -251
7180 -251 -26 508 58 -197 -259 -329 -227 298 478 -188 -306 -364 94 130 126 -64 -129 -206 -92 -40 66 559 399
7203 399 -299 93 -191 290 511 -80 -141 -169 -186 127 -35 20 314 -14 26 52 -334 252 370 -88 -153 -49
7225 -49 183 173 91 111 193 -91 90 19 -313 290 -34 -331 143 193 -21 17 -222 -533 -132 176 143 -198 35
7248 35 -296 139 -56 192 125 -3 70 -143 -231 155 350 11 -117 -191 -57 -158 442 223 -361 -539 -309 -231
7270 -231 189 452 320 20 -191 -253 -61 404 200 63 -453 -162 21 -10 55 590 386 -223 -208 -393 184
7291 184 475 262 -18 -359 -52 195 339 235 38 -209 -32 -226 -1 299 314 -165 -285 -447 -59 70
7311 70 153 135 -158 -136 48 -237 113 296 524 -93 -447 -276 -119 550 -240 -4 -379 -86 292 -27 438
7332 438 44 -14 -57 176 31 206 348 -223 -88 -308 140 249 467 -108 -286 192 232 13 -71 32 278
7353 278 301 64 -178 24 -49 133 -76 -118 259 281 -173 -171 -58 -96 -42 183 -294 -34 234 -164 -291 379 348
7376 348 -64 143 -192 -339 39 383 92 -231 169 -199 -140 -120 208 377 148 -155 -605 186 155 179 6
7397 6 -21 7 -77 112 5 248 -161 -86 -528 -365 101 296 341 -147 -325 -25 183 235 -59 16 -84 -67 199
7420 199 -194 -26 -38 -86 -136 -217 -243 347 253 17 -64 158 -231 275 143 -129 30 -21 116 -201 45 60 220
7443 220 -29 -137 -249 -152 174 -59 -230 46 -212 -110 58 51 231 -131 185 -1 -80 129 -156 21 -69 75
7465 75 164 108 39 256 25 -57 249 -298 -82 -8 110 -165 -129 147 -98 65 -109 -14 265 298 161 -184 147
7488 147 151 105 -179 -232 354 -171 -50 -13 -125 -316 272 105 166 229 -160 -72 186 3 -90 407 -168 -307 -459
7511 -459 84 17 122 -212 184 -46 102 192 72 -87 -98 70 -296 -340 172 281 134 239 67 28 214 42
7533 42 1 80 40 -25 -29 -210 -25 84 -51 98 -144 235 -19 -116 -234 164 137 -35 100 -24 423 32 -242
7556 -242 -135 181 355 -297 -253 201 141 178 314 62 18 -8 59 57 -9 167 118 191 -179 -532 -26 230 376 -142
7580 -142 -179 8 -17 -156 -68 -192 51 225 -89 -182 178 175 135 124 91 -58 -13 150 -35 193 67 61 -68 -81
7604 -81 -244 69 37 -238 -200 100 149 -125 39 18 142 25 -161 -158 -176 40 -28 37 -220 -169 228 38 57 -35
7628 -35 -42 135 296 -306 -234 11 348 -295 -105 141 177 -144 122 48 49 210 -10 -105 -112 72 -50 -79 -175 -29
7652 -29 -154 -69 175 -4 25 439 -165 -53 179 -69 64 188 -31 -148 134 233 124 -118 32 95 79 71 -298
7675 -298 -196 160 -2 -125 49 86 83 -34 234 236 39 219 -148 -62 284 186 -11 -146 -109 4 151 125 -280
7698 -280 -341 108 41 108 -336 -159 145 127 10 111 -52 175 -23 200 22 185 86 192 -176 73 73 20 39
7721 39 -130 -223 341 127 -132 -209 196 110 38 36 -101 51 301 -159 -218 -22 205 233 -225 205 -159 -105 366
7744 366 25 -219 91 399 23 -159 90 -239 -420 265 68 10 125 145 -122 -149 189 -91 140 -95 -141
7765 -141 61 -109 210 -97 289 373 64 345 26 103 36 331 -236 -210 4 -189 -69 -15 404 110 -273 -74
7787 -74 92 -62 345 75 -77 -123 -19 141 235 -31 198 193 123 21 -150 161 221 95 -260 142 67 59 59 -224
7811 -224 122 49 17 112 -66 -58 -75 120 -162 233 94 39 -14 66 -328 57 33 -66 -125 -106 -51 -123 -9 -238 44
7836 44 84 -180 92 -109 -43 362 -109 -51 -124 89 -180 50 147 -48 -289 -380 18 -143 -323 -174 -77 -284 -87
7859 -87 6 62 -189 -141 -40 -65 -37 -337 -94 66 7 199 17 -219 -214 -94 -174 30 -108 26 -143 1 117
7882 117 -114 -16 -49 -66 128 -233 -162 17 63 399 73 186 -368 76 -102 228 -227 44 -35 33 166 22
7904 22 104 -256 152 22 92 27 -106 23 99 -172 -54 279 280 -17 -27 288 -170 -5 -169 -72 191 141 -364
7927 -364 -17 -393 148 251 -92 -208 12 -188 55 1 120 -4 -141 105 -186 -11 -93 -64 -57 -339 79 -187
7949 -187 -55 -38 -243 -275 -24 229 -79 402 249 39 395 -132 206 210 -65 -89 -30 328 174 231 164 -30 -130
7972 -130 -45 -20 -281 -87 55 -33 -263 -105 102 179 -51 -147 168 12 167 238 -226 -167 56 127 -33 -339 -83
7995 -83 -19 -166 34 -97 48 21 43 -34 -304 277 -58 -207 -196 94 -11 61 -220 305 35 180 -21 -237
8017 -237 -41 -72 -47 -106 15 272 297 -268 34 16 -23 244 -41 -299 -261 153 36 -131 -204 -174 -157 -2 110
8040 110 -54 -11 -174 57 107 -89 79 -20 -31 -438 -60 -186 49 53 160 -23 56 -243 -169 7 -138 71 190
8063 190 181 -75 17 -7 -183 14 -71 -163 265 -96 134 141 101 -101 70 17 95 11 -165 -77 -58 53 13 342 -107
8088 -107 3 27 -118 -270 5 150 152 -19 198 -118 158 231 51 -363 36 26 48 -11 133 -18 -98 118 61
8111 61 -65 -96 7 -19 -358 74 30 -65 264 -154 -202 58 15 198 -172 -356 230 -28 -271 -197 89 187 40
8134 40 -317 -156 213 197 341 -354 -1 72 -22 -3 305 19 -238 -397 -30 281 227 225 87 -184 -283 -4 242
8157 242 -142 379 -9 -116 -325 35 51 171 319 -252 -146 -288 370 157 138 -283 71 -194 -381 -297 -112
8178 -112 271 133 -203 -216 224 22 60 66 -310 -60 163 -203 96
8191I6
##END NTUPLES=NMR FID
##END=
