##TITLE=1H_EC-3226(1)-Z
 CDCl3, 8 sc, 
 4.3.2020
##JCAMPDX= 6.0         $$ Bruker NMR JCAMP-DX V2.0
##DATA TYPE= NMR FID
##DATA CLASS= NTUPLES
##ORIGIN= UXNMR, Bruker Analytische Messtechnik GmbH
##OWNER= root
$$ XWIN-NMR		Version 3.5
$$ Wed Mar  4 16:35:54 2020 Russian Standard Time (UT+4h)  she@DPX200
##.OBSERVE FREQUENCY= 200.1315
##.OBSERVE NUCLEUS= ^1H
##.DELAY= (6, 6)
##.ACQUISITION MODE= SIMULTANEOUS
##.ACQUISITION SCHEME= undefined
##.AVERAGES= 8
##.DIGITISER RES= 18
##SPECTROMETER/DATA SYSTEM= spect
##.PULSE SEQUENCE= zg30
##.SOLVENT NAME= D2O
##.SHIFT REFERENCE= (INTERNAL, D2O, 0, 15.7039)
##AUDIT TRAIL= $$ (NUMBER, WHEN, WHO, WHERE, WHAT)
$$ ##TITLE= Audit trail, XWIN-NMR		Version 3.5
$$ ##JCAMPDX= 5.01
$$ ##ORIGIN= Bruker BioSpin GmbH
$$ ##OWNER= she
$$ F:/spectra/data/she/nmr/H-F/1/audita.txt
$$ ##AUDIT TRAIL=  $$ (NUMBER, WHEN, WHO, WHERE, WHAT)
(   1,<2020-03-04 16:34:53.32 +0400>,<she>,<DPX200>,
      <created by zg, POWCHK disabled, PULCHK disabled
       configuration hash MD5:
       00 E9 B6 7A A2 85 ED C7 34 08 36 98 17 FE 4E 26
       data hash MD5: 16K
       B9 C3 49 44 5A 64 AD 55 63 FA 6A 46 00 C8 E1 E3>)
$$ ##END=
$$ 
$$ hash MD5
$$ 19 A7 8A 5F 4D 18 20 0A 02 6E 7D 71 48 73 29 8B
##$RELAX= 
##$RELAX= 
##$RELAX= 
##$RELAX= 
##$RELAX= 
##$RELAX= 
$$ Bruker specific parameters
$$ --------------------------
##$DU= <F:/spectra>
##$EXPNO= 1
##$NAME= <H-F>
##$PROCNO= 1
##$TYPE= <nmr>
##$USER= <she>
##$AMP= (0..31)
100 100 100 100 100 100 100 100 100 100 100 100 100 100 100 100 100 100 
100 100 100 100 100 100 100 100 100 100 100 100 100 100 
##$AQSEQ= 0
##$AQ_mod= 1
##$AUNM= <au_zg>
##$AUTOPOS= <>
##$BF1= 200.13
##$BF2= 200.13
##$BF3= 200.13
##$BF4= 200.13
##$BF5= 200.13
##$BF6= 200.13
##$BF7= 200.13
##$BF8= 200.13
##$BYTORDA= 1
##$CFDGTYP= 0
##$CFRGTYP= 5
##$CHEMSTR= <none>
##$CNST= (0..31)
1 1 145 1 1 1 1 1 1 1 1 1 1 1 1 1 1 1 1 1 1 1 1 1 1 1 1 1 1 1 1 1 
##$CPDPRG= <>
##$CPDPRG1= <>
##$CPDPRG2= <>
##$CPDPRG3= <>
##$CPDPRG4= <mlev>
##$CPDPRG5= <mlev>
##$CPDPRG6= <mlev>
##$CPDPRG7= <mlev>
##$CPDPRG8= <mlev>
##$CPDPRGB= <>
##$CPDPRGT= <>
##$D= (0..31)
0 1.2 0 0 0 0 0 0 0 0.06 0 0.03 0 0 0 0 0.0002 0 0 0 0 0 0 0 0 0 0 0 0 
0 0 0 
##$DATE= 1583325292
##$DBL= (0..7)
120 120 120 120 120 120 120 120 
##$DBP= (0..7)
150 150 150 150 150 150 150 150 
##$DBP07= 0
##$DBPNAM0= <>
##$DBPNAM1= <>
##$DBPNAM2= <>
##$DBPNAM3= <>
##$DBPNAM4= <>
##$DBPNAM5= <>
##$DBPNAM6= <>
##$DBPNAM7= <>
##$DBPOAL= (0..7)
0.5 0.5 0.5 0.5 0.5 0.5 0.5 0.5 
##$DBPOFFS= (0..7)
0 0 0 0 0 0 0 0 
##$DE= 6
##$DECBNUC= <off>
##$DECIM= 24
##$DECNUC= <off>
##$DECSTAT= 4
##$DIGMOD= 1
##$DIGTYP= 9
##$DL= (0..7)
0 120 120 120 120 120 120 120 
##$DP= (0..7)
150 150 150 150 150 150 150 150 
##$DP07= 0
##$DPNAME0= <>
##$DPNAME1= <>
##$DPNAME2= <>
##$DPNAME3= <>
##$DPNAME4= <>
##$DPNAME5= <>
##$DPNAME6= <>
##$DPNAME7= <>
##$DPOAL= (0..7)
0.5 0.5 0.5 0.5 0.5 0.5 0.5 0.5 
##$DPOFFS= (0..7)
0 0 0 0 0 0 0 0 
##$DQDMODE= 0
##$DR= 18
##$DS= 0
##$DSLIST= <SSSSSSSSSSSSSSS>
$$ [...]
##$SUBNAM2= <"">
##$SUBNAM3= <"">
##$SUBNAM4= <"">
##$SUBNAM5= <"">
##$SUBNAM6= <"">
##$SUBNAM7= <"">
##$SUBNAM8= <"">
##$SUBNAM9= <"">
##$SW= 24.9337058887773
##$SWIBOX= (0..15)
0 0 2 0 0 0 0 0 0 0 0 0 0 0 0 0 
##$SW_h= 4990.01996007984
##$TD= 16384
##$TD0= 1
##$TE= 0
##$TE2= 300
##$TE3= 300
##$TEG= 300
##$TL= (0..7)
0 120 120 120 120 120 120 120 
##$TP= (0..7)
150 150 150 150 150 150 150 150 
##$TP07= 0
##$TPNAME0= <>
##$TPNAME1= <>
##$TPNAME2= <>
##$TPNAME3= <>
##$TPNAME4= <>
##$TPNAME5= <>
##$TPNAME6= <>
##$TPNAME7= <>
##$TPOAL= (0..7)
0.5 0.5 0.5 0.5 0.5 0.5 0.5 0.5 
##$TPOFFS= (0..7)
0 0 0 0 0 0 0 0 
##$TUNHIN= 0
##$TUNHOUT= 0
##$TUNXOUT= 0
##$USERA1= <user>
##$USERA2= <user>
##$USERA3= <user>
##$USERA4= <user>
##$USERA5= <user>
##$V9= 5
##$VALIST= <valist>
##$VCLIST= <CCCCCCCCCCCCCCC>
##$VD= 0
##$VDLIST= <DDDDDDDDDDDDDDD>
##$VPLIST= <PPPPPPPPPPPPPPP>
##$VTLIST= <TTTTTTTTTTTTTTT>
##$WBST= 1024
##$WBSW= 4
##$XGAIN= (0..3)
0 0 0 0 
##$XL= 0
##$YL= 0
##$YMAX_a= 297821
##$YMIN_a= -339519
##$ZGOPTNS= <>
##$ZL1= 120
##$ZL2= 120
##$ZL3= 120
##$ZL4= 120
##$ABSF1= 10
##$ABSF2= 0
##$ABSG= 5
##$ABSL= 3
##$ALPHA= 0
##$AQORDER= 0
##$ASSFAC= 0
##$ASSFACI= 0
##$ASSFACX= 0
##$ASSWID= 0
##$AUNMP= <proc_1d>
##$AZFE= 0.1
##$AZFW= 0.1
##$BCFW= 1
##$BC_mod= 2
##$BYTORDP= 1
##$COROFFS= 0
##$CY= 11.3945322036743
##$DATMOD= 1
##$DC= 2
##$DFILT= <>
##$DTYPP= 0
##$F1P= 16.9975609425685
##$F2P= -3.02152046262296
##$FCOR= 0.5
##$FTSIZE= 0
##$FT_mod= 4
##$GAMMA= 1
##$GB= 0.15
##$INTBC= 1
##$INTSCL= 1
##$ISEN= 128
##$LB= 0.24
##$LEV0= 0
##$LPBIN= 0
##$MAXI= 10000
##$MC2= 0
##$MEAN= 0
##$ME_mod= 0
##$MI= 1.114404
##$NCOEF= 0
##$NC_proc= 0
##$NLEV= 6
##$NOISF1= 3.799351
##$NOISF2= 2.8
##$NSP= 1
##$NTH_PI= 0
##$NZP= 0
##$OFFSET= 15.70392
##$PC= 1
##$PHC0= -9947.226
##$PHC1= 17.20082
##$PH_mod= 1
##$PKNL= yes
##$PPARMOD= 0
##$PSCAL= 0
##$PSIGN= 0
##$REVERSE= no
##$SF= 200.130013532006
##$SI= 16384
##$SIGF1= 3
##$SIGF2= 2
##$SINO= 400
##$SIOLD= 16384
##$SREGLST= <1H.CDCl3>
##$SSB= 0
##$STSI= 0
##$STSR= 0
##$SW_p= 3612.71676300578
##$SYMM= 0
##$S_DEV= 0
##$TDeff= 0
##$TDoff= 0
##$TI= <>
##$TILT= no
##$TM1= 0
##$TM2= 0
##$TOPLEV= 0
##$USERP1= <user>
##$USERP2= <user>
##$USERP3= <user>
##$USERP4= <user>
##$USERP5= <user>
##$WDW= 1
##$XDIM= 8192
##$YMAX_p= 0
##$YMIN_p= 0
$$ End of Bruker specific parameters
$$ ---------------------------------
##NTUPLES= NMR FID
##VAR_NAME=  TIME,          FID/REAL,        FID/IMAG
##SYMBOL=    X,             R,               I
##VAR_TYPE=  INDEPENDENT,   DEPENDENT,       DEPENDENT
##VAR_FORM=  AFFN,          ASDF,            ASDF
##VAR_DIM=   8192,          8192,            8192
##UNITS=     SECONDS,       ARBITRARY UNITS, ARBITRARY UNITS
##FACTOR=    0.0002004,     1,               1
##FIRST=     0,             0,               0
##LAST=      1.6414764,     0,               0
##MIN=       0,             -339519,         0
##MAX=       1.6414764,     297821,          0
$$ Real data points
##PAGE= N=1
##DATA TABLE= (X++(R..R)), XYDATA
0@%%%%%%%qJ6j6K4l2L3m1M9n8P4q9J05j27J51j78K08k35K69l12L54m03M60n19
30b75N88o61P41q31R28j037J153j281J423j578J749j935K144k375K630k914L233
47A702l597M013m495N054n717O525p529Q812j0524J2943j6645K3086l7470J25222
61A01380o0607l13571j0386J92416K87948R7265j41928k78418j44701P3323K39252
72D1973J96747j066k17101k19354l8209J65674K09402Q6233j14876j95160j00002
83a85739O3154J41471J14671M032j06440j24807l4520O5576J06616O5530k9461
94H0083r6528o3601J3297N2177M6738K1571j7089l8156k8514j2409Q245L9814
106E628M0776k955l6129l2024j5836P735L3025L1615Q248j3263l6417m3961j192
$$ y = [0, 0, 0, 0, 0, 0, 0, 0, -8, 8, -8, 16, -16, 17, -24, 25, -33, 41, -48, 57, -70, 81, -97, 111, -124, 145, -167, 187, -216, 244, -275, 313, -348, 393, -438, 490, -547, 606, -675, 748, -830, 919, -1016, 1128, -1247, 1383, -1531, 1702, -1895, 2118, -2377, 2677, -3040, 3485, -4044, 4768, -5756, 7187, -9458, 13628, -23842, 101380, 40773, -272798, -283184, -90768, 197180, 294445, 152517, -125901, -270602, -197279, 41973, 238720, 237654, 20553, -198801, -237010, -71336, 138066, 224299, 109423, -85737, -185739, -122585, 18886, 133557, 137589, 31149, -93658, -128178, -62602, 44014, 109544, 80083, -16445, -80046, -66749, -14572, 32166, 53737, 36648, -1508, -30022, -42431, -34186, 5628, 46404, 43449, 7320, -24704, -40540, -32805, 220, 31835, 40083, 26820, -9597, -53558, -54750]
119e4750N3713N1846M594l6519n0883k7393K3305M8058K9794L443k3089m8820
131b6701l5333J9735N4910M1338L42m4316n5267j1790L6054L9165K1421L435k6851
144A6142m6025k3731J6606M3355M5633Q621m6261n6596j6237K2717M3217M6590
156E4031J3195m2032o5380m0766J6567P8810Q3021L4q9903r5626k4257O4982J11179
169F3855O5998m3321j16865r5307o51J07932J41326M2271j08641j61575p2262
180a77240P8821J69909J14060n1038j67824j32475O945J36977J61978M7363j17807
191F9669j78717q2686Q0873J79140J24050m9886j77524j34840K0231J41693J41596
202A33599K4729j12649j44198m9704P2922J29438Q3585l7001j27708r5142K0864
$$ y = [-54750, -1037, 50809, 55403, 18884, -31999, -59392, -36087, 11971, 41765, 45208, 22119, -26701, -62034, -42299, 12611, 53949, 54291, 9975, -45292, -57082, -21028, 18137, 39558, 42993, 16142, -29883, -53614, -37008, 6347, 51980, 60601, 14340, -42256, -58493, -35776, 7441, 54031, 67226, 25194, -40186, -80952, -64385, 14425, 97446, 97480, 7577, -88049, -112306, -47324, 63855, 129853, 86532, -30333, -125640, -126291, -18359, 122967, 165238, 56597, -104978, -177240, -98419, 71490, 185550, 134512, -33312, -165787, -158842, -21865, 140113, 187476, 69669, -109048, -191734, -110861, 68279, 192329, 142443, -35081, -169921, -149690, -7997, 133599, 158328, 45679, -98519, -148223, -75301, 54137, 137722, 100721, -26987, -122129, -101265]
213a01265J02784R1006N152q1433q5763r847N5364N8494K3803k1386n0851l3136
225d7078J3100L6271K6202N98k6823k6655P550K5655L546j6459q869P053J7091
238A1182J0912j5953k9314m582K2149K1624J0382n818k8165k8382L069L1495L4255
251C2854J1707l0067n1753j6636L6850M6512J6208j9672m0834k8565J1113L4653
263B370K6223P019j7528l8202k3207J9115L8188K1131p795k9402k6029M372K2951
276g94J1382R40K196o326j5366q733K343J0414J7987R667j2614j8406q806m260
290b0376O402K6226K3593o828l3110l5550p769L9700N5691J1052m3962n3317k1826
303f0074K5173N9021M3088j4858n8770n4949r505N4218P9912K5486n9021q4612
$$ y = [-101265, 1519, 92525, 97677, 16244, -69519, -79366, -24002, 34492, 58295, 36909, -13942, -47078, -33978, 2293, 28495, 29093, 2270, -24385, -16835, 8820, 12366, -4093, -12962, -5909, 11182, 22094, 6141, -23173, -27755, -5606, 16018, 26400, 20582, -7583, -35965, -32896, -1401, 32854, 44561, 14494, -37259, -53895, -17045, 29467, 45675, 26003, -14831, -43396, -32283, 2370, 28593, 35612, 18084, -20118, -43325, -24210, 13978, 35109, 27314, -2088, -28117, -23745, -794, 10588, 11528, 13724, 7398, -7968, -16701, -14358, -3944, 14043, 23710, 11096, -7310, -16116, -20376, -13974, 12252, 35845, 29017, -4093, -39643, -47412, -7712, 47979, 59031, 15069, -38248, -60074, -34901, 24120, 67208, 52350, -6420, -61369, -70874, -16656, 63256, 88742, 29721, -54891]
315e4891l4299M3062Q6158N2256l3310q2842n5290J0681O5279P2760J4851o2935
327B1480q1451k6353M8556Q3313M4398m1866q5925m2463L2085O7162M6789j0845
339E4880n9544n0917K555M4392M8039J6343l4868n7437j8895L6472M8651J6551
351D6222k6525m5019j6670K8644L5614N648j7839k2316j2804J0980K6319J1758
363B4012j2716k1973j4912Q111L1534J9314k0562l5050j0197K0592L1610J4202
375C3965k1918l5232q690K0351K4601J4741o174k9600k5844O827L1249K7457J312
388C3045l2519l8093J323L9396L0930l932k8301k9237l953K6775K7952K788j6441
401I733k2575j6230J0560L3086J8106j6080l0316j7075J2338L3954J8039k0666
$$ y = [-54891, -89190, -46128, 40030, 92286, 58976, -23866, -79156, -68475, -3196, 69564, 84415, 21480, -59971, -86324, -37768, 45545, 89943, 48077, -37848, -80311, -48226, 18936, 65725, 54880, -4664, -55581, -53026, -8634, 39405, 55748, 20880, -36557, -55452, -18980, 29671, 46222, 19697, -25322, -41992, -13348, 22266, 27914, 10075, -12241, -25045, -14065, 12254, 24012, 11296, -10677, -25589, -17478, 14056, 33370, 12808, -22242, -32439, -11847, 19763, 33965, 12047, -23185, -31875, -11524, 13077, 27818, 21644, -7956, -33800, -26973, 4276, 31733, 33045, 526, -37567, -36244, 3152, 34082, 30150, 1849, -27388, -31341, -4566, 23386, 26174, 9733, -12842, -29072, -18512, 14574, 32680, 16600, -13716, -30791, -18453, 15501, 33540, 12874]
413A2874l0916p167J5262K1324J2906j0040k4946j2580R021J9711J8688p5k8443
426d381k7806P824L3442K3553o527l2428k8487Q639L6058K1920q305k4344k3975
439b4817m944K4581L1600O776k1778l2770j7614K0931M4168J7638k7837l9779
451b3845j5013J9875L8378K0068j9601l5020j6747Q445K6758K8631Q72l3430l2898
464c3527m61L0158L5679P045l4376l9262l14L2231K9062M996k1723l1354r923
477c1769K0208K6793J3035q670k9173k4911J0781L5952K1133j1930l1249k3040
489c2840R909L4224J8485j3926k3934j3567K596J9583K0543j177k0216j8554l646
502b2520J6763K7006N683k6522k6334K680K3919K2145J15k4828k3098M918K2455
$$ y = [12874, -18042, -25209, -9947, 11377, 24283, 14243, -10703, -23283, -14262, 5449, 24137, 24062, -4381, -32187, -24363, 9079, 32632, 26105, -6323, -34810, -26171, 9887, 31807, 23502, -842, -24817, -29761, -5180, 26420, 33196, 11418, -21352, -38966, -18035, 26133, 43771, 15934, -23845, -38858, -18983, 19395, 39463, 19862, -15158, -31905, -23460, 3298, 31929, 32801, -629, -33527, -33988, -3830, 31849, 38894, 4518, -34744, -35058, -2827, 26235, 31231, 9508, -21846, -31769, -11561, 15232, 28267, 19597, -9576, -34487, -23706, 12246, 33379, 21449, -9800, -32840, -22931, 11293, 29778, 15852, -8082, -21649, -19053, 530, 21073, 19896, -320, -18874, -22520, -5757, 21249, 26932, 410, -25924, -23244, 675, 22820, 22935, -1893, -24991, -20073, 2382]
515B382J5641J457j3911k3394q821J8922K6745R484j5952l1673j7130K1978L8660
528B4388J1427k3640l2059j4343J6757L4483J7404j5399k8693k0084J697K8800
540G38L3648Q11l4437l4195l636L0697L9738P485l4360l6954m183K4340L0729
553B0421J4731j6610l3724j7765J1466K8496K5742j898l4684l1539O568L3583
565D787K6084k352k8736k7862K699K6787J9744R0j4297k1216j0227J5051K4591
578A5143Q830j2652k3371j4314J3966K9756R083k0076k2791m851J4456K1733O683
591B1595j6358j8994l706R188J6203J3743p016k5467j5285J1222K5512J7593r272
604A8958l2110j9797J6400L1216J3753j1367k5886j9614P134K7454J9553k725
$$ y = [2382, 18023, 19480, 5569, -17825, -26646, -7724, 19021, 28505, 12553, -19120, -36250, -14272, 24388, 35815, 12175, -19884, -34227, -17470, 17013, 34417, 19018, -9675, -29759, -28062, 738, 34386, 35197, 760, -33435, -37071, -6374, 33364, 40849, 6489, -30465, -34648, -10308, 20421, 35152, 18542, -15182, -32947, -21481, 7015, 32757, 30859, -3825, -35364, -28796, 4787, 30871, 28519, -217, -28079, -25380, 1407, 21151, 21241, 6944, -14272, -24499, -9448, 15143, 23973, 11321, -12050, -26364, -12398, 17358, 26441, 6365, -16426, -21277, -6821, 14912, 21595, 5237, -13757, -17463, -8275, 7928, 21671, 14655, -10812, -26097, -14875, 10637, 28230, 18958, -13152, -32949, -16549, 14667, 28420, 17053, -8833, -28447, -21313, 6141, 25694, 22969]
616B2969k1255k6888p182K6843L4470M207k7910l2486q259K6421L6213O750k6930
629F963k8806p778J5271K8305J7179j3201k9756j7956O964K8008K6816m974l4921
642g886k5049R400K9270K2063m077k7649k2231N903K1907J6310K316j4213k2872
655a6808p618J7865K3074P032j4290k5372j0786J9330K7187L425j8921j9200n157
668b0239J3428K0588N800j3024j5641q011M075J8755J7573o674k4499j5755O677
681a6947K3072J9902o135k7378j6931Q545J9716J4876J166j6542k0307l859J3924
694f898J9384J2097r160k7563j6280J4093K6636J3002r246k3359j6281Q078K0986
707E489J1536k260j1198j5853o797J2561J8577N817r471j7161j0031J0666J9870
$$ y = [22969, 1714, -25174, -32356, -5513, 28957, 33164, 5254, -27232, -35491, -9070, 27143, 33893, 6963, -21843, -29621, -14350, 13955, 31134, 17933, -11823, -29779, -22815, 5193, 32009, 27035, -7886, -32935, -23535, 5735, 27798, 23721, -3928, -26159, -20256, 1651, 17961, 20277, 6064, -16808, -24426, -6561, 16513, 23545, 9255, -16117, -26903, -7573, 19614, 23039, 4118, -15082, -20239, -6811, 13777, 19577, 6553, -9088, -17099, -13024, 5731, 23304, 16630, -7869, -23624, -16947, 6125, 26027, 19892, -7486, -24417, -15872, 3844, 18720, 19886, 3344, -16963, -20822, -6898, 12486, 24583, 15423, -12140, -28420, -14327, 12309, 25311, 16065, -7294, -23575, -15497, 5489, 17025, 14765, 3567, -12286, -19083, -6522, 12055, 17872, 8401, -8760, -18791, -8125, 11745]
720A1745L554j3571j0683K13P737Q636o07r964m858M865N658L925P25r381j2415
735a4421K631J7372J3630l227k1113k2300M188L1528K4068q311k9898k5803Q8
748c1568K9980L3568M429k7501l5836j7415K0692M7784K8832k2329n1732l3481
760e4577J4467N2461M2800j0055n1202m1955oL8660M7986J5528l3677n1558k3365
773e4493K2938N1248L5947j6328n3866l6465J2068M3275L6117l07l5596l5922
785c1384m550K3546K9797J6203j2249l2374k0182J0136K6104J8657k962k1958
797a216j7742M819J5804O971j790l946m888j640K506N47p32K433J089j847K520
812B888K400o955q374K366J0851J0185L52j4487j6630J812J7449J2844O42r262
$$ y = [11745, 15299, 1728, -8955, -8742, -1005, 7631, 7024, -2940, -7798, -2933, 2725, 6650, 7375, -2006, -14421, -11790, 5582, 19212, 15985, -5128, -27428, -23240, 8288, 32356, 24045, -5853, -31656, -31568, -1588, 31980, 36409, 8908, -26928, -44343, -23651, 24133, 52965, 30636, -21096, -54577, -40110, 12351, 55151, 45096, -6106, -48061, -48067, -9407, 38579, 54107, 20430, -31128, -54493, -31555, 19693, 55640, 39312, -14554, -51019, -38951, 4324, 40441, 40134, 4538, -31384, -35934, -12388, 17409, 33612, 21363, -11011, -31193, -21057, 5047, 23704, 20742, -1216, -18958, -14139, 1665, 8636, 6846, 2900, -1988, -3628, -1122, -575, -1307, 1126, 2215, 368, 2888, 5288, -1667, -10041, -7675, 3176, 13361, 13713, -774, -17404, -15592, 1857, 14701, 15343, 6081]
826F081j4876r067O598J5381J2388K291j4140k2402o299J7970K1696O283j0923
839A0981j9302j1821O822J5869J0188K311o492j5824j1395O406J6096J1074n44
852A4369j2224j3690p74R250N464K261L810p24q533r048l551N818J5307J1385
866A9120o296j6585j2579l495J0012K2595J6104q470k7708k6187j593L2317M0976
879C8211O897l5548m4297j6011K6023N0027L0505j8390n0936m1018J501M8017
891e019N8438J2970m8795o5365k3742L8214O8978L8208k9360o7496m3939J2791
903e4117N6492N5482O293n0686o1357j8707L7710O2715L3722k8432o2922l6453
915f0260J8513N0189L9201k823m0627l9768n729K6278L5187J8712j4862l5947
$$ y = [6081, -8795, -17862, -11264, 4117, 16505, 18796, 4656, -17746, -24045, -6075, 15621, 21904, 10981, -8321, -20142, -13320, 2549, 12737, 15048, 8556, -7268, -18663, -12257, 3839, 14913, 14369, 2145, -11545, -12319, -3069, 2395, 4656, 8466, 7742, -791, -9839, -13390, -7572, 7735, 19120, 12824, -3761, -16340, -19835, -9823, 12772, 28876, 20406, -7302, -33489, -35082, -2765, 38211, 45108, 9560, -34737, -50748, -24725, 25302, 55807, 37417, -13519, -54537, -53036, -5019, 53419, 66389, 17594, -47771, -71513, -33299, 35679, 73887, 44527, -22969, -66908, -54117, 2375, 57857, 64150, 13464, -47893, -66600, -28890, 33825, 67547, 39115, -23807, -60260, -41747, 8442, 47643, 44820, 4193, -35575, -41304, -15026, 20161, 38873, 24011, -11936]
927a1936k1621J0502K7165J9770k174k0633j6918K311J1460O386K296k75m368
940A965m092r76p49P07M380K402N4J827j533r921p175O314J3668R576l306j7133
956c992j5338L895J7617J2850J532r267j6381j0441O141J6628J4707K737j5468
969E220k2875o242J6246J9986Q078o873j6973j3581J209J1663J2365R038k417
982A4844j6945j6154P08J3958J5181O902p832j6077r359R58P073J3174J3284k128
996A7587j8847j8964m363J5334K5968J3347j3642k6551j7987J331K1917L0400
1008B5530J1692k0772l6605k3005J1616M2331L7011o413m4106m0910m590L5134
1020a3087M8081J9386k7996n0179l0960J2713N0182M7283j522n1327n2957q197
$$ y = [-11936, -33557, -23055, 4110, 23880, 21706, 1073, -15845, -13534, -2074, 4312, 6608, 6333, 1965, -2127, -3103, -3852, -3145, 1235, 3637, 3691, 5518, 3985, -5936, -13111, -6797, 6871, 16447, 13141, -3992, -19330, -15435, 2182, 15032, 16564, 7297, -9084, -19525, -13384, 3244, 17951, 20688, 5220, -17655, -23897, -7651, 12335, 20413, 13540, -3433, -17014, -15805, -4142, 8223, 17261, 14844, -2101, -18255, -17547, -3589, 11592, 18494, 10662, -5415, -14774, -13816, -6743, 6431, 19715, 17587, -1260, -20224, -24587, -9253, 16715, 30062, 16420, -10131, -28118, -26787, -4870, 25530, 37222, 16450, -20155, -43160, -31544, 10787, 47798, 41385, -2721, -43631, -48221, -13087, 34994, 54380, 26384, -23795, -54755, -42042, 8140, 55423, 53901, 2574, -50383, -58580]
1032e8580M1991N6734K1044l4452n5602k7110J9528M8047L8801m571m5263m4053
1044d3486m930L5869M6263J6267l0223m6348j7309K2049L6446K0843j0168l0894
1056e621k1992M383K1190K0267N243j5731k2637n317J4700J6449L704r879j3520
1069h761j645J1698P534n102p562j875L328P017M326n454r513l858L621R922J1201
1084A4877j590j7577j4654M107J7687J6001K00j8385j9225l19J5439J5564O603
1097A8728o882j8161j3582M113J6916J6207L036j5495k1063m240J4758J5899N445
1110A5679n705j2746r479J433P660Q039O670j364j1637j0096J211P712P771M505
1124I653k566p401n482l251l18R026J3668K416j2583j5924o722R098J9963J2251
$$ y = [-58580, -16589, 40145, 61189, 26737, -28865, -55975, -36447, 11600, 50401, 45830, 567, -43486, -48416, -12547, 33716, 49983, 19760, -26588, -43897, -21848, 14598, 35441, 25273, -5621, -27613, -23230, -2040, 18227, 23470, 7739, -14898, -20215, -5515, 10934, 14638, 4759, -8761, -10406, 1292, 8826, 3724, -3838, -5713, -2385, 4632, 8958, 3504, -6009, -9867, -6246, 3676, 14877, 13287, -4290, -18944, -14837, 2850, 18851, 19051, 666, -18559, -18878, -3439, 12125, 18728, 11846, -6315, -19897, -15784, 1132, 17339, 20375, 4880, -16183, -20423, -5665, 10234, 15679, 9974, -2772, -12251, -10818, -3158, 4881, 11551, 10187, -1450, -11546, -10335, -2623, 5148, 9653, 7087, -314, -5796, -9047, -9365, -339, 13329, 15745, 3162, -12762, -19484, -10386, 9577, 21828]
1138B1828p577j8331j4728k666J4603K4149J0754j4632k7106j7421Q447L1154
1150H474K5236o941l0864k5136o21K3583K9874R763j9850l0491j6400J0259L1571
1163H457K6734o124l3855k7686K196K7855K9584M434k4975k8100o442J5715K4155
1176A1948J5052q729k5847j7688N899K2001J9718q77k2319k0096L218J8942J4118
1189A5340m32j3041j3970p35J1593J0338J660o408j1437n777Q980J4064K660j0248
1203B587j2560l441J1312J5280O07j4041j1611L79R479J1930M057r574j3375m723
1217a3694O230J3286J1161m838j8681j1950O969J6896J1705l688j6949j2788M585
1230a1756J3746R337O13q321j2787m629Q910J2585N398n685j3753q376Q058J4653
$$ y = [21828, 14251, -4080, -18808, -21474, -6871, 17278, 28032, 13400, -13706, -31127, -22680, 8474, 33710, 26769, -4095, -29231, -29852, -6269, 23605, 33368, 13518, -16973, -33373, -23114, 8457, 35191, 29067, -4788, -32474, -30278, -2423, 27161, 31595, 6620, -21480, -27922, -12207, 11948, 27000, 18271, -7576, -25264, -19365, 2636, 22354, 21477, -842, -20938, -17720, 1222, 15340, 14908, 1867, -12103, -12838, -1245, 9093, 10753, 4345, -7092, -12869, -3889, 10175, 12835, 2587, -9973, -13414, -2102, 13178, 13785, -256, -11867, -11488, -2009, 9921, 13978, 4404, -8971, -13694, -7464, 5822, 16983, 12145, -6536, -18486, -11517, 5379, 17084, 13396, -3553, -16341, -11756, 1990, 11327, 11940, 3619, -9168, -13797, -4887, 7698, 13096, 7411, -6342, -14718, -6660, 7993]
1244G993L721p923r336l741N195R261K375n756n248j734R25N959O041l044q980
1259d292m400L885R046O596n427j3233m519R188J0674K734n792j0468n593N810
1273e791J0349N321j777q775j1281p24J3327J2644p43j2201j3280j653J3580J4332
1287A3328p63j1909j0015k510O941J2216N568o932j1394p084L020J3371J1434
1300A5271n132j5991q583N673J2999R292m042j3857p873M666R435P272J077q604
1314A603j1706j708J0035J1352L529q792j4857m177J2313J3638J129r282j0919
1327g842m147P728J1462L326n293q151p049J142J1392R585l410j1361q121J973
1341h766J1311R373m313j1950m695M391P103M865j387p827n270K182O068N599
$$ y = [7993, 11714, 3791, -5545, -9286, -4091, 5170, 7545, 1789, -3459, -5193, -4268, 1691, 7732, 4688, -4292, -8692, -4807, 4239, 10835, 5408, -7825, -12344, -3156, 7518, 10252, 4460, -6008, -11601, -5791, 4558, 9879, 8102, -673, -11954, -12678, 649, 13293, 12550, 349, -12931, -14584, -1004, 13328, 12565, 656, -9359, -11869, -4928, 7288, 12856, 5924, -5470, -12554, -9534, 3837, 15271, 10139, -5852, -14435, -8762, 4237, 13529, 9487, -4370, -12243, -7577, 1858, 9130, 10207, 1603, -10103, -11811, -1776, 9576, 13105, 4313, -10544, -14721, -2408, 11230, 12359, 3077, -7842, -11989, -4261, 7201, 10527, 5234, -2917, -9966, -8824, 2568, 12153, 8743, -2618, -10739, -8766, 2545, 11918, 7605, -4345, -9040, -4649, 2454, 7319, 5932, -1895, -7165, -4983, 1085, 6684]
1355F684J036p777j0054J263J1802Q655k774j1479j0356K610J4431R802m444j1503
1369b104r364r85J0482J4009L199j0727j4953p749Q501K0073J1290j0919k0754
1382a0001j0597P269J8929J4433m465j8347j4083k40J2661J7912P673j2598k0968
1395a2422r173R740K0108J3525p467k1330j2570O040J5341J2513P39j2400j4464
1408a1820l100Q931J2901Q005n398j5707r065P009J2961O456l701j0358o656M064
1422e478P981K391j723k663l810r95M404L581j134l522k924O20O223M413n501
1437A863q735o21P272P419J472p196r738j089Q021P727K694l222r639q113L406
1452h479J1891Q904j332j1709j2794P53J4276J1204j851j0018r672j973Q111R775
$$ y = [6684, 7720, -57, -10111, -8848, 2954, 11609, 8835, -2644, -13000, -10390, 4041, 13843, 9399, -2104, -11468, -12453, -1971, 12038, 15237, 4510, -10443, -18192, -9691, 10382, 21672, 10753, -10001, -20598, -13329, 5600, 20033, 15568, -2779, -16862, -17102, -4441, 13471, 21144, 8546, -12422, -21595, -11855, 8253, 21778, 14311, -7019, -19589, -13549, 1792, 14305, 15044, 2644, -11820, -14920, -5989, 6912, 14917, 9519, -6188, -15253, -8244, 4717, 11173, 7472, -2886, -9542, -5478, 2503, 4894, 3171, 508, -3302, -4297, 107, 3688, 2554, -968, -3892, -3272, 2951, 7364, 1863, -6872, -7493, -221, 7198, 8670, 1474, -8264, -9353, -1332, 6395, 9089, 5867, -3772, -11885, -8479, 3412, 12316, 10984, -725, -13519, -12766, 1510, 12714, 10863, 845, -8827, -10800, -2689, 7086]
1466G086K085m820p168n734J791R553O446m009q042l821K799P209L199n712o196
1481e334K043N816J982k000m666l939K555P063L687k206o186p828j227J0723J2580
1496A3063j76j2695j3751k790J3292J7832L419j3968j6168n987P857J7472J2494
1509A9894n310j8410j5448j30J7180K1594L996j8833k2090n609J3849K1390J1040
1522B3113r978k0838j2571L673J6112J8002L694j6213k0828o040J2617K0299J0748
1535B1790r777k0449j0359O419J4331J1741R98j1832j3995l473Q161J2844Q168
1548A4567n235j4718q174N758J0851O005j960p742n814J590M569K294J143k53
1562B881l526k608J933K321j88r93r94Q06L714P61o233n149L423P658M241k440
$$ y = [7086, 9171, 4351, -2817, -8551, -6760, 2793, 9239, 5230, -2812, -6633, -3834, 3375, 6574, 862, -5334, -3291, 2525, 4507, 2507, -2159, -6098, -3543, 3520, 7207, 5001, -1185, -9013, -10240, 483, 13063, 12887, 192, -13559, -16349, -3057, 14775, 18194, 4226, -11942, -17929, -10072, 7400, 19894, 14584, -3826, -19274, -19404, -2224, 19370, 23366, 4533, -17557, -23166, -9317, 12073, 23113, 13135, -7703, -20274, -16601, -489, 17513, 21207, 4994, -15834, -21874, -9257, 11042, 21790, 12013, -8436, -18795, -12376, 1955, 13696, 14694, 2862, -11133, -14606, -6445, 6399, 14567, 9332, -5386, -13560, -7802, 3049, 9054, 7094, -648, -6462, -4872, -303, 1991, 3134, 2881, -645, -3253, -1320, 1001, 813, -180, -1174, -368, 3346, 4107, -2126, -7275, -3852, 3806, 8047, 5607]
1578E607q437o816L015R185N872l55o011r469m404P504J2216N199o065j3131q804
1593a4894O182J5571P495o437j1621p772K208J0749Q926j403q161p851k783O302
1607c489J0984L203q201r394j689O574Q711J452q081p013K150O452L450j060m886
1622h37m993J153O541M380q29n670p842r84R942J0428j236j1273j0535l58J1966
1637a47J3030l3j2131j1502k467P806J3444P725p001j5093r783L388J5381J4794
1651A7411j714j7413j4714O72J3468J5014L965j1177j5240n892O100J3231J1609
1664A5320j263j5053j4155l6J2685J4566M012j1131j5037m270P871J0902P060
1677A1471j578j0310r827n83P817J0057M903o238j2024m666O048Q346L908j771
$$ y = [5607, -2830, -9646, -6631, 2554, 8426, 8071, 2060, -7409, -11813, -4309, 7907, 13106, 7041, -6090, -14894, -8712, 6859, 14354, 7917, -3704, -11476, -9268, 1481, 10407, 9004, 843, -7008, -9791, -3489, 7495, 10698, 2497, -6897, -8586, -2012, 6699, 8151, 70, -6943, -4793, 1659, 5109, 4049, -837, -5830, -4677, 1864, 6244, 5415, -255, -8097, -9081, 861, 11289, 10053, -1220, -11755, -12113, -147, 12883, 12850, 719, -10783, -13250, -5444, 8000, 15725, 8724, -6369, -16152, -12764, 2617, 17411, 15697, -1716, -16430, -15758, -2290, 12724, 16689, 5512, -9728, -15620, -9520, 3711, 15320, 14057, -996, -15151, -15187, -2502, 12064, 16076, 4945, -10092, -14362, -6491, 4411, 11471, 9893, -417, -10244, -10827, -3010, 7047, 11950, 5712, -6312, -10978, -4930, 3416, 7324, 5553]
1691E553n942m568O80K698K358L045P20l932m149J49K068J946J731l9j031m50
1707H37k205l906J042P167N053k254p230o948L4Q712Q772J54o811q227n226L775
1723g261J1962Q816l341j2367j1503J6J3926J4852l12j3801j3140k298R906J4298
1737I753N523q402j3317p411L566J3284J1956k382j4759j1581J725J2228J1985
1750A2168L5j2021j0554R01Q228P773K337n599q898k744N342P318L616l858r094
1765e050m111O766R032J007o624p504j463P013Q313n7p070o277j552M206Q649
1780E278M761n260j0209n728L709J1458R258m108j3729q558L693J0974R647R9
1794A1285j0273j0750j963O837J0691P408m150j3662r475L640J2238J0387k34
$$ y = [5553, -389, -4957, -4277, -1579, 779, 3824, 4544, 612, -3537, -3388, -1320, 626, 2357, 2318, 1287, 837, -1368, -5274, -4232, 2935, 7988, 5734, -1496, -8444, -8410, 302, 9074, 9228, 2417, -5810, -11036, -7261, 4701, 13517, 10176, -2191, -13694, -13678, 248, 15100, 14788, 987, -12153, -14451, -4545, 9753, 15276, 6874, -6443, -13854, -10288, 2996, 14952, 12570, -2189, -13770, -12045, 183, 12168, 12203, 182, -10372, -9471, -1243, 6530, 8867, 3268, -5630, -8374, -3032, 4286, 7902, 4044, -5050, -9161, -2395, 6637, 7644, 1020, -6484, -7947, -934, 7379, 7322, 252, -6025, -7577, -3371, 5278, 10039, 4779, -5430, -11158, -7449, 4009, 13267, 9159, -4570, -13128, -9435, 1539, 11186, 11285, 1012, -9738, -11701, -4864, 5827, 13235, 9085, -4577, -14052, -10412, 1826, 12213, 11979]
1807A1979j1389j1325m19Q131Q743M396l058r386p436J106P728Q418K752o588
1821C652j0051k853N608O425L346p66m562m518j162J179L396N389J798m894o133
1836d146j911K132M634M819O25l816m871m208m55O908R470J373q280j0352m018
1851a2096O410J2564O625n598j1292q094kR820J3125L651r981j4505p187P225
1865i335J6907J0602p017j6534j0386L152J3395J2957P99j1881j3232m047P694
1878f926J4303Q759o682j5649q741N268J3161R643k984j2426q541K430Q469P077
1892G161J196o337q360j755N866P159K606m698q517k430P151P493k94o319o140
1907f218l63O744O654r12o194n397j301M512Q239L682n943r711m533M843J1251
$$ y = [11979, 590, -10735, -11154, -3023, 5720, 10116, 7058, -2328, -9764, -8658, -930, 7488, 10240, 3652, -6399, -9252, -3644, 2781, 6127, 5361, 799, -3719, -4881, -3702, -306, 5083, 6881, 1987, -4146, -6057, -3925, 709, 5528, 6153, 2337, -2534, -6742, -7197, -289, 9181, 10554, 2274, -8078, -12096, -5686, 6878, 13503, 7905, -3387, -11481, -11483, -1663, 11462, 15113, 5132, -9373, -16560, -9335, 7572, 18174, 11157, -5377, -15763, -12611, 784, 13741, 14540, 2659, -10573, -14620, -6926, 7377, 16136, 9454, -6195, -14936, -9668, 3493, 13136, 10152, -2274, -10815, -8385, 84, 7161, 8357, 2020, -6340, -8095, -2229, 4930, 7536, 2838, -5679, -8109, -958, 6535, 6241, -78, -6218, -6581, 163, 6817, 5905, -289, -5686, -6987, -2475, 5764, 9446, 3503, -6208, -10741, -5898, 5353]
1922E353P302n558j2781o629M489J0345Q307q10j0026r690j228P141J0584O107
1936A2906n741j3106p403N005J1592Q377j871j0687q892P51P344P154L381l212
1950E598q329n699J627O809O560J457n904p460j126M107L969K209L98k436l533
1965a753k199l70K824N759K489l985n686k628Q05M394N562J646l559o006n099
1980g806L44Q251R128m6r115r433k290P324J1152M337o173r904o264J356R562
1995D23J0565R22r926j1494l520Q067J3418N648q219j2469n266M607J0197P743
2009A0696j917r444q025n94O686R715L632p284j0452k762O364Q580L415n081q369
2024d840k365M785N612J958j924n259l728K130N813L442j721o028n122K516Q413
$$ y = [5353, 12655, 7097, -5684, -12313, -7824, 2521, 10828, 10018, -8, -9698, -10926, -3785, 6799, 12906, 7165, -5941, -13344, -8339, 3253, 11630, 9759, -928, -9820, -9069, -1725, 5429, 8810, 5598, -2731, -8430, -6803, 6, 6566, 8023, 2119, -5341, -6467, -2360, 1609, 3818, 4216, 1780, -1753, -3952, -4322, -1498, 4261, 6750, 2765, -2921, -5549, -4744, -350, 5212, 6858, 3299, -2707, -7806, -7462, 789, 9917, 9871, 756, -8677, -10967, -3643, 7509, 11846, 5673, -4231, -10495, -9139, 423, 10988, 11910, 1984, -9510, -13030, -4963, 8455, 14103, 5884, -6585, -11851, -7244, 2953, 10696, 8779, -665, -8690, -9284, -2598, 7117, 10749, 3465, -6987, -9749, -3385, 5195, 8610, 3529, -4840, -7205, -2420, 3192, 5150, 3226, -2033, -5761, -3631, 2182, 5624, 3903, -2125, -7247, -4731, 3682]
2039C682M340m316p621l937L152Q019M888l268p493m800N52O296Q194J439p689
2054A438r310k353O673J0685M492p256j1178l948N513R027N760k351q859p020
2068h687O48O745Q030L104o399j0144l059O120Q455L641l784p885l919L159N279
2083A304K946J70l065m576j337K898L680J730j300l848j945K450K612q30j491
2098f02K47J049P36o99k468q92K557K566j26j275j780k282m4L328L454O35k947
2115A457n378k575M627P046J597m598o007k685L110O472L267k331m806m302q82
2130e988M965O816J263n595o654j972M712P589K220n466o248j216L189M795K916
2145E326k011n222k849J179M045M484r1n889m987J748N914L826j433n696m301
$$ y = [3682, 8022, 3706, -3915, -7852, -4700, 3319, 8207, 4939, -2554, -7354, -6802, -506, 7688, 9127, 1438, -7872, -10225, -3552, 7133, 11625, 4369, -6809, -10757, -5244, 3783, 9543, 7192, -1667, -8687, -8039, -1294, 6736, 9840, 3441, -6703, -9762, -3642, 4813, 8454, 4670, -3215, -7134, -3975, 1304, 4250, 4420, 1355, -3221, -4558, -1660, 2020, 3750, 2450, -1398, -3343, -893, 1719, 889, -602, -355, 694, 1430, 731, -1737, -2629, -72, 2494, 2368, 1093, -687, -2969, -3013, 315, 3769, 4404, 1457, -3921, -6496, -1869, 5177, 6774, 2176, -3831, -6516, -3406, 3066, 6333, 4002, -804, -5106, -5988, -1023, 5793, 7056, 1461, -5193, -7165, -2453, 5136, 7356, 1890, -4358, -5574, -2385, 2410, 5326, 3315, -1907, -4756, -3577, 468, 4952, 4861, -1028, -6015, -4267, 1647, 5473, 4040, -1656, -5957]
2160e957K313N673K742j572l869l869k88M618N072M21m346n913k056N221P815
2175F005J355o232o747j284M642O869K320m462o149k263J904N474N080j005o842
2190a335n472J027O134O149j20p017n982J306N803M318jl994m994o61L643M158
2206B962J808k017n492l222L267O231K185l255n590k720L396O052J839l595m170
2221b321j979J255M401L635j091m524l969m24M653O142M28o154n622J36M819N373
2237D758J174m499n304j034K626M084L388p61n489m550J024N033M787K59n493
2252Cn342P34N045L443k17k670l592r75K382K948J107o22l081k919J477M233J605
2269C559k376l175j270K374L658L36l661k349Q58K293J951N44k409l104m47K204
$$ y = [-5957, -3644, 2029, 4771, 3199, -670, -4539, -4827, -209, 4863, 5284, 938, -4975, -7031, -1810, 6005, 7360, 1128, -5619, -6903, -2261, 4608, 6928, 2466, -3683, -5946, -4042, 1432, 6512, 5507, -1335, -6807, -5780, 354, 6503, 6383, -634, -6616, -5310, 493, 4811, 4810, 816, -4178, -4839, -1196, 2962, 4770, 2753, -2739, -5961, -2694, 3537, 5722, 2467, -3123, -5843, -2447, 3605, 5444, 1849, -2321, -4300, -3045, 1356, 4991, 3900, -624, -4593, -5017, -364, 5778, 6206, 52, -5570, -5434, -615, 4758, 5932, 1433, -3871, -4905, -2279, 1805, 5193, 4432, -1057, -5607, -4583, 450, 5237, 5496, 3, -5339, -4605, 440, 3883, 3666, 996, -2596, -3571, -1189, 1759, 2866, 2244, -837, -3756, -2279, 1954, 3559, 1183, -1992, -3262, -888, 2770, 3106, -555, -2904, -2046, 247, 2198, 2742, 333, -2771, -3218, -1014]
2285a014L352K112k124n719k604L845N868K006l081n931k953L285N820K193j871
2300C184m143l825l9M787M805J77m175n189j390M497O034K89m711m052j65L131
2316g85L644M06l003k476k3J442K114J529j845l571n28K813L361M71l522m602
2332d575L87N513L981j504m864l897J92M904N132J12m299n260k644L371P761M344
2348H654m067q262n182K731Q880O669k427q525o274M10O092P758K514n413q325
2363d767m302L191Q728P076k360r536o945J392P407P165J112o061p188k219L372
2378c935O316N023j225p188o050P56O055O057O99n368n934l99L878L712J681j432
2394B646l563k549Q78K523K358O12k431l005M17K767R85j204j395j64J527J555
$$ y = [-1014, 2338, 4450, 2326, -3393, -5997, -2152, 3716, 5722, 2641, -3290, -6243, -2958, 2862, 5055, 3184, -959, -4784, -4823, -36, 4769, 4946, 771, -4418, -5808, -1311, 4723, 5012, 301, -3751, -3916, -785, 2859, 3265, 262, -2214, -2237, -795, 1319, 2848, 1003, -2568, -3096, -283, 3078, 3549, 27, -4575, -4188, 1325, 5306, 3802, -1062, -4959, -4767, 137, 5269, 5381, 1082, -4178, -6822, -3451, 4310, 8654, 4587, -3675, -8857, -6126, 2754, 9423, 6996, -1529, -7803, -7393, -1301, 6457, 8971, 3558, -4767, -9069, -5878, 2850, 9926, 7566, -1970, -8915, -7523, -116, 7049, 8161, 2100, -5088, -7307, -3935, 2381, 7404, 6179, -1009, -7059, -6303, -248, 5809, 6508, 1140, -4794, -5193, -1315, 2397, 4078, 2646, -917, -3466, -2588, -65, 2293, 2905, 474, -2531, -2114, 653, 1638, 434, -961, -1125, 402, 1957]
2410A957j202k716l77K150J736O65p00k636k144P14K939K973P43l438n344q49
2426e529M880N241P40l858n464j835L817N214J551k018l869l484K85M649M173
2441D493k41l900m293p61M222M376n22l656k293M37K015J914m02k014o46R49P30
2458D08O49o6j972j624J599L228J256k052m207k448L221O118J931m065n655k559
2474f238K673O338M130k082o054n204m60N923P973J857o620q699k934N495R399
2489E497M565m865r125m800K414P244P004M65p072p974k240N196Q937M784m687
2504E343r450m863L345P517N663q78o518n906o46M024N899L527k647o975m137
2519f702K130N774M414o23n280m231P21L285K701J003j185l064j835Q79K052J855
$$ y = [1957, 755, -1961, -2338, -188, 1548, 2213, 1513, -1123, -3267, -2553, 386, 3359, 4102, 664, -4680, -5529, -649, 4592, 5332, 1474, -3990, -5825, -2008, 3206, 4757, 2739, -1130, -4614, -4329, 320, 4493, 4252, 352, -3941, -4702, -480, 3896, 3374, -282, -2575, -2138, -123, 1791, 1389, -625, -1271, -322, 408, 1057, 991, -981, -2605, -1006, 2222, 3478, 1426, -2781, -5229, -2008, 4110, 6041, 1976, -3679, -6238, -3565, 2773, 6903, 4821, -1233, -6437, -6897, -974, 6999, 8856, 2236, -6463, -9397, -3902, 5497, 10062, 5197, -3928, -8728, -6314, 930, 7934, 8399, 1327, -6647, -8887, -3691, 5246, 10030, 5343, -4107, -8970, -5625, 1892, 7555, 6677, 159, -5747, -6393, -2369, 3530, 7057, 4410, -2565, -6702, -4572, 1202, 5616, 4993, -287, -4518, -3797, -512, 2189, 3192, 2007, -1057, -2892, -2013, 39, 1894]
2535A894M74k021k213M96J755K57q06k10M87R04Mj856j583J178K435Q56o55j513
2553a17k017o06J967K714J303j030l827l196J527N161L007j571m399l617P85M432
2569E16L562n43k986l264j477K094M507K110k212m150k524J483M749K530k351
2584B044l969j158J688K580J399j366k496p18J216J550J090m06k603j855J822
2599a182L297J312k036l994j922L158N091J038l500m319j743K372N035K881k027
2614C461m904l900J61N255O399K85o289o597j036N426P290K388n230p082k657
2629g030K987O162M973r50o696o049k02N583P113K106n620p665k053M286O352
2644C297L266k195n981l984R82M200M532J543l618n740j871L180M820K407j916
$$ y = [1894, 2368, 347, -1866, -1370, 385, 642, -164, -374, 113, 1017, 1021, -835, -2418, -1240, 1195, 2051, 1396, -117, -2134, -2740, -773, 1941, 3244, 2214, -1613, -4809, -3282, 1879, 4886, 3315, -1084, -4701, -3916, 516, 4078, 3535, 549, -2715, -4192, -2098, 2409, 4519, 2307, -1843, -4367, -2884, 1865, 4395, 2044, -1925, -3083, -1395, 1185, 2584, 1218, -1278, -1996, -780, 770, 1860, 1454, -1149, -3004, -1182, 2115, 3427, 1391, -2603, -4525, -1367, 3724, 4762, 1262, -3057, -4800, -2428, 2607, 5488, 3461, -1443, -5343, -5182, 73, 6472, 6757, 468, -6129, -7165, -1739, 5551, 7939, 2709, -4373, -7030, -4043, 2119, 7092, 6142, -554, -6603, -6805, -1222, 5891, 7997, 2377, -5288, -7341, -3055, 3297, 6563, 4368, -1613, -5597, -4615, -415, 4117, 5660, 2042, -3698, -5569, -2389, 2431, 4838, 2922]
2659B922m463k403J571K743J508L78j045k239j180P75J505J357L61j476j577L48
2675i15Q96l87N6R67O48j85j401j970k3K736K335n23k179j992r51J349L038J744
2693C243q59k723l218o55L894M601K15l981m253j027L191M832J390k804l833j952
2709c939P00L825L647l73l950l766l57L515M557O08m151l782R0K819K890P81k200
2726I14k987m92J709K102J397r19l302j734K120L349J173k068l635j572L033M126
2742C214N08k821l333j316J956M074K104j808m016l075M56M741M978n67n721m852
2758e478J56M881N647Q85m892n464j309K903N189L711j788n986m584Q99N388N677
2774E835N02n764n935m36M454M919J864k659n085k619J600L753L490N96l765m583
$$ y = [2922, -1541, -3944, -2373, 370, 1878, 2256, 1211, -1028, -2208, -1433, 72, 1429, 1790, 314, -1263, -915, -19, -406, -350, 617, 1265, 1080, -321, -2291, -2314, 422, 2757, 2234, 55, -1937, -2888, -1539, 1499, 3243, 2384, -339, -3557, -4212, -318, 4283, 4498, 517, -3736, -4763, -1572, 3260, 4650, 1846, -1987, -3939, -3239, 586, 4233, 3860, -90, -3856, -4213, -698, 3859, 4467, 316, -3466, -3376, -557, 2333, 3114, 914, -2073, -2565, -856, 1246, 2643, 1724, -1578, -3312, -1192, 2157, 3330, 1262, -2373, -3945, -912, 3214, 3722, 901, -2432, -3748, -1792, 2282, 4386, 2578, -1438, -4513, -4057, 684, 5662, 5095, -626, -5478, -5322, -441, 5206, 6091, 1199, -4265, -5574, -2671, 2518, 6229, 4441, -1545, -6129, -5230, 158, 5835, 6337, 573, -5362, -5798, -1344, 3575, 5439, 2780, -2305, -4924, -3324, 429, 3919, 4515, 750, -3833]
2790c833n82L329L698J158k068l389j236J593J696Q20M22n78j621r87L51R03J188
2807H64O37q52j088p4k28n68Q71J872P37j135k328j881J047L629J962j340k837
2824g12k147l08K405L439R90j958l492k568J028M742L573j422m651l379M17M032
2840a1M146Ll582l473r18J761L901K562j539m305k618Q87L922L434q62m288k598
2857c578J120K978K139j64k471k379L08J950J795O00j542k984o29K700K862J34
2873B839k667l158k21L443L263m85l058k677n14K348L622J254k386l827k097J473
2889b848M701L595j849n447l353J249M808M195n10m748m063j12L070M326K214
2904E228k379n378k828J934M821L745q97n175l936J014L959L260M53k672l629
$$ y = [-3833, -4415, -1086, 2612, 3770, 1702, -1687, -2923, -1330, 366, 1186, 1608, 1030, -591, -1578, -1227, -324, 864, 1501, 649, -439, -513, -741, -1309, -438, 1434, 2171, 1036, -1292, -3173, -2126, 1503, 3465, 2125, -712, -2859, -3167, -762, 2677, 3667, 1709, -1783, -4351, -3323, 1419, 4992, 3570, -1081, -4460, -4043, -11, 4135, 4138, 556, -2917, -3835, -2074, 1827, 4389, 2850, -1455, -4073, -3186, 736, 4170, 3308, -980, -3578, -2458, 520, 2659, 2495, 24, -2355, -2047, -97, 1698, 2298, 756, -2228, -2857, -157, 2705, 2839, 172, -2986, -3207, 236, 3499, 3014, -44, -2721, -3235, -887, 2735, 3989, 1603, -2224, -4321, -2848, 1853, 5448, 3599, -1848, -5201, -3952, 856, 5051, 4541, -207, -4270, -4382, -1312, 3014, 5228, 2849, -2529, -5357, -3423, 1398, 5143, 4246, -929, -4865, -3851, 108, 3368, 3821, 1149, -2480]
2919b480j064J789K805K095l72l112k862N35K909J906p4j771j926J26J406M17
2935C27j27M25p6p55l61pJ40N89M66j24k13kr19j092Q06K203R40j084k307j780
2955b951J060L122J603j130k170j829l28J949K891Q48j698k922k168J198M167
2970A642K539j758l776k249Q48L332K795n36k896k226n56J650L089J610j969l422
2986a883j339J496L242J941j748l583j010J847K441Q86r54k300j312J109J989
3001H22J192k63k027k452N31L215K087r34l089k346Q55L662K414j499l162j833
3017b827L25K484L033K83k826l064j052K147M177J886k875m538j354K279L950
3032B028K147j811l964k003J197K813K569M27k906l534n07K732L298J223k354
$$ y = [-2480, -3544, -1755, 1050, 3145, 2773, -339, -3201, -2666, 243, 2149, 2075, 304, -1622, -1496, -90, 327, 200, 625, 549, -206, -567, -574, -434, 155, 621, 497, 284, 282, -637, -1729, -923, 1280, 2220, 1136, -1171, -2951, -1891, 1231, 2834, 1704, -466, -2295, -2623, -674, 2217, 3065, 1367, -1555, -3723, -2525, 1642, 4181, 2423, -1353, -3602, -2754, 578, 3373, 2837, -59, -2285, -2841, -1191, 1898, 3508, 1539, -1883, -3222, -1726, 1516, 3457, 1709, -1874, -2884, -1037, 1404, 2290, 1336, -964, -2276, -1167, 822, 2014, 1751, -276, -2728, -2197, 1018, 3105, 2171, -918, -3264, -2409, 1253, 3667, 2168, -994, -2827, -2502, -18, 3015, 3298, 472, -2592, -3644, -1497, 2680, 4566, 1691, -2847, -4201, -1922, 2028, 4175, 2364, -1600, -3603, -2406, 407, 2976, 3403, 497, -3037, -3544, -812, 2486, 3709, 1355]
3047A355l760j053K495K749P35j261k167j379R09J828J131o1j204j896m09J939
3063d9J816l98j547j244Q6J746J136q68j501r4N68N23N57m6j062n91K39O16J107
3082I94M94j469j911L37J960J336l17j714j698M02J986J149l70r13j338q45J055
3099h62K052Q18r27j890j643P38K936J674j710k379j087Q78K060J549p63j963
3115e19j175M2J358K075O68k178k364k83J934K472P55k441k772M7K371J857L21
3132B168j493k204q00J573K019R26p10k295k157J186L286J488j358k761j804J142
3148a794L186J469j473k307j150L53K021J964j66k200j909k03J892K641M00k735
3164a1k660L67K469K052p4k177k246L13K051J515K82j146k264r14J607K420Q42
$$ y = [1355, -2405, -3458, -963, 1786, 2521, 1260, -907, -2286, -1377, 451, 1582, 1521, 317, -1579, -1988, -49, 1767, 1369, -178, -1422, -1336, 410, 1546, 678, -823, -917, -349, 174, 731, 685, -377, -968, -729, -113, 994, 1488, 19, -1892, -1555, 405, 1741, 1424, -290, -1988, -1586, 400, 1549, 1179, 266, -1072, -1917, -862, 1190, 2008, 1081, -809, -2452, -1714, 1222, 2896, 1186, -1193, -2280, -1402, 658, 2207, 1444, -519, -1694, -1652, -294, 1781, 2449, 271, -2093, -2376, -442, 2030, 2785, 344, -2428, -2381, -10, 1847, 2168, 675, -1529, -2329, -756, 1263, 2189, 1479, -816, -2973, -1787, 1499, 2987, 1629, -1132, -2936, -1794, 1392, 2861, 1388, -919, -2069, -1716, 305, 2269, 2103, -97, -2006, -2209, -317, 2324, 2724, -11, -2671, -2304, 165, 2217, 2143, -34, -2280, -1967, 84, 1599, 1881, 735, -1529, -2443, -836, 1584, 2426]
3181B426j245k777j466J834L235Q85k005k412j073J183K518J466j085k088j574
3196b178j27K083K693L40k671k639l19K168K951O66k409k636k82J356J929J362
3212B287o10k212j594J67J767K197M81k207k534J3J983J841K87j369j846k35J145
3229d39J068N27j63j123j297K82J488J026k58j332j221L91J893O31j103j217j03
3246i50O26J095L66q63j002j31K80R46J171k86j911j309O84K009J471m00k557
3263g61j821J116K358J192m21j671j855r9J790J829N63j162k482j310J513K933
3279A712R29j551k378j096J252K495P05j252j559p26M20J264J349m22j438j026
3295a322J79J400J453m25k222r66J265J800M89j082j920n84J567J819K38j021
$$ y = [2426, 1181, -1596, -3062, -1228, 2007, 2892, 887, -1525, -2598, -1415, 1103, 2569, 1484, -604, -2178, -2305, -222, 2471, 2811, 140, -2499, -2818, -650, 2301, 2967, 558, -2078, -2360, -1004, 925, 2287, 1677, -535, -2129, -1962, -195, 2002, 2483, 276, -2258, -2245, -262, 1579, 1866, 497, -1349, -1584, -439, 629, 1156, 993, -130, -1427, -1145, 343, 1369, 1111, -221, -1442, -1051, 842, 1473, 370, -847, -950, -324, 771, 1137, 274, -728, -859, -579, 367, 1538, 1252, -659, -1968, -1284, 725, 2196, 1796, -761, -2582, -1466, 892, 2084, 1663, -8, -1863, -1962, -172, 1657, 2220, 1058, -1424, -2734, -1221, 1712, 2641, 1090, -1288, -2384, -1132, 1363, 2068, 816, -743, -1469, -1049, 215, 1564, 1142, -296, -1322, -1143, 257, 1710, 1285, -937, -1903, -638, 1162, 1651, 569, -1351, -1935, -368, 1451, 1689, 668]
3311F68j589j256P41K442J687q52k604k203L69L289K785q56l242k402M3K734K932
3328B686N10k400k837j251J272L392K440j181l819k585P49L380L112j46l418k807
3344b903K3K082K537J337j448k894j616P65K543K355q8k917k462M36K229J830
3360A809K66j540j853l55J029J197O51o9j262j192J97J336Q81k34r23r73N13J149
3378F27J31r68l93L95M38M03j72q90k91L64N31N37K81o65j454m39J359J660L25
3397A779j202k134n62J740J897K37r93j569r84N39J797J195j85j414j831l82J850
3414b22K166o2j655j665k71J411J717j2j355q16j10L92R63O04o52j038l14N94
3432c25R83O12r84j613J4J690J211m91j501j307K50J980J404n03j515j473n95
$$ y = [668, -921, -2177, -1436, 1006, 2693, 1841, -763, -2966, -2597, 692, 3477, 2621, -621, -3023, -2980, -246, 2686, 3196, 796, -2041, -3292, -2020, 1372, 3812, 2631, -1188, -3773, -3024, 356, 3468, 3322, -96, -2903, -2880, -798, 1739, 3076, 1628, -1266, -2882, -2117, 426, 2781, 2693, -224, -2686, -2250, -21, 1809, 2075, 535, -1318, -1673, -644, 553, 1204, 1135, -127, -1319, -1122, 214, 1095, 861, -62, -1035, -522, 627, 758, -210, -603, -208, 230, 633, 461, -429, -720, -356, 175, 712, 993, 328, -1126, -1565, -206, 1454, 1779, 577, -1557, -2119, -379, 1518, 1755, 762, -807, -1791, -1252, 545, 1740, 1555, 141, -1690, -2072, -222, 1944, 1882, 227, -1438, -1709, -298, 1419, 1407, 52, -764, -874, -482, 481, 1085, 433, -605, -919, -325, 658, 1270, 286, -1327, -1313, 377, 1588, 1097, -404, -1711, -1461, 519, 1923, 1420, -95, -1568, -2163]
3449b163J402K556R02j668k718j496J346L518J995j688l420j962Q80L003K744
3464C231k31k842k910o00J982L554J866k053l997j951J511L642K596r53l660k423
3480c238N25K458K565P39j792l097j216J346K775K008r01k955k027R26K373J491
3496A980k41j546j573j0R65J073N28j53j292r89M43J147M96k95p49l87N26P12
3514F35m28p54R3P92K96j18n79p83K42P49M55J81j61j025j030N12J549R61l31
3533A256j610j494M09J974J193n12j331j074k35J033J442M68p43j335j064K89
3549a334J914J264p64j784p20N37J364Q49o36j187k82M01M34N75oq25o97L69Q37
3568C09O34j52j308j066P90J794O54j072j611q83Q84K024R94q66j726j343k0J860
$$ y = [-2163, -761, 1795, 2697, 1029, -1689, -3185, -1839, 1679, 3674, 1986, -1434, -3396, -2516, 487, 3231, 3000, 158, -2752, -3352, -1370, 2184, 4050, 1997, -2000, -3951, -2440, 1202, 3798, 2845, -815, -3238, -2713, -255, 2310, 3049, 1257, -1840, -3056, -1710, 1065, 3073, 2172, -783, -2810, -1884, 489, 1980, 1739, 193, -1380, -1390, -425, 648, 1176, 1023, -269, -1258, -815, 332, 828, 533, -216, -603, -77, 635, 207, -547, -454, 338, 634, 516, -63, -846, -604, 145, 600, 781, 620, -405, -1435, -923, 626, 1587, 1256, -354, -1848, -1439, 535, 1728, 1216, -115, -1189, -1424, -391, 1051, 1519, 776, -559, -1623, -1334, 580, 1844, 1080, -704, -1424, -887, 477, 1326, 690, -497, -779, -378, 56, 631, 625, -200, -897, -528, 309, 943, 791, -517, -1583, -793, 1001, 1655, 583, -1028, -1911, -1027, 997, 1991, 1125, -601, -1944, -1964, -104]
3586a04K349L09k194k584p88J955L361J123k254l156j219J417K886K052p14k916
3602d77k362r3K278L295J025k527l587j169K070L285J750j533l209j663Q91K278
3618B52K038K83k072k444o29J529K506J225j366k544j080J226J821Q22m35j246
3634a14j013K69P08O54L08k02r21n76N85P34m9m34j77O1N50J74q04o18N62Q98
3654E95J88l43p74o34L29R75N10J6m86j197o50Q26J628N85q17j650r18Q91J804
3673H78P07q72j107p65J06J050J175Jq90j068o72Q66J500O00j141j299j59P84
3691c06J002K85q85q95K68N66L14K09m13p12l58Q05Q59K64o75j454m79J409J773
3710A577M0j548j578l32J372J970M82j231j791j057N19K223J856l56k504k265
$$ y = [-104, 2245, 2554, 360, -2224, -3012, -1057, 2304, 3427, 1173, -1983, -3202, -1785, 1101, 3153, 2439, -477, -2839, -2932, -654, 2641, 3666, 1139, -2448, -3617, -1547, 1738, 3488, 1955, -1254, -2917, -2026, 252, 2290, 2573, 501, -1943, -2572, -1043, 1463, 2688, 1322, -1222, -2302, -1076, 745, 1567, 1132, -114, -1127, -858, -150, 504, 812, 610, -311, -887, -302, 432, 383, -51, -228, -167, 383, 557, -247, -865, -303, 595, 783, 440, -334, -968, -639, 336, 846, 862, 376, -821, -1471, -645, 983, 1568, 751, -899, -1817, -926, 878, 1585, 713, -394, -1159, -1053, -3, 1172, 1173, 283, -785, -1457, -591, 909, 1509, 368, -931, -1090, -306, 696, 981, 96, -799, -531, 35, 349, 558, 145, -567, -925, -120, 739, 1003, 328, -1126, -1605, -196, 1577, 1617, 69, -1509, -1841, -469, 1501, 1983, 752, -1039, -2096, -1577, 646, 2502, 2146, -358, -2623]
3726b623K7K442K797L02k696k593l39J668K607J274j296k700j595N75K416K431
3742B697N4k766k645j6K244K454P14j938k422n81J156J774J196k95j843j552O0
3759a709J526J698K91j402j777j41J389J055j8n84p11l45M88M53J6Q2j84m74k2
3778c69O09J26l63l70N8N18N37k68j050l97P90Q77K31n74p75n71M50Q74M74M7
3798H54o29j156m46J091J439K00r19j373o59J086J489K78q37q49n78J92J049Q74
3816A106j65r32q90k57Q58J416J9j244q95J64R29P37j26j018n35M49N83L67K7
3835E93n74q23m1J001Q07J5r46j408k5J596J435l27j491j326m8J479J545J74j342
3854B94j421o85O82K017J381q55k294j474O12K320J916n77k427j604K79J737J764
$$ y = [-2623, -2596, -154, 2643, 2945, 249, -2344, -2683, -1015, 1592, 2866, 1570, -1130, -2725, -2150, 266, 2697, 2751, -15, -2660, -2676, -432, 2022, 2736, 798, -1624, -2205, -1049, 725, 1921, 1626, -217, -1769, -1709, -183, 1515, 1806, 404, -1373, -1514, -125, 930, 912, 328, -383, -728, -240, 213, 229, 311, 127, -347, -369, 240, 366, 3, -367, -309, 209, 746, 478, -572, -969, -179, 698, 929, 355, -420, -991, -541, 333, 807, 854, 225, -931, -1377, -286, 1153, 1353, 434, -939, -1598, -512, 977, 1255, 418, -431, -1009, -817, 232, 1106, 941, 9, -881, -1138, -280, 1136, 1155, -89, -984, -820, 109, 846, 720, -298, -833, -384, 199, 566, 593, 19, -804, -845, 156, 963, 978, 32, -1376, -1401, 195, 1630, 1303, -188, -1514, -1562, -83, 1462, 1636, 294, -1127, -1812, -1130, 887, 2268, 1413, -881, -2355, -1743, 577, 2493, 1916, -511, -2115, -1836, -99, 1665]
3871A665L77j442k101n46R52K049J347p61k389j457R26K028J302m27j799j401
3887a677M28J288R85J97o91j315n70Q14J160O06n39j194p39P11J257J95o78o49
3905d11j52M28N34M5l42l07o7lM43N16l00p73l60M94O72N21n33j156j71Q43Q04
3926G25j3m33p11m11L92P36M70j18n73r74j82J110J063o0r94j022j76J106J092
3945A027j12r04n98k25L53R44M97m12r34o06J47J104R69m56j371n30N46J004N60
3964A003m29j056m62N17P12L67O6p69r77M6J146Q59Pj072j337J04J544J134l86
3983A017j253j024L3J247J203j6j046j083m74O99J610Q56j019j728p67Q52J729
4000H36J059r57j820o82P29J296R24k38j354j134J30J137J217L76j171j665k56
$$ y = [1665, 2042, 600, -1501, -2047, -1095, 954, 2301, 1540, -849, -2306, -1380, 648, 1950, 1523, -276, -1677, -1249, 39, 1024, 1221, 530, -785, -1355, -541, 619, 1225, 686, -508, -1247, -536, 721, 916, 238, -411, -563, -135, 399, 444, 102, -205, -272, -275, 168, 684, 384, -389, -749, -255, 417, 938, 405, -751, -922, -79, 725, 712, 279, -432, -843, -451, 285, 755, 637, 64, -910, -1092, 18, 1081, 1021, 27, -995, -1171, -65, 1027, 915, 11, -587, -812, -459, 485, 982, 570, -364, -970, -823, 281, 1250, 794, -577, -1107, -561, 443, 1003, 574, -482, -944, -427, 285, 652, 718, -51, -1028, -982, 164, 1023, 1030, -42, -1379, -1275, 269, 1403, 1017, -236, -1260, -1227, 20, 1223, 1207, 161, -922, -1396, -697, 913, 1769, 750, -978, -1745, -893, 836, 1895, 938, -882, -1564, -835, 461, 1385, 1147, -207, -1341, -1211, -74, 1143, 1519, 348, -1317, -1573]
4017a573J375J361J72j064j284k86J062J049J30n96p40o35L28J140O43l48r85
4034b51q27J77J364Q10o09j157m14L57Q50O49l45q93l56J07M41P35L08o95j032
4053g81j26P49Q89L91q65j152k8Q91P01j6m10o44l46M58O09K96r9n45p60m8J072
4074B36O71l44p31o42J25R53N75l47p76k63O3M31N85J40o19n97k28M28R98L60
4094A018p90j127oQ53P59J53p83q67n7P45N75K25k42r42n84M45J152O54m11j161
4114c91r87N20J445O88n68j169o64K18J128P52q4r47p68k46O99J318L53r88j325
4133a016k35Q39J354L88j009j254j37P99Q13M62m53r85o43M84R60O20j7j235j033
4152a298M03J407O92m78j146q20N11J183O22m17p98o37j59P83J097J41r35j027
$$ y = [-1573, -198, 1163, 1335, 271, -1013, -1299, -237, 812, 942, 346, -394, -1029, -701, 439, 1082, 734, -251, -1078, -901, 463, 1273, 664, -493, -907, -550, 300, 949, 604, -289, -645, -538, -97, 638, 946, 251, -781, -907, -158, 731, 1122, 257, -895, -923, -32, 669, 653, 243, -401, -747, -289, 320, 616, 517, -28, -788, -836, 236, 907, 563, -168, -810, -685, 268, 843, 496, -280, -543, -480, -49, 536, 676, 57, -540, -768, -340, 658, 1018, 228, -899, -905, -52, 707, 860, 77, -790, -847, -102, 473, 698, 456, -486, -1070, -625, 527, 1181, 770, -391, -1378, -858, 587, 1275, 707, -462, -1126, -908, 220, 972, 888, -59, -827, -1073, -374, 944, 1297, 309, -1016, -1251, -412, 942, 1330, 321, -933, -1070, -271, 542, 1004, 551, -434, -1077, -593, 367, 987, 970, -265, -1298, -895, 512, 1204, 726, -420, -1240, -729, 454, 1076, 659, -139, -776, -935, -152, 945, 1086, 151, -876]
4170h76l44Q02J493L31j136j282j53Q12J110N00p41j117l31L56Q08P76rj067j120
4189a188K29R51J062N0j056j072P5R73O62ql36q24k77L87O99L41n9p54p06K16
4209f35R41N11n34n41l43K59O93K35n38k36q8J84J80L63k61m01k92J97M44N06
4229F44j65r13m53N17Q59L22m27q18n11M77Q45K91j62m90p48j50P93R86Q7p91
4249A93j047m15Q91J316K97j015r68k53N21R71N94n18q77n21K5P79J100l4j124
4268h5r16J16R48R17n7j022q71L19Q43L96N6n16p59o8O25O56K33m35j064l85Q89
4289a80J122J04q63j047j69P68J176J91q23q86m12L85J065Q72m19j275q74K10
4307a055J282J276j87j517j206K56J147J067K47j001j193l16N65J149Q68l78j466
$$ y = [-876, -1220, -418, 1075, 1406, 270, -1012, -1165, -353, 757, 1257, 516, -601, -932, -576, 232, 1008, 999, -68, -1188, -959, -8, 1054, 1104, 48, -1024, -949, 24, 686, 678, 342, -482, -759, -372, 327, 668, 609, -145, -851, -635, 306, 817, 283, -258, -601, -342, 351, 586, 48, -188, -276, -92, 88, 451, 190, -211, -503, -306, 138, 644, 479, -434, -887, -370, 489, 811, 384, -434, -945, -468, 377, 668, 506, 16, -732, -882, -89, 897, 984, 193, -854, -1269, -378, 938, 1235, 220, -748, -1001, -480, 491, 1085, 567, -310, -831, -806, -27, 1073, 1039, -85, -1001, -885, 63, 980, 923, -99, -970, -651, 192, 588, 644, 128, -631, -699, -74, 582, 815, 380, -684, -1069, -180, 942, 1046, 183, -864, -1033, -265, 911, 1102, 279, -607, -1019, -634, 431, 1303, 884, -391, -1265, -1055, 227, 1503, 1316, -201, -1407, -1151, -4, 1063, 1310, 309, -884, -1200, -635, 514, 1382, 1004, -462]
4324d62r74M09J292R85j14j219j092K22R89O52O3l87p85l84L51P50M02q3o96o80
4344g61L01P40K04l27l39j51K09K91K3l36p2K59P7p0J09k58k47Q9L60K52J30m27
4366E6p46j2Q87O65j44p63p29j7P76O96J12n11o28m92J57J057O28k62q37r17J38
4387h86R65R76j78j131m90M7N84P06J63n67o60j97K63O24O79m16r67k96M94P31
4407D44K83l63r30j42O42O73n5l34m54m85L75O98N00l00q69o76K68J250P46m80
4427G91j258p50K81J289R69l79j115q63j18Q37J278M77q40j454o04O13J534J015
4445A703o51j703q84N06J245J090m1j176j209j23Q08J145P67o33j499p70N72J275
4463D22P71l25j129p47L18Q15M49Q3l70p08l19M27N72L10j89n63m59L99N58m2
$$ y = [-462, -1436, -1027, 265, 1250, 1136, -83, -1175, -953, 36, 688, 751, 364, -421, -805, -454, 296, 698, 615, -81, -761, -460, 280, 484, 157, -182, -333, -124, 167, 190, -146, -218, 41, 118, 48, 157, -101, -348, -259, 101, 353, 483, 56, -690, -702, 185, 850, 706, -57, -786, -803, -27, 669, 781, 270, -358, -850, -693, 364, 992, 730, -107, -1024, -886, 79, 1055, 877, -254, -744, -697, -113, 593, 756, 189, -471, -668, -405, 219, 898, 482, -485, -781, -287, 444, 727, 364, -566, -708, -66, 607, 552, 218, -236, -721, -346, 352, 852, 552, -317, -993, -725, 525, 1271, 791, -467, -1217, -936, 353, 1322, 943, -172, -1035, -1153, -316, 962, 1439, 599, -855, -1459, -846, 688, 1703, 1052, -651, -1535, -1029, 216, 1306, 1265, 89, -1120, -1243, -435, 710, 1477, 844, -655, -1425, -853, 422, 1193, 868, -261, -1008, -690, 125, 574, 657, 287, -421, -740, -313, 259, 569, 380, -183, -642, -243, 315, 273]
4483B73l01j57Q6K48J31k70l32J09L52N0N0j52l03k34J47M66L78j8o76o41J91
4504f03Q94N08k25o70o27L1P14N93p7l28n06m39J89Q92M88l38p20n83K58Q07N61
4525H19l68o88k08J40K98M12k6m29k46L8J27M03K40m45o07J64N80L79j98o46n30
4546g91L81Q50L30m46n19m32j9P65O83np00q86l13P65J321M15j021j293m92Q43
4566e64J286O43o23j236p88L20J029J203J19j271j289k49J007J420N63r58j533
4583i21n46Q52J102O70l20j067q31J05R05Q51L17p55j178k78Q35R44J98n09q41
4602d67k91N47N61N0j48k99l35N2L84K55n2k76l46L4N15L30m67m54kL58M11K3
4624C83m48l62N4L41K89J25r3n43l32K08O04M19r6o94o59K00Q71M72k51n33m86
$$ y = [273, -28, -185, -99, 149, 280, 10, -322, -213, 139, 189, 239, 87, -216, -450, -303, 163, 541, 523, -153, -794, -603, 291, 799, 574, -96, -723, -692, 22, 615, 538, 210, -296, -735, -546, 346, 834, 496, -224, -807, -549, 258, 819, 451, -237, -445, -305, -7, 405, 379, -50, -296, -258, -131, 272, 512, 67, -540, -376, 204, 583, 385, -261, -791, -410, 440, 770, 324, -195, -627, -646, 119, 802, 797, 97, -789, -1102, -337, 984, 1399, 378, -915, -1407, -564, 722, 1365, 742, -494, -1282, -962, 67, 1270, 1389, 118, -1171, -1420, -413, 1007, 1570, 612, -921, -1467, -615, 487, 1157, 837, -230, -1061, -956, -51, 800, 1117, 362, -816, -1094, -259, 685, 883, 374, -467, -758, -211, 350, 400, 252, -47, -382, -330, 54, 309, 257, -19, -365, -331, 184, 514, 47, -407, -409, -51, 360, 383, -65, -427, -373, -32, 257, 382, 289, -254, -586, -378, 226, 645, 549, -145, -804, -604, 267, 739, 488, -45, -531]
4645e31J3M70M59R4k58m40m73K51O93L76j84p24m22L51O34K86m76l79q2K44K25
4666A27J77j04l14j33J28J92K92j03l86m29L40O58J74m37o43k75N39P47J23m63
4686B10n27l76K05P80M98j29p20p34j38Q85J098m4r92r61qP65J010K87q18q88
4706e97l47M41Q16P38k28j144p62K12R54R44r8j010r05K31P83O95j1n69o93j88
4726g38N46N81K44j38q66m70L86Q04M02m11o42l83L72P14J99m61m00j41J25L36
4746E9L73j34m39k58o4M76O02p6p31m53K11N86L70j9o89l98K12L78L76Q3j69o16
4768c20k77L99N60K28j75p53m55M47P42K14l20m88l23K28M46L28j75k66l79j69
4788e08M03O77O8o22m67j18M92O34l8n49m21O9L65K89K11k81n36j79K59N21K81
$$ y = [-531, -518, -48, 411, 505, 247, -193, -666, -415, 278, 654, 470, -254, -676, -325, 309, 595, 119, -260, -342, -98, 127, 304, 200, -114, -247, -119, 73, 365, 262, -124, -553, -213, 445, 619, 182, -461, -736, -197, 550, 673, 210, -317, -693, -488, 292, 790, 661, -59, -793, -931, -46, 1052, 1008, 16, -945, -953, -188, 822, 1109, 291, -597, -944, -503, 313, 1051, 823, -321, -1083, -871, 83, 1027, 929, -81, -986, -755, 28, 723, 712, 143, -550, -738, -192, 389, 633, 495, -371, -841, -455, 349, 751, 340, -302, -685, -313, 401, 600, 139, -261, -402, -277, 59, 432, 298, -141, -399, -463, 13, 615, 539, -192, -645, -434, 152, 522, 503, -186, -584, -372, 6, 382, 465, 296, -320, -597, -198, 362, 590, 415, -338, -793, -346, 396, 610, 290, -198, -521, -293, 153, 481, 306, 40, -339, -508, -105, 572, 640, 18, -449, -567, -75, 559, 521, -28, -449, -380, -15, 274, 485, 204, -332, -511, -252, 269, 550]
4809E50r7p02m48M22O90K75l45o61l66M08O86Q1j87l93l97k0N58N84j14m38o09
4830e23j29N95Q31j74p88l83P9N70M50K3n84m44N9K93L64M09l26p99k22M46P08
4851D55K58m26q02k50O23O73Q2m18n40k98L07N94L00j46m55o25QP03P54j98o55
4872e6o33M1P14O80j82o72l08p2L16N75J82l78n35k54K40O38M34l91p08k98M85
4893a82M91K79k87o43j39L13L49J55m4l17m56J39M63L52q0m57n18N8P04M98j78
4914E00o94k46p3N46M56qm33m31j48K38P17L87m13p81m72L63Q61M46k80q13m31
4935g09L38N40M08N1n31n85q1L73O44L56m44q88k81N29P20J50l29n53k04K74M91
4956B69J45j07l15l85OL99M09mm33m00J0M82M98k86m93k01J73L79K25j79l81k01
$$ y = [550, 453, -249, -697, -275, 415, 690, 345, -316, -682, -274, 412, 493, 306, -87, -484, -504, 54, 638, 524, 86, -523, -652, -57, 774, 600, -188, -571, -492, 78, 528, 551, -33, -477, -418, -125, 239, 648, 322, -477, -699, -253, 455, 713, 287, -515, -765, -142, 531, 613, 195, -345, -643, -336, 258, 558, 412, -43, -668, -660, 43, 797, 599, -56, -689, -648, 66, 746, 564, -108, -416, -488, -172, 403, 585, 207, -328, -582, -342, 296, 730, 339, -369, -667, -182, 309, 588, 301, -342, -481, -168, 181, 336, 292, -25, -481, -342, 121, 473, 393, -64, -582, -524, 180, 678, 500, -194, -440, -513, 33, 489, 481, 48, -383, -531, -293, 424, 811, 398, -383, -855, -492, 369, 815, 535, -278, -709, -371, 169, 577, 628, 97, -488, -569, -196, 448, 804, 360, -528, -809, -280, 440, 590, 261, -292, -496, -222, 269, 414, 307, -8, -393, -387, 12, 421, 417, -16, -416, -406, 76, 574, 288, -205, -406, -233, 146, 371, 192, -189, -390]
4978c90J87K44K49J28l56n72J0M71N14Q2n45o16M7N72N31j09m69l14j97L25N35
4999C27K05k63m67l94J59O31M36k83n44l72J83O06L21l06m36q5K3K87K41J25l48
5020D6l67j2L26L78N8m83m18N3N99K72j63m01l42J15N25K68j48l14l66j18L54
5041a38O79P6m78n54k98M21Q64K34n56p50j72L44P07L71k92o50m18N3N34P36N0
5062G63o06q57j14O87P11J80n48p29j14L67N86K25j66n66m59J99N05N02J11o10
5082F7o65L1O44M60n6m89m64P7M87K84p7k63l25j26L05M40J74l65n30j22K12O74
5104C73K35n01m95q4L93M32J15k64m65j85K52K96L43L1m96n32L9O16M08L0n71
5125c0m92N7N80L13n5l09l67o3K51L88N1q5k94m17J69M90K82k87m22j92K70M03
$$ y = [-390, -203, 41, 290, 418, 62, -510, -500, -29, 485, 567, 22, -594, -547, 25, 556, 447, -22, -336, -533, -208, 327, 532, 269, -198, -592, -433, 198, 634, 351, -193, -565, -382, 224, 545, 239, -197, -282, -259, 28, 269, 394, 46, -321, -333, -7, 371, 429, -54, -472, -419, 180, 452, 289, -112, -454, -339, 186, 454, 306, -8, -374, -492, -138, 541, 617, 139, -415, -713, -292, 572, 806, 250, -500, -672, -328, 379, 750, 458, -192, -610, -557, -23, 713, 763, 157, -700, -814, -127, 584, 764, 216, -513, -627, -260, 326, 551, 385, -181, -640, -441, 64, 566, 677, 67, -598, -567, 77, 537, 481, -8, -472, -395, 92, 376, 299, 36, -289, -415, -110, 330, 504, 139, -391, -513, -301, 373, 608, 107, -388, -472, -79, 353, 468, 204, -261, -446, -194, 102, 445, 476, -20, -552, -513, 103, 511, 541, -30, -522, -465, 115, 428, 373, 64, -303, -366, -115, 273, 324, 239, -55, -472, -303, 187, 469, 182, -240, -432, -162, 241]
5147B41J61l56k55N5J05J46J13o1k92j70J58L05K16j11m74l34L74N09J47k79m97
5168b99j78K64N45J81k98l13l24k9N00M73Rm59n44j96N21P47K2n65m85o4L17N33
5190C58J83k85m58j93O1M88M86q3o90m63J77N87M01j12n08m95K24M64K39o3k54
5211F4m27j33L71M02K42l36n29k31M01O50Q0m06n68j15L20N86J16l33l89j70P1
5232c34M23M48j16n42m18R8M67N57ro85n42J64N83L09M5l55m43j43L31M01K68
5253E07j58n91l71K04O80K62j89n75k87K89M06K31k57j53k85n6L62K67N3l28l38
5274c27o2L32M27K9m77l39R2L89L09n6m60k08J36K15K07R5k29l42j25K70M30J48
5296D54k56n40j84M27N20P4l70m26j54K96M25J23j83k98k66qM55M37j20m73l40
$$ y = [241, 402, 46, -209, -154, -49, 97, 210, 149, -143, -313, -155, 150, 366, 255, -219, -553, -179, 330, 477, 198, -299, -477, -213, 332, 513, 215, -98, -422, -451, 49, 522, 531, 72, -472, -668, -147, 600, 622, 57, -428, -492, -175, 358, 541, 256, -202, -395, -334, 154, 640, 557, -133, -596, -419, 168, 569, 457, -51, -546, -322, 142, 381, 318, 64, -363, -496, -125, 277, 519, 183, -346, -577, -176, 474, 554, 148, -420, -535, -215, 371, 487, 154, -235, -405, -334, 89, 537, 421, -121, -539, -441, 26, 583, 574, -111, -653, -489, 94, 403, 448, 93, -350, -493, -162, 239, 507, 349, -242, -613, -409, 271, 533, 344, -231, -518, -229, 177, 408, 151, -2, -287, -343, 19, 286, 339, 11, -327, -389, -57, 370, 399, -78, -417, -325, 64, 373, 317, -143, -351, -215, 0, 207, 302, 73, -269, -394, -124, 306, 454, 198, -342, -526, -99, 421, 495, 125, -301, -455, -159, 266, 389, 206, -92, -358, -366, 89, 526, 406, -67, -407]
5317d07k5M75N12j41n22k77J94K36K76L0l23k77n1J27L98K96k87n19l07M57M57
5338C22J39k08n80j82L80L44J84j97l22k52P1L18M10m5l48m51k0M63N27j41m54
5359d2l94L9L90L72M3l60k98j27J58M18K64j48n86k19J46M52M81k81n97j86L01
5380a74K82L04j34l51l26Q7L60J93Q2k95m43l2M88M83j04m58m58L1N20L92j77
5401B70k79k52q0K60L47K16l15l78k11J50M61M14k76o30k50L30N36J05j59m51
5421a92k26K91K22K97ol70m16K6L30L79J09l65n23l9N63L68m6m54k84l8M00K50
5443B76L3k33l04j64J22N33K46l04m61k14K26N54K19l16n12j97K60L76K84q6m34
5464i6l27N3K75N09J19m30m96j26M17N06Q6l48m88n8K81L34J10j21k47l26L1L41
$$ y = [-407, -432, 43, 555, 414, -108, -385, -191, 45, 321, 351, 28, -249, -300, -173, 225, 521, 234, -285, -592, -135, 322, 461, 253, -327, -509, -129, 215, 399, 202, -120, -372, -301, 17, 427, 382, 34, -417, -437, 26, 553, 412, -42, -436, -397, -7, 365, 408, 48, -250, -377, -219, 199, 463, 315, -271, -490, -344, 108, 589, 308, -289, -475, -174, 108, 412, 278, -73, -399, -312, 48, 241, 323, 28, -415, -447, 41, 524, 420, -38, -496, -465, 55, 447, 270, -9, -261, -341, -81, 266, 482, 167, -211, -422, -272, 189, 603, 327, -303, -553, -223, 313, 418, 259, -192, -418, -127, 95, 392, 386, 16, -400, -374, -44, 335, 444, 79, -444, -483, 80, 448, 402, -52, -336, -374, 26, 276, 309, 76, -228, -392, -270, 263, 509, 205, -256, -470, -244, 310, 529, 213, -299, -496, -236, 140, 424, 338, -96, -423, -370, -95, 414, 533, 103, -393, -519, -102, 404, 490, 142, -346, -404, -123, 211, 321, 200, -47, -373, -342, -1]
5486aL21j9k48m83J5M52L66q3l76k53N0K84K31n5k24j83m4J43K69R2j51k86j12
5509b95K98K37J52l90l87J03K60K70M8k68k57m5J35L40O8r2l50k75J39M73L10
5530D74k56l83k99J80N30J99k67k60j90K4K08L67l0k49k58q1K17L64J52m16m14
5551c88Q7L55L04o0l02l29J0L86J73k2j50l01j32K64L58J51k94m68j99M50N07
5572D00K11m96m84j72L41N34K89l25m79k53j9M85N85m8o10n98m3N87O73J22n28
5593A72o83r1M13N64K71k47n83l62R1M92M42J78n64o74L4N63N13q9l18n03k9L26
5615h4K72J02j19k37k59K8M25J72o9k95k97J06M16K25k53l31j9J32K11N6r3j90
5637a01j25Q1J35K80Ql41l37O9L17L65O4l93n45K15M75J07N3j92l49j42K88J45
$$ y = [-1, 320, 301, 53, -430, -415, 37, 403, 320, -56, -309, -259, 25, 256, 201, -23, -206, -250, -107, 162, 254, 103, -183, -295, 3, 240, 392, 2, -385, -282, -22, 248, 296, 28, -229, -274, -139, 201, 269, 177, -173, -448, -309, 164, 474, 218, -165, -464, -284, 246, 445, 178, -82, -272, -248, -40, 327, 297, 48, -210, -291, -74, 290, 442, 26, -388, -301, 54, 358, 298, -4, -333, -323, 63, 236, 214, 64, -237, -369, -105, 253, 404, 110, -358, -557, -107, 400, 611, 115, -369, -541, -200, 334, 623, 298, -181, -434, -453, 32, 617, 569, -41, -639, -682, -95, 578, 700, 172, -511, -602, -189, 375, 646, 399, -184, -546, -455, 37, 479, 657, 93, -581, -547, 16, 529, 440, 122, -381, -410, -84, 188, 290, 171, -66, -325, -297, 128, 300, 231, -64, -361, -255, 161, 386, 133, -198, -217, -85, 126, 182, 89, -101, -226, -145, -10, 270, 278, -63, -400, -331, -14, 351, 415, 22, -523, -308, 167, 274, 327, 135, -214, -356, -68, 77]
5659G7J91O7m06l40K6M86K31p2k67l05M4K77J70r1r6Mq7l8J20K4n0O1m2M9L9p2
5685@j97o5K91K43p1k39l34R1L81L36r0l33l80r4J89O52J19j69n98l45L1P44O00
5708G62k48o06n45M2N91O07N3m49n71k66L04O61M01j69p72m95Q8P11O18K5p28
5729A4n68K6N42L39J73k82n11k11K11M34L22j57m35m54K69N12K21j70m70j85J90
5750a90M43Qj64j40k41J9K86K86p0k90k97j8L56N07r6n74l27J78L99L52M0n33
5772f6l41pK34M49L27k41o16l38J95N38M41j00n73m67O8N07L17J56k96l98k51
5793d62J62L50L31M2l90m50K5M13J99L2j57k28m3Q9J23jJ59o2j55j54J7Q2J12
5816C4R1Qm8j03j19r3K05K98J75l30l43k19K32N02J54j37l76k65k5K88M12J81
$$ y = [77, 268, 335, -71, -411, -385, 101, 332, 260, -7, -312, -268, 9, 179, 88, -8, -4, -91, -129, -9, 15, -35, 26, -16, 33, 72, 0, -197, -262, 29, 272, 201, -38, -372, -281, 100, 436, 346, 13, -367, -461, -272, 380, 499, 330, -268, -613, -582, 162, 762, 514, -92, -637, -595, -4, 603, 656, 207, -364, -630, -326, 335, 736, 567, -205, -700, -612, 99, 717, 742, 14, -554, -528, 14, 353, 526, 244, -267, -478, -267, 167, 489, 332, -103, -557, -288, 224, 445, 275, -195, -380, -190, 253, 261, 97, -43, -284, -265, 21, 307, 237, -53, -350, -368, -12, 495, 399, -175, -502, -324, 75, 427, 467, -66, -407, -414, -180, 269, 596, 355, -261, -599, -404, 134, 575, 475, -98, -565, -497, 10, 327, 483, 187, -211, -462, -300, 50, 381, 423, 33, -417, -392, 21, 220, 252, 95, -133, -176, -87, 36, 35, 194, 132, -23, -177, -160, -78, 34, 125, 133, 85, -18, -137, -230, -25, 273, 448, 118, -225, -444, -212, 290, 444, 307, -69, -334, -359, -71, 341, 522]
5838E22k78n04k64J15O90M91l92o05l30R3N75L96K5n25l21j71J88N51L02k64n53
5859b59k54J79N44K89k31m88k35K05L26K00p1k27k71Q3K59K50m6l46k66J9M26
5880H6L40k04l87k79J11N38K35j47l65k77n2L38M28J32l48n30j64K99O25L59l91
5901C47o99k88K54N84M22j65n03m97N1L54N10K58l23p07k57L81N54L11j67n57
5921a37m28K22M69K24N2k22l90k12K72K70K19p8l21k11J43K12J71j96k06K2R7
5942b8K0l4j7O5J16j26l5P0j02M4L3O7J12n0k15j93J34L42J63k25k83j27R7K87
5966A15J65q3j57j97j54J34L39K59k27l44k61R1M76K92k55k85j31N9K10J88k1
5987B13k59m5r9J49K26Q2k36k04p6K66K51m4k91k19J07L63J47l02q9j68k5L09
$$ y = [522, 244, -260, -524, -409, 281, 772, 380, -225, -555, -462, 113, 509, 534, 9, -312, -483, -295, 256, 558, 294, -259, -513, -334, 210, 499, 268, -220, -455, -250, 76, 276, 205, -22, -293, -210, 49, 299, 253, -93, -359, -340, 86, 426, 222, -165, -444, -333, 205, 440, 293, -72, -349, -401, -63, 365, 497, 149, -381, -545, -246, 379, 738, 347, -352, -640, -386, 198, 620, 455, -48, -545, -494, -140, 370, 628, 305, -402, -659, -278, 276, 587, 420, -137, -565, -343, 126, 350, 402, 180, -210, -422, -150, 120, 339, 261, -60, -271, -128, 84, 255, 59, -147, -125, -28, -8, -42, -59, 6, 122, -4, -39, 31, -71, -27, 6, 73, 185, 135, -80, -273, -139, 203, 366, 141, -142, -269, -172, 115, 280, 197, 40, -157, -311, -177, 162, 421, 194, -150, -411, -320, 156, 448, 193, -92, -223, -164, 46, 234, 213, -46, -91, -190, -41, 185, 267, 31, -173, -249, 17, 268, 224, -67, -286, -179, 184, 331, 29, -60, -228, -253, 56]
6009E6K60n0k05m02r8L45M99P1l85n29j20L63N14K20l47m33k18J79L95L77O3n75
6031b0m27r5M20N59K20m92n92j38L50M82K49k47n02j70J22L88K34J41m17m08j30
6052d73M46L17J21l45l56p8L87K36l5j81j64o1J04K11M3q5k29n3Q8L31N9k40k07
6075a64q0J79K80J06l27k56L4J24K43J22p0l09k14J54K99K32q1l48l28J14L91
6096A01J71k7k76k13N6J92J87k4r1j63j95P2L12J15l6k93j47J51K34J29j68k72
6118a85L5J41N0J24n5j76rQ7K8J06Kl11p6K39J90P6j16l56j26K97K81L5k26k17
6142a62j03R5K82J70Ml09k94r0L75M17M1m29l17n8L70L33Q4k96l59j27K20K89
6164A36K20q6l50l46P0M02L11%l94l08Q6L47K08n1k23k96L9K43J53J01j32l11
$$ y = [56, 316, 266, 61, -341, -439, -94, 405, 476, 91, -438, -558, -195, 319, 539, 192, -241, -459, -280, 115, 492, 555, -20, -447, -542, -122, 437, 657, 165, -427, -565, -215, 267, 516, 269, -233, -403, -281, 107, 341, 482, 65, -343, -473, -27, 290, 411, 66, -290, -368, 19, 255, 220, 39, -125, -186, -82, 129, 172, 87, -142, -195, -107, 224, 283, 43, -164, -244, -65, 215, 321, -6, -262, -228, -104, 139, 261, 191, -118, -332, -178, 121, 353, 272, -76, -404, -290, 101, 272, 245, -31, -244, -188, 4, 191, 167, 76, -87, -282, -210, 102, 217, 181, -112, -259, -108, 126, 255, 87, -185, -150, -9, 41, 165, 110, -66, -75, 12, 40, 146, 148, -163, -239, 0, 190, 266, 150, -206, -332, -35, 246, 281, 55, -162, -265, -170, 112, 282, 286, -23, -317, -407, -32, 385, 426, -3, -320, -378, -8, 325, 409, 113, -246, -373, -153, 136, 356, 270, -80, -426, -356, 46, 357, 357, -37, -345, -259, 88, 296, 245, 22, -274, -235, 8, 161, 262, 130, -181]
6186a81j58K55L05J02k25k27k17K16L56P5j99l19j3Q4K42J12l7k03j85RK01L19
6208C12J4l85k30OL58K53n3l08k32M8J61L20k3n2m31j10J92L08J70j14l19k50
6230c65J62M25O0j35k81j49J22K28J19l4j49j52p2J28L61j3k32k08m7K38K82m5
6252B43k77j93J00J84J11Lj55j36q6J55J65Q0m2l53r2J87L33P8k72k21j74L50
6274a2K01O4j83k69p9J12K16J68m0k08k11p0K91L41k9l41k57J3K74L09o0k22k29
6297b21k3J87K46J44j62l73j30J72L18K16k47k99j93K54K73Q9j48k04q2L1K74
6318A22R6N6k12k75q1L18K45mk54k50n7L11K69n8k15k55N4J23J99Q9o8k92j24
6341b63J48K32J74j78k12j85K26K03J37j48j86j86J29K44M8k9j54k24kJ66L07
$$ y = [-181, -339, -84, 221, 323, 98, -129, -346, -130, 226, 301, 102, -217, -230, -146, 96, 208, 171, -32, -217, -208, -7, 312, 326, -59, -289, -283, 75, 328, 275, -33, -265, -217, -56, 264, 241, 189, -242, -352, -160, 148, 318, 204, -115, -365, -203, 222, 282, 147, -134, -283, -161, 67, 186, 152, 3, -149, -221, -93, 268, 255, 23, -185, -232, 6, 288, 243, -34, -227, -127, 57, 168, 171, 16, -120, -206, -51, 114, 194, 152, -201, -293, -106, 227, 305, 33, -188, -362, -12, 189, 253, 70, -199, -278, -166, 50, 218, 178, -30, -241, -311, -20, 321, 292, -49, -306, -293, -19, 290, 230, 8, -221, -244, -57, 189, 333, 171, -202, -332, -160, 158, 374, 127, -172, -365, -111, 162, 251, 103, -101, -183, -152, 122, 218, 274, 62, -213, -294, 24, 269, 265, 11, -239, -296, 15, 284, 226, 11, -244, -190, -67, 132, 221, 153, -139, -263, -115, 117, 291, 113, -99, -284, -58, 145, 282, 134, -52, -238, -109, 135, 183, 154, 0, -224, -226, -60, 247]
6362B47L2k13l18j9K25L49j02j85j64k7J49J94O8k28j34o6PK78J78j50k69q5P9
6385a54K06K92j53l18j90K51J96J18j68j73j74J25J16J38J64k58l24lL74K39o0
6406B44k84l18J40K44K69r9j91k28m1K20K27J62k31l23r7J44M13K09k50l98k36
6427d24J49L97K48j37l54j84K5K69L07O2k32m49lK43K58K41k37m27j75L59K22
6448A58J09j85k35q6O1K40J39k4j16k96j0K52J84k2k06j89O3K48P3o2p2j23M3
6471e6L5J81r9k2j03j42J81J60P0j69k58L4K31J32K8j77k02k6J58J24M1pj70j18
6495a74K6K33J86j06k12k25Q5K63J29q4j74p5L1J56P9n0n8j16n9O2J82R8j75k34
6519b12P5J41J03N2j86k10R4K14O6q2q3j38l5K58J46m8j37j65j71K05L76J11l21
$$ y = [247, 279, 66, -252, -271, -46, 303, 201, 16, -148, -175, -26, 168, 236, 8, -126, -192, -185, 93, 271, 121, -148, -233, -154, 52, 344, 191, -127, -317, -66, 130, 248, 80, -93, -267, -142, -26, 112, 276, 18, -306, -309, 65, 304, 244, -40, -358, -218, 26, 295, 196, 5, -223, -264, -44, 183, 345, 114, -209, -306, -162, 251, 460, 210, -188, -424, -275, 122, 370, 233, -121, -305, -280, -11, 296, 358, 126, -323, -326, -83, 175, 416, 179, -248, -423, -64, 158, 267, 82, -153, -239, -178, 62, 201, 177, 61, -235, -245, 7, 191, 169, -37, -226, -163, 85, 158, 96, 24, -99, -56, -21, 160, 61, 39, -64, -206, -25, 135, 205, 36, -222, -188, 43, 175, 203, 26, -176, -202, -44, 80, 121, 114, -56, -174, -148, 85, 271, 165, -47, -272, -187, 76, 205, 121, -53, -128, -97, 59, 138, 88, 30, -86, -145, -83, 99, 197, 22, -212, -137, 4, 107, 159, -27, -237, -143, 71, 137, 55, -28, -166, -201, 57, 203, 155, 18, -147, -318, -113, 263, 374, 53]
6542E3l15j37K54M29J53l19k84j47J06L04L21mm81l46n5L90M60P3k88n02j36L38
6564a33L96J98k42l84k12P8L06M10n4l71l54qL00L45J59k91m62o0L48K45M6j01
6586A59k64j55J81J17J31k4j60k19O8J81J23l5k27j3qK58Q5j67j93k2K01R0O3
6609A70j01q5j43L0J15K88n5l30j54Q1K45K13Ol28k11M4J84J75J7r5j17j69N4
6632a66K25J73j9k07k72P4K44P5n7r6q3k4R0N1O2n3j0n8k8P4O3j01n1J13O4J01
6658A84j51j98k3J86K34o2k04j69N9J25J86J31j81k53j24n8L56L70j20l34k93
6679c39l2L60L89k0k23l48j96K18M22J81j35l84l28Q0L56M52o0m29l15n5L35L22
6701B51P1j93l38j03J60L38J04p4l33j88M6L43K40j09l01k00J13K90Kl8j01j28
$$ y = [53, -262, -399, -145, 284, 437, 118, -166, -313, -207, 97, 418, 414, -67, -413, -468, -78, 382, 455, 167, -335, -471, -133, 263, 461, 219, -165, -377, -299, 7, 417, 363, -8, -362, -370, -70, 275, 434, 143, -319, -379, -31, 214, 260, 159, -105, -260, -79, 38, 169, 145, -15, -234, -166, 15, 138, 103, -124, -137, -145, 113, 198, 31, -162, -184, 17, 107, 170, 69, -16, -159, -129, -14, 274, 219, -111, -265, -184, 61, 274, 280, -48, -259, -215, -31, 144, 161, 66, -51, -220, -166, 59, 232, 213, 6, -266, -192, 52, 127, 70, -26, -109, -133, -43, 8, 70, 17, 7, -51, -79, -5, 58, -43, -94, 19, 83, 184, 33, -165, -188, -2, 232, 170, -34, -203, -144, -19, 167, 298, 117, -136, -260, -318, 38, 408, 288, -46, -339, -371, -11, 378, 358, 135, -213, -409, -191, 231, 412, 277, -107, -435, -355, 1, 453, 393, -36, -351, -406, -71, 251, 322, 129, -209, -312, -152, 186, 290, 216, -117, -305, -259, 84, 324, 215, -86, -286, -173, 117, 119, 81, -20, -148]
6723a48M8J75R8o2j27j39k2J38L13j2k76k01LK28J86Lk51j72n7J64K44J09j17
6746A25k40j41J54K31J79r3k84l06J31L17J79o1k45j73JJ79J70N5p3k15j08P9
6768a39K17J06j6k26q2K1J85J21k14j6l8P2N0j7n1j6P3n7L1L7r0p2J2J38J46o7
6794A08j15k09M4J77J95K1j90j92l5P9K53L2r1j66k09L1L09K87r0l19k26j5L51
6817C0K34l1k92k12J3J32L61O4k16k32j05P0L05J41n3l70q1M8L32J02j17j38j84
6840a99M3K36P6qq9k71k0J93K38J4j23l23m9L12J80K1k62j23n0J64K10M1j37j60
6864h6r2N1K66J68j44k70k38K07K05J89j04k63n5l4J72K77j07j18k08n3J95J66
6886A24J65k27k71p4K74J73N7j67j93o4J01K15L6p5j81j03N8J92J37o0j52j45
$$ y = [-148, -100, 75, 173, 111, -16, -155, -177, -39, 274, 262, -14, -215, -212, 16, 202, 205, -46, -218, -275, -111, 133, 242, 125, -115, -256, -102, 129, 308, 215, -69, -375, -244, 73, 252, 191, -54, -227, -226, -47, 123, 178, 105, -110, -218, -139, 78, 184, 168, -58, -140, -119, 66, 187, -27, -43, -81, -9, 41, 24, -27, -43, 30, -27, 4, 41, -49, -121, -109, 29, 175, 108, -7, -216, -172, 5, 200, 221, 31, -161, -196, -117, 136, 168, 77, -89, -298, -267, 42, 329, 239, -80, -306, -321, 30, 264, 233, -59, -271, -258, -126, 235, 299, 83, -149, -254, -184, 121, 262, 209, -161, -242, -194, 138, 240, 123, -15, -199, -156, 80, 156, 148, 59, -212, -232, -39, 199, 213, 90, -233, -282, 30, 210, 231, -31, -154, -204, -40, 170, 211, 74, -86, -178, -127, 139, 307, 163, -107, -345, -138, 67, 256, 152, -111, -166, -200, -28, 249, 142, 24, -184, -237, -42, 124, 289, 62, -209, -283, -9, 164, 221, 54, -139, -203, -102, 113, 149, 74, -107, -210, -152, 40, 177, 117, -35, -180]
6908a80K7K44J63r8k52p4P9J51R9o3j60r3lR4K39J4j34k65N6J53J45J15j71k44
6932a58r3J71K65n9j10m2j60R2J55J24j2k76j19Q3J86J73r6k09o3L2J58J27r5
6955G4p1j16J3P8J13Pq6j11o5J57J42O2j74j61m2J38J36Q0j56j45k0O9J91M8k2
6980A39k27j16N0K37J16jk72r3JK65J26j11j18j87M7J14J46N1j19j49l4R6J66
7003A27P5q6k38n9J80K04m5j43j70M2J22Q1M3q3j38j6L8J98N7k0k85j12J32K50
7027A54Q4q3k73r3J25K27J57j98j74o9m7J89K24Qj74l11QJ47L27J33k81k88j08
7050c16J22K44J72l2k90j56K5J83K74rj55k97n6K64J97lq9k85J2J52J21J06j54
7073C0j55r3J43J15J32p5j53j25P7J67J04o4j87p5J12J59j7Pk30K5L5M8J52N5
$$ y = [-180, -153, 91, 254, 156, -96, -170, -91, 60, 159, 96, -64, -157, -160, -66, 173, 187, 53, -212, -156, -3, 142, 257, 86, -158, -251, -80, 185, 126, 16, -26, -186, -94, 61, 185, 173, -103, -222, -139, 47, 220, 124, -85, -148, -116, 42, 169, 74, 3, -113, -100, -22, 91, 98, 12, -99, -164, -7, 135, 197, 23, -138, -180, -42, 94, 174, 18, -127, -147, -78, 113, 161, 139, -88, -204, -154, 83, 199, 198, -74, -167, -166, 99, 225, 114, -4, -191, -144, -30, 116, 167, 48, -101, -135, -39, 127, 202, 116, -122, -181, -1, 203, 158, 15, -155, -113, 9, 90, 133, 50, -88, -104, -66, 132, 189, 169, -116, -228, -96, 154, 238, 155, -118, -211, -86, 141, 298, 100, -74, -143, -190, -1, 223, 231, 57, -254, -246, -99, 228, 361, 80, -208, -316, -194, 50, 222, 190, -100, -256, -231, -48, 226, 217, 62, -235, -291, -27, 170, 167, 78, -207, -195, -43, 78, 184, 30, -125, -218, -75, 40, 172, 97, -56, -181, -104, 63, 167, 103, -84, -159, -47, 112, 95, 102, -128, -103, -68, -20, 132, 187]
7097A87j62j68m7K04J50P2k92j57MK26J42l4j32j77n1K11J58k2J0j74j06K7K23
7120I2J15r9j51j10N1J66N6K1k05pMJ20L6l9k1n4j40J83K2oo2j67J30Q4P9k5j02
7147b9r8J0K48L0j20j13j14R4L3K94j16j89j56J1K48J66P8l11k23K4K03J51J31
7170B52j29k62j02PK69K86r5k96j83K4K25K73o2k13j91l7K14J82J3j15k01j21
7192b62J63K31Q6q1j43k21J01J85J01mj93j49P3K14K0oj68q3N7M0K48o6j92p7
7216a26J4M8K75n3k11j09K6J43J32lp7j83p1J35J12J03m2k57Mk5J97J79j15j71
7240g5j54P3K20J38j02j04j38j5N2J79N3m0j30j18R9K00Q5j70j58l3P2J42M0r2
7264B4j24k1Q8J16k1K2j25j9M2M1O4q0j21L6M1J51J4j94o6LJ15J63Oj54p2j17
$$ y = [187, 25, -143, -190, 14, 164, 236, -56, -213, -209, 17, 159, 125, -7, -184, -235, -24, 134, 112, 122, -52, -158, -131, 92, 207, 108, -43, -153, -102, 64, 120, 141, -64, -71, -67, 53, 89, 50, 29, -25, -165, 18, 40, 34, -28, -195, -65, 19, 98, 73, -29, -127, -117, 131, 161, 41, -72, -186, -92, -59, 235, 119, -70, -226, -215, 33, 199, 277, -34, -257, -233, -30, 121, 252, 123, -139, -241, -234, 35, 321, 226, -70, -253, -229, -4, 269, 207, -6, -197, -234, -20, 162, 175, 60, -141, -262, -99, 132, 218, 137, -6, -227, -126, 59, 160, 156, -37, -186, -113, 101, 121, 115, -53, -136, -79, -39, 209, 143, -49, -126, -112, -64, 211, 158, -53, -162, -136, 7, 139, 136, 59, -124, -195, -60, 52, 155, 113, -144, -140, -165, 32, 211, 96, -75, -229, -156, 64, 202, 100, -4, -142, -157, -105, 74, 127, 87, -43, -161, -62, 138, 223, 53, -105, -138, -66, 76, 116, 24, -100, -121, -33, 83, 62, 84, -41, -60, -18, 23, 87, 7, -114, -78, -37, 114, 128, -66, -132, -129, -14, 149, 155, 1, -71, -188]
7290a88J06J46R8m2j80j40PJ69K04m7j53j50l1K58J26j5j37j50n6J39J62J25j06
7313A45k69j49J36K57M0k6j62j44M9J68J08Rr3j45p4J15J35O0j28k18J6Q9K59
7336A78rj99j62J5J78J36M7j31j49n6K7K31J07j99j05p3L7K03J48j53j62j39J46
7359h4J43J39p6j76j15K4J16J42O0j36j04j43J79J93O8j66k10RJ63J17n4r2j24
7382a27q5J46J08O1L7j74r1JJ69J19m0j19j65O6J92K8l6j93L4rJ08J13J6j41r6
7407g8n8J24J27M2j43j69n6J88J41K1p2j78n2P2K47p0L3j99j17J35J07J32j27
7430E0j03j30L2K85L0r7j13n6m0J55J59j01j14n5jJ19R7Kj13j19MR6J24L7o5j76
7456i3n7J35K37j18n7j17j41J35J65oK3j37j49N0J19J76l9j58n8jJ09J06m8q7
$$ y = [-188, -82, 64, 162, 120, -60, -200, -193, -24, 180, 133, -20, -170, -201, 57, 183, 168, 31, -119, -175, -36, 126, 251, 145, -124, -273, -137, 120, 160, 134, -28, -172, -123, 45, 153, 162, 69, -76, -150, -35, 100, 160, 32, -186, -170, -81, 178, 169, -30, -192, -177, 1, 137, 184, 53, -96, -152, -125, 106, 213, 14, -91, -164, -127, 76, 224, 71, -91, -230, -84, 59, 198, 122, -54, -169, -145, -29, 113, 173, 37, -67, -210, -31, 162, 230, 64, -146, -137, 26, 143, 89, -3, -127, -212, -66, 42, 103, 140, -34, -125, -124, 45, 164, 124, 5, -160, -94, 98, 126, 90, -103, -69, -78, 30, 143, 159, 18, -78, -136, -12, 115, 157, 14, -155, -211, -23, 118, 139, 67, -111, -163, -91, 156, 86, 119, -80, -197, -62, 45, 177, 50, -53, -183, -151, 134, 164, 67, -46, -102, -142, 13, 172, 71, -43, -98, -99, 20, 117, 119, 6, -113, -109, -13, 111, 148, 83, -93, -150, -15, 222, 104, 47, -70, -211, -76, 89, 83, 106, -31, -180, -130, -11, 165, 126, -32, -90, -91, 18, 124, 76, -11]
7480a1p5j2K0J85%j9j74l7R1J10P8j08j45n9J21N3J21j3k18L6L5J28%j7j13j02
7506a25M0J21J17n9q8j20O1Q1R9j6j38p2n5J75R1m5o0j32k6J16J87j7j15j02o8
7531a50O0K31L7j53j08o2O5J11J49Mk25j25P0J15J60j00o4j56n9J95J70j0j66
7554a1j41o3K17J29p5J1p1j84Q1K32ok7j32j59J28J61N2j05j20m6N0J30O7m5j59
7579h6q2M9P4J96L6k25r9J9J62O4O2k38r0J7J33J61n6q1q5j10J21J77L1j02j29
7604h1k3N5J00J18j03p0j20J15O7L7p5k8l4q8J37J09%j37n9m1N7J79J3j15j40
7629a27L4J30R5o6r3q7JJ13J37n7n9j37%Q6J39n4q6p0n0J33Q4P3q4j65k9J45L4
7656D0P1K3j29j15PJ17J32m4o7j90K6J16J37K6j43l1j36J07Q8J25j02j22q6J9
$$ y = [-11, -86, -98, -78, 107, 107, 88, -86, -123, -32, 78, 156, 48, -97, -156, -35, 18, 139, 126, -92, -56, -21, 107, 107, 90, -23, -125, -85, 36, 153, 94, 6, -114, -53, 28, 127, 111, -27, -99, -154, 21, 112, 67, 7, -125, -151, -35, 152, 135, 20, -82, -150, -90, 141, 178, 25, -83, -145, -80, 31, 180, 184, -41, -166, -96, 19, 179, 79, 15, -141, -200, -5, 165, 155, -11, -152, -215, 2, 131, 56, 67, -4, -188, -107, 125, 119, 92, -40, -199, -71, 90, 142, 37, -83, -129, -79, 51, 118, 73, -86, -168, -119, -45, 151, 187, -38, -137, -118, 44, 108, 170, -68, -158, -141, -8, 153, 97, 16, -69, -179, -58, 119, 150, 48, -81, -104, -49, 51, 169, 66, -4, -124, -9, 58, 95, 20, -8, -42, -130, 7, 116, 116, -21, -80, -121, -64, 115, 128, 13, -127, -93, 37, 132, 66, -27, -114, -113, 0, 137, 80, 21, -116, -116, -30, 109, 55, -31, -101, -151, -18, 66, 139, 55, -110, -139, 6, 40, 111, 134, 5, -110, -103, 14, 146, 102, 35, -155, -129, -13, 124, 150, 7, -24, -160, -53, 35, 160, 58, -64, -150, -131]
7680a31K18N1n1j51j8n3J79M0k9r5m9K4L9J72l9j27n7K8l7J92K5j33j38K1K00
7705H1k0j2p1q0lO6R9O8q8r1o4O9J24J53j71j37j7M0J07L9k1j06j24J23J15L5
7731A14Jj58o9N7R6JJ0l1j04m7R3J60N0j91q3l4J44J86j41q1p0k9L6J40O6j01
7757A5j12j6M6J15O9m8j28k3M3J01L3J4j90j8L4R8M6j3l3j22O8K2R2K0r9j55l6
7784a77J95J13Jj67n1l0J18P4Rj1j58o4J79nJ05q7j28kN6J24O0j08j42L4lP7J13
7811A25l0o9j36M9R4Q5k5q6j47pJ47J40k2p2j32q6J19J18L4p8p0p8J20Q2M0J6
7837A31j61r2L3J34J02n4j54l8L4J69Ql6j16k4j1N7J26n5o6j04K4Q6J05Rr8j92
7863a83R0J03R7K6q8j14K0K0J70m6m5j00n4K8J86R2j22r3j24J9J27J23l8j27o8
$$ y = [-131, 87, 138, 87, -64, -82, -135, 44, 84, 55, -40, -89, -65, -26, 146, 107, -20, -77, -49, -86, 106, 131, -2, -140, -119, 81, 61, 49, -22, -102, -105, -39, 60, 128, 40, -51, -115, -46, 78, 231, 60, -77, -94, -54, 53, 92, 71, -35, -159, -36, 79, 114, 115, -43, -112, -55, 41, 42, 52, 21, -83, -130, -37, 123, 173, -18, -101, -135, 9, 195, 54, -27, -97, -126, -90, 50, 116, 15, -97, -113, -67, 48, 117, 69, -59, -82, -39, 62, 95, 109, -81, -99, -65, 33, 79, 66, 33, -89, -21, 1, 93, 113, 14, -141, -177, 18, 131, 132, -35, -86, -116, 2, 76, 85, 74, -84, -148, 31, 26, 131, 44, -84, -86, -30, 94, 154, 46, -96, -62, -65, 12, 125, 95, 26, -110, -61, 33, 118, 93, 7, -140, -147, 0, 140, 118, 46, -86, -172, -53, 65, 99, 21, -49, -127, -7, 75, 115, 131, -30, -122, -89, 45, 147, 93, -61, -99, -65, 104, 112, 76, -40, -64, -75, -18, 108, 53, -13, -117, -93, -7, 98, 107, 9, -183, -93, 10, 107, 133, 45, -69, -49, -29, 141, 95, 50, -50, -104, -76, 110, 202, 80, -13, -137, -118, 9, 132, 94, -33, -101]
7888a01j8O8J30Q2j74j22J8J19J22%j31o7o2J03J92l7r6p5p6J14O9j8O4j45l0
7913g1l4J14J59n7j04j05jJ38L4Rq4n5j9J10P6j7r7r7n5J21J00K1o4o4p5K6J56
7940F5P4j03r9o9J30J07J8j02n6j27J13J35qJ0j77l5K6O3J44k1r7r0K1J06QN3
7966H9q6r5m0Q2R6J1rq7o1J20N4L5j21K4l5n8J57k2j8r2M1l4J07Qj6j26n1M9R5
7995A7J32p1j59j8N0R2P1o7n8p2j7J19J01n0p6q0l0R9J28J3j00j29M4K0J15J12
8021A86j77p4j12J56O0J33p1j34n1J0J12J07J4j06j06o5J58L7J6o0j39mP4J22
8045H6J0q1j53L7jJ94M3j33j11JK9K04m8k4j37l3O9O5N8L7q2j00l7J03J49o2q8
8072ej02l4J38R2k9q4r6pJ00P5Q4j11r5l1Q4J50Jn6j72K4K5J12j7P2j16n3l4J07
$$ y = [-101, -119, -51, 79, 161, -13, -135, -117, 2, 124, 124, -7, -74, -136, -33, 159, 122, 26, -49, -125, -11, 58, 40, 104, -41, -71, -105, 9, 168, 111, 7, -98, -99, 39, 73, 82, -2, -57, -76, 34, 110, 93, -4, -101, -156, -35, 65, 86, 22, -42, -117, -91, 65, 139, 36, -63, -132, -2, 105, 123, 21, -35, -162, -49, 86, 78, 88, -89, -124, -98, -35, 109, 88, -9, -99, -78, 28, 36, 89, 3, -92, -132, -50, 46, 57, 48, -39, -100, 20, 74, 109, -12, 12, -23, -81, 76, 54, 36, -56, -15, -49, 58, 66, 50, -76, -127, -78, 17, 149, 78, -81, -99, -49, 43, 114, 47, -11, -83, -100, 19, 120, 70, -6, -86, -116, -17, 111, 124, 24, -105, -61, -41, 74, 186, 9, -65, -177, -21, 39, 172, 101, -33, -84, -74, 38, 145, 159, 53, -53, -118, 40, 77, 93, 33, -106, -110, -36, 86, 96, 15, -138, -101, -102, 92, 135, 2, -109, -108, -79, 125, 77, 53, -84, -117, -48, 17, 75, 112, 30, -70, -107, -4, 145, 83, -5, -107, -141, -3, 89, 60, -24, -120, -127, -27, 48, 132, 21, -74, -105, -21, 129, 130, 74, -98, -74, -49, 63, 46, 118, 2, -51, -85, 22]
8100B2P6Op7j46k1J03J22jr5q4%Q0J07K7j18Oj5LK0K7J7p0o8K3J46k0j58k3L2
8129g9L9J25oj8j15K1J4J2P2k1q0n3K5R7K4rp0q9jJ43J01n0j29j04J0J78J05m
8157A38j22j33J2L9J39P1o1j74n2J02J22K1r7n4l9J8J41l3J01j58j16M5J54L3
8181I7N3j54j04o5J35J41j3j08n0m2
$$ y = [22, 98, 104, 27, -119, -140, -37, 85, 84, -11, -95, -95, -15, 92, 119, 1, 7, -8, -5, 15, 42, 59, -11, -79, -56, 90, 70, -88, -111, -79, -40, 85, 79, 61, -54, -33, -19, -7, 65, 44, -36, -89, -64, 33, 57, 48, -22, -111, -112, 31, 132, 82, -47, -151, -141, 37, 142, 138, 16, -117, -105, -66, 73, 144, 83, -91, -143, -41, 81, 102, 5, -49, -88, -70, 71, 38, 139, -19, -135, -90, 64, 97, 150, -4, -108, -173, -38, 103, 90, -18, -68, -110]
8191a10
$$ Imaginary data points
##PAGE= N=2
##DATA TABLE= (X++(I..I)), XYDATA
0@%%%%%%qQlJ1j6J6k4L2l2M0m9N7p2Q5j01J20j36J55j80K04k33K68l02L42l86
31b04M32m85N45o09O77p51Q36r29J029j140J262j397J548j716J904k114K352k629
49a389K950l325L776m330N025n933P170q964J1830j7135L0228j20830k38592J58652
63a80867K77728K00960o6600k51527k37610N0K07595K41099P3994j42372k54186
74a31736j31493J01768K34142J52056m1328j95783j71936L9J53562J50464L9998
85A59753q2328j36752q3554M0751J15538R0481L251q1076j00134k5454O1445P2576
97C4497K7320j4575m1060m1068j1131J6644K7080L4513J8740k6879m7711k0342
109d3972J1271K6917L2975J5884j6570l1184k9446j5881K4978N8978L0984k9577
$$ y = [0, 0, 0, 0, 0, 0, 0, -8, 0, -3, 8, -8, 8, -16, 16, -16, 24, -25, 32, -40, 45, -56, 64, -72, 83, -97, 107, -126, 142, -160, 182, -204, 228, -257, 288, -321, 356, -395, 441, -488, 541, -599, 663, -734, 814, -902, 1002, -1112, 1240, -1389, 1561, -1764, 2012, -2318, 2707, -3226, 3944, -5020, 6810, -10325, 19903, -100927, -339519, -180867, 96861, 297821, 231221, -20306, -257916, -257866, -50271, 190828, 264822, 122450, -131736, -263229, -161461, 72681, 224737, 183409, -12374, -184310, -184271, -30709, 119755, 159753, 77425, -59327, -142881, -102130, 13408, 103889, 107140, 26064, -74070, -99524, -38079, 34497, 61817, 47242, 6182, -34886, -46017, -29373, -2293, 32220, 50960, 24081, -23630, -43972, -32701, -5784, 27191, 43075, 26505, -4679, -34125, -50006, -25028, 33950, 64934, 35357]
121C5357n4067l5417N050M5916M7804O515k8308l6329l3390m870M3725N5055J3176
134F0217l3833n3198l4402J8916N5405L4389n742k4301l3875l1113L869M0907
146b761M2679J6941k3676n7053l9993J7743N0330M0239J5027k2575n7780m8130
158f9009M134N4643P3540L5956n1478j04764n6624M1431R9826Q2688j828r7046
170A1469j12309k9928P4800J26057Q2956m4832j52089j21077K4170J46640J45949
181A51806J9621j34258j70480n0209J06275J65635R4558n6380j70804j36577K1900
192a58913J57786J58488K5578j37923j80932n2996J16406J67546P6710o8564j54096
203e0910j04630L4868J31320J11126Q357j00425j27788l6814Q6455J18912M5548
$$ y = [35357, -18710, -54127, -49077, -3161, 44643, 51158, 22850, -13479, -46869, -51739, -8014, 47041, 60217, 26384, -26814, -61216, -42300, 13105, 47494, 41752, 17451, -16424, -47537, -43668, -2761, 39918, 56859, 33183, -23870, -63863, -46120, 4210, 44449, 59476, 36901, -20879, -69009, -64875, -10232, 63308, 99264, 47786, -56978, -113602, -72171, 27655, 110343, 108515, 11469, -100840, -130768, -55968, 70089, 153045, 108213, -43876, -164953, -140783, 5857, 151806, 171427, 37169, -133311, -183520, -77245, 88390, 182948, 126568, -44236, -180813, -158913, -1127, 157361, 182939, 45016, -135916, -188912, -72506, 95040, 171750, 103186, -50910, -155540, -120672, 10648, 121774, 130131, 29706, -98082, -134896, -48441, 70471, 116019]
214A16019n5289j02899n7625L8012Q3372M5539j4533m8073m7327r505L6855M2337
226B6883J0483j9588l1166j7173J7379K8653l28k0871o028J2239J3025O76j8899
239d715k1609P445L0011J5956p069j8256k4013j1988K0577L6280J7956j3741l9296
252a2462l6514R076N2079L7696j1142l9687l5461o269L1141L9246J1063j6977
264B1789k8468k7948k361L4695L6894K138k6988l0833j2396J8815K9486P160j0794
277A1189p245p302j1279o57J2068J2939R550j686j9292j7750J312J0133J2278
290D258J8603P392k2292l4255j5365J8019M5415L5651j8583n9407l8683J3498
302d5749M8665M9466R726m6159o2323k3605L2203O7049N1841j9517q3093o4923
$$ y = [116019, 60730, -42169, -99794, -61782, 21590, 67129, 52596, 4523, -42804, -52309, -15454, 26883, 37366, 17778, -13388, -30561, -13182, 15471, 15143, -5728, -11756, 483, 13508, 14184, -4715, -26324, -18879, 11132, 27088, 20019, 1763, -22250, -34238, -13661, 22619, 40575, 26834, -12462, -48976, -39900, 12179, 49875, 38733, -954, -36415, -42684, -11543, 27703, 38766, 21789, -6679, -34627, -36988, -2293, 34601, 36739, 9751, -21082, -33478, -14663, 14823, 21983, 11189, 3944, -3358, -14637, -15294, -3226, 9713, 19263, 17577, -1715, -19465, -18153, -8020, 4258, 22861, 30253, 7961, -26294, -41659, -23640, 21775, 57426, 38843, -20564, -59247, -45749, 2916, 52382, 62108, 15949, -46374, -69979, -37776, 29273, 81114, 61597, -21496, -86419]
314h6419J5061P6752P2233N434p1415q1323j4602N6234P4181L7978l1612q2109
326b9607n7641K2192P7978O5710k581p4210p7202k041O8737O6372J0996m5936
338B2767o4213k5514L5954N7542K8802j6589m9834m3659Q985N4230M0143j0190
350C8424m3131l6382M306M1575L1035j1147l0300j7668K026J9667K3020N24k2553
363f04j9590q51J7960K6103N308k9609l0312O125L1710K4117l843l1037k8483
376c3006P176L2292K0607k920j9420k6723j0814K2271L3715J1837j8464l5290
388a8739k2138J9993M4445J7520k4343l4731j5761J3918L2982J9536j3364k6470
400g152j6176M76K0480K8529L858k8360k7986o29K4683K9233L110l0734k8016
$$ y = [-86419, -71358, 5394, 77627, 83061, 11646, -69677, -84279, -28045, 46136, 84114, 52502, -29607, -87248, -65056, 12922, 78632, 76051, 1841, -75361, -77402, -8665, 57707, 68703, 22767, -41446, -66960, -31006, 26536, 55338, 38749, -11085, -54744, -45759, 8471, 48614, 38424, -4707, -41089, -36783, 4792, 35827, 24680, -5620, -23288, -21262, -1595, 21425, 21949, -604, -20194, -21045, -3085, 23018, 28326, -1283, -31595, -25470, 6240, 30357, 26514, -4523, -33006, -25830, 6462, 27069, 24149, 4729, -21994, -32808, -10537, 23178, 35015, 16551, -18739, -40877, -20884, 23561, 41081, 16738, -17993, -33754, -19836, 13146, 32682, 19318, -7152, -23328, -22852, -2372, 26157, 30015, 1655, -26331, -26960, -2277, 26956, 30066, -668, -28684]
413b8684O769K6157J7300q29j8587k2367j699K0170J9258N342j2804k7348j4814
426c2136K1433L4806Q671k3255l2301j2515K3751L7240Q260k5442k7887j0001
438b9376J2120K9395K1370j1122l1996k3266L600L2047L5290k613m1525l3263
450c9339O937L4725L1668M49l3804l2907O92K5889K6857J1928j6433l6728j9341
463c9407J9761L6992K0872j3983m0529k6696J9179M1179J8181j5151l0224k2055
475c1881O660L0559K2384l978k1649k5219q752K3760L5137N781k7434l0342o720
488c1694K3744L2858N646k6973k5084j046J5523K0143J0776j2421k4070j0266
500b2864J0025K0977J7162p005l0296j7876J6398K8557J1429j3535k6854j3610
$$ y = [-28684, -21915, 4242, 21542, 20713, 2126, -20241, -21940, -1770, 17488, 22830, 10026, -17322, -32136, -10703, 24103, 32774, 9519, -22782, -35297, -11546, 25694, 33954, 8512, -19375, -29376, -17256, 12139, 33509, 22387, -9609, -32875, -29275, 2772, 38062, 35449, -6076, -39339, -32402, 2323, 33991, 34440, 636, -32271, -31579, -5690, 21167, 33095, 16662, -20066, -39407, -19646, 17346, 38218, 24235, -16294, -42990, -23811, 17368, 35549, 20398, -9826, -31881, -25221, 5338, 27722, 23744, 2095, -23124, -31876, -8116, 27021, 32802, 5368, -24974, -31694, -7950, 24908, 30554, 3581, -21503, -22549, -7026, 13117, 23893, 11472, -12598, -22864, -12839, 8138, 25300, 18295, -12001, -29877, -13479, 15078, 26507, 12972, -13882, -27492]
512b7492J6723K6439P126j2225j8242j4588L957K5137K0438o192k5400k3473M08
525b7384L1217L1628o246l5801k5656N148K8861K8956N83k9389k7968l232J9061
538a0222K9683J8010j7549l9834k0169J8305L8204K5181j3745m3058k6400J6768
550b4826L6071K1839n287k8656k9341p97K7083K8051Q369j8879l5412j6835K3837
563a4783L7808J1914k0529l2022j5523J7602L1882J1245j4981k0733j3414K768
575a8766K1542K0350l740k1812j8669p36K1617K4829k695k8094j8376Q152K1228
588D830J5653m189k1858j5333O909J6848J2166K075j4264k2538l994K1595K3362
601B1262L202k0607k8357n483K7863K9281j001k4680k3676n094J9736K7984P546
$$ y = [-27492, -10769, 15670, 22796, 10571, -7671, -22259, -18302, 6835, 27273, 21081, -4319, -27792, -27384, 3833, 35461, 29215, -6586, -32242, -27094, 1767, 30723, 31306, 1917, -26051, -29283, -10222, 19461, 37471, 19922, -19912, -40081, -21776, 16428, 41609, 27864, -15194, -41594, -24826, 11245, 33084, 27797, -859, -30200, -30997, -3914, 24137, 32506, 13627, -21785, -38620, -14783, 23025, 34939, 14410, -17612, -33135, -15533, 16349, 27594, 12613, -8120, -21534, -18766, 2776, 23126, 19386, -2426, -21095, -21831, -214, 24615, 21920, -6174, -24550, -16398, 4830, 20483, 16294, -5564, -20897, -13988, 2860, 15026, 17101, 2837, -19701, -23695, -2100, 21262, 24464, 3857, -24500, -29983, -2120, 27161, 26160, 1480, -22196, -27290, -7554, 20430, 27976]
614B7976j8110k4883j3927R407L1765K3522j3590l6286k1274J1618L4356K5803
626C6377j1088l6550k1448J0397K6348K2146J070k4974k7891k743K2052K7393
638B1089J1127j9709l5586j1585K5277L1674P995j9088k9117j1067J8940K6142
650A6092P183j1412j8696j4981M396K3840J7839o366k1918j8609K239K5557K1668
663B6832q742k6143j3599P329J9080J5356m157j9612j3174K695J2327J6023P036
676B1251j5391k4122m954J8299K2498P454j7131k7216o578K0624K1709M618j1175
689I886j9214j3011P770K0905J4174j865j7595k2976l523K4248K4930l04k0809
702B616k1619m644J8040K2200L180j3561j4433q624K997J7205J4823l948j6460
$$ y = [27976, 9866, -15017, -28944, -19537, 12228, 35750, 22160, -14126, -35400, -23782, 10574, 36377, 25289, -11261, -32709, -22312, 4036, 26182, 27252, 2278, -25613, -28356, -6304, 21089, 32216, 12507, -23079, -34664, -9387, 22287, 30282, 11194, -17923, -28990, -10050, 16092, 23275, 11863, -6833, -21814, -17418, 6422, 24261, 17895, -4023, -22632, -20393, 5164, 26832, 18090, -8053, -21652, -14323, 4757, 20113, 15956, -3656, -16830, -14135, -1808, 14215, 21251, 5860, -18262, -23216, -4917, 17581, 25035, 7904, -19312, -25890, -5266, 16443, 21061, 9886, -9328, -22339, -14569, 6336, 20510, 18645, 1050, -21926, -25449, -1201, 23729, 23425, 2616, -19003, -23647, -5607, 16593, 19773, 6212, -8221, -16845, -13848, 3357, 18180, 14232, -2228]
715b228j3583l10J5813J7097l519j8343q631O876J0319N109m244j0253k444Q153
729a88N953p08l304p727o499P886J6780N174j2862j9848r579J5679L0736J0599
743C2092k3716l1488j0095J8384L3438J9477j5913l6920k4056P276L4925L8286
755D1690L228m2271m7233n972L9787N1081J6367l7156n5854j9665L0139M9151
767B3292K9534j4334m9460m0429O287M5136M4823P526m0320n3223j2439L8272
779a5335M7647J5720k5038m3174k2450J7249L5818K2293l773k5764k9424n258
791c1489K4769K7805O148j6598k4049r780J4384J9518K932q756o987l075O03M212
805c63J901j194J390Q90k433J03J434n217m984O097J1061L654o975j4347r220
$$ y = [-2228, -15811, -16121, -308, 16789, 13270, -5073, -13704, -6828, 3491, 8600, 4356, -5897, -8341, -188, 5765, 5057, 1753, -5974, -12473, -4587, 12193, 17367, 4505, -15343, -24922, -9243, 21493, 32092, 8376, -23112, -33207, -14823, 18615, 38092, 22179, -14741, -38797, -31521, 3404, 41690, 44918, 2647, -44586, -50558, -10771, 40310, 56677, 19521, -36333, -55998, -25859, 23292, 52826, 38492, -10968, -51397, -45110, 26, 44849, 52375, 12055, -41168, -53607, -15335, 32312, 48032, 22994, -20180, -42630, -25381, 10437, 32730, 28957, 3193, -26231, -31489, -6720, 21085, 27233, 10635, -13414, -23194, -8810, 10708, 13640, 4884, -2103, -5178, -4575, -363, 1538, 344, 1734, 2624, 191, 294, 1728, -3489, -8473, -2376, 8685, 12339, 5364, -8983, -18203]
820a8203R865J9824O928r816j3922r997M12J3671J5167L450q889j6661j4179N443
834a6907K3912J6592o528j9482j6070j123J5679J7202L185q250j1292j1630k281
847a6993J3691J6613L201r840j4386q437O186J3698N297k808j949l377q211m438
861a1753M234R897J1275K380j3713j7103m008Q896J5364J5759J883k0301k6474
874b3664r150J7699L5416K3851j6700m5904l0133J2440M3235L9723J776m2099
886F490m9525j3152L3124N4541L3267k2639o4646m6412J5718O2509N5671l22n8939
899E685o3771r638M8389O1553K6352l0680o4475m1157J9126O0059M9456k295n4528
912D076n8094n933M7807N2649J4217l0956m8539k3775J9668M0197K6319l780l0458
$$ y = [-18203, -8338, 11486, 18414, 8598, -5324, -15321, -14909, -1238, 13929, 17379, 8490, -8171, -22350, -16907, 7005, 23597, 17069, -2413, -18483, -19606, -3927, 13275, 16460, 8210, -3082, -14712, -16993, -3302, 13311, 16512, 6672, -7714, -16151, -9965, 3733, 9030, 6222, 4273, 896, -7315, -11753, -7519, 2378, 13653, 16033, 2320, -14783, -18791, -9895, 5469, 21228, 23111, 2810, -23664, -32814, -15115, 20301, 44152, 27452, -18452, -48585, -36145, 7090, 46813, 48589, 6490, -43035, -56187, -23063, 31478, 64745, 42106, -22540, -68952, -53234, 9275, 64946, 64624, 5685, -58086, -67724, -19335, 42218, 68570, 37890, -26585, -67742, -48616, 11443, 60899, 58604, 4076, -54018, -59951, -12144, 40505, 54722, 23766, -24773, -48548, -28880, 11317, 37636, 33856, 3398]
925C398l3302n074K6954K9570P082j6413k4199j0323J1967J6791M396l872m461
938B514n004l063J639K248J864L539J300k774j525j921o505j775J0172J1961J080
953A3750j0822j5708o673J2722J9638N855r582j4257j1498l37J4431J6773N148
966A9440r242j8789j5136N958K3338J6258m330j6368j6041m769J1094J6149P958
979A5520j768j0281j6294p954J1024J8477R528m244j4562j4574j675J0732J1525
992E454Q436K671j0905j9765r631R883K1507J8070j979k4484k4523k755J7994
1005a0027K5560J7349p889l2061k8956k1L0449L9351J3974l0164m8590k0725K4269
1018b7481M6548L2092j0103m6675m2476j415L9242M9467J9938l1966n9221l0742
$$ y = [3398, -29904, -34978, -8024, 21546, 28628, 12215, -11984, -22307, -10340, 6451, 10847, 6975, 2514, -2490, -5553, -3914, -1666, 198, 3737, 5037, 2263, 738, -1183, -7688, -9463, 709, 12670, 13750, 2928, -12780, -19453, -6731, 12907, 18762, 9180, -5077, -16575, -16912, -2481, 14292, 19440, 10198, -8591, -23727, -17769, 5569, 21827, 17497, 1129, -14912, -19681, -8587, 7562, 15520, 13752, 3471, -12823, -20777, -9753, 8724, 18252, 14008, -554, -15128, -16803, -6071, 5454, 13890, 16561, 5656, -14109, -23740, -13857, 7650, 25720, 23741, -743, -25266, -28021, -10027, 15533, 32882, 24993, -7068, -36024, -36045, -5596, 33755, 47729, 17565, -31025, -51750, -27481, 19067, 51159, 41056, -5619, -48095, -49510, -10268, 39199, 59137, 27171, -32050, -62792]
1030f2792K5984N7224L9468j2533n4691m6660L392M5356M6390J2237l1981n1127
1042b9733k4255K4018M8347L1238j1388m5486l7891O439M0185L3016Q49k7305
1054H034l1629q478K0301K6328J0782r093k1733j6895N454K1492J3253n387j4849
1067b420j0343L956J3607N459q561q163J567N964M966J51p364p832J332Q186Q264
1082H769L583p738j6588o914J3066J9019O798j0719k0432j1460J0436K0815J0306
1095A8941n108j4306j5389l834J3848J8672P331q771j9224j4309O579K1019J2651
1108A8100m538j3100j1854l009Q464J1100N056o83o569j1365n208P623J1113M624
1122I754j619o717q048k403K847M723P995P502n058j6072j0684M238J5520J5889
$$ y = [-62792, -36808, 20416, 59884, 47351, -7340, -54000, -50608, -5252, 41138, 53375, 21394, -29733, -53988, -29970, 18377, 49615, 38227, -7259, -45150, -38711, 1474, 34490, 35339, 8034, -23595, -32073, -11772, 14556, 25338, 16245, -5488, -22383, -16929, 4563, 17816, 12429, -2420, -12763, -8807, 4800, 10259, 1698, -6465, -4898, 1066, 6032, 6183, -1181, -9013, -7681, 505, 8769, 12352, 4614, -11974, -18888, -5822, 13197, 19995, 9276, -11156, -22616, -12180, 8635, 18941, 13833, -473, -15862, -19696, -5848, 12824, 20155, 11384, -7840, -22149, -15570, 5449, 18100, 13562, 462, -11392, -14401, -5937, 5163, 10219, 9536, 2967, -8398, -13606, -5983, 5130, 9754, 8135, 1418, -6630, -9033, -6186, -1463, 6532, 14034, 8976, -7096, -17780, -13542, 1978, 17867]
1136A7867J610j6874j8784m607J0296J8734J5907l491k3797k2642q77K2004K8886
1149B4232R447k2793l3457j1204J8092K9718J8796q590l0300k4616K194K5171
1161c310K9120R413k3047l5813j2953K1197L3128J6850j3736l2292k0026J0064
1173b1405K6465J9316j60k0038k4604n588J8815K3675Q454j3396k4607j1530J4275
1186a0328K2565P227j0661j5951q494O640J4915P014n489r995p731N52J1736J1159
1200A3159l711j3767q605M087J3554J0390o122j6681p239Q251J2454P012l421
1213I361j2854j0282K891J1915J0896K400j1243j7136l844J4890J6834K892j1996
1226D724j6847n555J2240J5758L593p748j0928q181K375J2954J0260k052j0909
$$ y = [17867, 19477, 2603, -16181, -20788, -10492, 8242, 24149, 20658, -3139, -25781, -26658, -4654, 24232, 33679, 10886, -22571, -33775, -15683, 14035, 32831, 24241, -6059, -30675, -28481, -3310, 25810, 35223, 12176, -23637, -36590, -15393, 17735, 34585, 20849, -11443, -31469, -21405, 5060, 24376, 24216, 4178, -20426, -26014, -7199, 16476, 24930, 11534, -13073, -24603, -10328, 12237, 19464, 8803, -7148, -15642, -9002, 5913, 12927, 7438, -2557, -10288, -9736, 2000, 13159, 9448, -4319, -12924, -8837, 4717, 15107, 8985, -7696, -14935, -6684, 5770, 12782, 9361, -3493, -13775, -10884, 1031, 11927, 14327, 3084, -14052, -17896, -3006, 13828, 16720, 4724, -12123, -17678, -5438, 10320, 13913, 6165, -4763, -12944, -10569, 2385, 12645, 10593, -316]
1239c16j1142j490J2449J3151k052j2600p913J946Q266P766j308q507m640J935
1253d455L921M650K484n206q490m97P472P606J079q335j1012P20J2701Q712l485
1268G865r672p867J07R634R635k10p521q676n239N334J4314P538q309j4559p168
1283a4794O214J5636R292q103j5220n953N361J0355Q890r27j1402j0173o1Q853
1297b032J1940M609j0871j5621k086J2368J2535K343r899j3408k514J0453J0466
1310H283K006n130r755p361M389J2717P504l912j1915j0509K879J5690J0169o202
1324H853j3234p477K871J1102R280k354r964p179j096N879J0857M682q678j2066
1338h524k728P582J1194M377q904j2082o34R038P076N47m936p455k278N807O687
$$ y = [-316, -11458, -12948, -499, 12652, 10600, -2000, -9913, -7967, 299, 8065, 6757, -1750, -6390, -4455, -534, 4116, 6600, 1394, -7096, -7593, -121, 7485, 8564, 229, -10783, -10063, 2638, 11350, 7865, -1807, -9674, -9567, 67, 9702, 9492, 1971, -6705, -11944, -6610, 7704, 15242, 6933, -7626, -14794, -8580, 7056, 16348, 8245, -6975, -12928, -7567, 2788, 11678, 10751, -651, -10824, -10885, -2032, 9908, 14517, 3646, -11975, -14061, -1693, 10842, 13185, 3286, -10122, -12636, -2183, 8283, 10289, 5159, -4596, -11957, -7568, 5149, 12653, 8741, -3174, -13683, -10804, 4886, 15055, 8853, -4381, -11858, -8987, 2115, 11395, 9041, -923, -8102, -9198, -3319, 7538, 12220, 3542, -8524, -11252, -3670, 7524, 11901, 2997, -9085, -9719, -681, 6395, 6942, 2006, -5449, -7727, -1920, 4767]
1353D767J937l293p821n855N563J2309L828q522j1391m117Q302J4155M080j0909
1367C033j2610l130O544J2081Q748m862j4830j0709K383J4265J6095J112j8394
1380b74j8564J76J6517J7587M452j3944j9636o158J0825J6639J0980l451j8414
1393c265j6913K091J8315J7562K303j6392k0553l432J5831J6973M452q552j5206
1406f786r461N459J4197R944o39j1025j4015k129J2928J2950L72r501j0019k304
1420a0029P980Q636j86n227l357j588J007M621K676k958m081p97K337M866J787
1435E687o524p050L035R010M393l426q535o488L707J0495N290l113o949p543k456
1450a0467Q180J1700K965q099j2149o435P408J5645O246r140j2519n112M494J0642
$$ y = [4767, 6704, 3411, -4410, -10265, -4702, 7607, 11435, 2913, -8478, -12595, -4293, 9862, 13942, 3033, -9577, -12707, -6163, 5918, 14666, 9804, -5026, -15735, -13352, 913, 17008, 18120, -274, -18838, -18662, -2145, 15442, 19894, 5950, -13686, -19844, -9019, 7620, 18600, 15149, -3265, -20178, -18087, 228, 17790, 20093, 3701, -16852, -20284, -4453, 12520, 16972, 8420, -6786, -16247, -10788, 3409, 13353, 12714, 1689, -12326, -14455, -1527, 11423, 11795, 2294, -7725, -10029, -2049, 6587, 6401, 1174, -2183, -3771, -2764, 1857, 4533, 1575, -2506, -3303, -966, 3900, 5687, -837, -7887, -4852, 4158, 8551, 5125, -3410, -9898, -6191, 4304, 9594, 6481, -468, -8011, -10467, -2287, 9413, 12378, 4279, -7870, -14305, -6897, 8748, 14994, 5854, -6665, -11777, -7283, 3359]
1464C359P262l215q806n900o40N493Q982K783p712q229k87N942O266M72o859n243
1480f332M020O391o9m321l721q47M348O255M05n759o048k681L637J0879P404o974
$$ y = [3359, 10621, 7406, -1400, -7300, -7940, -2447, 6535, 9318, 1606, -6623, -6910, -968, 5298, 5770, -1089, -6332, -2312, 4079, 4010, -311, -4032, -4879, -531, 5724, 6129, 370, -5678, -8359, -4722, 6157, 13561, 6587]
$$ [...]
8191I4
##END NTUPLES=NMR FID
##END=
