##TITLE=1H_EC-3225
 CDCl3, 8 sc, 
 25.2.2020
##JCAMPDX= 6.0         $$ Bruker NMR JCAMP-DX V2.0
##DATA TYPE= NMR FID
##DATA CLASS= NTUPLES
##ORIGIN= UXNMR, Bruker Analytische Messtechnik GmbH
##OWNER= root
$$ XWIN-NMR		Version 3.5
$$ Tue Feb 25 14:14:21 2020 Russian Standard Time (UT+4h)  she@DPX200
##.OBSERVE FREQUENCY= 200.1315
##.OBSERVE NUCLEUS= ^1H
##.DELAY= (6, 6)
##.ACQUISITION MODE= SIMULTANEOUS
##.ACQUISITION SCHEME= undefined
##.AVERAGES= 8
##.DIGITISER RES= 18
##SPECTROMETER/DATA SYSTEM= spect
##.PULSE SEQUENCE= zg30
##.SOLVENT NAME= MeOD
##.SHIFT REFERENCE= (INTERNAL, MeOD, 0, 15.7039)
##AUDIT TRAIL= $$ (NUMBER, WHEN, WHO, WHERE, WHAT)
$$ ##TITLE= Audit trail, XWIN-NMR		Version 3.5
$$ ##JCAMPDX= 5.01
$$ ##ORIGIN= Bruker BioSpin GmbH
$$ ##OWNER= she
$$ F:/spectra/data/she/nmr/H-F/1/audita.txt
$$ ##AUDIT TRAIL=  $$ (NUMBER, WHEN, WHO, WHERE, WHAT)
(   1,<2020-02-25 14:13:15.53 +0400>,<she>,<DPX200>,
      <created by zg, POWCHK disabled, PULCHK disabled
       configuration hash MD5:
       00 E9 B6 7A A2 85 ED C7 34 08 36 98 17 FE 4E 26
       data hash MD5: 16K
       5E BE 47 4D F5 18 51 39 9B 1D 90 70 8D 46 0E 60>)
$$ ##END=
$$ 
$$ hash MD5
$$ 2B E4 E0 E0 8F 1B 8E FE 8C C9 58 11 F2 1D F9 86
##$RELAX= 
##$RELAX= 
##$RELAX= 
##$RELAX= 
##$RELAX= 
##$RELAX= 
$$ Bruker specific parameters
$$ --------------------------
##$DU= <F:/spectra>
##$EXPNO= 1
##$NAME= <H-F>
##$PROCNO= 1
##$TYPE= <nmr>
##$USER= <she>
##$AMP= (0..31)
100 100 100 100 100 100 100 100 100 100 100 100 100 100 100 100 100 100 
100 100 100 100 100 100 100 100 100 100 100 100 100 100 
##$AQSEQ= 0
##$AQ_mod= 1
##$AUNM= <au_zg>
##$AUTOPOS= <>
##$BF1= 200.13
##$BF2= 200.13
##$BF3= 200.13
##$BF4= 200.13
##$BF5= 200.13
##$BF6= 200.13
##$BF7= 200.13
##$BF8= 200.13
##$BYTORDA= 1
##$CFDGTYP= 0
##$CFRGTYP= 5
##$CHEMSTR= <none>
##$CNST= (0..31)
1 1 145 1 1 1 1 1 1 1 1 1 1 1 1 1 1 1 1 1 1 1 1 1 1 1 1 1 1 1 1 1 
##$CPDPRG= <>
##$CPDPRG1= <>
##$CPDPRG2= <>
##$CPDPRG3= <>
##$CPDPRG4= <mlev>
##$CPDPRG5= <mlev>
##$CPDPRG6= <mlev>
##$CPDPRG7= <mlev>
##$CPDPRG8= <mlev>
##$CPDPRGB= <>
##$CPDPRGT= <>
##$D= (0..31)
0 1.2 0 0 0 0 0 0 0 0.06 0 0.03 0 0 0 0 0.0002 0 0 0 0 0 0 0 0 0 0 0 0 
0 0 0 
##$DATE= 1582625595
##$DBL= (0..7)
120 120 120 120 120 120 120 120 
##$DBP= (0..7)
150 150 150 150 150 150 150 150 
##$DBP07= 0
##$DBPNAM0= <>
##$DBPNAM1= <>
##$DBPNAM2= <>
##$DBPNAM3= <>
##$DBPNAM4= <>
##$DBPNAM5= <>
##$DBPNAM6= <>
##$DBPNAM7= <>
##$DBPOAL= (0..7)
0.5 0.5 0.5 0.5 0.5 0.5 0.5 0.5 
##$DBPOFFS= (0..7)
0 0 0 0 0 0 0 0 
##$DE= 6
##$DECBNUC= <off>
##$DECIM= 24
##$DECNUC= <off>
##$DECSTAT= 4
##$DIGMOD= 1
##$DIGTYP= 9
##$DL= (0..7)
0 120 120 120 120 120 120 120 
##$DP= (0..7)
150 150 150 150 150 150 150 150 
##$DP07= 0
##$DPNAME0= <>
##$DPNAME1= <>
##$DPNAME2= <>
##$DPNAME3= <>
##$DPNAME4= <>
##$DPNAME5= <>
##$DPNAME6= <>
##$DPNAME7= <>
##$DPOAL= (0..7)
0.5 0.5 0.5 0.5 0.5 0.5 0.5 0.5 
##$DPOFFS= (0..7)
0 0 0 0 0 0 0 0 
##$DQDMODE= 0
##$DR= 18
##$DS= 0
##$DSLIST= <SSSSSSSSSSSSSSS>
$$ [...]
##$SUBNAM2= <"">
##$SUBNAM3= <"">
##$SUBNAM4= <"">
##$SUBNAM5= <"">
##$SUBNAM6= <"">
##$SUBNAM7= <"">
##$SUBNAM8= <"">
##$SUBNAM9= <"">
##$SW= 24.9337058887773
##$SWIBOX= (0..15)
0 0 2 0 0 0 0 0 0 0 0 0 0 0 0 0 
##$SW_h= 4990.01996007984
##$TD= 16384
##$TD0= 1
##$TE= 0
##$TE2= 300
##$TE3= 300
##$TEG= 300
##$TL= (0..7)
0 120 120 120 120 120 120 120 
##$TP= (0..7)
150 150 150 150 150 150 150 150 
##$TP07= 0
##$TPNAME0= <>
##$TPNAME1= <>
##$TPNAME2= <>
##$TPNAME3= <>
##$TPNAME4= <>
##$TPNAME5= <>
##$TPNAME6= <>
##$TPNAME7= <>
##$TPOAL= (0..7)
0.5 0.5 0.5 0.5 0.5 0.5 0.5 0.5 
##$TPOFFS= (0..7)
0 0 0 0 0 0 0 0 
##$TUNHIN= 0
##$TUNHOUT= 0
##$TUNXOUT= 0
##$USERA1= <user>
##$USERA2= <user>
##$USERA3= <user>
##$USERA4= <user>
##$USERA5= <user>
##$V9= 5
##$VALIST= <valist>
##$VCLIST= <CCCCCCCCCCCCCCC>
##$VD= 0
##$VDLIST= <DDDDDDDDDDDDDDD>
##$VPLIST= <PPPPPPPPPPPPPPP>
##$VTLIST= <TTTTTTTTTTTTTTT>
##$WBST= 1024
##$WBSW= 4
##$XGAIN= (0..3)
0 0 0 0 
##$XL= 0
##$YL= 0
##$YMAX_a= 496995
##$YMIN_a= -367840
##$ZGOPTNS= <>
##$ZL1= 120
##$ZL2= 120
##$ZL3= 120
##$ZL4= 120
##$ABSF1= 10
##$ABSF2= 0
##$ABSG= 5
##$ABSL= 3
##$ALPHA= 0
##$AQORDER= 0
##$ASSFAC= 0
##$ASSFACI= 0
##$ASSFACX= 0
##$ASSWID= 0
##$AUNMP= <proc_1d>
##$AZFE= 0.1
##$AZFW= 0.1
##$BCFW= 1
##$BC_mod= 2
##$BYTORDP= 1
##$COROFFS= 0
##$CY= 11.3945322036743
##$DATMOD= 1
##$DC= 2
##$DFILT= <>
##$DTYPP= 0
##$F1P= 16.9975609425685
##$F2P= -3.02152046262296
##$FCOR= 0.5
##$FTSIZE= 0
##$FT_mod= 4
##$GAMMA= 1
##$GB= 0.15
##$INTBC= 1
##$INTSCL= 1
##$ISEN= 128
##$LB= 0.24
##$LEV0= 0
##$LPBIN= 0
##$MAXI= 10000
##$MC2= 0
##$MEAN= 0
##$ME_mod= 0
##$MI= 1.114404
##$NCOEF= 0
##$NC_proc= 0
##$NLEV= 6
##$NOISF1= 3.799351
##$NOISF2= 2.8
##$NSP= 1
##$NTH_PI= 0
##$NZP= 0
##$OFFSET= 15.70392
##$PC= 1
##$PHC0= -9790.047
##$PHC1= 16.80082
##$PH_mod= 1
##$PKNL= yes
##$PPARMOD= 0
##$PSCAL= 0
##$PSIGN= 0
##$REVERSE= no
##$SF= 200.130013532006
##$SI= 16384
##$SIGF1= 3
##$SIGF2= 2
##$SINO= 400
##$SIOLD= 16384
##$SREGLST= <1H.CDCl3>
##$SSB= 0
##$STSI= 0
##$STSR= 0
##$SW_p= 3612.71676300578
##$SYMM= 0
##$S_DEV= 0
##$TDeff= 0
##$TDoff= 0
##$TI= <>
##$TILT= no
##$TM1= 0
##$TM2= 0
##$TOPLEV= 0
##$USERP1= <user>
##$USERP2= <user>
##$USERP3= <user>
##$USERP4= <user>
##$USERP5= <user>
##$WDW= 1
##$XDIM= 8192
##$YMAX_p= 0
##$YMIN_p= 0
$$ End of Bruker specific parameters
$$ ---------------------------------
##NTUPLES= NMR FID
##VAR_NAME=  TIME,          FID/REAL,        FID/IMAG
##SYMBOL=    X,             R,               I
##VAR_TYPE=  INDEPENDENT,   DEPENDENT,       DEPENDENT
##VAR_FORM=  AFFN,          ASDF,            ASDF
##VAR_DIM=   8192,          8192,            8192
##UNITS=     SECONDS,       ARBITRARY UNITS, ARBITRARY UNITS
##FACTOR=    0.0002004,     1,               1
##FIRST=     0,             0,               0
##LAST=      1.6414764,     0,               0
##MIN=       0,             -367840,         0
##MAX=       1.6414764,     496995,          0
$$ Real data points
##PAGE= N=1
##DATA TABLE= (X++(R..R)), XYDATA
0@%%%%%QqQj6J6k4L2m0N0n8P2q8J05j26J51j79K08k41K81l24L71m27M84n48O26
30C33p08P93q88R99j118J245j387J544j714J899k106K334k582K857l165L510l892
47b046M325m822N389o050O835p779Q942j0419J2359j5041J9031k5653L9173j11236
61h6992L10722K67412l85086l33699j6394K17303J11797k3328n7896M3379j9293
72B7925j10354j22J76535J6336k04940r7188J93302K23157k2031k75504k12906
83b85790J41414L18506L0867k37966q7639J49273P2624j18623j24078N1236J86684
94I6508Q7008j41949j44441N0291O1174p2396J0512J76795O2757j87157j91022
105a91920N2486K38918J13833k00426k41085J12276L14744M0240k64073j93619
$$ y = [0, 0, 0, 0, 0, 0, 8, 0, 8, -8, 8, -16, 16, -24, 26, -32, 40, -48, 57, -69, 82, -97, 111, -130, 151, -173, 198, -229, 255, -293, 333, -375, 418, -470, 529, -589, 656, -731, 813, -901, 998, -1108, 1226, -1356, 1501, -1664, 1846, -2046, 2279, -2543, 2846, -3204, 3631, -4148, 4794, -5625, 6734, -8307, 10724, -14929, 24244, -86992, 223730, 491142, 106056, -227643, -244037, -26734, 85063, 61735, 3839, 47218, 27925, -82429, -82551, 93984, 110320, -94620, -191808, 1494, 224651, 202620, -72884, -285790, -144376, 174130, 204997, -32969, -120608, 28665, 101289, -17334, -141412, -90176, 96508, 183516, 41567, -102874, -52583, 8591, -63805, -53293, 123502, 186259, -898, -191920, -139434, 99484, 213317, 12891, -228194, -115918, 198826, 239066, -25007, -218626]
115b18626N2772J82269J46895P49j16824j11037p6119k5163J43152K38304J1088
126B27460k63572j84286J01739K06508N7433j42605j43478Q7733K02810j4749
136A34993k12695q2839J13089J02410J3729k0586k9575k7224l5795m7273L8162
147e3604J37286L2014j37658o1627J04391M3610j11541q3987Q2234J72956O3105
158A87179j69018k16836L1293K16356R4388q0195q8231m0821J450O5678O3641
169F4884k2029o7993n4431n23J12520J37157o2426k33922j02977J51211K20303
180A41774P2136j43115k15439l8264J61265J14703l1154m5289j6185l5270m377
191c9215M8650J5339l7522k6335J6141O5657O1458o9215j57153j2950J58258R9846
$$ y = [-218626, -165854, 16415, 163310, 164059, 47235, -63802, -139921, -165084, -21932, 216372, 227460, -36112, -220398, -118659, 87849, 145282, 2677, -140801, -53068, 149742, 134993, -77702, -160541, -47452, 54958, 68687, 48101, 18526, -8698, -44493, -91766, -53604, 83682, 115696, -21962, -83589, 20802, 64412, -47129, -131116, -48882, 124074, 187179, 18161, -198675, -167382, 48974, 143362, 63167, -25064, -65885, -64435, 1243, 64884, 42855, -25138, -79569, -80092, 32428, 169585, 107159, -126763, -229740, -78529, 141774, 213910, 70795, -144644, -182908, -21643, 93060, 61906, 16617, 432, -34838, -39215, 9435, 24774, -12748, -39083, -22942, 42715, 104173, 34958, -122195, -135145, 23113, 122959]
203A22959n3185q8363m0431K1784N8792M181n9839M71P5940K6883m2343m8636
215b1787n0155j1791Q8668J03914n174r0613r7039m2889Q8449J60231J6384j56817
227a8619j04351O0034J16790N1647o2842j25131k7484J15671R9180j7629p2217
238A5049q2456n1274P2045J45498L3926j04792j06537k0491P3661J06605K041
249H3275j12753m8240P8350O4524k4789n7935m8244Q325Q7394O2874m5545p5631
261b8395k8474K691M4932P2722l334q0147k7569M5272L0138j3743m1176l6974
273f4057M7573J11069N814j31088r3463L8558J02975Q7012k295j14129r9930K9118
285h2843R3657N8661K914o9760r4533J7950J21046M8027p8080r0440j4910P4124
$$ y = [122959, 69774, -18589, -59020, -37236, 21556, 25737, -34102, -33631, 42309, 69192, 26849, -21787, -71942, -83733, 4935, 108849, 103675, 13062, -83977, -126866, -38417, 121814, 138198, -18619, -122970, -62936, 53854, 105501, 42659, -82472, -109956, 5715, 104895, 87266, 15049, -67407, -118681, -46636, 98862, 132788, 27996, -78541, -99032, -25371, 81234, 83275, -29478, -77718, 632, 65156, 40367, -17568, -65812, -57487, 29907, 92781, 47236, -28395, -56869, -54178, -9246, 63476, 60142, -20005, -47574, -2302, 27836, 14093, -27083, -64057, -16484, 94585, 100399, -30689, -124152, -85594, 17381, 104393, 102098, -12031, -111961, -82843, 10814, 69475, 72389, 2629, -91904, -73954, 47092, 95119, 17039, -73401, -88311, -14187]
297a4187J07460M160j25554q4353N2852Q8126L7932j4738o7485n9786L6447P6156
309C7030Q510m0453l6778j8944L9200Q0221m967j03691n3119N6989Q0381L3941
321G8320m1903r3485k4494Q5363O0632m0677n1744m873K0607M3619K5772n5338
333A799p4036J2701P3060N9061R406p4569j12882J593J31701Q7579m3985r7406
345b5978o2062K7465J01918M8915p2618p6368J6450N3161L4315L345n4749o5319
357g1525K5331Q6947L5496l5021o6707n6303K9663J09676M0731q3904q0262J1019
369e4859N9426N3829l927p5580m8046N2945O4564n019l4725l3923k4513L4538
381a5290O9296l13o5700l7050J6115M5079M8720j8616r0892l1369Q1590P2061
$$ y = [-14187, 93273, 97433, -28121, -112474, -59622, 28504, 66436, 51698, -15787, -75573, -39126, 37030, 45540, 5087, -31691, -50635, -11435, 68786, 63819, -39872, -92991, -36002, 44379, 78320, 36417, -57068, -81562, 3801, 64433, 23756, -27988, -32861, -12254, 31365, 57137, 1799, -72237, -59536, 13524, 72585, 81991, 7422, -105460, -103867, 27834, 115413, 71428, -25978, -88040, -60575, 41343, 90258, 17640, -58728, -42278, 10883, 45198, 48543, -6206, -71525, -46194, 40753, 76249, 41228, -25479, -81782, -52119, 57557, 98288, 14384, -65878, -54859, 4567, 58396, 54469, -21111, -69157, -16212, 48352, 43333, 8608, -25315, -49828, -15290, 54006, 53693, -12007, -49057, -32942, 12137, 60857, 42241, -48651, -80020, 1570, 73631]
393G3631j6622o5907o2523J254Q9567P1977m2203q4393k8354K0623N2617N6808
405F6475j7840q4063l0518N0762N0133R232l6267o2383k130Q5700M8352o0496
417A6957p3479o231M5462O5984K5278o7570p9348J3645O6802L8523M53m2345o3679
430e9548M048P7592L6930m1291n0329j7240K8944O6572J5377p7021n9282M1046
442c4202O8337K0698k6683o2296l9285N0719P8845Q04n6468m3633j1925M0102
454a4987P3406O845q0601n2439K9843N7054L6777j4033p2339m0730N8736O7151
466E4683j2406n0027l1035J998M8039M9017l0106p0200j0758M3243M2241K1432
478E6121l1327p6729j8171P4985O1546j6233n3818m8117n16O8876N3756m1812
$$ y = [73631, 57009, -8898, -71421, -70167, 19400, 91377, 49174, -35219, -63573, -42950, 9667, 66475, 48635, -35428, -65946, -15184, 34949, 44181, 7914, -54469, -56599, 29101, 77453, 16957, -56522, -62753, -17291, 48693, 73971, 6401, -72947, -59302, 7500, 46023, 46476, 4131, -59548, -55500, 22092, 59022, 17731, -32598, -49838, -20894, 45678, 61055, -15966, -75248, -34202, 34135, 54833, 28150, -34146, -73431, -22712, 56133, 56937, 469, -43164, -55089, -14987, 58419, 65264, -15337, -67776, -37933, 19121, 55898, 41865, -30474, -71204, -12468, 54683, 42277, -7750, -38785, -36787, 11252, 60269, 30163, -40037, -50795, -7552, 34689, 56121, 24794, -51935, -70106, 4879, 66425, 50192, -3626, -51743, -52259, 16617, 70373, 28561]
490B8561o5351k439L5385L3491J3579l8862n6615J6352O8542K3144l3794m6032
502b4039l3496K3042Q0516L3194o4208o9555k085M5771N9629J8690o4766o8151
514f5458K3174O6807K1097k0248l8894l4777K2920O4372J0335n2665l6605N952
526c3990L4205M5905p66o9056m1763M5624N8340Q422l1627n2599k5896N3223P0014
539F0036j1873o4431l3573J0666M3632M8238j4477o9202k3667M3922L9238N403
551C3912k5271m8953r953O3900M8702l8254o2841j7272K9850O0784L5523n1455
563A8672q0530j512O1009M6327O966m0900o4475k549P0597M1543l1404m6062k0580
576d2898J7035N5538K6402n3928n7857J7349N2469L0304o441n0942m9386K8763
$$ y = [28561, -36790, -39229, -3844, 29647, 43226, 4364, -52251, -35899, 32643, 55787, 21993, -24039, -57535, -34493, 46023, 79217, 15009, -54546, -56631, -10860, 48769, 67459, 2693, -65458, -42284, 24523, 45620, 25372, -13522, -48299, -25379, 38993, 49328, -3337, -39942, -33990, 215, 46120, 45354, -23702, -65465, -19841, 38499, 46921, 15294, -37305, -63201, -9978, 60036, 48163, -16268, -49841, -39175, 4457, 52695, 38218, -30984, -54651, -10729, 28509, 33912, 8641, -40312, -50265, 13635, 62337, 24083, -38758, -56030, -26180, 34604, 70127, 18672, -61858, -63370, -2361, 43966, 50932, 10032, -54443, -56992, 13605, 55148, 23744, -22318, -42898, -25863, 29675, 56077, 2149, -55708, -38359, 14110, 44414, 37973, -12969, -62355, -33592]
588c3592P1930J5669m2678m1306j5983K7786O0804J2094o0348m3024J9225L9077
600I654K9113k392m9814l8937L6784N4661l789l8609k6873J117M1169M1028k7355
613B5757o4070r772M2743M1031J7712k8817o9785k3427O4619O3097o463m8019
625D606m7948q095N5303N4028k3733n7290j4453K4108L5386K3111l0984o0517
637d6478K664O1764L1077k0947l5864l5003J740N7288M1453l0471n1952j7208
649d1937J9747M5971K7272m1745n6302J4857N1038J2667j6749k3836k4355J1383
661b1989M5425J1577l5282k5207L071J9453L0860J360m9827k9227L9534M6646
673C6394J499l0816m5024k1279M9074O8918o155o4371l9393Q798M2283M5437p241
$$ y = [-33592, 38338, 54007, 11329, -29977, -45960, -18174, 42630, 54724, -5624, -48648, -29423, 9654, 38767, 36375, -13439, -52376, -15592, 39069, 35280, -3329, -30202, -29085, 12084, 53112, 25757, -38313, -48085, -5342, 35689, 53401, 24584, -45201, -68628, -4009, 59088, 52625, 4606, -43342, -51437, 3866, 57894, 34161, -23129, -37582, -13474, 21912, 45023, 14039, -46478, -43814, 17950, 49027, 28080, -7784, -42787, -41047, 16241, 57694, 27223, -24729, -41937, -22190, 23781, 51053, 9308, -46994, -32137, 18901, 31568, 14819, -9017, -33372, -21989, 23436, 35013, -269, -25476, -22405, -2952, 27908, 29268, -20559, -49786, -10252, 36394, 37893, 7077, -37947, -59226, -10152, 58766, 52611, -11760, -51153, -42355, -72, 45365, 38124]
686C8124n7380k5594L0143L2438J0416j4173m3811k0925N0696N6137j6854n8724
698a9507l5045J0184N6305N2958k4030p0810k3963L1756L5396K1090q913m2902
710a7481j8771L3031K7311j1616j8453j3024M20L3319K4721l2961m2805R469L4666
723G826J8792p71l0163l5171J9382N3418N698m1274l0500L1L1632M7385J610n8143
737a0248m0355J6560L9584L6629R035n0347n6989J8818O2312J9067k9555l4968
749b0457j3141L0709M5427r150n2636k2557J9778L4924L6157k057o2347m8960
761f4310K9797N8471K2295j3599l8341l4154J5117M2031O728k3084j0036K927
773f158J1917J6890j4891m1292K170M7154K1069j8890k4551k1611j469L7888K9073
$$ y = [38124, -19256, -44850, -14707, 17731, 28147, 13974, -29837, -50762, -66, 56071, 39217, -19507, -54552, -44368, 11937, 64895, 40865, -29945, -53908, -22152, 13244, 34334, 25421, -17481, -36252, -3221, 24090, 12474, -5979, -19003, -18583, 14736, 39457, 6496, -36309, -26840, 7826, 26618, 25847, -4316, -39487, -20105, 33313, 39011, -2263, -32763, -32732, -1100, 46285, 47895, -10248, -50603, -34043, 5541, 42170, 51205, 858, -56131, -37313, 24999, 44066, 14511, -20457, -33598, -2889, 42538, 33388, -19248, -41805, -22027, 12897, 49054, 46997, -15350, -64310, -34513, 23958, 46253, 32654, -5687, -39841, -24724, 17307, 24035, 951, -9085, -6158, 5759, 22649, 7758, -33534, -31364, 15790, 36859, 17969, -6582, -28193, -29662, 8226, 37299]
786C7299k3045l5831m278J9972L0797J0360m2095m6604K2403N8962K0161k3383
798B4718m2189l8291J4475O6929L3574l7632n0109j5421K2769M7337J8582m5506
810g64m6408J7412M5706K3136r014m4790m5964J8940O9385L1233l0562m6072l0257
823d8019Q621M9961L0724k5038k8139J853M992J708M055j0376p895K8500K6651
836C7598k2489l9058j2974J3139L6154L3674j8916n1529j2225K8501K3539O501
848B1915j3143l2645m119M4402K6736k9512m3110j4632K3845N4718K8285m4093
860A8647o2190m849L7323L7046J9162k3708n2359j0277M5809L2198j3740l2811
872i749k5920J0780N1194K7763l7197m9218r206K2595L8556K9338k1525m9332
$$ y = [37299, 14254, -21577, -25855, -5883, 24914, 35274, -6821, -53425, -31022, 27940, 48101, 24718, -17471, -55762, -41287, 25642, 59216, 21584, -28525, -43946, -21177, 26160, 44742, -764, -47172, -29760, 15946, 39082, 30068, -14722, -60686, -41746, 27639, 58872, 28310, -17762, -48019, -39398, 10563, 41287, 16249, -11890, -10037, -5045, -3337, 718, -9658, -17553, 10947, 37598, 15109, -23949, -36923, -23784, 12370, 46044, 27128, -24401, -36626, -8125, 15414, 21915, 8772, -23873, -27992, 16410, 43146, 13634, -29476, -44108, -20263, 34455, 62740, 18647, -43543, -48392, -11069, 25977, 45139, 21431, -30928, -41205, 4604, 36802, 23062, -9749, -35669, -24889, 26305, 54068, 16871, -32347, -41553, -18958, 19598, 48936, 27411, -21921]
884b1921r302K4783J1355K663K735p514j829J2681o085k8002o383K1065K4450
897A8696J9250r588n0939k9554L5672M5247J498k1004k1045r853J9328K5427j3863
910I272l1708j88K3060K4184J3925k5861n7332j3087N2987N1077M568l5561n4196
923c8860k1413M6809N6844n042m1529k4737K118K7315K9277j3352m1611p904K6669
936e416K2736J1299j0180m0377k2914L0581L8015J271j8044j6933p806J4871J4173
949A1276j8833j6361K4162K7425o138k2603k3040j3377K3618M3656P237k7690
961I332k6091j3776P650L5911J9139k9236k5954J4559K3378M095j6221l2033j0652
974c9899M4559M8355j3604n0391l2557R15L6412N0226M744m6013l5710P57K1517
$$ y = [-21921, -31223, -6440, 4915, 7578, 10313, 2799, 970, 13651, 7566, -20436, -26819, -5754, 18696, 37946, 28358, -22581, -52135, -16463, 28784, 30282, 9278, -11767, -21620, -2292, 23135, 9272, -22436, -22624, 436, 24620, 38545, 12684, -44648, -57735, -4748, 46329, 50897, 15336, -38860, -60273, -13464, 43380, 38338, -3191, -27928, -25810, 1505, 30782, 17430, -24181, -32085, -5416, 17320, 28619, 18439, -21938, -44852, -14271, 23744, 25015, 6971, -9962, -17768, -2897, 11276, -7557, -23918, 244, 27669, 21531, -1072, -24112, -37489, -13871, 29785, 37022, 9332, -16759, -30535, -22885, 13026, 32165, 2929, -23025, -8466, 14912, 19007, 2786, -29247, -39899, 4660, 53015, 39411, -10980, -43537, -42622, -6210, 44016, 48760, 2747, -32963, -32206, -10689]
987a0689L3175J3647l4136l4278J8707L5469J913k2363k3268n959L0228L4982
999C7428j2021l6247j0583R381R013J6900N070k0116j0213J4521O563q624o695
1012e623q372K382L1709J9440l1313l9922p33K6903K9727J1215k7119l5765P309
1025b0162L1272M364j4170r247n589J0271K9063K987l5912k9415N352L0362M1419
1038D0595J1764n0141n5837Q671M9177L1986k100k9887l4661M496L3905R538j6815
1051F91q173M26M200J6600M963k8390k0981J5870K5939J3329m489k9970k5475
1064c5460K0692L6460k410k5613r731O378J6129J5217j5797l2985J666L0150J6564
1077B1260k158j3560k8010j0285L0742K8792q827k3096j3969K149K5435K0187
$$ y = [-10689, 22486, 36133, 1997, -32281, -13574, 21895, 23808, 1445, -21823, -27782, 2446, 37428, 25407, -10840, -21423, -12042, -3029, 13871, 18941, -1175, -11388, 3133, 9696, 1072, -5623, -13995, -11613, 20096, 39536, 8223, -31699, -32432, -5529, 24198, 35413, 8294, -27471, -20162, 11110, 15474, 1304, -7943, -13532, -3261, 25802, 28789, -7123, -36538, -31186, -824, 40595, 52359, 2218, -53619, -44948, 4229, 36215, 34115, 4228, -30433, -25937, 7968, 17506, 691, -7482, -7056, -2856, 13744, 18707, -9683, -30664, -14794, 11145, 24474, 19985, -9985, -35460, -14768, 21692, 19282, -6331, -16062, -9684, 6445, 21662, 5865, -27120, -25454, 4696, 21260, 19102, 5542, -22468, -32753, -2011, 26781, 17954, -5142, -19111, -16962, 8473, 28660]
1089B8660k4937l7484Q768L6973J9777p102l1828l4978Q744M7360K4846j5305
1101B3494k7022k3387l927L0761L0185j2360k7263m566R894J2907O426j8089k3540
1114b6487J6284L5207K495k5335k0984o905J6118L3256O622k9400j9113N312J0280
1127b650J3899O979j9596j9005J5795K3614l237j6592j5464n111K3570L0801j0690
1140B2313l7469j0273J6868J9334J2798r487l1045p711K7407K0264o982j6066
1152d9j9719o098K9641L2093j2418l5071j5577P872K4283K5482r670l5726q136
1165b3093K1642J2123k520o460j3090k75K3645R362k1467j8969J323J2287K1931
1178A6439J3675k4237l4873K444K8210J7086R89j7221k4927L338K9181Q078j9244
$$ y = [28660, 3723, -33761, -24993, 11980, 31757, 24655, -7173, -42151, -33407, 13953, 38799, 23494, -3528, -26915, -30842, -81, 30104, 17744, -9519, -14085, -4191, 8716, 15142, -2947, -26487, -10203, 25004, 27499, 2164, -18820, -25725, -9607, 23649, 30271, 871, -18242, -12930, -2650, 11249, 18228, -1368, -20373, -4578, 19036, 15799, -793, -16257, -21368, 2202, 33003, 22313, -15156, -25429, -8561, 10773, 23571, 14084, -16961, -24672, 2735, 22999, 16017, -49, -19768, -25866, 3775, 35868, 23450, -11621, -27198, -19326, 4957, 30439, 20769, -14957, -23093, -1451, 10672, 8152, 1692, -11398, -11673, 11972, 21334, -133, -19102, -17779, -5492, 16439, 30114, 5877, -28996, -26552, 1658, 18744, 19733, 2512, -22415, -19077, 10104, 18182, -1062]
1191a062j1193J946P823J6612L081k6381j7816J6654K1937P007o461k2809j9451
1204c0113J7607L4474J086k4124j7021l000J6950K7545j736l3565j4558J7270
1216i185J7962Q020m185k3020j4483J9348K2934m486j4344j0446k984J6505K1573
1229B3209j1829l0313j718K0675J5445M730j3328k8888m456K9986K0933q480j6663
1242f97j5088l765K2366K0849j3237k1635N1R546R237P973j2374k3180O146K8548
1256A4740P525j5844j6681j0764R814L0249J0242k6048k2188J857J2607J8649
1268A4158J1041k0751k6964P095K4046O892n824j2497j3891Q337K5097R36k2336
1281d661j0478O849J1951J4601j315k8287j4750K0862K2755J036j1765j9909j1953
$$ y = [-1062, -12255, -10309, -2486, 14126, 17207, -9174, -26990, -10336, 11601, 18608, 12147, -10662, -30113, -12506, 21968, 23054, -1070, -18091, -21091, -4141, 23404, 21668, -11897, -26455, -9185, 8777, 16797, 12612, -10408, -24891, -5543, 17391, 12905, -1439, -11885, -14869, 1636, 23209, 11380, -18933, -20651, 24, 15469, 20199, 6871, -22017, -26473, 3513, 24446, 15966, -697, -15785, -19550, 2816, 23665, 10428, -11207, -11156, -1610, 7627, 15600, 3226, -19954, -13808, 14740, 22265, 6421, -10260, -21024, -11210, 19039, 29281, 3233, -18955, -17098, -4491, 14158, 25199, 4448, -22516, -15421, 8625, 15517, 9693, -2804, -16695, -8358, 16739, 17675, -4661, -15139, -8290, 3661, 18262, 16947, -11340, -26090, -5228, 17527, 18563, 6798, -13111, -25064]
1294b5064J9663K9236m150k4144j2354J508J4666K1254l527k9155r594J8772J4441
1307A1552O40p895j7897n423K2831J8135j3903j9840n302N952J9527J7275j6668
1320H984l1959r43K3219J6416K602j3839k4834k041K6552J4463j1417j2662p298
1333a2757J351J8308J1761j9522k0768J1415J8984O122m536j7731j8218J2880
1345a2711L0255N190j8263j7789q618J1432K8935N667k7560j7448J1098J3800
1357C988P739Pj7314j4692J4572K1839j637j5664j1801l803J7310K3510q220k8937
1371a3103p128J4694J4546J0146n884k6633j2079K2827K2450k142j4445j6643
1383a3394o375J9699K1585q105j9454m021M677P221J1504m241k1660j260K1939
$$ y = [-25064, -5401, 23835, 19685, -4459, -16813, -15305, -639, 20615, 17088, -12067, -21661, -2889, 11552, 12192, 4297, -13600, -19023, 3808, 21943, 8040, -11800, -17102, -11150, 8377, 25652, 8984, -22975, -23918, -699, 15717, 18319, 4480, -20354, -22395, 4157, 18620, 7203, -5459, -12757, -11406, 6902, 18663, -859, -21627, -10212, 8772, 14894, 10358, -7373, -25591, -12711, 17544, 22734, 4471, -13318, -21936, -10504, 18431, 24098, -3462, -20910, -9812, 3988, 11727, 11734, -5580, -20272, -5700, 16139, 14502, -1162, -12963, -16766, 544, 24054, 15834, -13103, -20231, -5537, 9009, 19155, 13271, -13362, -25441, -2614, 19836, 17694, 3249, -13394, -19769, -70, 21515, 13410, -6044, -10065, -5388, 1833, 13337, 9096, -12564, -13824, 8115]
1396H115Q807j0111j2661r851M181K5187J1605k0381k0429j15R609J5879J2430
1409B2265j5005k5137L109J9973O923m139r190j2598N347K2178K682j9810j1055
1422a4457M414J0891J5447K248k5511j8609J5762K3033M255r004j8246j3522J5735
1435g564K6494o14j9965j1746k531J0209K2214L627k5541j5866J2702J4892N344
1448A1655m141j6203r045J7037J6759q834j4259n416J060J4191J8257q695k8039
1461a5673n511J6547J3045N944n611j9423q018J7156J3046n446q381o462J38J5408
1475F759J0724j8872j9679J0593J9225N666l002j4931j8163O226K6019R898j1165
1488I298j6195j2395N646K6954J1616k2965j9881M899J2940J2798M966j6833k0929
$$ y = [8115, 16922, 6811, -5850, -15701, -11520, 13667, 25272, 4891, -15538, -15653, -6044, 9835, 22265, 7260, -17877, -14768, 5205, 12128, 7989, -1201, -13799, -8452, 13726, 16408, -3402, -14457, -10043, 848, 16295, 18543, -6968, -25577, -9815, 13218, 17473, 8469, -9777, -23299, -7564, 18930, 18316, -1649, -13395, -15926, -5717, 16497, 20124, -5417, -21283, -8581, 6311, 11655, 7514, -8689, -17734, -697, 16062, 7228, -7031, -12447, -11387, 2804, 21061, 12366, -15673, -21184, -4637, 8408, 14352, 8741, -10682, -18700, -1544, 11502, 6056, -2325, -8787, -8649, 6759, 17483, -1389, -21068, -10475, 8750, 14416, 11414, -3517, -21680, -15454, 10565, 20463, 9298, -6897, -19292, -13646, 13308, 24924, 1959, -17922, -13023, -83, 12715, 17681, 848, -20081]
1501b0081P197K1960N173p843j0185r172O659J9342M95j8190o872O395P493J0787
1515A3158K341k1411j6624J4900K1268L544r493j4745j0429J2310J9452m575j3337
1528c641j5L568J509N367k692j5540j83J9332R614p511j3458j4748K49K6539J9612
1543B8002j5513k4874n991Q760J8141J3187j3524k5268K72K0109J0293j675j1436
1556D83j7819J53K4478J3724j1982j6304q522K231J9717J6006j5937k3502L295
1569a3979J7152P966j704j2619j4442P862K1088K771j2418p909o401J700J7685
1582F752R361j4652j2788N632P562J618j050j0041m139J6462J4295j2550j9892
1595a3430n258P228J9473J8142j1862l0549q683J6550J6710Q670m310k1665j1547
$$ y = [-20081, -12884, 9076, 14249, 6406, -3779, -12951, -6292, 13050, 13545, -4645, -11517, -5122, 2371, 13158, 15499, -5912, -22536, -7636, 13632, 17176, 7683, -7062, -17491, -5181, 14271, 9696, -3641, -3656, -88, 1421, 6788, 4096, -11444, -11627, 7705, 17319, 9808, -3650, -18398, -18149, 8390, 28002, 12489, -12385, -18376, -9616, 8525, 21712, 8188, -17080, -16808, 3301, 13594, 11919, 483, -17336, -17183, 7295, 21019, 9037, -7267, -15789, -13558, 6159, 22165, 6228, -17274, -13979, 3173, 11139, 9435, -3184, -17626, -9764, 11324, 14095, 1677, -6232, -12633, -10933, 6752, 16113, 1461, -11327, -5695, 1867, 3485, 2435, -7606, -11745, 4717, 19012, 6462, -13430, -18688, -11460, 8013, 26155, 14293, -16256, -24939, -8389, 8321, 16991, 12681, -8984, -20531]
1608b0531J5825J7540k063j1586j1190j828J9107J7774j4555k5762j241J5351
1620c159J3714P754r458k2268m846J7570J2401k065o652j1393m372J5998J2894
1633A6118j1042j5037Q40O158R981Q095j0345j7921L213J5164K364m951l352l897
1647d612M099J1884m504j8150k623J4025J0877N893n881k2965j3420J7109K4564
1660A6296M671r976j8899j4838J2815K5730J129j8563q689L471R474J1107m647
1673I081k1297o712J8063J5649J273r062j8804j1924J5912K4325J598j3564j2776
1686h238p396Q462J8822O64j7908m633J0755N563j580n172r539J041J5392N206
1700A1439j0756o327P34l03P041P648r266j2533O426J3124L463n245j4306j3094
$$ y = [-20531, -4706, 12834, 10771, -815, -12005, -13833, 5274, 23048, 8493, -17269, -18510, -3159, 10555, 18309, 8851, -13417, -18263, -693, 11708, 9643, 2991, -8402, -12774, 3224, 16118, 5076, -9961, -9121, -2963, 7018, 15113, 4768, -13153, -9940, 5224, 7588, 2637, -715, -4612, -513, 11371, 6867, -11283, -13906, 119, 10996, 16889, 11008, -11957, -25377, -8268, 16296, 20967, 10991, -7908, -22746, -9931, 15799, 16928, -1635, -10324, -6853, 2621, 13728, 9081, -12216, -18928, -865, 14784, 16057, 6995, -11809, -23733, -7821, 16504, 18102, 4538, -8238, -15634, -7172, 11650, 12314, -5594, -10227, 528, 6091, 4511, -661, -10200, -9159, 6233, 11439, 683, -5644, -4910, -5213, 1828, 9476, 210, -12323, -5897, 7227, 10690, 5445, -8861, -21955]
1714b1955J2310K8287M624k1293j8018l830J0977K1597P133j8136j4868M178Q132
1727h62M838L598q925j2697Q442J8443J490j4316j4443o074J4913K7182K533k6278
1741b156j7372M542J1704J3138N449j2420j2325M146O250o16J384m42o081L900
1755h99J2172m454j4758l235P844R408P445o452j8469j387J7824P280r674p905
1769e260k707M701J4006N402j6187j4577K790J0077J2289R569j2159k4522k206
1782a8784J9422J3583j196j1659j4252K681K0128O020j7399j2252M736J0498J2236
1795A3762L926j7062j9603K972J6339J2658N152j0389k2184l661J8380J0407n528
1808E169n829j909J603P008j732j4253k534J5289R907m067p506j0383o343J2131
$$ y = [-21955, -9645, 18642, 23266, 1973, -16045, -19875, -8898, 12699, 19832, 1696, -13172, -8994, -862, 3976, 7574, -1351, -14048, -5606, 12837, 14327, 11, -14432, -20506, -5593, 21589, 24122, -2156, -19528, -14986, -3282, 9856, 15305, 2885, -9440, -5294, 956, 340, 1724, 1282, -4799, -899, 11273, 6819, -7939, -11174, -3330, 6078, 13523, 7071, -11398, -12785, 5039, 12319, 2645, -5260, -7967, -3266, 10740, 16142, -45, -14622, -11832, -1755, 10534, 20103, 7944, -16578, -18784, 638, 14221, 13025, 1366, -12886, -10205, 9923, 15943, -1456, -13708, -8972, 1526, 13762, 17688, 626, -18977, -16005, 334, 12992, 18144, 7755, -14429, -18090, 290, 10697, 5169, -660, -2569, -966, 6042, 4310, -9943, -12477, 2812, 12719, 8652, 1146, -9237, -15580, -3449]
1822c449J5985j347j1426o854k876P842J4269l439j9713l616J5680J1614j608
1835A1062j1330j6090n64K1013J4043r262j3953n837l37J1831J3506o623j7342
1848i883k204J0910R987L593j1171j9808N94K4003J3911r012j5876j0569O73J6837
1862A985J3135q073j1090m12O22J584N502j798q245M087J2196j035j0078q189
1876i809l811J0038J9573J742k0712j2827O672J0445Q214r7j1308q288R305R172
1890H309l881o149l737l011R340J4764l359j9378q362O808J3571J2580m575k2055
1904i135q639J5824J3460j650q119r361k962J2508J2641o653j2871m048J214Q565
1918G74J3516j480j8635p718R169R686K926m140j0279o98J3733M453j4040q964
$$ y = [-3449, 12536, 11189, -237, -7091, -9967, -2125, 12144, 8705, -11008, -14624, 1056, 12670, 11062, -268, -16358, -16922, 4091, 18134, 8872, -5081, -10918, -11255, 576, 14082, 7459, -9883, -12087, -1177, 8810, 12403, 1232, -18576, -17982, 6021, 19932, 10920, -4956, -15525, -14852, 1985, 15120, 7047, -4043, -4455, -3833, -2249, 3253, 1455, -6790, -2703, 9493, 8458, -1620, -9809, -13620, -3582, 15991, 17733, -2979, -15806, -9134, 1311, 9525, 9428, -1880, -10168, -863, 8309, 4428, -1721, -5458, -8469, 871, 15635, 12276, -7102, -15464, -8656, 4915, 17495, 12920, -9135, -17774, -1950, 11510, 9860, 1741, -7620, -10582, 1926, 14567, 7914, -4957, -9005, -7791, 774, 14290, 12810, -5825, -13543, -4374, 5312, 8238, 4098, -6181, -6879, 6854, 11307, -2733, -11697]
1932a1697N985Q510P396J899j2977j3973L769J2733P610K527p812j5659j655J6668
1946C324P493q524p546q62N385J0490q94j7227q258J3597J3915O07p123j1970
1960g593q495R552J6214J900q279q914o418M642J7130M323j7095j1107P613J1501
1974D974N365m358j4353o061J3178J1815m907p444l038k239N179R735k769j1487
1988f410j265O433N714M243m711j6080k759J7132J2688n826j2193q910J080J4436
2002C572R657r764j0669L033M965J279K235l857r095L574J1674M048o365r436
2016e149q771N019K0484Q029j6272j5892M58J0013J0828L383j0868j1510N130
2029e118R318P53j457l524p294K613J2921K192j1194p391J240O888J0545Q12j5924
$$ y = [-11697, -5712, 2798, 10194, 12093, -884, -14857, -11088, 1645, 9255, 11782, 3970, -11689, -13344, 3324, 10817, 2293, -5253, -6115, -730, 9760, 8866, -8361, -16619, -3022, 10893, 11500, 4377, -7593, -16088, -6536, 9678, 11578, 3299, -5615, -12033, -7391, 9739, 14062, -3033, -14140, -6527, 4974, 10339, 5981, -8372, -14433, -1255, 10560, 5653, -1791, -4829, -7068, -1889, 7846, 5077, -6410, -7675, -1242, 4472, 8715, 4004, -12076, -14835, 2297, 14985, 9159, -3034, -11944, -10864, 3572, 13229, 3465, -7204, -4171, 794, 2073, 4308, 451, -8644, -5070, 6604, 10652, 4287, -5149, -13920, -8901, 11583, 19612, 3340, -12552, -12094, -2081, 8747, 12130, 1262, -10248, -5118, 4200, 4953, 3496, -28, -7322, -4709, 8212, 10404, -790, -8181, -6941, -53, 10492, 11304, -4620]
2044d620r302J0770J2606K63o831r992m114J1666J2458m823j1852k901P79M684
2058a209J0361R15j2944p729O743Q453L251m097j2104k121J6015Q813j1970j2872
2072a0495R28P368R826N847j0052j5249m32J0821Q692L426n953j4377l573J4297
2086A074Q980n141p825m785J585J1609O347j3267j2443O954J2514L471l905r613
2100d445q318O878J3471J100p113n390n793K392J4403O044j3172j2069L697R832
2114A517P336j370j2752p563J0581J1765l861q141l288j60O426R163l382j2821
2128f550k887O292P135O107k303j5487p434J1599J3769R16q685j0744l546J2087
2142B69J2100o821j1921P31O378K673J746m141p834J642R245L098k642m375q527
$$ y = [-4620, -13922, -3152, 9454, 9717, 2886, -7106, -11220, 446, 12904, 8081, -3771, -6672, -5893, -1209, 9152, 10067, -2877, -10606, -3863, 4590, 7841, 3744, -8360, -10481, 5534, 14347, 2377, -10495, -9567, -2199, 7627, 13474, 3422, -11827, -12259, -1438, 7254, 10680, 4727, -9650, -13223, 1074, 10054, 4913, -2912, -7697, -6112, 5497, 11844, -1423, -13866, -6912, 5602, 9073, 5168, -4445, -12763, -5885, 7586, 8686, 1573, -3817, -9610, -7218, 7185, 13229, 57, -12012, -8315, 1517, 8853, 7483, -5269, -12832, -2251, 9514, 5653, -2488, -5776, -5936, 490, 9653, 6271, -6550, -9437, -3145, 3990, 10097, 7794, -7693, -15127, -3528, 10241, 11157, 2472, -8272, -11818, 269, 12369, 5548, -6373, -5642, 736, 3409, 5155, 1014, -6820, -5178, 4067, 7165, 4523, 148, -8379]
2157h379j179J4926J0429j0415j4194j808Q072J0821L901j0980j1834M631J0665
2170D656J696k610l722o333J698J0748K321q985m879J019L460Q503L153j3015
2184b290j1259P098J3708M755n626j3508p528J1316J5670k528j1654m041K7K777
2198c083Q141L834r327p381L288O397M141q84j0351o115J1480J1404o007j0943
2212e406l503K940R538Q015o742j3895r67R122N892J148l320r478k712J0030O548
2227G210l406n166m567j098J0031P991r666j2452K765J1341N572k163r889r495
2241a2992O209J4315K364p140o825n242J040J3233Q142r522j1453m78N480Q120
2255E251M010q503j0480M815J0469K79n053m018k804M079R880n20j0816m657M607
$$ y = [-8379, -9558, 5368, 15797, 5382, -8812, -10620, -2548, 8273, 12174, 1194, -10640, -6009, 4656, 6352, 3742, 20, -6313, -4615, 6133, 8454, -531, -5410, -4391, -931, 7572, 10725, -2290, -13549, -6451, 7257, 12012, 6386, -7122, -14650, -3334, 12336, 9808, -1846, -5887, -5860, -3083, 5058, 8892, -435, -7816, -4528, 1869, 6010, 5126, -5225, -11340, 140, 11544, 5537, -5406, -8909, -5969, 3569, 11584, 4842, -9053, -10020, -898, 4994, 6142, 2822, -6656, -9368, 662, 7210, 3804, -1362, -5929, -7027, 3004, 10995, 1329, -11123, -8358, 2983, 8555, 6392, -3497, -12992, -6783, 7532, 9896, 2756, -4069, -9311, -8271, 4962, 13104, 3582, -7871, -8349, -2869, 5251, 9261, 758, -9722, -4907, 5562, 5841, 788, -3230, -6034, -1955, 7925, 7405, -3411, -8068, -3461]
2270c461N434N925o03j1346o657Q101R251Q45m205p456m975P264J1716l223j0464
2285c854j525M069M346L262l186r937k37J0524N306k880o823q459l78J4737J0419
2300A5384q705j3807l487N012J0409Q510o619j4146k548Q710O549K549l981j0674
2314f844j569J1353O389o802o255j744J954Q260M972q990r686K969Q271L560j56
2329E682o657q186L715J1487J489p594m188j273K554Q689K163j0200o812O275
2343b856O662K126l264q710l928J0748R589n069j0490l573K209Q483J0582m190
2357H319j5604o020P473R830P343l346j4528p036R867J0653k06o027n670k106
2371g058P393Q036n532r710J53O333M416L175m758j1163p50J0754O240k092m916
$$ y = [-3461, 1973, 7898, 7295, -4051, -10708, -2607, 6644, 7489, 3284, -4172, -9147, -1883, 9833, 6610, -3854, -5379, -1310, 3036, 6298, 3112, -6825, -7062, 3462, 8768, 5888, -935, -9394, -9772, 4965, 15384, 6679, -7128, -10615, -5603, 4806, 13316, 6697, -7449, -9997, -1287, 5262, 7811, 3830, -6844, -8413, 2940, 9329, 2527, -3728, -5472, -3518, 4742, 9714, 724, -8962, -5993, 2278, 5838, 5682, -975, -9161, -5446, 6041, 7530, -64, -4252, -5525, -2971, 5718, 7881, -2319, -9131, -2856, 3806, 5932, 2668, -6042, -9970, 778, 10367, 5298, -5192, -8765, -6556, 1927, 12509, 8319, -7285, -13305, -5832, 3998, 11341, 7995, -6533, -13569, -3702, 6951, 6745, 718, -4952, -7058, 335, 8371, 2839, -6871, -6718, -385, 4031, 7206, 2448, -8715, -9465, 1289, 7529, 5437, 521]
2386E21o920j536R928P253o902p806J102M477L640J465o338p061N238Q648m70
2401E239m617l416l359L893J0248J86j0993n858M538P176P392k005j3842r004
2415a4422R863J3365K382n600j0786p258O707J4326J900q562o294j085L090Q239
2429E865J216r388m882O515O132N95l580q283l993R638J0741l185q833m597m37
2444f476N540Q311j409q843j923N188J859j06j894m713K30R080L464q022o622
2459f336J85M001Q006M378r814j0543L216R518M516j131q074r165M527J3868L861
2474A1013q820q437l588M175J2203N264r670j0747J068N291O109L491o744q945
2488h337L739R498M22n865n211k080O388J0655m90j2103o209L480N788O552J516
$$ y = [521, -6399, -7935, 1993, 9246, 2344, -5462, -4360, 117, 3757, 5222, -1116, -8177, -2939, 5709, 5239, 622, -2794, -6153, -2260, 7988, 8174, -2819, -8677, -4139, 3037, 10429, 8424, -5418, -14422, -4559, 8806, 11188, 5588, -5198, -12456, -5749, 8577, 10477, 1915, -4379, -5464, -2374, 5865, 7081, -2307, -7189, -674, 5458, 6053, 2473, -5810, -9803, -165, 10576, 7391, -1442, -6039, -6476, -936, 7375, 5966, -2877, -4800, 388, 2247, 2141, 247, -4466, -4236, 4844, 8308, 286, -6336, -6151, -2150, 5856, 10234, 420, -10123, -6907, 2611, 7127, 5996, -2078, -11243, -6716, 7152, 11013, 2193, -6244, -9832, -5657, 6546, 11810, 2140, -8607, -7539, -2248, 3861, 7352, 608, -8337, -4598, 4900, 5322, -543, -5754, -7834, -1446, 9209, 8719, -3384, -9593, -6113, -325, 6227, 7743]
2503G743p774p251L406N214J74l64j449k290L014N105m585q804J528P334N756
2518F757J574p147j1602L21J3104O630m440o205n414k91R351O961n974q992j527
2533f894M102P669O214o918j3653r49J1165Q301j082o842q831L68J0508N256o779
2548A635n076J62K481M828L253o828q661K415P777M868P13o259j0660J294J2024
2563C966L531n294l894m22J759L835j367p690N5R251M446l859n081o279k633R560
2579a16J1099j810r464p540j726P966J1277q61j3173m657P613O462O64m775q424
2594g465p17J1350O476n309p157l781o24P567R506l125j0899m262M572O698M660
2609G490m451j1055m64J1865N350n931o389l368J546Q151N011n390o275K48J103
$$ y = [7743, -31, -7282, -3876, 1338, 1512, 1148, -301, -2591, 423, 5528, 943, -7861, -6333, 1001, 6757, 8331, 1184, -10418, -10097, 3007, 9637, 5197, -1008, -6422, -6713, 2638, 9599, 3625, -5367, -6894, -2792, 4877, 11091, 4173, -9480, -10429, 736, 9037, 7955, 1113, -7718, -7350, 3158, 8414, 1635, -3441, -3279, -798, 4030, 7283, 455, -8206, -5791, 1986, 6854, 7567, 1308, -9352, -8058, 3966, 7497, 2203, -1691, -2113, -354, 3481, 2114, -5576, -5521, 3730, 8176, 4317, -764, -7043, -9676, -116, 10983, 9173, -291, -7831, -9557, -1591, 9686, 8825, -4348, -9005, -1392, 5070, 5734, 959, -7465, -8182, 3168, 9644, 4335, -2822, -6603, -7227, 340, 9846, 6721, -4178, -8440, -3868, 2830, 7490, 3039, -8016, -8480, 3385, 8735, 2804, -3585, -6953, -5407, 2744, 7755, 2365, -3910, -3662, -2559]
2624b559K332L723k151n746K039P456p85o160m905q89P953J1206j581j4361p666
2639a2094N591Q423O264l51r352p490N180P371N23k155l497m426M577R507j659
2654F412j0527m873M578Q018P452m048j3544m495R076Q216J18l259n808m568N749
2669a503P601j704o003j901O58M164O389k845j0377j615P340M792j47l280o114
2684d545n79Q806L302p395m746K221L582M829K107q243q595K720R210N106L32
2699H112p607j0027J277J2089N019o417n581j051K715N727O67p921m484O333O085
2714D936J258k462q104o617O507J2671J209p311p298l634M210J1461J648r269
2728g95n748L678M258K236q49o504l304P372N986l253m748k445j176M858P309
$$ y = [-2559, -227, 3496, 1345, -4401, -2362, 5094, 4309, -1851, -6756, -7645, 308, 11514, 9933, -4428, -12094, -6503, 1920, 8184, 7833, -1519, -9009, -3829, 3542, 4065, 1910, -1587, -6013, -1436, 8071, 6412, -4115, -8988, -4410, 3608, 11060, 7012, -6532, -11027, -1951, 6265, 6383, 3124, -2684, -7252, -1503, 6098, 4394, -1609, -3510, -2852, 1312, 7701, 4856, -5521, -7136, 204, 4996, 4849, 1569, -4545, -5124, 3682, 6984, -411, -5157, -2936, 646, 5475, 7582, -661, -9256, -6536, 2674, 7780, 8112, 505, -9522, -8245, 3844, 8863, 2446, -3135, -4186, -1471, 4256, 4923, -2998, -7482, -1149, 4936, 6194, 3732, -4372, -10989, -4482, 8189, 9398, 2087, -5211, -8845, -4635, 6826, 8474, -795, -6543, -2865, 1393, 3629, 2780, -3724, -7028, 344, 6330, 3077, -1671, -4116, -5292, -434, 6875]
2743F875k225r233k135M675N207K973m161j0095l57J1521N494n100o306l934O89
2758f112Q210O736n085q279p97K701M639M006m113q612J785R018K347m601n484
2773c641m111L282J1412L749r846q875N94N941P138L022p426q012K511N703J560
2788C001k6k104n398J230Q550Q88q058m132K474N636N654j725j0550m388P597
2803a351O751M33k618o115m586N975Q858j780p057l100J125M242O380j768r357
2818c968l190O463N468Q98l366p732j942R917O269n944p524r66L372O449M592
2833H796o344r973K72O799N792K229m710j0494j553J0393O476l812n603k927P08
2848c951O646L361o684n754L407N679K230j011o491o923M915J0657J580o453n544
$$ y = [6875, 4650, -4583, -6718, -2043, 3164, 6137, 1976, -8119, -8476, 3045, 8539, 3439, -2867, -6801, -6112, 2098, 8834, 3749, -4530, -5327, -2626, 2013, 6019, 1906, -6706, -4921, 4097, 6444, 1843, -3641, -7752, -4470, 6942, 10691, 845, -8030, -7436, -1495, 5643, 8665, 1239, -6773, -4262, 1441, 3001, 2975, 871, -4527, -3297, 5253, 6141, -1917, -6049, -3575, 2061, 7715, 5990, -4560, -8948, -1351, 5400, 5833, 3215, -2900, -7486, -1511, 7347, 5567, -1490, -4590, -3465, 777, 7157, 5389, -3968, -7158, -695, 4773, 5671, 2305, -5427, -7369, 2548, 8817, 2873, -4651, -5617, -2245, 4204, 8796, 2452, -7521, -7249, -450, 5342, 7571, 2861, -7633, -9186, 1207, 7683, 3871, -1732, -4659, -3951, 2695, 6056, -628, -6382, -2975, 2704, 4934, 3923, -2568, -9491, -4576, 6081, 7661, 1208, -4336]
2863d336l164L084R939K558q499o254K277N047L858J91p766n313P198P795k563
2878D052n622l315m88N104P695k428q784l311L454N600M994k096j0498l785R165
2893b63P401k113m915n187j606O820P457l354p551j607K696M106L681l629q003
2908f067J214P688L073l459m328m151J189R204N563p538q422q10M404P607L654
2923H821p364q625K163O844K280o83l214n185J573Q165J287p078m170J587M340
2938G41O101j81r831n653N907P351K040k077o777o495N292J0743j88o905m458
2953d390o53M260O578K9q320l916M976M495J046j379o182l344O918P373l917o377
2969b803k604J770O177N900n022r533j000N929N276K205l519q941j886R268N349
$$ y = [-4336, -7500, -4416, 5523, 8081, -418, -6672, -4395, 652, 4510, 4701, -3065, -8378, -1180, 6615, 4052, -1570, -4885, -5373, -269, 7426, 4998, -3786, -7097, -3643, 1957, 6951, 4855, -5643, -9428, -263, 7138, 5025, 110, -5077, -6683, 137, 7594, 4240, -3311, -4918, -2222, 1884, 5565, 1936, -6067, -4853, 2835, 5908, 2449, -1879, -6030, -4841, 4363, 9926, 2388, -6034, -6844, -2440, 5167, 8821, 1457, -7168, -5005, 1839, 4119, 3436, 222, -4963, -3390, 4775, 6062, -1016, -5186, -3599, 741, 6842, 6661, -3170, -8823, -2916, 4435, 6475, 4398, -2379, -8874, -3582, 7161, 6973, 68, -4390, -5043, -783, 5795, 5824, -2496, -6412, -1436, 3059, 4105, 2726, -3456, -6800, 118, 7491, 3574, -2803, -5407, -3637, 2540, 8440, 3418, -6115, -7115, -1186, 4090, 6295, 2776, -6165, -8051, 1217, 6566]
2984F566l777m509k773Q21O009L958n944o616J767N415L680K82n932q182L062
2999f173J1065K762n133o306l684K619Q939L482o409o846J082L746M440J597n833
3014f52o216L794P533l24m063l369j806L905P383o36q377l877L183N527M484j589
3030D900r272m401P226P363q75l695m998k859N633P718k102o809k414J950M022
3045A387M584k771q550p91Q025M247k001m779n832L42R368O476n711q407k623
3060g036L265P087N588n259r192j93N767L756O43k762o257k3P611L402n427n202
3076d232J75L298N866J738p697o756M384O589K170j539n643n569L623R222Q83
3091F512o323m008q72L332O880P50q596m747N070N456J575k073o992l466P072
$$ y = [6566, 2789, -1720, -4493, -3672, 2337, 6295, 351, -6265, -4498, 917, 4597, 4879, -1053, -9235, -6173, 4892, 7654, 2521, -3785, -7469, -4850, 4089, 7571, 1162, -5684, -4602, -856, 3584, 5181, -652, -6868, -3074, 4459, 4135, 72, -3297, -5103, -1198, 6185, 5549, -2828, -6705, -3522, 2005, 6489, 4900, -4372, -8773, -1547, 5816, 4941, 1246, -3752, -6611, -978, 6740, 4638, -2171, -4585, -2635, 1387, 5971, 3200, -5350, -6141, 1884, 6131, 4130, -649, -6481, -6139, 3229, 9705, 3994, -4413, -7036, -3771, 3316, 8904, 3645, -5547, -5740, 27, 3783, 4426, 1664, -4593, -4616, 2995, 6397, 970, -4232, -4057, -759, 5107, 6845, -852, -7608, -3224, 3365, 5535, 3996, -1647, -7216, -3593, 5629, 6512, 189, -3819, -4691, -1359, 5521, 6271, -2325, -7072, -2002, 3454, 5029, 2956, -4036, -7502, -430]
3106d30P610j995p544l480O71O154P273k678j0244l539M896O226M007k412r179
3121d664m001P057O883j018m421l531j393N931M857m401o611J024M653L318R66
3136D649m578o947J038R021L259l713m886m255J777P707M047n795o550Q73M193
3151a60L934Q07o012n986M673P571J70m626l917k591M415Q274L02q786n043K369
3167d606N311N945j00r605o047N834Q210J829l636o391m379M926Q741L1o239l338
3183c514J5L146M800l11o812k363N529L846j047l037m832q46P453O214m611o740
3199c110k330K308N382M848l505q189l47N484L119m98k907m981Q87P922K684o144
3215F23n519p9L959O743K230p987q192K764P657L777q74n831o718K246R108K914
$$ y = [-430, 7180, 5185, -2359, -5839, -5168, 986, 8259, 5581, -4663, -8202, -3306, 2920, 6927, 4515, -4664, -8665, -1608, 5275, 4257, -164, -3695, -5088, 843, 5700, 1299, -5312, -4288, 365, 3683, 4649, 71, -6876, -5838, 3183, 6442, 2729, -2157, -6412, -4635, 3072, 7119, 1324, -5226, -4353, -160, 3774, 4581, -1431, -7417, -2744, 4827, 4997, 371, -3546, -6137, -1722, 6552, 6854, -1932, -6975, -4606, 705, 6650, 6550, -3055, -9102, -3268, 4942, 6771, 3135, -3256, -7635, -2709, 6032, 6063, -176, -3514, -3499, -353, 4447, 4136, -2676, -5039, 490, 4336, 3289, 252, -4580, -5426, 2027, 8241, 3630, -3110, -5440, -3132, 2250, 7098, 3593, -4596, -4943, 541, 3660, 3162, 255, -4726, -3839, 4083, 6767, 623, -4896, -4975, -1016, 5727, 7957, -30, -8222, -5458, 2199, 5976, 5102, -729, -7447, -5201, 3907, 6821]
3231F821n064n314k189K589P907K408p531o064K530N116K807k19n663m428M359
3246a935O381j066m620k293n92M111O048j528q367k846L929M712L857j798p453
3261c460l665N838O127j626m375k269M42M621L986n067o947J986N503L625P90
3276E509n190q111K20R374N955k546o248n986O4R043O179n215p434m42L398M619
3292C189K218m848o310J858O282K056j682l228m297O94P155L115n328m881N88
3307c419K837N116O14o987n231N154O886L84l594m588k821L875O929m19n211k415
3323b890O40K232L884r6o813k886O134N124l47m854o370q78Q934P963m052q655
3339b930l850J736O357N843j898q088k202L707L085J857j206n926j849O950M823
$$ y = [6821, 1757, -3557, -5746, -3157, 4750, 7158, -373, -6437, -3907, 1209, 4016, 3797, -1866, -6294, -1935, 4446, 3380, -1240, -3533, -4125, -14, 6034, 4506, -3861, -6707, -2778, 1934, 5791, 3993, -3460, -7125, -1287, 4840, 3214, -1161, -3430, -2988, 1633, 5619, 552, -6395, -4409, 1094, 4719, 5509, 319, -7792, -7572, 1802, 7757, 5211, -1037, -7023, -6959, 2084, 8263, 3048, -4386, -4828, -1430, 3189, 5407, 559, -5751, -3893, 2389, 4445, 2763, -465, -4762, -4068, 3087, 6202, 874, -4007, -3419, -582, 4534, 5148, -1839, -7070, -1916, 4970, 5354, 1760, -2828, -5649, -1774, 5155, 4736, -475, -2890, -2250, -18, 3866, 3770, -3043, -5929, 205, 5329, 4982, 128, -6242, -7120, 1814, 9777, 5725, -2930, -6780, -5044, 1313, 7156, 5258, -2830, -5032, -1325, 1760, 3617, 2411, -3515, -5364, 1586, 6409]
3354F409l449o413k224K289P351M006o579p633R77N760K608P67l574n084R17O161
3370B289K146l432l683j450J848N979K161o594n683K920M831K852p81n569m215
3385f381M911P049j403o495k952R01N081O164j329q948m549L500O016N352q89
3400F028q619n948M559P950O71l398l968j625M278M967k356o417p98L935L822
3415C081K449l062q303r21O901N489j205l499m404j829N546N056l101n052l38
3430c192K717L280J433l951o434K720P030J745l113m049l308J912P171K069n296
3445G34n071N31L817M442J301p095o183M055P265K331k607n644m864L288Q087
3460D387K162n100m246o19K398M672N51o316k870M376M830k86k734n304k337N728
$$ y = [6409, 2960, -3453, -5677, -3388, 3963, 7969, 1390, -6243, -5266, 494, 3102, 3869, 295, -4789, -3872, 2289, 4435, 1003, -2680, -4130, -2282, 3697, 5858, -736, -6419, -3499, 1332, 4184, 3403, -2166, -6381, -1470, 5579, 4176, -2319, -5271, -4370, 711, 6875, 5546, -3402, -7951, -4451, 1565, 6917, 6028, -2591, -8539, -3980, 3970, 4641, 1243, -2725, -4350, -72, 4895, 2539, -3878, -4676, -741, 3081, 5530, 2468, -5835, -6756, 145, 5634, 4429, 930, -3474, -5303, 243, 5299, 2198, -2854, -3192, -475, 2805, 4238, 287, -6147, -3427, 3603, 5348, 2235, -1814, -5122, -3210, 3961, 6030, 734, -4337, -3806, 11, 4453, 5754, -1341, -7524, -3469, 3796, 6127, 3520, -2124, -6988, -3700, 4387, 6549, 1449, -2797, -3416, -1018, 3654, 4205, -2111, -4981, -605, 4225, 3939, 1205, -4099, -6436, -708]
3476g08P423l85o660m651m65M563O673q44o918k481L597K426N77j396l671r12
3492c832N792L594l886n339j481K223O129L433n083p276M42N237L560R54l751
3507G16o158J28Q256K968m200m901k125K434O443K628n626n220Q21L295L312J129
3523C900l612n527K266O619N90m278l632j294M051O358qp036m828K473M412M373
3539D827J13o418m586L574N482m35j830k208j160K775M294k126n671j437L696
3554a110L780L022k869p830j910O901N401j184l835m068q08M843N126k661m670
3569a872j510J549L777K828k658o786k0O162L405j740l634m328J101O674L109
3584F057m747n040j6L253M336J759n538n659J670O099K353o91l987n152J273O534
$$ y = [-708, 6715, 6330, -330, -4981, -5446, -883, 5790, 4946, -1972, -4453, -856, 1570, 2147, 751, -2920, -3832, 1960, 5554, 1668, -3671, -5152, -2929, 3200, 6633, 1550, -5726, -5284, -47, 3513, 4467, 716, -5442, -5314, 2942, 5910, 1710, -3191, -5316, -2882, 3561, 6189, 563, -4657, -3836, -541, 2771, 3900, 288, -5239, -2973, 3646, 4236, -42, -3674, -4968, -917, 5441, 5433, -1603, -6431, -3958, 454, 4827, 4940, -1478, -6064, -2490, 2992, 2557, 727, -1481, -2641, 134, 4428, 2302, -3369, -4806, -1110, 2670, 5692, 2823, -5007, -6917, -16, 5385, 4201, 366, -3702, -4510, 333, 5459, 2798, -1872, -3382, -1833, 1944, 4772, 2114, -4672, -4692, 1470, 4875, 3135, -499, -4827, -3726, 2948, 6057, 1310, -3730, -3746, -493, 3843, 5602, 64, -5595, -3925, 2174, 4527, 3836, -151, -5303, -4030, 2504]
3600B504K693l842l593o19K138M226J0n827k695M264M536K5k826m411k343M347
3616a413P060l51n277m308n39L937N986n22o561k729L468L368R72j773m592j698
3632d972O019M440l140m671k065J608M852L181l138o121o10L764L415J748k734
3647A576o471r10O953M044k645m633k253J335N282K590m183m358R25K689J985
3662A926J094l297m339J818N918J060l505l750j364K822O418R66o223m838J353
3677c941M234L728O22n445m424L033M979N7k217k358j383K550M805j023n275k309
3693d367K387L729L307j618o927k960O018N285k13l712m307j082M488M887j698
3708C217m813j211Q74K939L080j776n463q49M552K719n92k728l458N55N398L083
$$ y = [2504, 5197, 1355, -2238, -2857, -719, 3507, 3517, -2310, -5005, -741, 3795, 3820, 994, -3417, -5760, -1413, 5647, 5296, 19, -4289, -4828, -891, 5095, 4573, -1988, -4717, -1249, 2119, 3091, 1318, -3274, -4972, 1047, 5487, 2347, -2324, -4389, -2781, 2071, 5252, 2114, -4007, -4617, -853, 2562, 4310, 1576, -4895, -5805, 1148, 5192, 2547, -2086, -4339, -3004, 2278, 4868, 685, -3673, -2748, -59, 1926, 3020, -277, -4616, -2798, 3120, 4180, 675, -3075, -4439, -1617, 4801, 5767, -456, -5294, -3941, 293, 4021, 4643, -802, -5226, -2193, 2786, 2843, 626, -1732, -3115, -565, 4240, 3217, -2058, -4367, -1980, 1749, 5056, 3438, -3489, -6449, -431, 4854, 4641, 929, -3378, -4460, 28, 4915, 3217, -1596, -2807, -1933, 1006, 4086, 2310, -3153, -4002, 550, 3269, 2677, -51, -3509, -2954, 2444, 5527]
3724E527m345m657k28K890M221J956m886n660J371N039K435n37l319m273J053
3739c413N611K100l248l536p21K469L933Q15n336m002L529M573Q63j600m485k986
3755e434L419O244J40m068l245j112K854N261K05n727k944K473K999J323n56m175
3771b343k025M328M283k197m009j309R00L782K996k714n352n30L594K867J515
3786C786k247n529j201N693M087j952l856k432L58M968K970l600m305N26K798
3801F4K606M85l095m331J500N170J931k847l323k373J624N592K628m642m867M99
3817c379L004L130J581m380m008J797L979Q59j587j945j728K167L612n24l985
3832a407j623J555K700K948j244n454l016M886M508r0l065l435j563M138M827
$$ y = [5527, 1182, -3475, -3703, -813, 3408, 5364, 478, -5182, -3811, 1228, 3663, 3126, -193, -4466, -3413, 2198, 4298, 1050, -2486, -3207, -738, 3195, 4010, -1326, -5328, -1799, 2774, 3637, 2037, -2448, -5434, -2015, 4229, 4369, 301, -2944, -4056, -1202, 4059, 4264, -1463, -4407, -1934, 1065, 2388, 1832, -2343, -4368, -40, 4243, 2046, -1963, -3272, -2372, 1410, 4406, 1692, -3660, -4190, -596, 2271, 3786, 1539, -3990, -5191, 502, 4589, 2637, -1219, -3651, -3293, 1675, 4645, 1045, -3260, -2734, 64, 2670, 3155, 60, -4271, -2771, 2399, 4330, 1483, -1840, -4213, -2589, 3003, 5631, 989, -3878, -3379, -375, 2755, 4336, -44, -4052, -2255, 1724, 2583, 996, -949, -2677, -510, 3102, 2578, -1407, -3030, -1475, 1225, 4173, 2929, -2525, -5541, -655, 3853, 3763, 698, -2737, -4300, -162, 4665]
3847D665j397m972j432J323K515L197j184n442j089M261K438k16k268l709m85
3862c795N278L762l154m940j087J988M216K339l109n067jL568K366L37j969l758
3878c026l05M498K020k307k312q50J113L316J285m466l462K889L999Q20j790l494
3894b072k510L050N239pm030k714p42K507M534Q30n107l300K207L420J583r17
3910A971m167k324L952M541j246m018j794Q6L612L927j908m761k134K509L144
3925A390K101j014m762k404L851M058r21k038k720m54L220L229j971l958Q52J669
3941A28J435M74j966l061J262M162Q19k421k409j719J670M561J894m368m184M87
3957c236K997L214P28l672m291K097M212J069j894k178j730J516M470M2m071k589
$$ y = [4665, 3268, -1704, -3136, -1813, 702, 3899, 2715, -2727, -3816, 445, 2883, 2667, 399, -3310, -3795, 1483, 5245, 2091, -2849, -3936, -1948, 2268, 4607, 1498, -3569, -3570, -2, 2364, 2701, 732, -3026, -3331, 1167, 3187, 880, -1432, -2282, -1169, 2147, 3432, -1034, -4496, -1607, 2392, 3212, 1422, -2072, -4582, -1532, 3707, 3700, -330, -3044, -3786, -1279, 3255, 4085, -1022, -4322, -2115, 1305, 2888, 1971, -2196, -4520, -568, 3973, 2727, -1291, -3085, -2999, 613, 4540, 2632, -2129, -4263, -1754, 1390, 3491, 2477, -2285, -4689, -838, 3220, 2299, 261, -2459, -2913, 307, 3536, 1565, -2393, -1541, 128, 1563, 2037, 71, -2990, -1728, 2434, 3253, 832, -1577, -3296, -1626, 2935, 4829, 461, -3723, -3236, -239, 2975, 3703, 31, -4260, -2163, 2049, 3118, 1224, -954, -2684, -1168, 3302, 3344, -727, -3316]
3973c316Q42K949L345M07n214m124K681M752J268j507l296k985K504M756P9l307
3989a66j547K04Q29L301k23l753j862L154J943k92j129k468m80L020L284k673
4005A142l666j93J525L295J644l158m524L66M364J836m26k173l324q4M265K791
4021C680k675k954n87R99L815J241l882l950J578M331J701n79l566m161K064N204
4037B259J758k333k960k129O08M279K086k772k955M33J155J603R33k642k172K174
4053f75L335n85k567j642k06K532K860p82l987j041K284J862Q09r44l372j296
4069c415L485L539j410k641j964j44L250L142j900m109o24K015K398J272j766
4084A128m114Q1L947K518j739k647k612N25N029L056k872m498j064J116L261K953
$$ y = [-3316, -2474, 475, 3820, 4227, -987, -5111, -2430, 2322, 3590, 2083, -1213, -4198, -1694, 3062, 3141, -166, -1713, -1509, -680, 2621, 2398, -1355, -3217, -63, 1880, 1588, 459, -2009, -2489, 531, 3815, 1142, -2524, -2717, -1192, 2103, 3747, 589, -3935, -3569, 795, 2631, 2205, 32, -3292, -3376, 889, 3680, 1005, -1949, -2536, -1537, 2278, 3519, -363, -4313, -2735, 1596, 3297, 2718, -848, -5009, -2945, 2259, 4017, 1684, -1276, -3405, -2797, 1482, 3568, 796, -2159, -1726, -571, 1032, 1965, -677, -2849, -675, 2660, 2075, -492, -2134, -2340, 192, 3052, 2270, -1717, -2758, -474, 1388, 2197, 1253, -2119, -3415, 70, 3609, 2199, -442, -2406, -2550, 700, 3842, 1942, -2167, -2791, -776, 1622, 2894, 1128, -2986, -2905, 1042, 3560, 1821, -826, -3438, -2913, 2116, 5172, 2300, -2198, -3262, -2146, 1115, 4068]
4100D068j688m608m62L015J033k85p34j899N48K992L83k999j620Q45J900K025
4116B514N68l764k996K089L388M97r07k253k066K340L218m89l146j340R64J643
4132B60K985j072m648j040K787L169J2j617k767j567L291L869j596l353j786Q92
4148b181K941L430j703n454p84K657K644J219r86l638j752K939K389n19j257p91
4164h46n07J786J839k384k357J279K816M23o78k159k690J156M336Q94k015j756
4180h63j590R40L006J326k899k130J401J662M98k92j896k635K608L875j02k905
4196Dk583o83K858L808m55m059j952J624K144J778j9l288k825K559L499n7j334
4213A019k785j351K548L695n97l186q02O09R84J631m37k869n85L245J444j546
$$ y = [4068, 2380, -2228, -2690, 325, 1358, 1073, 339, -1560, -1012, 1980, 2363, -636, -2256, -1411, 489, 2514, 3082, -682, -3678, -1589, 1799, 2296, 1389, -864, -2930, -590, 2628, 2139, -1007, -2347, -1383, 260, 3245, 2173, -2475, -3515, -728, 2441, 2453, 836, -1931, -3498, -207, 3662, 2066, -1287, -3073, -2181, 760, 4190, 2487, -2967, -3751, -1094, 1550, 2769, 1783, -1855, -3607, -668, 1721, 1202, -55, -846, -1353, 433, 2272, -112, -2469, -1190, 1626, 2049, 1371, -788, -3478, -2322, 2014, 2908, 893, -863, -2453, -1513, 1493, 2819, -80, -2210, -809, 853, 1351, 1059, -837, -3472, -864, 3011, 2909, 4, -2579, -3262, -404, 3404, 2949, -1110, -3062, -1438, 706, 2484, 2465, -823, -3648, -1089, 2410, 2353, 1019, -1766, -3117, -569, 3126, 2529, -657, -1459, -850, 134, 1765, 1328, -1541, -2126, 1119, 2563, 1017]
4229A017j475j340l58L878J755j929l080n97O32K524K175j824l468M1L114O26
4245A691j036j471q85J137K812N46l328k072N51J940K839R32m129l998K022L471
4261A022J831q79k165k929Q58L990Q99k473j523l93R38K783Q38l543k197K285
4277f58J610K12j78j514j847J722K918p50k412r35M90J782K368j206l991n94K619
4294c64K121m9k98k620j541K555J678m99j327p24r4J576J880k171l271J621K274
4311G47J750l73k201l311L74M152K159j662j802k509O14K505K426k081k320L94
4327a138Q38J073J011j090l250J172L039P55j796k086o51J073L337N50l165j602
4343a930R55J034J341P18k466k231J780K423L0r77j519j397J421L074k51k790
$$ y = [1017, -458, -1798, -2156, 1722, 3477, 1548, -1532, -2129, -1497, 1027, 3202, 1378, -2090, -2049, 1065, 1691, 655, -816, -1701, -564, 2248, 2794, -534, -2606, -2055, -115, 2724, 3656, -473, -4471, -2449, 1022, 2853, 1974, -191, -3120, -2262, 1728, 2627, 154, -1369, -1762, -824, 1959, 2797, -746, -2943, -658, 952, 1164, 986, -528, -2375, -653, 2265, 1515, -897, -1832, -1342, 440, 2808, 1602, -2389, -2983, -364, 1757, 1708, 1410, -1210, -2751, -196, 1482, 983, -344, -1068, -1162, 414, 2294, 123, -3148, -1527, 747, 2497, 2124, -77, -3388, -3014, 1138, 3297, 1635, -167, -2676, -2062, 443, 2869, 788, -1532, -1138, -300, 773, 1784, 694, -2556, -1384, 1655, 2410, 614, -1472, -2123, -1050, 2287, 2837, -328, -1930, -975, 59, 1400, 2118, -348, -2579, -799, 1624, 1654, 677, -842, -2239, -818, 2256, 2005, -785]
4359g85n27O35Q42J836o52l265n21L113J667j138j662j674k36L404K424j532l107
4376a178j034J51J634L547j032l642o89K035J391k63m13j890L7K560R63k180j974
4393a977L82R85J996J656k484l499Q60K277J258L22j040k910J91L193P12j867
4409E5j406P4N94K205O24k635k442K317J641j06m1j593j936J810K906m98j982
4426d13j234J30J268K598j96l812j352K218J125J883p03k467j528J571K438q66
4442F60o17q81m35J293K040j565k772L83K182J071N94j117l181n58L187K350r19
4459A715j413j728p42K355K219j470j991M96N36K85J156j162j974N24K432O80
4475A918j418j096j359Q50L176P35k974k114R12J338J782M14k065l187J655K823
$$ y = [-785, -1312, -677, 165, 2001, 1349, -1916, -2437, 676, 2343, 1205, -457, -2131, -2367, 1037, 3461, 1929, -1178, -2212, -2061, -427, 3120, 2088, -1554, -2243, -208, 1183, 920, 507, -1383, -1346, 1214, 2177, -3, -1977, -1595, -610, 1386, 3042, 558, -2941, -2081, 196, 1454, 1776, 736, -2174, -1983, 1210, 1922, 55, -1351, -1277, -683, 1522, 2146, -489, -2931, -614, 1027, 921, 880, -713, -2649, -839, 2067, 1569, -413, -1647, -1517, -249, 2349, 2153, -1659, -3011, -793, 332, 2215, 1512, -955, -2483, -912, 1526, 660, 43, -838, -1273, 20, 2060, 495, -2277, -1894, 288, 1359, 1953, 836, -2345, -2903, 284, 2634, 1715, 302, -1426, -2168, 187, 2406, 936, -1055, -559, -23, 262, 1418, 256, -1718, -1194, 1238, 1918, 500, -596, -1955, -1105, 2071, 2806, -168, -2282, -1370, -32, 1750, 2164, 99, -3088, -1433, 1390]
4491A390R7l91j294k079N25L728J31k151r84L00O09J427L04k729j349K309K055
4508A898p56j040j438q38J901K839p61k263r28O2Q19K524p7k868j288K175R54
4525I15q3n41j537p9K481R39k107j289k66O11J576K053j767k864M5J734J207O72
4543A700j120k762j29K737J623j205j601p38M37J755J251j963k093J312J525L18
4559A047j44j136j773P91K525K74j505j074q74J032K830M90k945j904J319J302
4575B55R67K21j596j697J365J636n80o77q9n79O21K111r27k456lJ610Q95Q13r15
4594I75k907l12K219K289o08j462j337m76J506K485j348j747j75M37P80J276j70
4611A425k992R4J905J162r06n37j686O3K634J373k066k104N82M78J403J128j586
$$ y = [1390, 1487, 1096, -198, -2277, -1752, 1976, 2107, -44, -1028, -728, -119, 1308, 1612, -1117, -2466, -157, 1898, 1142, 102, -1336, -2174, -273, 2566, 1805, -458, -1386, -1324, -505, 2019, 1942, -926, -2214, -39, 915, 832, 291, -1246, -1325, 1156, 2095, -12, -1301, -1567, -956, 620, 2673, 906, -1958, -1913, -179, 1028, 1700, 580, -2182, -2311, 426, 2049, 844, -757, -1495, -1058, 697, 1948, -15, -2108, -796, 729, 1047, 903, -233, -2006, -1215, 1310, 1584, 79, -995, -1869, -837, 1993, 2483, -462, -2366, -1047, 255, 1222, 1443, -153, -1850, -485, 1151, 571, -106, -195, -774, -153, 1958, 1031, -1425, -1428, 182, 1077, 1890, 975, -1932, -2244, -25, 2264, 1656, 194, -1143, -1619, -113, 2372, 1024, -723, -898, -461, 319, 1595, 1425, -1567, -1473, 432, 1594, 688, 151, -1535, -1472, 1162, 2535, 469, -1635, -1053, -575, 828, 1956, 370]
4628C70k233O41J879O81n04k65k206R6K548M13j616o95j8Q00J442L08k756j094
4646b209K163J770m89j102j314j161J753K758o7k636j288K84P79K776R0k782j369
4663b044J113J677K21j43k023q55K299J769j498j176n17m8J499J549j156k266
4679a599l76J671J201M12j56k566q37K415J352p45j084m38j49R87J566j687j395
4696a428J076J184o8k58o22j649Q73K584k11j266j140m80M63K603R09k451j974
4713a855Q8J737J573N62k498j910J659J596J14q32l15j218M83K370m16j925m11
4730a198P08P99J229K18k442j705J734K220j16n13j633j030R97K078l52j283j94
4747d83J39M34P74n3j712j03J645O22r88n32p42k76K328J221j629k345L62Q82
$$ y = [370, -1863, -1222, 657, 1338, 834, 569, -1637, -1541, 1007, 1420, -196, -891, -909, -109, 1333, 1641, -1115, -2209, -46, 1724, 1235, 133, -1181, -2342, -589, 2169, 2102, -534, -1822, -1538, -759, 2017, 2107, -675, -2044, -931, 746, 967, 824, -1199, -2054, 245, 2014, 516, -660, -1177, -1225, 274, 1823, 667, -1599, -1975, -304, 897, 1309, 1153, -1413, -2250, 165, 1517, 772, -312, -750, -899, 88, 1654, -33, -1428, -352, 832, 764, 506, -116, -1765, -892, 1692, 1481, 215, -925, -1405, -942, 1661, 2570, 119, -1855, -1767, -30, 1543, 2105, -393, -2303, -644, 952, 1066, 234, -81, -1299, -816, 1554, 1138, -787, -1198, -490, 309, 1538, 1756, -686, -2391, -657, 1563, 1447, 934, -699, -1729, -732, 1346, 994, -289, -483, -344, 90, 864, 811, -901, -1004, 641, 1263, 275, -257, -999, -1275, 1053, 2274, 645, -1700, -1338, -456]
4765d56J520J143j708k790Q47K052P05l06r07j616j61K531P96j511r01l05j89
4782a256K071Q94j638k651J706J573N33k75j520j457R79K325pj219p35n17k56
4799a450K161P76j480q37M53J30K97O94j185j098J829J355j344j342j51L54J414
4816E76J508j265k642M9J843P74N03k22k357n51J616J446l60j290p34n07J904
4833B91J588j201k030M48N31J057O30p28j975m8J863J068o91r02j070m94K610
4850I47P80j315j220k18O52O61J358p97k025J92R22O59j17L27j239K79J165%k080
4869a069j7J163N73O16l2k255j204J555J987K83q38j410j092J123K211j31j943
4886d80k45kQ15J292m61j853p43J941J026n4q20j856o94K141J988r27j515p20
$$ y = [-456, 1064, 2207, 499, -2291, -1444, 608, 1313, 1007, 100, -1516, -1677, 854, 1650, 139, -762, -1067, -1256, 815, 1709, 71, -2580, -874, 699, 1232, 957, -563, -2020, -1041, 1284, 1277, 58, -677, -1194, -1450, 711, 1487, 7, -830, -377, -247, 50, 744, -441, -1539, 290, 1645, 301, -1041, -1192, -838, 576, 2084, 819, -1823, -1774, 69, 843, 1346, 1124, -1233, -1784, -168, 1278, 918, -372, -1106, -1613, 291, 1879, 678, -1352, -904, -373, 684, 1314, 586, -1389, -1437, 426, 1494, 803, -99, -1169, -1663, 947, 1727, 412, -808, -1026, -374, 287, 1645, 848, -1177, -985, -63, 596, 479, 806, -433, -154, 1011, 1011, -1069, -1086, 77, 650, 1266, 1234, -1021, -2225, -670, 1317, 1600, 762, -648, -1740, -617, 1594, 1463, -480, -725, -727, 88, 1380, 919, -934, -1677, 264, 1290, 1236, 416, -1440, -2134, 7, 1995, 1068, -447, -1167]
4904a167n3R93J797k92k497l60J182P61P46m24j876m00J861O96p41n03j25l60
4922g62R61J039j462j321J543J007j01j68j213j419Q91K580K91j504j222p45K13
4939a392K589N82j756j788Q11J212L37j16q01j103J313J393l85j484l70n78J054
4956d82K522k4k528j395R26Q41J640Q8j935j292J041J397L3l74n97r30Q50J832
4974A613q72j307J45L44j3J125j60j743j94J368O89q35m06q71lK192J142j771
4992D43j749j4R01J152R88j016j903K62J183J08N77n94j200r2J885M24j899o95
5010a239L86R10J308O25k141k217Q69K323N87k97j050j549L75J775O1o59k31n27
5028f91K31J060J34j278q28J385P78N5j95j379r92J619J308l28j557j24L12K69
$$ y = [-1167, -1220, -227, 1570, 1278, -1219, -1579, -397, 364, 1110, 686, -1190, -1590, 271, 967, 226, -277, -402, -762, 199, 1238, -224, -1545, -2, 1005, 904, 736, -477, -1896, -1005, 1575, 1866, 362, -860, -1605, -1392, 1197, 1779, 23, -1765, -954, 258, 595, 479, -322, -1425, -112, 1281, 896, -588, -958, -1536, -482, 2040, 2016, -512, -1907, -981, -140, 1500, 1588, -347, -1639, -598, 799, 832, 458, -139, -1069, -219, 1613, 741, -566, -421, -77, -90, 1035, 875, -868, -1062, 306, 995, 160, -246, -1117, -1120, 1072, 2214, 443, -1306, -1320, -419, 733, 1721, 705, -1198, -936, 247, 355, 932, 338, -862, -954, 931, 1355, -544, -1239, -853, 57, 1365, 1990, -151, -2368, -1499, 824, 1411, 1114, 64, -1485, -1110, 665, 726, 67, -164, -691, -460, 600, 734, -544, -1372, 13, 791, 846, 651, -728, -1720, -101, 1207, 879, -678, -802, -490, -221]
5046b21J534m84j579o49J875J36M19n75j348j012J680J418n40p62o06k57J145
5063A74J073j221j474N77J305N65p1q55j769L59K282P86j004q91j402j14K187
5080E07J343j161j291L14J23L00L96n24q87L98J553q2j364m05n63R56J686J46
5098A445j732q10L21P61M16R01j248j230P46J541m91l19p09o28J002J382j06j721
5116d79k99O18L32Q53J63k065l80J428Q77k9o96j542j14J553J570r17j727j14
5134i68K9R40J582l91j794n50J077Q4O82l18q47m02J459M23j397o18O45L70Q79
5153H85P17j581j818Q16J431R33j60j012j768L85J727M33r01o39N4L9Q50O22j539
5172e26p04Q47Q93J74o5j085j157J060J760j01j277q20k5R57J199l3k099l65R33
$$ y = [-221, 1313, 829, -750, -1399, 476, 612, 1031, 456, -892, -1904, -224, 1194, 654, -108, -714, -971, 174, 1247, 26, -1448, -871, 434, 999, 928, 73, -1696, -1337, 945, 1731, 727, -164, -1566, -1680, 507, 1850, 689, -602, -288, -165, 135, 531, 7, -880, -482, 1071, 989, -375, -780, -1343, -387, 1299, 1445, -287, -1097, -776, -15, 401, 1302, 54, -1176, -430, 1111, 620, 301, -408, -1036, -34, 1348, 1242, -479, -778, -160, 172, 1025, 1188, -877, -1257, 171, 1048, 1019, 323, -1219, -1333, 220, 1790, 873, -854, -968, -939, 1, 1583, 1192, -602, -1152, -75, 9, 691, 373, -474, -876, 583, 1006, -391, -1009, -364, 6, 885, 1602, 21, -1797, -981, 450, 1383, 1223, 211, -1557, -1172, 555, 988, 87, -552, -498, -459, 391, 1013, -526, -1230, -383, 510, 684, 619, -466, -1623, -563, 1197, 1096, -181, -1001, -1026, -69, 1130, 1097, -1002, -1367, -434]
5191d34J044L62k04j431q34R33J722o62o5r37k7N67J106o56j639N42J021N37N5
5210A000q06j577k23K028R84l42p58j140o64J497J465q14j066q0M99N6M67n85
5228e9r52N39J531j85o02m26p72K95J886O27j877j050L06P33R72L89j120j374
5246a139M18J485J50k88p34j125Q13J662j70j476m14M14k2J579j44j450q31R77
5264b95J314l38m05q14p53J140J772p49j199n82L92N83J089P7j916n09R12Q07
5282E26r3j81p76j81J279M50j035o56L9N80M22Q78j174j567K73J326N17J99l36
5301D90j847j71J798N28m59m67n30j77Q74Q87j219m64K38O88M6L75r48j158O53
5320h63J752K9j027o54j53N46J412R0j526r20O28P88P06J82j456p35P97J027k02
$$ y = [-434, 610, 972, 768, -663, -1497, -564, 1158, 496, 431, -506, -533, 34, 1140, 484, -1155, -613, 408, 945, 1000, 194, -1383, -1606, 422, 1406, 1064, 306, -834, -1498, -1, 1464, 650, -416, -496, 3, 59, 526, -59, -1011, -472, 1059, 874, 272, -154, -926, -631, 1255, 1882, 5, -1045, -739, -6, 966, 1355, 235, -1139, -721, 764, 914, 626, -108, -1233, -420, 1242, 1072, -404, -818, -404, -426, 1153, 1009, -441, -1272, -295, 1019, 681, 276, -538, -1291, -151, 1621, 872, -327, -909, -517, 66, 1155, 1232, -684, -1193, -281, 526, 433, 252, -524, -705, 574, 1024, -11, -667, -628, -48, 374, 1252, 78, -1489, -1216, 110, 627, 826, 490, -1357, -1528, 270, 798, 339, -128, -658, -835, 39, 926, -293, -757, -519, 169, 215, 590, -358, -1516, -863, 889, 918, -109, -763, -916, -370, 1042, 1132, -394, -1314, -686, 102, 808, 990, -466, -1201, -404, 623, 421]
5339D21n34k73n6K69J239o50j332QJ156L23M81n81j605m19J722J309l75n49j272
5358g18r15J621J217m53q80m06J09J52J165l25j553L3J605K35k08q86n30Q8J464
5377H15P70j492q28N7L61Q75J072j444j316N64J190J13m6n87j005L03J289M09
5395A100r02q93K26K58Q19M95j536q23J016Q93J77m40q93j042J312J647k94j106
5413A4j094J96M54J519M78k143k89N48N90L99l96n82o40J052R14q04o13j77Q4
5432d90R08Q27q62j445j07J216K74M20j67j641j58J432O14k72q68o3K6N55O07
5451H06r26q80N69P86K13L35r30r51N6J923J01r26n84q09L36J713O70j393j178
5470a069K76O11R12K06j116q88L57J030K17m46m19l69J15J377J66j232l87L91
$$ y = [421, -113, -386, -442, -173, 1066, 416, -916, -908, 248, 571, 1052, 471, -1134, -1553, 169, 1478, 1103, 554, -718, -1633, -12, 1205, 752, -128, -534, -425, -273, 892, 567, -986, -953, 652, 887, 679, -207, -737, -649, 815, 1585, 93, -735, -678, -317, 558, 1630, 186, -1130, -566, 624, 737, 691, 104, -901, -598, 691, 1100, 198, -695, -469, -211, 608, 1103, -433, -1256, -240, 653, 830, 390, -503, -1545, -233, 1414, 1120, 14, -1080, -884, -430, 1089, 1567, -576, -865, -317, 273, 672, 276, -306, -946, 106, 1020, 216, -397, -574, -490, 418, 1245, 383, -1062, -1169, 47, 321, 741, 574, -1067, -1225, 207, 821, 549, -319, -382, -356, 199, 806, -120, -1000, -431, 355, 568, 903, -27, -978, -922, 1001, 1102, 176, -408, -1217, -881, 832, 1502, 109, -1069, -793, -182, 730, 936, -180, -1068, -711, 319, 536, 90, -329, -698, -583, 794, 960, -272, -659, -268]
5488b68L77R14k44j355o64J088J155l07j41j211k37J121Q58m50r37oK38m0P57
5507F48j07q87l8P08N87l97o20r79m1J718J087j345j348P9P50N19R12p59j333
5526h46N4J034L28L30l24j129n90J349Q19r51m38k44L1R08R25j466j008Q22R96
5545F00p4j32p85r04P71J518l47l83q17j62N5J217K88r03n85L90J03N53l4j031
5565f62l63J107J038n95j157k96O58K30J137l28j442l31O81P62O09l69j320p79
5583a420R84J212k52p56l68k85P43J186o77q40K29K42M06J78o34p42J12R29M64
5602G11n74j87q57o1J222J144p07j237j00J61J044M67q55j240O72Q12j46k96K3
5621dj63L5R22j55j193k98O78O97M90l71j282p72J020J352L18m70j487o41P82
$$ y = [-268, 109, 1023, 779, -576, -1240, -152, 1003, 696, 555, -656, -893, 228, 1086, 636, -301, -307, -69, -109, 648, 541, -346, -384, 324, 911, 514, -106, -1085, -1126, 592, 1679, 334, -1014, -935, -185, 334, 1246, 487, -846, -792, 242, 570, 900, 576, -553, -1143, 206, 1025, 74, -364, -608, -577, 331, 1256, -210, -1218, -396, 600, 526, 394, -391, -1295, -524, 994, 647, 264, -553, -715, -660, 557, 845, -58, -643, -253, -150, 403, 369, -662, -1025, 82, 1120, 525, -632, -928, -270, -40, 1097, 769, -673, -1004, -323, 439, 1048, 679, -641, -1420, -436, 776, 524, -232, -600, -885, -142, 1044, 367, -473, -244, -2, 404, 582, -52, -794, -682, 247, 711, 137, -50, -907, -968, 254, 1398, 691, -546, -646, -485, 559, 1026, 171, -1069, -397, 415, 269, -27, -4, -167, -132, 790, 635, -558, -856, -178, 519, 1009, 638, -644, -1416, -396, 956, 1274, 804, -683, -1324, -542]
5640e42J387r8r30m98K33O2J045K5j033j20L85O06J8k34p37o31J007J544q75j178
5660e64m9qP12J202q48j303k2P34L93n0R0q29m54J430M75j075R1j5l53Q01L91
5681G49o74j082O18P45N75n07p34j024O16J628M3n94r41m61L43J043Q56r19j025
5700g45J04K51P06N27r20q35O31R50n10o09K9j63K76J476k38j569k5Q1M40R42
5720G99K71j263j098Q70R00p4k34j52n64N56O15k77p65m0O56J7L19m75q97K49
5740e87R94J90k82l15p70K13J078Q97j117n80l74J48R25R37p85j323l3R49K30
5759C95l29P2q77P6J336K61r80n44K94K56Q27J28r16j207O72Q83L36J71o62r54
5779g62J62Q79P92p78m71n3p1N29O5l96p64Q71O58j81k13r83m56J031J248m24
$$ y = [-542, 845, 747, -183, -681, -448, -386, 659, 684, -349, -469, -84, 522, 540, 306, -431, -1062, -55, 1489, 614, -564, -613, -621, 91, 1293, 445, -858, -880, -146, 247, 197, 287, -542, -996, 434, 909, -166, -75, -90, -443, 358, 749, 75, -1007, -389, 356, 931, 424, -310, -1334, -718, 910, 953, 359, -582, -1043, -700, 343, 1199, 280, -745, -641, -390, 316, 843, -77, -912, -281, 669, 159, -450, -421, -584, -308, 1168, 930, -639, -664, -583, -143, 799, 1070, -193, -1291, -421, 479, 405, 171, 19, -545, 11, 626, 349, -416, -456, 200, 217, 536, 61, -836, -587, 407, 597, 315, 0, -770, -557, 521, 1418, 301, -279, -653, -505, 420, 1357, 572, -751, -784, 165, 395, 66, 138, -739, -663, 673, 934, -46, -590, -296, -40, 787, 915, -1, -1208, -536, 347, 683, 854, 192, -762, -600, 279, 1071, 293, -178, -231, -302, 227, 292, -104, -868, 3, 661, 480, 267, -716, -1172, -141, 1107, 683]
5799F83j182j71M5M58J327m38j136l88O17L17L35K42j401l66Q87J092q58l56p9
5818c72k11O45R01n27j147K22P72L56J78q97q32j86J677J61p05j28q77m26J473
5837G7J009q55p36O7K70L31L3j41o59M33R29m92m79o6k76M09Q58J91j093q56N07
5858e39M65R29J05q05j134N27J069j44n42n5o99M46J387o27q33m3M98K36N79k88
5878E32r24p26J239L56k1K29q52p42R28J134n10n75j051M25R98L85j53j459M3
5897g44O18L85K41l05o36l68J247P6p03k1K1J34Q62K17j015j180N47J285N0J50
5917H61n82j322o0J451N54m89n53m64L35M31K82n64o62O31N21K95O9q05q08M04
5937d75J592j23p37q61k98O87Q01K46j025q33P14M01M17K29j134m06M39R14p8
$$ y = [683, -499, -670, -625, -167, 1160, 722, -414, -802, -185, 132, 467, 709, -692, -1058, -171, 921, 63, -293, -372, -583, 62, 963, 436, -711, -489, 283, 639, 817, -80, -912, -1098, 579, 740, 35, -93, -970, -1396, 77, 1086, 231, -505, -438, -168, 163, 196, 55, -604, -171, 758, 266, -213, -279, -555, -146, 712, 903, -190, -1046, -539, -74, 855, 960, 155, -979, -452, 617, 473, -69, -124, -823, -377, 1010, 383, -450, -493, 5, 241, 820, 532, -392, -1118, 121, 477, 456, 685, -167, -909, 19, 1153, 643, 68, -983, -558, 440, 825, 672, -787, -744, -126, 259, 500, 195, -441, -809, 438, 514, -189, -210, -189, -55, 807, 1024, 9, -1171, -624, 661, 711, 861, 279, -1043, -1103, 348, 902, 413, -140, -604, -269, 162, 444, -120, -782, -151, 370, 665, 734, -71, -879, -475, 1117, 994, 257, -604, -902, -215, 586, 832, -193, -1026, -312, 89, 506, 735, -399, -805, -366, 548, 470]
5956D70n56r2n98N30P96k31r40P8O75J97L06o35j031J51J042M82k67k13o92l36
5976h64J037O73k91j010l9M32M5Q05o72q64K14J018K0k23o15n04J46J748J61j192
5996B5q95M11K37N41Q85q69j244M68N13N46j22n06o22K5J398k68o14l51J9N96
6016A73N58l1r22n16O22O18K3M2q25r38R84J145k67r47l93J3R33N32J4j277r3
6037e52N91J84K07q6q77j72J085J86m60n08l05Q13O78L65p21j321j50J101N07
6056E65J34l77j259k93J346M43k99l05j79k00M48M93l83n99M12K58R6Q4q52l98
6076h65J87J063N73r99j12p10O0J495J61r89p17M15M70L52M29r32o26N29Q21k54
6096C51m34L4p08N16J195p03p66j68N92N55k6j58j049m1N74Q54j11o80l30m31
$$ y = [470, -86, -178, -776, -246, 550, 319, -621, -543, 132, 329, 635, 0, -1031, -880, 162, 644, 377, 164, -528, -864, 173, 846, 555, -455, -494, -62, -17, 788, 116, -748, -534, 484, 504, 281, -334, -838, -692, 1056, 1217, 25, -870, -459, -222, 319, 1204, 335, -909, -441, 72, 618, 496, -10, -632, -607, 791, 523, -91, -442, -423, 173, 731, 700, -222, -738, -116, 502, 525, 567, -258, -1196, -212, 933, 666, -281, -674, -661, 272, 804, 818, -459, -552, 39, 223, 430, 344, -533, -705, 380, 566, 106, -402, -707, 106, 784, 1149, 428, -893, -1043, 58, 565, 699, 322, -937, -1230, 116, 559, 260, -45, -224, -424, 24, 517, 134, -465, -53, 205, 301, 385, -467, -865, -678, 385, 958, -41, -153, -863, -803, 692, 853, -136, -853, -438, 32, 384, 813, -119, -745, -216, 605, 351, -83, -49, -757, -241, 954, 251, -515, -683, -91, 464, 438, 280, -769, -810, -236, 618, 507, -173, -503, -934]
6116i34P03J122o00m57j61K85k09P58J75j448L85N37P86q57j05o05O0J122K77
6135H34n67p56j33L73N34R14r51j070L74L16N73r7k16j089K67J311L9m79l45j78
6155c46K07O42L3o17p53Q95L33K86L1n55j131Q26R81J18p84o40n7J33J159J89
6175I50j211n66Q69j7K01O3l78l14N33L70l23l38l45K34K60P29m68j006Q0K71
6195d06R26L10n00j236l10J225M27j35l67k16n23P31P13m92p83L40M28k85N48
6214C95k50j095K75J101O22p90p16j61k43J108R94r86j134L98J81O59J47n32o48
6233f75J61Q27p3k13o6n05j99J547j79r63l37K49L23O49J27j413m32J299K76P1
6253D74k37n67m97N00Q03J21p30k76j51M19Q53o7j295k75J184K65j94j68n96m08
$$ y = [-934, -231, 891, 291, -166, -327, -42, -251, 507, 682, -766, -381, 156, 942, 85, -20, -625, -565, 557, 834, 267, -489, -622, -249, 285, 1199, 248, -822, -448, -132, 441, 344, 128, -961, -694, 617, 656, 177, -168, -346, -139, 503, 536, -81, -834, 61, 394, 680, 711, 156, -975, -149, 832, 950, 166, -474, -531, -398, 761, 950, -261, -827, 42, 25, 226, 289, -89, -403, 130, 500, 177, -161, -506, -272, -12, 717, 249, -757, -677, -406, 520, 830, 330, -906, -1216, 9, 436, 301, -66, -282, -805, -74, 639, 147, -636, -296, 132, -153, 395, 145, -950, -675, 426, 1048, 258, -458, -619, -862, 246, 1240, 254, -880, -482, -301, 358, 505, -27, -675, -514, 313, 240, 27, -39, -544, -743, 804, 625, -338, -675, -426, -103, 546, 673, -740, -1172, 127, 403, 474, 237, -330, -827, -327, 476, 597, -133, -409, -560, -141, 712, 645, -650, -925, 259, 524, 330, 162, -434, -842]
6273h42J204Q37r65q98O7L64O42P02l37j419J70L96L25L08K43r02l73P39L07j90
6293C78n67k84L10P55j47n12m73K17M79K19j2k91n21j23Q13M75o47k30k20J25
6313b56Q82J13q70n39O12RM06K6p46l32O08P06k61n27j65o5N58O61k21j171j54
6334g26M93O04L16L7r00q23O66Q90j18Q5q56j35L73N05K0o87KK5L25L61J77j133
6356d99k26R53L10l38n89k00k5R27O19n87n86p7J43J95R57o35j008K06J046k41
6376C45N4o85m4J48Q95P3q16n81j01N80P66L15j003n55L15P70J62r8p83j065P39
6397e69J306J69o83m15l10L28M94K82p27l73N86J60j04K2k78n57O21R74o50m33
6417a57m9r8O22N87m72p86l73N90M44P6p6n70m53O45M67l30m11k08L69M62O37
$$ y = [-842, 362, 1199, 234, -664, -597, -233, 409, 1111, 774, -645, -475, -79, 246, 554, 797, -105, -478, 261, 568, 378, -189, -473, -163, 592, 445, -67, -540, -323, 156, 375, 363, 72, -449, -572, 241, 716, 69, -161, -381, -256, 626, 739, -131, -670, -58, -49, 357, 383, -363, -695, -87, 619, 358, -169, -334, -399, 159, 820, 599, -572, -726, -233, 371, 687, 724, -176, -999, -333, 557, 439, 524, -332, -467, -94, 411, 431, -256, -254, -229, 96, 457, 634, -499, -725, 228, 538, 200, -389, -589, -614, 313, 932, 345, -241, -318, -175, 20, 977, 342, -666, -460, 586, 345, 399, -286, -330, -182, 713, 786, -30, -611, -712, -132, 634, 949, -54, -609, -294, 476, 638, 540, -243, -1308, -569, 737, 906, 223, -192, -502, -174, 320, 602, -125, -498, 88, 248, 144, 166, -112, -669, -48, 926, 276, -157, -206, -304, 318, 905, 433, -353, -726, -136, 308, 384, 308, -262, -715, -70, 397, 67, -344, -552, -183, 279, 916]
6438I16j236n50N63K19K46N06l51j170Q3J031O26p40k67p17L50P78K60n77n41
6457e71oK15N34M34n50n68K91N18Q7l87j96j82O9J121k28q58l95L46M42N81m8
6478F49o33j024R33N52l28kk60k40L03P04n8j046nR0N60L28n13q68J25Q22O57
6499G46M1j054k59k49P24J029k80j022l18M89R7J027p26p34j20P42L42k55m8p47
6519e75K20N15K44l00n76l04L97P60K31n70q09M23N31J77O7j21j247P21M07M00
6539E91n37m79j66L36O83K6q29k06Q64k10K48k07l92o40Q24P84M6r46j58m96O73
6560a91J154l46j012k16L79N08Q4K66j057P8N04M59j35o30l70j22P04N06k09j084
6580g30M84K05M09J63l52o25l32J101L90m14m91n15M00M34L37k69m94j90L96m1
$$ y = [916, -320, -870, -307, -88, 158, 664, 313, -857, -774, 257, 883, 143, -124, -841, -491, 287, 547, -30, -571, -577, -362, 172, 606, 56, -512, -221, 297, 384, -3, -199, -381, -312, 809, 581, -277, -672, -326, 116, 697, 649, 16, -1008, -75, 477, 149, 147, -113, -353, -50, 654, 596, -450, -455, -365, 195, 523, 10, -858, -733, 89, 746, 787, -267, -526, -775, -51, 978, 698, -324, -642, -153, -56, 971, 245, -489, -609, 133, 475, 220, 172, -575, -355, 160, 404, 104, -472, -776, -379, 381, 612, 42, -767, -344, 187, 364, 431, 310, -937, -216, 191, 591, 54, -425, -591, -255, 428, 454, -375, -581, 283, 73, 321, 114, -278, -918, -94, 690, 736, -210, -368, -864, -191, 963, 617, -395, -611, -232, 276, 360, 626, -431, -353, 151, 610, 475, -155, -525, -647, 57, 563, 354, -730, -246, -41, 368, 531, 179, -446, -778, 323, 713, 299, -192, -707, -307, 127, 464, 195, -299, -489, -93, -134]
6600a34L64k09p90P89M64j09o29j23j94L76R19m3q63l19k07P97K47O88j079q70
6620i25N56O56n3M9n01m51M36P31j62n32n52M52L32N39j58p08l13M67Q57k32n62
6641g4l65m95P51R70l32m40n21Q6M99O30j27r73r7O75J02k04j46j41l90Q52R7
6662C57j86n49M6K63N17N35r20j145O99O04L71l12k48q75J7J342L8j11n24l88
6682d69K2N08M12o24k74N25L17J08O0j026l61P12P65K6o53m66l44P76L14M73q12
6703a1o54M07N89p6j32k10p36R49L19M9m98m16k8M55O29k46p68j80O30J38K24
6724D34l18o33j47O65M91j73n69q8j02R05K03o31l45m54P66o5N11r7j016K25O89
6745B51O4m02q6k58K33J160l23n53q29K34N83K60N34o92q86M11K69K80j04m31
$$ y = [-134, 230, 21, -769, 20, 484, 375, -254, -377, -571, -195, 724, 681, -182, -501, -708, 89, 336, 1024, -55, -925, -369, 287, 234, 283, -218, -669, -233, 498, 336, -196, -748, -296, 36, 575, 417, -291, -604, -137, 720, 488, -74, -439, -934, -183, 787, 455, 15, -506, -420, 79, 709, 582, -391, -488, 187, 289, 85, -61, -202, -592, 260, 357, 171, -378, -332, -69, 448, 983, 63, -1082, -383, 221, 592, 280, 32, -843, -826, 516, 554, 443, -81, -469, -447, 61, 473, -151, -425, 100, 417, 525, 585, -441, -802, -90, 675, 701, 48, -418, -762, 14, 328, 801, -11, -665, -258, 331, 255, 123, -87, -823, 126, 445, 494, -4, -420, -448, 7, 636, 390, -378, -558, 72, 210, 434, 116, -517, -664, 1, 492, 319, -250, -338, -440, 465, 668, 37, -308, -762, 4, -61, 450, 353, -663, -438, 251, 315, -87, -173, -431, -198, 962, 639, 86, -743, -509, 74, 334, 868, 176, -710, -299, -30, 250, 146, -285]
6765b85n60P92N03J06o94n06M29L40K03J91o52o80P28M35J01j38m97n33M72R27
6785F82n61m36j85K25M42M00r4r01NL41N60l15k21k99m9N01N75o62l92J71k27
6806d40P16P9m54m06j04L36N85J99m95o07K78L71M03J15o57k51j83O62mN0n44
6827c51J45M33j06J56n72l02O21Q2K97o92l41K36N34M11J6q84j38M39m5N49l69
6848A19n61n35Q56N49l3l98m07QM22N72l29l25k18q0M13L92q0q04j72O64L56k99
6870A10j5l89n90O34P22l17k28q5K92l36N06k12o17R7M79K97k46j13n98K60Q76
6891E27M3k50q48K67J56L09N25o59q06K42Q36N4j87q8l88j56P93M5m21m48J69
6912b85K51N74J25p52o37P37K02K65p00m1k88L76Q25r5m76n82j25O12K99K1m66
$$ y = [-285, -845, -53, 450, 556, -138, -644, -215, 125, 328, 519, -133, -813, -85, 350, 451, 313, -184, -717, -245, 682, 121, -315, -500, -275, 167, 567, 473, -428, -423, -82, 478, 163, -58, -357, -406, 95, 670, 8, -384, -213, -440, 276, 355, -99, -505, -609, -273, 312, 511, 16, -591, -313, 58, 461, 576, -81, -332, -515, 147, 143, 193, -351, -206, 227, 121, 277, -295, -597, 24, 106, 403, -289, -630, -394, 140, 551, 567, -317, -455, -16, -61, 488, 119, -442, -977, -121, 428, 395, -3, -410, -402, 20, 592, 263, -62, -280, -360, 53, 445, 365, -439, -611, 53, 409, 110, 95, -294, -884, -250, 472, 155, -73, -158, 134, -202, 304, 92, -525, -428, 51, 348, 102, -11, -609, -349, 527, 570, 320, -528, -261, -105, 204, 729, 70, -736, -494, 342, 396, 209, 121, -267, -423, 370, 415, -6, -454, -285, -34, 540, 665, -87, -724, 13, 215, 480, -220, -261, -549, -173, 652, 557, 81, -501, -626, -14, 285, 306, -160]
6933a60l41O98M3L4J32p30J3K14P10l68n86J17J57K88L94n82k25n06O72N31n0
6954D55j59p17j93P50L48l54j70j09j87K52O87n85l87K74K63j37L87o26n33J81
6974e60O83L50l22m21m41O31L75K38m63n04K07K34J90L44n36n46L56L02O4j14
6994F7l81l1K12P93l25n63n71N43O65K16k86o62p2L63O46j15m98m64K3J72Q38
7015E70l52m06k07K63R3M30k31m31j10N97J06j58l90LJ6L43M57m87n54K9J66O28
7037C75K37j80j057K57L02M93k4l54m93K92O40k8p16k67N91p0L51J26o51j05L76
7058I5L58k22J56m55m93N41L77k42k74q0j73M68M71k27m96n48O39N70l10j62n8
7079f5m28P14J51o5m64P5K3m7O27l31o93j03L96O62k9j30k66p79N44Q74l08o37
$$ y = [-160, -501, 197, 240, 274, 406, -324, -311, -97, 613, 245, -341, -224, -67, 221, 615, 33, -192, -698, -26, 505, 455, 296, -421, -614, 136, 484, 130, -40, -149, -336, -84, 603, 18, -369, -95, 168, 31, 418, -208, -741, -560, 123, 473, 151, -270, -711, -80, 295, 533, 70, -434, -227, 7, 197, 541, 5, -541, -185, 117, 181, 67, -314, -345, -133, 660, 335, -228, -799, -256, 409, 625, 339, -323, -395, -32, 614, 499, 1, -463, -440, -268, 570, 218, -188, -395, -132, -39, 391, 160, -271, -381, 216, 322, 164, -226, -223, -207, 136, 593, 106, -448, -419, -253, 375, 612, 432, -625, -368, -66, 427, 403, 49, -444, -152, 488, 460, -256, -523, 68, -2, 349, 475, -176, -281, 95, 453, 231, 387, -68, -561, -20, 357, 115, -159, -239, -412, 56, 527, 300, -196, -744, -105, 465, 155, -7, -65, -493, 221, 372, 307, -157, -82, -59, -106, 521, 190, -503, -606, -210, 452, 423, 293, 27, -752, -208, 666, 358, -279]
7101b79J08j42K00P44l99q24K80M16K05m0m26k61K47L10L9l4j84m16K88L36J86
7122C54k70n68J88N55k77M28m22m50L41K78K58l58l12m07M80Q64m93m08PK30R0
7143A08J97Ko47k48O39M35l63q6m05k02L91L01J75k71q5o4J21R8J93n93P4M29
7165A99J18j11m21p8l14J067j87j14m51N0K52K20K81m73k96J42K45P5K13j96m15
7186a94k14M89J67m67N5k91L39L87Q2l06m69J28O82J36l70j16l28K31L72r9k31
7207a7l9k22K49L14L14o82j71L05K06R1j07n91M43nJ50r7n70L33m6M12J63k12
7229B21n53o1M11k41L84l3n26R6L66M31o6o06k07mM77K00l89j57j3K05L31nj29
7252A32n02K42L99K51k29m29m5j15K70L75k83l03J02k69Q28m9l22m99J94M11J43
$$ y = [-279, -171, -313, -113, 631, 232, -592, -312, 104, 309, 269, -157, -418, -171, 139, 178, 144, -40, -456, -168, 168, 354, 84, -484, -296, 259, -18, 410, -12, -462, -121, 157, 415, 57, -255, -662, -182, 682, 189, -219, -212, 18, 108, 305, 307, -340, -588, 51, 486, 123, 37, -368, -570, -179, 122, 297, 26, -59, -123, -2, 96, 289, -304, -230, 199, 317, 206, -215, -293, -607, 460, 273, 159, -292, -242, 10, 230, 511, 38, -258, -116, 129, 204, 417, 221, -194, -408, 81, 248, -219, -164, -455, -116, 271, 353, 47, -422, -294, 388, 524, 154, 38, -290, -59, 313, 214, -17, -56, -278, -29, 285, 599, -83, -254, 51, 257, 348, 241, -350, 93, 88, 238, 141, -429, -96, -142, 270, 433, 221, -332, -393, 18, -223, 161, 128, -398, -302, 64, 495, 429, -177, -384, -388, 89, 289, -100, -257, -270, -65, 266, 261, 132, -370, -128, 271, 522, 293, -136, -181, -296, -26, 349, 66, -237, -135, -404, 424, 375, 53, -446, -252, 159, 302]
7273C02l23p3j22k4N35J42n42n37N36M71k31r5m32m3K78L57R1j20k78l02M23M35
7295D48l81o9l1J67j10J98Q6n59l84Q40K55k67l18j96j16O16J59n27Kl51O90j12
7317D0N10n46l05J11K41p3r4J74m0k18K87J28j33l25K31j8Q8L17m20k73J92L84
7339B58QK04n19l43K09K83K96l99r7k4J25p4L61j97l64M11nJ59k84k97L83l93
7361b99Q56k69l91k79J48J70M90l36m25J8k2L42K35M0n53l2J94M18j72k08J28
7382E3l87K88L12n23n3K72N9q9M03l50n08L34O38m47K24n02J60k80M28N76o11
7403cl60K97k97N58J80o43K9K27L21j16j67o7j61J94K55O74r39k91P8Q8K21J33
7425B11j2p73K59K76N39n14k91J48N7J29L00n18M2K32j20J79j34k14j40O81m0
$$ y = [302, -21, -94, -216, -240, 295, 437, -105, -642, -106, 365, 134, 39, -393, -436, -158, 199, 290, 170, -108, -410, 13, 448, 67, -2, -33, 134, 24, 222, 308, -251, -635, 205, 460, 193, -125, -321, -437, 179, 338, -189, -187, -538, 152, 40, 550, 4, -301, -190, 51, -22, -116, 58, 18, -200, 87, 215, 82, -243, -12, -30, 58, 375, -45, -318, -126, 258, 266, 470, -49, -392, -183, 100, 396, -3, -100, -124, 1, -73, 288, 91, -273, 138, 133, 292, 8, -289, 94, -299, 557, 288, -103, -382, -234, -64, 426, 90, -335, -317, -339, 3, 238, 278, -275, -307, -113, 305, 133, -75, 53, -334, -46, 266, -257, -310, -38, 21, -68, 335, -15, -523, -189, 449, 2, 226, -276, -116, -396, 32, 608, -3, -363, -66, -363, 195, 375, -268, -239, -12, 309, 193, 26, -41, -202, -8, 247, 921, -18, -309, -231, -143, 78, 211, 199, -574, -315, -39, 500, -14, -305, -157, -100, 29, 329, -189, -147, 85, -35, 144, 10, -204, -344, 337, 297]
7446B97k58M5j02m16L21M84j91l52m2kL24J37j80k96J35K35O4k63K24m84K37J40
7468E7K33j16n24L27j43M17j78K27q53J87L47J10Q2k74n75M93J19L10J7k98j71
7489b06K44M1m1r5m04K22L12K44M3k44o81L81K64j30o0J05j09K20R2O7k78j36
7511a49J88J47j56p4m13J15L33M32j61l63K27j35J40P4l55m28K81N32J33n4m87
7532a73k68j62O00L50j00o60L16n9J65N95m71m07M58k30J07K60l53k98q0M82N6
7553A28P4k75P7j93L67oo2k09p1K53J08K03o88L63n5L39r5n00L10l68J20O98k80
7576B38n13J94NK38L0q5n00l0L86K74m05L32l48l23M72L18k17q7j15l60K75M83
7598B62mm22n3R1P6J60J2k24n0O4M41p6k74q2n6n8M82k26j12j29K38M13j98l20
$$ y = [297, 39, 84, -18, -434, -113, 371, 180, -172, -214, -216, 108, 245, 65, -231, -96, 139, 203, -60, 164, -320, -83, 57, 290, 174, -350, -23, -166, 251, 73, 300, -553, -366, -19, 91, 173, -101, -676, -183, -64, 246, 263, -35, -206, 38, 79, 38, -57, -461, -239, 73, 317, 360, 116, -565, -184, 80, -50, -110, -5, -114, 106, 198, 265, -13, -149, 39, 186, 30, -44, -457, -342, -9, 423, 262, -101, 126, -9, 131, 205, -150, -578, -297, 235, 368, 314, -173, -441, -603, -3, 347, 247, -413, -97, -156, 9, 604, 133, -274, 184, -46, 61, 321, -32, -330, -410, 72, 128, 202, -73, 4, -189, 178, 172, 110, -99, -170, 83, 191, 394, -294, 69, 14, 353, 258, -242, 68, -300, -180, 518, 238, -275, -81, -76, 162, 192, 107, -393, -423, -37, 237, -168, 164, -184, -507, -35, 283, 66, -21, -136, -496, -221, 262, 258, -164, -217, -126, -50, 110, 122, -102, -152, -88, 353, 277, 3, -79, -135, -193, 289, 63, -49, -178, 60, 473, 275, -45]
7622d5j79K3K48K93n72L03m23J45M22r3rk20K49j73J02K28J81m41k74M98o5o8
7644A30j23j28R1K27K11n88Q4K77n9M1Ol11K5K49R2p5k24M3p6K18N3J25n45J08
7668a49J17N4K77l55j2K3J1J99K0K1l94K8L09O6l22K59k18J5o9L85j99P4m50K43
7692f7L18k73J53J8k57M09l19q4O3J54k6J88J3n62J9P0J51K43j00k03l45K10L99
7715A72j89j12J14l9j11M43k53j57p6jM66mQm43k3M1K76k00j46L85k44J11m2J16
7739I2k65J3K66l47K82k2M7k24K50J88k14m47J41K9L84N5m24J77m31K49Q6M22
7761C07k60q1m91M42K32l40J82j00J05q0L79m04R1j33JJ35K1J15j77J73J92k35
7783G4R2k73j60P7R0M31j82l83J08K24k38L39l13k37M78N5P7j27j36K10q1J75
$$ y = [-45, -224, -201, 47, 340, -232, 71, -352, -207, 215, 122, 113, -107, 142, -31, 71, 299, 480, 39, -235, 263, 198, 130, 7, -121, -30, 197, 408, -180, -96, 181, 122, 163, 169, -142, -117, 132, 224, 149, -75, -32, -108, 110, 163, 288, -257, -149, -32, 22, 299, -56, -68, -45, -34, 165, 185, 206, -188, -160, 149, 215, -107, 152, -66, -51, -120, 265, 66, 140, -310, -67, 251, -22, 131, 149, -108, 301, -18, -102, -39, 115, 89, 277, 290, -272, -253, -183, -32, 211, 111, -92, -437, -227, 172, -17, -129, -15, -54, -165, 278, 25, -132, -208, -209, 257, 253, 261, -182, -205, -164, 112, -88, -234, 151, -93, 18, -24, 92, -173, -160, 106, -241, 41, 19, 66, -158, 92, 280, 66, -381, -240, -211, 173, 228, -196, -19, -450, -201, -115, 307, 47, -34, -525, -83, 149, -191, -9, -109, -4, -84, 295, -109, -18, -151, -150, -15, 6, 121, -56, 117, 309, 74, 166, -107, -267, -190, -100, 331, 149, -234, -126, 98, -140, 199, -114, -351, 127, 182, 259, 132, -4, 206, 125, 300]
7805C00q0l12J48O7l17N79q5m85Q5L42l78L79l09j67J64P7K95j13k65Q5k09n3
7827b52O02j94k18k07L74j78N8J48k90p3M92l94r4J19Q0Q2J68mj47j37o9M19j65
7850A20j49N7J37k82L05kj14l04M17j78j06M32l64j49n3L74J05k77j67L4l9K75
7872G2p1j58r2J10J60J95j86k37L00k10k4J46J11n9l63K69l6Q1MJ83j1k69K68
7895A83R2m69L55o2k19L92k43r6k04L11J58m30N34m07RJ93M2k36r9M5L43n2p3
7918F7p2l16R8M01Rp1m14M92l78O2L84j79l28L34K83k85K04j70m14J03J79M5J09
7941A43j74r5L41J18n09K45J65j76K6k17J97j19N0q2J63r1K47j7n46O1L31k48
7963a87j8J20J28J65j70K34j80j22K59j47j87j34K08j51L02J30l40j5O5M7K04
$$ y = [300, 220, -92, 56, 123, -194, 385, 300, -185, -100, 242, -136, 243, -66, -233, -69, 8, 303, 190, -75, 10, -199, -252, 350, 156, -62, -269, 105, -73, -15, 133, -157, -230, 262, -132, -226, -107, -27, 55, 223, 219, 72, -65, -134, 285, 120, -29, 28, 165, -117, 188, 186, 72, -232, 185, 7, -99, 333, -31, -180, -233, 141, 246, -31, -198, -164, -203, 72, 1, -157, -249, -139, 21, 216, 30, -207, 93, -117, -141, 5, 116, 57, -306, -37, -73, 8, 12, 195, 184, -85, 183, 275, -194, 161, 99, -120, 272, 29, -67, -271, 40, 198, -232, 302, -105, -96, 97, 139, -97, -196, -151, 192, 140, 67, -5, -321, -223, 178, 187, 116, -298, 194, -184, -122, 262, 83, -245, 89, 372, 87, 291, 121, -293, -190, -11, 34, 143, -31, -126, 215, 333, -176, 69, 234, 58, 84, -133, 64, -55, -5, -87, 76, -15, 232, 215, -331, -270, 61, -187, -205, -85, 43, 208, 38, 272, 92, -30, 229, 82, -105, -239, -31, -182, 120, 250, -90, -105, -40, 7, 211]
7984B11J71k35j80j34K55J77j51q4J75n25L85J01Rj40k34J46L25n51L31l08L3
8005b23L19j76J64j82j29Q9O15o28J23K76m10N03j75l87J18R2k3o9L37k04j4l40
8027c24K51J14n6J11j38j7qK00l59m8O2K46K62Rk59l06j34N43k56M28k34k71p6
8050b60M7N75k87qq3J32j48J45j62o4N8J20j89J11l4mr2o2M14k87k80M13j76K45
8074A24K89l80l53L25n1L14j0l42N1j99J64M54n93L8o9L56k60J79p2k38M25Q7
8096B39J36j89j30k66J53J18K24l73J99j55j09M59k45j59p0K01q6J39k0l64j25
8117d23M25L50j67k84m2k59M63L06m77j76K32J33K98n6k96k38M3J96K5k56n3J34
8139a22J73L24j92L7l81J27P6K9N1j19k43K52N8j12o3N7M6j77K90m8J85k21L23
$$ y = [211, 382, 147, -33, -167, 88, 265, 114, 30, 205, -320, 65, 166, 175, 35, -199, -53, 272, -279, 52, -256, -223, 96, -80, 84, -98, -227, -138, 477, -151, -28, 248, -162, 341, 166, -221, -103, -11, -34, -103, 234, 30, 16, -324, -73, 41, -15, 96, -42, -59, -67, 133, -226, -274, -212, 34, 296, 305, 46, -260, -394, 149, -107, 321, 87, -184, -260, -213, 362, 75, 67, -16, 116, -32, 113, -49, -113, -55, 65, -124, -13, -47, -51, -143, -205, 209, -78, -358, 55, -121, 124, 413, 33, -320, 5, -46, 268, 258, -84, -33, -232, -68, 386, -207, -169, -238, 118, -142, 37, -35, -273, 152, 239, 375, 186, 56, -210, -57, 61, 285, -88, 111, -44, -153, 306, 61, -98, -168, 33, -53, 86, 66, -298, -423, 2, 352, 185, -99, -141, -400, 63, 369, -108, -284, -52, 81, 379, 323, 27, -211, -168, 28, 53, -203, -256, -122, 51, 375, 183, 220, -161, -34, 42, 71, 122, 3, -240, 12, 70, -42, -105, -48, -2, -179, 111, 63, 248, 27, 350]
8162C50m43q0J47q4j27J81J1lJ54k86J5J14K29j10qk23K03j54N22m07j16j36L86
8185A35J16k23J0pj24k34
$$ y = [350, -93, -173, -26, -110, -237, -56, -45, -48, 106, -180, -165, -51, 178, 68, 60, -163, 40, -114, 408, 1, -115, -251, 135, 251, 28, 38, 31, -93, -327]
8191c27
$$ Imaginary data points
##PAGE= N=2
##DATA TABLE= (X++(I..I)), XYDATA
0@%%%qJ6qQj7K5l2M0m9N7p2R0j14J37j61J93k28K67l12L62m16M77n49O29p13Q10
29D32r20J035j162J305j462J632j818K024k248K494k765L063l394L757m159M609
45B423n108N671o316P053p905Q909j0108J1567j3399J5773j8980K3593l0839M3932
59B6266p4991K77403K68317n73851k90984J34518L24922P9698q5504j08783K5892
70B903j213o7931N386J54854k62j87677n2410K18501J54792j22470k74054r6816
82b66397K25022K94584m9167k91161p9056J86839P6065j28794q9627R7951J62950
93A39209J7175j80511j34881Q9330J14527m3649j0666J24519J0051k02499j30944
104b08339J32311K28394L3012k26309j83957J62846K87566m4210l11153j26759
$$ y = [0, 0, 0, 0, -8, 8, 0, 8, -9, 16, -16, 24, -25, 32, -40, 50, -64, 73, -88, 105, -123, 144, -168, 194, -222, 255, -294, 335, -378, 432, -488, 547, -615, 690, -772, 860, -958, 1066, -1182, 1312, -1453, 1610, -1784, 1973, -2186, 2423, -2685, 2986, -3330, 3723, -4182, 4727, -5381, 6186, -7213, 8560, -10420, 13173, -17666, 26266, -48725, 228678, 496995, -76856, -367840, -233322, 91600, 171298, 85794, -22989, 2903, 1690, -66241, -60855, 93999, 93737, -93940, -146350, 72151, 226943, 104473, -169581, -266397, -41375, 253209, 204042, -87119, -166175, 20664, 96729, -32065, -121692, -23741, 139209, 156384, -24127, -159008, -69678, 44849, 1200, -9466, 115053, 125104, -77395, -208339, -76028, 152366, 185378, -40931, -224888, -62042, 225524, 181314, -129839, -256598]
114b56598J73212K15583O5441j00801j64942q3460K2795P0760J39689J42419q5051
125A39047k82725j11479J94638K14623j2472j76794j07340J13295J75164n6960
135H8997k19407l6063J75757J08435m2546o8174l8891j7719k472K296N0140J00573
147A00926n321j48423n6383J17244N2110j04047n2437J09783J30799k1542j90398
158f7689j51279J10548K40051M4547j55900j07885R343M7561O4486L8311m9665
169B2429p3970j3848M4333R1172O4585j05606k00982j2831K19142J80794m4895
180A70323k06009j67474N1791K09884R8765r2918r1292o307j847Q289M8847J3326
192C5378m2977j7310L1173M4434J4806p7557j14389L6679J74395O4817j13134
$$ y = [-256598, -83386, 132197, 197638, 96837, -68105, -151565, -128770, -58010, 81679, 224098, 139047, -143678, -255157, -60519, 154104, 141632, -35162, -142502, -29207, 145957, 88997, -130410, -166473, 9284, 117719, 75173, 6999, -31892, -49611, -52083, -49787, 353, 100926, 95605, -52818, -109201, 8043, 60153, -43894, -96331, 13452, 144251, 122709, -67689, -218968, -108420, 131631, 176178, 20278, -87607, -78264, -30703, 33783, 72094, 22429, -51541, -65389, -21056, 70116, 134701, 29095, -171887, -184718, 34424, 215218, 170323, -35686, -203160, -151369, 58515, 157280, 64362, -26930, -33237, -35084, -26795, 22052, 35378, -7599, -24909, 6264, 50698, 65504, -12053, -126442, -89763, 84632, 149449, 36315]
203C6315j06993l110N5165N6944j341n6413p35O9018Q193o9542m4583j819K9199
216b9702Q4394O2980n9669j16341n3496L1626J09995J13367m1894j74509o8367
227a41616J14632J20205k176r6485r6382J9832J32852P0951p4576j01137m1214
238i5114J6757R4223J11034k3496j42671q2745M3940J01821P3707l4923j17477
249e4944l0801R8033N8822n5039o5269j1295L8998P6746K8917p6127q0764O100
261f6623M6081M6948M1073k7267q4986j6998O4102K9547k8912l3269p239M9051
273A1508P4399k9646j34244n1788R7482J13458K9328o1674j17596n7900Q0043
284d6630J12681K2017n0764p5186n4103M8619J16648J6114j07617p3763L5416
$$ y = [36315, -70678, -73788, -18623, 38321, 36980, -19433, -20168, 48850, 57043, -12499, -57082, -58901, -29702, 54692, 117672, 58003, -58338, -111834, -80208, 29787, 143154, 101260, -73249, -141616, -26984, 93221, 91045, -5440, -101822, -81990, 50862, 121813, 47237, -53900, -95114, -78357, 15866, 126900, 103404, -39267, -122012, -78072, 23749, 97456, 62533, -54944, -85745, 12288, 71110, 16071, -49198, -60493, -21495, 55251, 84168, 8041, -72723, -66623, -20542, 26406, 67479, 40212, -44774, -61772, 2330, 31877, 2965, -30304, -37543, 11508, 85907, 56261, -77983, -129771, -32289, 81169, 110497, 48823, -68773, -126673, -46630, 66051, 88068, 37304, -37882, -91985, -43366, 73282, 89396, -18221, -91984, -56568]
295e6568R1304O6650m1100j28763m9669R7830R8421l100n7132o2573k7478N6903
307a5275P6039j2663o3106k5174J2887M1858N1489k6849r9481k4312Q9488P3943
319G8844j1715o8775p1507P920R6471M9225o4384o0314J7043L7781K5639R84n4970
332a7758n2394M1372Q3544K4320m0476p8755o5932M6919J37112M8499r7078j05704
344g6331j3191O8335R2305J4928r4140o9609M5562O9810J0805k7963n0049l6207
356f5745M6569Q4418M698p0377n8507j0808N6102R1891N621j06392o7553M9612
368d0471P6397K5325l3616p1002k4385O8628O1887l0119n5372j8196O442L9764
380E282N1303j9908p4836j9956M4834M5217J6743l5740p4818m983R3599N5605
$$ y = [-56568, 34736, 101386, 60286, -68477, -118146, -20316, 78105, 75005, 17873, -44700, -72178, -15275, 60764, 48101, -15005, -40179, -27292, 14566, 66055, 39206, -60275, -84587, 4901, 78844, 67129, -1646, -73153, -65233, 31238, 80463, 16079, -44235, -27192, 10589, 36228, 37212, -17758, -70152, -28780, 54764, 79084, 38608, -40147, -106079, -59160, 77952, 126451, 29373, -76331, -89522, -21187, 71118, 86046, -8094, -77703, -32141, 37669, 48474, 20511, -29538, -65745, -19176, 65242, 69940, -437, -58944, -69752, -13650, 78241, 83862, -22530, -90083, -40471, 35926, 61251, 27635, -43367, -67752, 876, 62763, 32644, -22728, -40924, -34482, 5282, 56585, 36677, -38159, -58115, -13281, 31936, 48679, 12939, -61879, -66862, 26737, 82342]
392H2342n4295p7400k5347L9612Q5166L9067p3066q8795M711N9300M9126K1259
404F1680m0192p9263p829P3058M5247k1611m6776l8314J9407P9427K5619p9675
416i222o5975L0029O6862M1186j2318p5380n8418M4134Q2897J6604l6389m7405
428b3395l6446K6393P7804J8893o4192m7607J2346M3662M5173q440p7443l9642
440g2894O4597O9619j0284n2842m7142n987O3422O5667k7261p5857k6654K5347
452c0269M8921M7069j9915q4971l2725O0549O1271M929l9876o1093j4358P0978
464A0510N9300l7075o3974j1189K7787M3330K5838m3237o5171J0777O3210K9590
476D9696j3130m2814n3892R406Q4248M3849n0084o5235j9289K9986O5580K9966
$$ y = [82342, 28047, -49353, -74700, -35088, 50078, 89145, 16079, -72716, -68005, -8705, 40421, 61680, 21488, -57775, -65604, 7454, 52701, 31090, -15686, -54000, -34593, 44834, 70453, -9222, -75197, -45168, 21694, 62880, 50562, -24818, -83236, -39102, 43795, 60399, 24010, -23395, -59841, -33448, 44356, 63249, -943, -48550, -36204, 7458, 52631, 44191, -33252, -72894, -8297, 61322, 51038, -1804, -48946, -54933, 8489, 74156, 46895, -28962, -55616, -30269, 18652, 65721, 45806, -39165, -71890, -11341, 49930, 54859, 14983, -46110, -60468, 10510, 69810, 32735, -31239, -42428, -14641, 28689, 54527, 11290, -53881, -43104, 20106, 49696, 36566, -6248, -60140, -50734, 33514, 77363, 27279, -37956, -57245, -27259, 38321, 68287]
488F8287n9628o5789J9283N4757K0636j2266l9778l7213L0616O7964K760n7200
500g571l9300J372M0742O3059L794q1210n7200L3930O4901L6121j5187o9612m8949
513g5110M7125P4496J244m7103l4687q434L4167N4326o781o3998k6338L2458L9600
526B0965K1567k0374o2707k1496O2747N5304k0444n0257l4238M189N9142N2789
538F7187l6244p4289j3059M1639M4285K1259l2661o4574n807O1184L5477j9961
550B4436l5340k9433R131O1072L0708n6242o0726J2315N2250M4250J775o3864
562i668o4023K7648P9297K8768k9821n0328m0065K1048P4535K5491n4796m8546
574d0460N394L4439M1897M114n9835m5026L9077O0921P519l3227m6303k2638M4227
$$ y = [68287, 8659, -57130, -37847, 16910, 37546, 25280, -14498, -51711, -21095, 46869, 49629, -7571, -46871, -45499, -4757, 58302, 62096, -19114, -76314, -42384, 22517, 58638, 43451, -26161, -75110, -27985, 46511, 47755, 652, -34035, -42469, -8302, 46024, 39243, -24755, -51093, -18635, 20965, 42532, 22158, -40549, -62045, 702, 56006, 35562, -14695, -48933, -44744, 14398, 67187, 30943, -43346, -56405, -14766, 29519, 50778, 18117, -46457, -52264, 8920, 44397, 24436, -10904, -40337, -31206, 29866, 60574, 4332, -56394, -44079, 8171, 52421, 54196, -9668, -73691, -46043, 33254, 62022, 32201, -18127, -58192, -37144, 37391, 62882, 8086, -40460, -35066, -627, 41270, 45384, -14451, -59477, -20400, 40521, 48040, 14813, -31490, -54128, -9901]
587i901O7555o885o3360l2636J4068L9513M2843r621o6508l0665M2644M6592O123
600C9762k3165m3970k0007M6862N0694k1295n0548j2394K1596L6436K1019l8318
612F672n6674J0339N9717K8580j5006m1804m8920N310P5989M8114l9389o3115
624c0187k4766K1670N8177L5171m2278o1367L309M4036K7987j457l6897m3989
636e0591J9286O6168J5649m5602l8919q675K3046N2167K1887m9204n2765P098
648d0455L9359L5688M304m7754m5307K9635N7939N53l6844k1333m325J9767L8806
661C0033k1m3922k0663K0921K4795J4903j1032m2822j4955M8731M1041k2148m3773
674a8912k5641P565N3983M9652l2054p4609j9526M0325M7364K2013k7276n7617
$$ y = [-9901, 57654, 50769, -12591, -45227, -31159, 8354, 51197, 41576, -24932, -55597, -12953, 33639, 39762, 16597, -27373, -47380, -518, 50176, 28881, -21667, -34061, -12465, 23971, 44990, 6672, -50002, -39663, 20054, 48634, 33628, -8176, -57096, -51786, 24203, 72317, 32928, -30187, -54953, -33283, 24894, 60065, 17787, -43580, -40271, 3765, 31752, 30295, -6602, -50591, -31305, 34863, 50512, 4910, -34009, -42684, -19638, 32529, 54416, 5212, -47553, -40455, -1096, 34592, 38896, -8858, -54165, -24530, 33409, 33962, -2882, -24215, -28540, -8773, 30033, 30012, -13910, -34573, -13652, 11143, 26046, 15014, -27808, -42763, 5968, 47009, 24861, -18912, -44553, -36988, 16995, 66647, 34593, -40016, -59542, -19217, 28147, 50160, 22884, -34733]
686c4733j1306M7069L2567j0045k5793k8955k046N2075M0587l8975o3729r142
698e2426M0011N2404K3557m5727p0011j963N6937L5705l259k5193l6662o825M0592
711G140K5623k2802k4301p37J0922K4457J2015l6456l6072K3353M2630N633j9607
724A1798k7769j8113K6957M7416p856n1283j9538K3728L5279K5021j8655n8945
736c1960k3486M2287M6908J2484j9231n0419l6609L7762O6022J524m8694k9965
748c3377P736L5078L0864k1778n3301p063M1081L3378Q173k3574n6365k5476N2250
761a2374O1526j605m1078l6471j3379K8611M3494j971l3964r496J2085J0118O034
774A1530j3823k9131J0679M8116R873l7098k6879k213J4302L3812J7149l3549
$$ y = [-34733, -46039, 1030, 33597, 23552, -2241, -31196, -33242, 18833, 59420, 20445, -43284, -52426, -12415, 39989, 63546, 17819, -52192, -54155, 2782, 38487, 35228, 10035, -26627, -33452, 7140, 32763, 9961, -14340, -15077, -4155, 20302, 32317, -4139, -40211, -16858, 25772, 31405, 11798, -15971, -34084, -7127, 40289, 32433, -18850, -38388, -14660, 20619, 45640, 26985, -31960, -55446, -13159, 33749, 46233, 27002, -23417, -60026, -22264, 43758, 45282, -3412, -33377, -25641, 9437, 40301, 18523, -34778, -41841, -760, 32618, 40791, 17217, -39148, -64624, -12374, 49152, 47547, 6469, -30002, -43381, -14770, 28724, 26753, -7211, -16707, -4622, 5496, 11530, -2293, -31424, -20745, 27371, 37244, 146, -26733, -28946, -14644, 19168, 36317, 2768]
786B768l5581R420L0987J8344o393l9544k9341L6737N7768j331m7079l7203p426
799d7874L4243N9491J0684n7890m7962J0776M0512L5519j733n0142l5025L4239
811a5162N0555K687l2142l8247j9137L7904O5683O240n6713m5675k176L2033M8031
824C3881J4407m0400l4505J0827J6295J083K390m055m921K0516J5286l0539l5863
837c5598O437L1227K9319J0983l2192m8864K471M4300K1108j0606j9541k1553
849b2509N278M0539J5217m1470l7918J0271L9289L8582O73n6627n1273K1542N6158
862A7752K6474r622l5337m0645O747N3369K3771l1680l5242o662K4725M1983Q254
875D3887n0123m3533J5590M1767K8698M462l5325m5821M549M0388J4463q975l708
$$ y = [2768, -32813, -23393, 7594, 25938, 19545, -19999, -49340, -12603, 45165, 43834, -3245, -40448, -47874, -13631, 45860, 56544, -1346, -49308, -38532, 1980, 37499, 35766, -14376, -49401, -15162, 35393, 38080, 5938, -32309, -51446, -13542, 52141, 58381, 1668, -44007, -46183, -14150, 33881, 48288, 7888, -26617, -15790, 505, 1588, 3978, -77, -4998, 15518, 30804, 265, -35598, -29161, 2066, 31385, 42368, 10176, -38688, -36217, 8083, 29191, 18585, -956, -22509, -17231, 23308, 38525, -2945, -40863, -30592, 8697, 47279, 47952, -8675, -59948, -38406, 17752, 44226, 34604, -733, -41378, -34631, 18738, 42509, 10829, -24413, -31075, -6350, 35633, 43887, -6236, -49769, -34179, 7588, 36286, 40748, 5423, -40398, -35849, 4539, 19002, 10027, 6319]
888F319p009n211Q291l106k0807K699K9118J7693l318k2298l9696j0305M9198
901A568M2689j6687l6505j5235M551K1235J9771j6738k9841Q955L0300J2508q119
914A8452l0170l8281J0341O2904L6636k8017n1189l4789Q551N7883M4994k6870
926C0445n4694j3369K2525K9083J5444k1241l8088K793L7706J7829q980k0575
938a122k9284o042L9944L5447j4982l1225j2190L723J6337J3463j5122j4514K3037
$$ y = [6319, -690, -5901, 2390, -716, -21523, -18824, 10294, 27987, 24669, 2371, -37325, -47630, 1568, 44257, 27570, -8935, -24170, -19619, 1616, 21387, 4649, -25192, -16237, 14063, 26571, 18452, -11718, -49999, -39658, 23246, 59882, 31865, -19324, -54113, -45562, 12321, 57315, 30445, -24249, -37618, -15093, 13990, 29434, 8193, -29895, -27102, 10604, 28433, 19453, -1122, -30406, -36448, 3496, 38943, 23961, -7264, -19454, -15731, 606, 14069, -1053, -15567, 7470]
$$ [...]
8191A92
##END NTUPLES=NMR FID
##END=
