##TITLE=1H_EC-3224(7-2)
 CDCl3
 8 sc, 
 20.1.2022
##JCAMPDX= 6.0         $$ Bruker NMR JCAMP-DX V2.0
##DATA TYPE= NMR SPECTRUM
##DATA CLASS= NTUPLES
##ORIGIN= UXNMR, Bruker Analytische Messtechnik GmbH
##OWNER= root
$$ XWIN-NMR		Version 3.5
$$ Thu Jan 20 12:43:00 2022 Russian Standard Time (UT+4h)  she@DPX200
##.OBSERVE FREQUENCY= 200.131346
##.OBSERVE NUCLEUS= ^1H
##.ACQUISITION MODE= SIMULTANEOUS
##.ACQUISITION SCHEME= undefined
##.AVERAGES= 8
##.DIGITISER RES= 18
##SPECTROMETER/DATA SYSTEM= spect
##.PULSE SEQUENCE= zg30
##.SOLVENT NAME= CDCl3
##.SHIFT REFERENCE= (INTERNAL, CDCl3, 0, 15.7579)
##AUDIT TRAIL= $$ (NUMBER, WHEN, WHO, WHERE, WHAT)
$$ ##TITLE= Audit trail, XWIN-NMR		Version 3.5
$$ ##JCAMPDX= 5.01
$$ ##ORIGIN= Bruker BioSpin GmbH
$$ ##OWNER= she
$$ F:/spectra/data/she/nmr/H-F/1/pdata/1/auditp.txt
$$ ##AUDIT TRAIL=  $$ (NUMBER, WHEN, WHO, WHERE, WHAT)
(   1,<2022-01-20 12:41:36.48 +0400>,<she>,<DPX200>,
      <created by zg, POWCHK disabled, PULCHK disabled
       configuration hash MD5:
       00 E9 B6 7A A2 85 ED C7 34 08 36 98 17 FE 4E 26
       data hash MD5: 16K
       B2 7A 7A EA 90 45 53 17 DC D8 D3 77 83 DD D5 6F>)
(   2,<2022-01-20 12:41:38.70 +0400>,<she>,<DPX200>,
      <Start of raw data processing
       efp BC_mod = 2 LB = 0.24 FT_mod = 6 PKNL = 1 PHC0 = -15866.54 PHC1 = 7.200781 SI = 16K 
       data hash MD5: 16K
       C3 53 BC F7 14 8F C3 66 1D 3A 60 CA 21 38 5C 73>)
(   3,<2022-01-20 12:42:01.76 +0400>,<she>,<DPX200>,
      <pk PHC0 = -4.147411 PHC1 = 6.6 
       data hash MD5: 16K
       5F 4B 77 08 79 12 3C 0C 59 07 57 63 E1 5A 41 9D>)
(   4,<2022-01-20 12:42:04.93 +0400>,<she>,<DPX200>,
      <abs ABSG = 5 
       data hash MD5: 16K
       D7 E6 DF E7 4C 14 0E 7C 79 40 5C 43 02 59 05 88>)
$$ ##END=
$$ 
$$ hash MD5
$$ D9 EA F4 8D 1D C4 02 FF C5 3B 72 2A 9D 69 4F CB
##$RELAX= 
##$RELAX= 
##$RELAX= 
##$RELAX= 
##$RELAX= 
##$RELAX= 
$$ Bruker specific parameters
$$ --------------------------
##$DU= <F:/spectra>
##$EXPNO= 1
##$NAME= <H-F>
##$PROCNO= 1
##$TYPE= <nmr>
##$USER= <she>
##$AMP= (0..31)
100 100 100 100 100 100 100 100 100 100 100 100 100 100 100 100 100 100 
100 100 100 100 100 100 100 100 100 100 100 100 100 100 
##$AQSEQ= 0
##$AQ_mod= 1
##$AUNM= <au_zg>
##$AUTOPOS= <>
##$BF1= 200.13
##$BF2= 200.13
##$BF3= 200.13
##$BF4= 200.13
##$BF5= 200.13
##$BF6= 200.13
##$BF7= 200.13
##$BF8= 200.13
##$BYTORDA= 1
##$CFDGTYP= 0
##$CFRGTYP= 5
##$CHEMSTR= <none>
##$CNST= (0..31)
1 1 145 1 1 1 1 1 1 1 1 1 1 1 1 1 1 1 1 1 1 1 1 1 1 1 1 1 1 1 1 1 
##$CPDPRG= <>
##$CPDPRG1= <>
##$CPDPRG2= <>
##$CPDPRG3= <>
##$CPDPRG4= <mlev>
##$CPDPRG5= <mlev>
##$CPDPRG6= <mlev>
##$CPDPRG7= <mlev>
##$CPDPRG8= <mlev>
##$CPDPRGB= <>
##$CPDPRGT= <>
##$D= (0..31)
0 1.2 0 0 0 0 0 0 0 0.06 0 0.03 0 0 0 0 0.0002 0 0 0 0 0 0 0 0 0 0 0 0 
0 0 0 
##$DATE= 1642668095
##$DBL= (0..7)
120 120 120 120 120 120 120 120 
##$DBP= (0..7)
150 150 150 150 150 150 150 150 
##$DBP07= 0
##$DBPNAM0= <>
##$DBPNAM1= <>
##$DBPNAM2= <>
##$DBPNAM3= <>
##$DBPNAM4= <>
$$ [...]
##$SUBNAM2= <"">
##$SUBNAM3= <"">
##$SUBNAM4= <"">
##$SUBNAM5= <"">
##$SUBNAM6= <"">
##$SUBNAM7= <"">
##$SUBNAM8= <"">
##$SUBNAM9= <"">
##$SW= 18.0517287032376
##$SWIBOX= (0..15)
0 0 2 0 0 0 0 0 0 0 0 0 0 0 0 0 
##$SW_h= 3612.71676300578
##$TD= 16384
##$TD0= 1
##$TE= 0
##$TE2= 300
##$TE3= 300
##$TEG= 300
##$TL= (0..7)
0 120 120 120 120 120 120 120 
##$TP= (0..7)
150 150 150 150 150 150 150 150 
##$TP07= 0
##$TPNAME0= <>
##$TPNAME1= <>
##$TPNAME2= <>
##$TPNAME3= <>
##$TPNAME4= <>
##$TPNAME5= <>
##$TPNAME6= <>
##$TPNAME7= <>
##$TPOAL= (0..7)
0.5 0.5 0.5 0.5 0.5 0.5 0.5 0.5 
##$TPOFFS= (0..7)
0 0 0 0 0 0 0 0 
##$TUNHIN= 0
##$TUNHOUT= 0
##$TUNXOUT= 0
##$USERA1= <user>
##$USERA2= <user>
##$USERA3= <user>
##$USERA4= <user>
##$USERA5= <user>
##$V9= 5
##$VALIST= <valist>
##$VCLIST= <CCCCCCCCCCCCCCC>
##$VD= 0
##$VDLIST= <DDDDDDDDDDDDDDD>
##$VPLIST= <PPPPPPPPPPPPPPP>
##$VTLIST= <TTTTTTTTTTTTTTT>
##$WBST= 1024
##$WBSW= 4
##$XGAIN= (0..3)
0 0 0 0 
##$XL= 0
##$YL= 0
##$YMAX_a= 588189
##$YMIN_a= -781850
##$ZGOPTNS= <>
##$ZL1= 120
##$ZL2= 120
##$ZL3= 120
##$ZL4= 120
##$ABSF1= 15.71824
##$ABSF2= -2.33361
##$ABSG= 5
##$ABSL= 3
##$ALPHA= 0
##$AQORDER= 0
##$ASSFAC= 0
##$ASSFACI= 0
##$ASSFACX= 0
##$ASSWID= 0
##$AUNMP= <proc_1d>
##$AZFE= 0.1
##$AZFW= 0.1
##$BCFW= 0
##$BC_mod= 2
##$BYTORDP= 0
##$COROFFS= 0
##$CY= -3
##$DATMOD= 1
##$DC= 0
##$DFILT= <>
##$DTYPP= 0
##$F1P= 0
##$F2P= 0
##$FCOR= 1
##$FTSIZE= 16384
##$FT_mod= 6
##$GAMMA= 0
##$GB= 0
##$INTBC= 1
##$INTSCL= 0
##$ISEN= 128
##$LB= 0.24
##$LEV0= 0
##$LPBIN= 0
##$MAXI= 10000
##$MC2= 0
##$MEAN= 0
##$ME_mod= 0
##$MI= 1.114404
##$NCOEF= 0
##$NC_proc= -6
##$NLEV= 6
##$NOISF1= 3.799351
##$NOISF2= 2.8
##$NSP= 0
##$NTH_PI= 0
##$NZP= 0
##$OFFSET= 15.75791
##$PC= 1
##$PHC0= -15870.69
##$PHC1= 13.80078
##$PH_mod= 1
##$PKNL= yes
##$PPARMOD= 0
##$PSCAL= 0
##$PSIGN= 0
##$REVERSE= no
##$SF= 200.129998728235
##$SI= 16384
##$SIGF1= 3
##$SIGF2= 2
##$SINO= 5.538805
##$SIOLD= 16384
##$SREGLST= <1H.CDCl3>
##$SSB= 0
##$STSI= 16384
##$STSR= 0
##$SW_p= 3612.71676300578
##$SYMM= 0
##$S_DEV= 0
##$TDeff= 16384
##$TDoff= 0
##$TI= <>
##$TILT= no
##$TM1= 0
##$TM2= 0
##$TOPLEV= 0
##$USERP1= <user>
##$USERP2= <user>
##$USERP3= <user>
##$USERP4= <user>
##$USERP5= <user>
##$WDW= 1
##$XDIM= 16384
##$YMAX_p= 490403846
##$YMIN_p= -453963
$$ End of Bruker specific parameters
$$ ---------------------------------
##NTUPLES= NMR SPECTRUM
##VAR_NAME=  FREQUENCY,     SPECTRUM/REAL,   SPECTRUM/IMAG
##SYMBOL=    X,             R,               I
##VAR_TYPE=  INDEPENDENT,   DEPENDENT,       DEPENDENT
##VAR_FORM=  AFFN,          ASDF,            ASDF
##VAR_DIM=   16384,         16384,           16384
##UNITS=     HZ,            ARBITRARY UNITS, ARBITRARY UNITS
##FACTOR=    0.220516191357247, 1,           1
##FIRST=     3153.63046318642, 0,            0
##LAST=      -459.086299819362, 0,           0
##MIN=       -459.086299819362, -453963,     0
##MAX=       3153.63046318642, 490403846,    0
$$ Real data points
##PAGE= N=1
##DATA TABLE= (X++(R..R)), XYDATA
$$ [...]
11339 42731 -42966 -2576 5631 8803 20484 60324 131707 45640 1505 -5465 -22250 -5039
11327 -5039 -23124 -31967 -45159 13952 91514 74133 -17421 -16655 -78601 -9182 11943 -20654
11315 -20654 34365 8588 -10264 38708 11855 44499 -24069 47577 41376 10491 148073 199122
11303 199122 155906 68998 87009 87797 52375 80052 -14343 -47066 -140432 -37946 3676 -58203
11291 -58203 -70135 -68411 13037 24576 -4178 60507 111947 53064 81362 29451 94370 65181
11279 65181 -26588 -19204 -30604 -39644 -31680 -17537 108646 7895 23460 5219 -40690 -93076
11267 -93076 -37511 68214 85072 60419 65599 27645 12984 -8840 4075 -16357 -64614 -17635
11255 -17635 -44455 4131 30936 14056 64326 39869 64660 43198 -35152 68608 21828
11244 21828 15534 45781 87742 -29229 38279 -15197 -37627 -84508 -101831 -52264 -97797 -118386
11232 -118386 -175983 -81486 10159 -13661 17436 -66055 -108849 -76322 -59017 -26568 23792
11221 23792 44396 -26680 -4965 79196 97586 16294 -27306 3720 8685 26214 -18391 -9537
11209 -9537 62296 -33307 -5831 -22919 -51644 -101913 -34626 -19111 45387 90051 -28571 -26170
11197 -26170 -23548 -32988 -5909 -31182 -42992 -29288 16236 -21925 3454 191181 139663 -45769
11185 -45769 -68659 -66253 301 32209 23046 134478 -8362 -11637 29435 8533 -22881 -40566
11173 -40566 24065 60351 100164 77669 70658 -27471 -40421 -46069 -56133 -148343 -254514 -128181
11161 -128181 11403 26447 28746 69554 92933 -24532 -122595 -113543 -71257 -47816 71890
11150 71890 56219 8764 -49227 87 87813 119582 86982 94871 7232 -47706 11698 -30491
11138 -30491 -68930 5462 30294 -10676 -125347 -146494 -144462 -209235 -77311 -53170 -41165
11127 -41165 -105605 -25969 -52142 47342 65938 30326 99458 4269 -89853 -13628 48203 -61089
11115 -61089 -99342 -94797 33876 49201 164082 66271 -17642 -74816 -74132 -98313 -101824 -69790
11103 -69790 27223 -50725 -122947 -45293 -14774 -59403 -110677 -11902 -86378 -94403 -107833 -23692
11091 -23692 -44701 -37063 -98806 -7601 -57463 -59129 -203144 -217032 -154397 -170207 -28323 -10086
11079 -10086 -6180 -94760 -100488 -95139 -27990 6873 36405 85248 117344 76756 74990 92867
11067 92867 46399 15956 41715 2156 12512 22503 5055 68249 35148 14359 85351 93947
11055 93947 46993 101324 78584 103616 79951 87784 18234 -58924 -6946 87265 76669 -34134
11043 -34134 794 105156 -7402 -86185 -73458 24325 -26516 -54645 -36422 -34294 -52071
11032 -52071 -139303 -50792 -50827 16879 14950 -36505 98619 93567 39422 35220 95506 34224 -45581
11019 -45581 -92543 -66409 -31410 -53437 7104 -43651 -55257 26690 69943 45192 14427 13804
11007 13804 -77756 -158227 -123974 -73742 22817 62103 130972 97191 305 10851 -19362 -900
10995 -900 -1903 -48498 -49465 -21465 -141775 -105546 -8508 -43600 -28785 -31425 -13730 2844 -31727
10982 -31727 -52752 15812 116051 84594 -68522 -59618 -25534 8550 47968 -32367 -20499
10971 -20499 37035 13211 68787 50971 65229 -50984 -86783 -76354 25064 84635 63176
10960 63176 81182 -20935 -81301 -57661 -48155 33720 3253 51930 -38037 -124081 -119918 -37886
10948 -37886 -30933 -33607 -27928 3953 -20396 -11042 -24064 -38143 -49242 83102 39522 -37966
10936 -37966 18105 87185 24750 -20082 51262 -8843 -71773 -99920 -16764 55905 48211 74096
10924 74096 -105562 -155687 3628 -33401 39994 -84087 -134299 21239 112994 80484 30162
10913 30162 -93476 -180215 -203239 -116679 5052 45721 27776 4578 43010 89577 43975
10902 43975 58406 162146 115556 -83973 -158468 -109854 -69862 -62183 -56677 -98063 50165
10891 50165 20340 520 18450 -75395 -58872 -53066 -102984 64335 87834 93859 39254 -3919
10879 -3919 36976 61221 65876 -67678 -6470 12469 -33684 4917 80777 137740 186074 132968
10867 132968 20296 105664 154644 121765 51302 100727 29453 16021 118111 47891 -78364
10856 -78364 -7513 -59402 -8347 32161 67865 83260 -1212 -90612 -57326 -59507 -44634 2426
10844 2426 1412 64895 13761 39060 99842 102856 62037 -8225 31821 55805 9656 105842
10832 105842 73306 75166 19200 -54065 7784 74941 30247 -95540 -88963 37105 103988
10821 103988 27182 -14369 -14446 -56292 6064 57077 74223 -36870 -59913 -39730 -32120 -65815
10809 -65815 -75542 -23926 14759 -11890 -110156 -95190 -43113 -32242 -71037 -19337 43585 -118121
10797 -118121 -85194 -67994 -9621 -19384 -5638 50345 22013 34863 -12180 54765 54012 20092
10785 20092 -33180 -53895 -14417 21158 -33023 -59896 6150 -35700 -17900 77062 226858
10774 226858 -4078 -23337 74362 133056 59108 2581 61395 97042 28134 -114356 -88445
10763 -88445 14872 -10854 -23049 615 15247 49515 -48282 31889 -37307 -101908 73941
10752 73941 61265 4829 97042 4338 24399 -36418 -109254 -111450 -74867 62894 -52986
10741 -52986 -87015 4319 -14854 -66419 -56490 -81529 -11779 3845 -12825 40652 1124 21635
10729 21635 -11286 -13246 -19103 -2216 54067 -14355 -86664 -85415 -32350 -18541 -62901 27939
10717 27939 -46936 3497 49538 127285 98652 -19520 11492 123831 102972 -7901 -10493
10706 -10493 7147 -42084 -84646 -72401 289 -25297 -40566 -24949 -41532 35859 51772 1014
10694 1014 -21632 29913 -34980 -34047 30035 130039 128014 113795 45542 -105574 -45842 24875
10682 24875 14244 5278 59356 67549 19310 37844 143864 110769 104093 153960 155792 146628
10670 146628 113686 34711 -5671 99888 -4292 -11514 18168 96311 6608 -19512 -19342 -87769
10658 -87769 -74801 -45439 55263 122481 118878 -78937 -156047 -136804 -85548 15757 -75257
10647 -75257 3676 36590 -81655 -60010 -50087 -79035 -94511 -44346 -11764 72044 53939 12306
10635 12306 -27253 29784 86971 101857 106333 117835 57802 29165 -32361 -14517 51709 80577
10623 80577 92004 -32610 -25579 -72782 -33262 4390 51609 -42202 -130309 -19426 16587
10612 16587 -17097 -17773 -12942 35967 28649 41773 127730 62022 -57063 -30634 -561 3779
10600 3779 1488 -6137 40331 60065 100818 78204 -24177 -1321 63172 6126 53419 76534
10588 76534 71189 62352 62291 34062 16207 4191 54525 55208 8366 57266 3729 -58587 -8468
10575 -8468 -119461 -40874 109776 83547 60661 -23445 -70570 -28445 -48278 23478 -11675
10564 -11675 -99182 -87558 10319 36772 -126966 -131114 -91495 -72398 -128933 -123850 -10319 -80610
10552 -80610 -88765 -42482 -130372 -140255 -104729 -20863 10253 -18916 5576 -33401 10677 57235
10540 57235 164785 139845 -21372 -14507 -12963 8252 14427 25903 84403 60029 60432 75202
10528 75202 11540 -2471 -56309 -67196 -79158 -33902 -50326 -27463 46827 23491 -12276 -5704
10516 -5704 -111579 -114610 -42994 -79763 -53315 -54578 -42070 8401 97544 31854 79560 124364
10504 124364 -50637 -6692 49093 -7018 -21038 -93797 -148198 -87749 -131187 -50374 14160
10493 14160 24451 15496 65076 22314 -11934 11007 -40022 18754 -72802 -30696 58072 76178
10481 76178 125688 -7719 -63837 -62966 -80790 -63933 -19423 41043 -30884 -11859 -29488 -29573
10469 -29573 -60063 -139598 -101586 24251 8795 -91418 -64155 -95943 -44249 -95917 -6189
10458 -6189 -6368 -49528 -37274 99706 106839 13519 19223 -10560 -72546 -59430 4115 12205 -61532
10445 -61532 -85167 -34193 234 78453 80160 62737 143511 53797 25291 129715 16826
10434 16826 30503 95732 20872 -45143 -10104 -3735 -3494 -71298 -16268 19478 96648 -15172
10422 -15172 -55293 27154 45255 550 -88050 -21958 47867 -21 -58826 -36354 -3214 -49792
10410 -49792 9829 -963 39601 270 -72237 -57877 -66895 -55599 638 -36432 73959 81538
10398 81538 -56584 67791 47613 -19170 12909 50949 78409 21152 22826 70387 66931 -17643
10386 -17643 -5712 -24503 -20181 -9075 -58721 59625 -14847 -19334 -46500 66952 147973 70980
10374 70980 10524 -15206 4112 72392 2131 -104441 -150422 -68329 -93773 -150997 -117168
10363 -117168 -86372 -54354 -49751 49733 49851 -5922 -5967 -4772 -82140 -77460 -11434 73789 58787
10350 58787 38877 -41712 19811 30843 30836 37186 893 -31231 102121 88688 1305 -8837
10338 -8837 -58259 -2937 57241 -25358 -36582 -69300 -85517 -20205 14503 63803 -52319 -118638
10326 -118638 -66664 -16418 8985 31137 -46394 -22435 33545 16896 -62995 -66820 -97376 -43417
10314 -43417 2270 -49887 -26521 -88740 -86078 46425 -4152 71816 114648 63063 96202 85322
10302 85322 31586 -33222 -37768 14777 -21726 15214 27756 -26970 61019 -12013 -48381 -24401
10290 -24401 27180 46935 59368 6119 78244 48337 -45152 -71151 -69913 -92857 -21693 -37094
10278 -37094 -40070 21465 -38619 8100 -48764 -18575 -61064 -22217 -61682 3654 -22677 -736
10266 -736 -13695 20301 -12058 -107168 -57172 -30469 -53317 -47504 -19498 23291 34514 -32134
10254 -32134 12441 29410 -31413 -10333 -50551 -123176 -89537 76112 61377 36915 8092
10243 8092 -32926 -62284 -30080 40810 -35814 -67121 -28832 14842 -45824 -12351 58492 20568
10231 20568 6008 -99955 -69729 -54728 -106491 -122203 -87156 -83344 -21753 71266 -15725 -106741
10219 -106741 -149381 -11908 -75400 -48976 -71139 -85639 -19006 -42210 -57851 -64865 -72081 -114254
10207 -114254 -46075 2280 -98173 -73316 54464 41116 11104 8708 25403 88292 44959
10196 44959 112842 82488 -8951 -63070 -87233 24814 113484 214542 153656 27108 -8051
10185 -8051 -88364 36043 60631 578 -57000 -13378 -90680 42241 -35717 -81450 -4052
10174 -4052 6867 107915 92268 57230 50258 -3084 -54260 -26606 -15636 16989 71088 29174
10162 29174 -28138 -30335 -49128 -35829 -51065 -54073 -8015 -86504 -122440 -76258 6311 11721
10150 11721 158493 138635 42698 48572 -62870 -114162 -92270 -169863 -32988 14337 86175
10139 86175 122313 33695 80544 -67983 -92378 -123880 30613 13967 -39056 -35428 -35336 -40177
10127 -40177 64992 -11611 -38916 -105596 -126756 -112069 7625 44134 -26485 -89479 -119075
10116 -119075 -79841 -90858 48728 -12709 -59562 -34350 -168814 -171539 -119029 -110026 -79368
10105 -79368 -147455 -135655 -49707 21322 71362 -1197 -48094 -5124 14293 -99941 65514
10094 65514 -28098 -61795 -47316 -51448 2120 43805 70741 -51568 -65432 -86752 -38408 14651
10082 14651 -66444 -109399 -22705 53052 73959 -20642 39153 -71956 -112539 63552 71357
10071 71357 66262 102384 150808 111338 101672 55745 -96075 -51949 17515 30525 17641 -68899
10059 -68899 -16715 1635 64821 -10522 -42772 133107 35166 -4281 -45906 -2210 -38592
10048 -38592 21780 64820 24580 98982 23190 88370 99240 45081 11447 -69651 -35713 -18372
10036 -18372 -90079 976 65232 38363 6326 6230 2466 -72729 28770 133697 57883 -101814
10024 -101814 -148309 -65340 -26895 -84074 -1634 -51074 -98658 -22097 34865 -8471 94984
10013 94984 -1091 -90090 -50496 -60697 -32284 -81886 -30719 33725 163414 12076 -57899
10002 -57899 -60141 12638 33305 -9504 56425 61611 92758 37336 31094 114726 91537 145934
9990 145934 76236 18794 -1421 -53756 -22503 -33837 -71287 -28898 -31553 -37812 -71013 -45466
9978 -45466 60427 6822 25683 58245 -32171 -1949 -5066 -63326 38634 -10307 -10838 18502
9966 18502 64901 20967 36925 116166 46217 -42930 49914 7186 -58789 -69187 -70799 -5515
9954 -5515 -12525 -11205 110012 159644 99395 -84302 24000 54353 -19672 31878 68554 44352
9942 44352 -77596 -97465 -59204 -45772 -54662 -39469 37738 73650 -9615 -32136 53315 48863
9930 48863 82425 39261 -91704 -129604 -9050 31492 -44649 -61543 66587 118259 -45166
9919 -45166 13511 -78225 -26245 120532 80209 84684 119581 92011 -21406 29133 -4675 -105996
9907 -105996 -88964 -65945 -6534 -33738 -58422 -107832 -47548 -5304 -24506 -10251 -9074 -28777
9895 -28777 50262 23059 10740 41005 74731 1978 -10366 -63188 -42421 -34760 -12066 -72283
9883 -72283 -21983 -51968 -54465 -3311 -39257 -31074 -77773 -41472 64535 71470 78646 74778 -30774
9870 -30774 -34593 -51249 -47303 -154295 -79132 -49152 -37510 -4459 68702 117289 54411 4546
9858 4546 -75587 -81238 -126612 -112045 4681 58237 66230 -33422 -109829 -103413 -114280 -104882 -8052
9845 -8052 -20901 -17626 -3220 -99587 -11026 -59547 -70864 9161 71996 63533 -38426 15786
9833 15786 -28118 -25731 -3196 87285 47293 -42230 -28357 -36976 8181 -34796 -44620 -13830
9821 -13830 57199 58146 75314 61817 -39005 10153 85966 158689 126865 13405 -31846 -32504
9809 -32504 -27639 -49316 -81317 -94123 -54239 -48681 -76189 -14686 41270 -60694 -159407 -46957
9797 -46957 -12033 -6753 19517 30543 9015 -102233 -50652 5413 -4068 -58040 -153551 -116057
9785 -116057 -163299 -87289 -29327 -76057 -40444 11678 126051 65903 108662 95515 -26204
9774 -26204 30640 36801 16488 -30989 -12520 -24052 -79156 -6457 4244 -31393 -143483 -90652
9762 -90652 -60979 -148778 -74363 -91151 3483 11800 19009 -16862 -48049 -40471 -73714 -45507
9750 -45507 -4311 -70211 -73250 -94818 -115902 -43618 51451 16633 35406 -19525 -31173 3131
9738 3131 -5858 25172 -6540 -48804 14329 3403 -42029 -70740 -60654 9298 -74237 -28995
9726 -28995 -45641 39611 -110564 -87082 -90661 -122973 -23936 -11625 -67168 -159072 -70960 54711
9714 54711 91968 23023 -25083 44308 30916 -52312 -9370 -24402 -49936 57328 68882 -11205
9702 -11205 39514 -20927 -44209 -9027 11321 57250 16309 -92844 -125509 12692 5151 -73123
9690 -73123 -50949 38001 106313 69147 43095 63346 3748 5806 7118 -29424 -43469 -34404
9678 -34404 -65286 -3249 -24601 -115629 -57475 20550 86430 73751 3072 16872 32503 4079
9666 4079 -11063 52429 -1458 45776 95405 42130 -95382 -80151 -31253 -112677 -71175 21736
9654 21736 54893 4566 37774 25330 -83370 -139387 6509 -23675 6791 11608 -36687 54841
9642 54841 81511 -2455 35551 44284 28720 54846 -4926 14476 103398 11911 6065 24074
9630 24074 -48680 -59628 62399 88679 -62713 -92399 -47871 -108547 -99722 -6608 -31118 -80948
9618 -80948 -21266 -27322 -75236 -97442 -70641 16653 -109368 -150105 -71468 44412 82883 21353
9606 21353 -72780 -33257 62515 -47964 -18566 -38732 23978 76204 -12949 19876 46553 -2139
9594 -2139 -68892 -80769 -63126 27472 73594 70351 146400 132974 46854 -85084 -65724 13057
9582 13057 -46469 -37520 -8844 -2582 -35794 -45159 -109459 -60254 -9045 80007 -9194 -52438
9570 -52438 -57797 -48484 -13327 -10882 -81173 -32522 8732 -71608 -76527 1628 38948 -8298 64790
9557 64790 -63749 -22766 -76313 -102372 -84186 -138192 -84184 -121503 -115317 56232 31768 24965
9545 24965 101300 53441 23378 -25527 -21154 -57573 -48427 -25188 12443 -2032 10720 -87861
9533 -87861 14675 41123 -33504 116102 55833 11164 4 -841 -65993 -12119 -53831 -50609
9521 -50609 -17300 -93799 -21272 34111 54164 43819 -13890 10879 -10594 27130 38426 -38736
9509 -38736 -41881 -8334 27948 -46059 -5347 -33704 -42550 -71990 -89842 26083 -18620 9210
9497 9210 40376 13795 -84997 -29008 14051 39086 -13342 -66337 -6910 8846 -4777 -19602
9485 -19602 -37140 -14045 -7619 -15947 9087 17586 -39537 -74814 -13989 -59792 -70260 -103910
9473 -103910 -157915 -276946 -143160 -34346 28530 -17537 -108563 -106883 -145223 -85001 -105019
9462 -105019 -86008 -54643 -17482 43770 -26325 -104383 -75053 -4097 25764 12798 -45363 11384
9450 11384 -43210 69808 122577 -39761 33229 94602 39726 -20094 24578 52878 49658 25515
9438 25515 -5240 -27494 -65213 -13664 -9906 -63919 37548 -1209 -20478 112806 30981 30234
9426 30234 52485 6841 22766 96786 69287 160265 112837 87556 197381 38527 2547
9415 2547 87793 91556 46192 19997 32139 -11272 34452 -22627 -91709 -141195 -156162 -14679
9403 -14679 17203 29799 37359 66143 983 -79132 -45897 10419 28476 50393 -51182 -9911
9391 -9911 62052 94006 31076 22817 -51710 -111944 -159796 -65294 5626 -72270 -47841 9285
9379 9285 -51528 -65310 -46891 -55017 -682 34131 -48657 -17034 -84272 -142830 -102730 -16076
9367 -16076 56497 125616 94547 50362 -34764 -51099 30016 25300 -57447 -67492 48017 -6046
9355 -6046 -6206 38469 96135 33622 13696 -55147 -145238 -116602 -58069 -106189 -49052 -31688
9343 -31688 -6639 -65002 40737 83419 -36812 8054 51496 23169 -136972 -195465 -116382
9332 -116382 -106779 -85488 -105329 -2932 21499 -36800 -180363 -79679 26103 43809 45178
9321 45178 -16929 -105897 -84879 14932 70991 66242 33271 30710 -131761 -59952 133239 45035
9309 45035 -33306 -173 48947 275 61139 137977 -16602 -92141 -59128 -44678 30832 18809
9297 18809 -30655 -46320 -95118 -99325 -38427 -92705 -99248 -49022 -49226 104678 117053 -32085
9285 -32085 -78881 -24016 -51317 -32152 74027 55484 -22025 -84978 -106945 -72290 35717
9274 35717 -8942 -45909 2063 14874 26048 -12631 46862 23268 46576 -14854 71165 27388
9262 27388 553 11369 -544 -27312 61353 25167 -10635 32693 28864 -18977 -36377 -36495
9250 -36495 6652 86017 87876 -7306 4289 1637 56133 64270 32391 24321 -5313 -68737 2024
9237 2024 -1218 -52495 -35761 4522 40997 47955 49026 79446 93945 44153 25420 -13047 -456
9224 -456 -63718 -95622 56253 82691 21183 -54454 -108201 -41111 46080 14267 -32629 14495
9212 14495 -15916 -30802 -53164 54644 75344 177780 34468 41793 -26799 -23384 -21629 -21361
9200 -21361 -62178 26 51129 66540 84734 60508 -18354 3731 24490 7329 18307 62997
9188 62997 48831 38366 26964 41889 -27032 -99608 8203 143186 77198 14325 48045
9177 48045 9092 -60910 -32591 77033 -287 47516 21020 -58638 -103289 -14661 -21120 -17566
9165 -17566 -14041 33179 4176 1331 -45897 -101518 17250 -8937 41341 12497 -41974 58250
9153 58250 2403 16985 14017 -9395 -111274 -58730 -110928 -94072 -94612 -30551 -15161 16230
9141 16230 73539 7523 16359 -128482 -124522 -134122 -98054 -55639 -91289 -167942 -201577 -169662
9129 -169662 -53381 -93212 -123651 -80823 -48620 -41086 -43871 -69100 -92166 -53023 69907 58111
9117 58111 -3777 -95541 -118074 -100333 -105372 -21905 44002 135036 231671 221623 33790 -44360
9105 -44360 -17060 -19928 -80506 18013 -64241 20416 42057 21319 595 -40110 10815 -20014
9093 -20014 -28813 -66251 19540 -5204 -20826 1170 74150 131290 106481 -31129 8088 50757
9081 50757 -49292 -47458 -42387 -57674 -80476 -50334 -27226 -78170 -11899 11332 -15650 45593
9069 45593 14848 25910 -11610 54580 -26603 -85268 159434 187259 29422 113528 73626
9058 73626 34491 72223 110413 -93014 -67169 59018 30842 -21921 15700 46490 -24067
9047 -24067 10646 -107459 32133 9277 -73874 -73515 -42018 -92916 47537 84430 41168 -30171
9035 -30171 -78800 -104200 -78324 -112950 -121228 -27194 -136285 -125723 -112228 -55627 -107510 -88611
9023 -88611 -39287 -56131 -35352 29693 71754 -3069 -16428 -36341 44380 52104 21849 -42055
9011 -42055 -127015 -58219 -94697 -56789 -53313 7920 -18675 -133914 -103029 -89407 15880 33259
8999 33259 -37470 43056 49195 19790 43511 -61 -61520 -49500 -30705 14242 30265 23717
8987 23717 43984 1044 54752 133759 79459 -8632 -12620 40179 3186 51044 72237 -18587
8975 -18587 -4550 53238 79881 2890 152299 143173 98349 68468 81097 -19617 -41473 -54631
8963 -54631 -68121 12950 37741 -11185 -2781 63790 88203 116054 41694 63452 47009 81867
8951 81867 76014 122043 50524 -26594 2600 12733 27923 -32768 -16897 61352 -53822 -55452
8939 -55452 319 39754 15530 -40631 -14303 64372 32429 -7910 45565 79506 -32335 -10856
8927 -10856 44973 52818 57311 79396 58859 96187 44996 -33236 17253 55329 127020 6778
8915 6778 47613 102981 99298 10548 -1948 20363 17788 121661 37569 -21438 83489 -58771
8903 -58771 2656 41235 -4168 48148 25192 -8935 24914 17525 65466 105045 50955 47243
8891 47243 -16353 -11743 -103723 -58708 8194 48634 23666 6122 57642 45628 -52106 -48150
8879 -48150 -31925 -2044 25248 40671 127162 127382 103375 10039 -38484 64 55188 -41680
8867 -41680 -3340 -2520 -23957 34803 45063 1213 -8120 -19640 -39002 74844 58642 13448
8855 13448 27847 49906 49202 38884 59518 200487 177882 172442 152868 65225 94634 82793
8843 82793 42101 109416 113030 172386 88659 -52909 -56996 -68777 -39566 56133 159282 190231
8831 190231 167099 101186 30142 -57740 -52655 99552 200308 85939 117678 138294 119460
8820 119460 110499 103297 113923 201540 162469 177948 128423 71361 45899 -5727 88806 176244
8808 176244 118275 82646 86124 104812 104903 221893 156224 57701 128048 136463 233944 174000
8796 174000 168634 273447 198823 231677 244036 267441 207037 180575 172443 187417 297113 215777
8784 215777 355346 346538 240346 214274 354990 311859 215547 90648 192182 249259 343568
8773 343568 293488 411378 385789 299789 370596 392034 394464 366238 308330 369108 403638 352154
8761 352154 378939 472275 493177 485982 471146 383653 573240 470467 539391 520955 539188
8750 539188 519990 645917 676660 730871 801573 718506 862440 935377 938544 1010210 1031700
8739 1031700 1017684 1122068 1086432 1157005 1261398 1373984 1451121 1353763 1495163 1698991
8729 1698991 1904558 2077833 2397557 2738193 3019278 3318009 3852832 4410068 5118212 6126431
8719 6126431 7390390 9047323 10989613 12810151 13928058 13672496 11578056 8565961
8711 8565961 6394475 4988202 4036146 3433773 2983853 2605022 2390930 2055068 1840792
8702 1840792 1638896 1499640 1452344 1381913 1284867 1129352 1037867 913399 1033605 940675
8692 940675 900111 816148 741329 849496 849830 699376 634775 586277 516217 591607 552933 472270
8680 472270 512502 488323 524680 525164 517827 419905 487892 562867 438196 405388 434869 424235
8668 424235 443526 331537 292303 244609 281868 251698 195358 171473 210088 131696 118671
8657 118671 209303 141227 233538 299404 216858 167729 102324 204331 208211 144272 166586 188317
8645 188317 198722 245333 203546 201224 218751 222258 191312 283813 252002 227049 130538 116759
8633 116759 160931 88439 178099 103567 123860 100229 132710 140567 107580 38354 20592 29781
8621 29781 103093 216734 165698 49879 71533 75796 63333 -18038 -39948 21386 61132 82277
8609 82277 57624 70205 128913 118876 142654 137383 83276 122309 166572 186079 90313 -24588
8597 -24588 -24361 117282 188320 28006 115835 69408 16482 50227 150387 175783 35520
8586 35520 34159 -55342 -98435 -75902 -111007 -70536 -42772 -30128 -20095 -101399 10465 96331
8574 96331 95226 36109 55337 68736 32889 129791 78751 89205 61557 -36464 20199 854
8562 854 29215 43282 4688 91611 13033 19134 5671 -31922 69848 105516 -30307 -108954
8550 -108954 -85054 37665 47012 -43068 -53177 -29663 -59109 -18574 6063 -18381 60640 147124
8538 147124 57216 -60297 -24365 8271 15083 -38922 48018 73497 -126191 -88723 -13569
8527 -13569 36604 58650 -100527 -87504 -104703 -153179 -191153 -62078 49986 316 31858
8516 31858 113484 138294 92937 34493 30884 -37096 -16223 58817 24246 20941 -14476 -56150
8504 -56150 -70444 -118248 -32300 883 -2583 28087 -28964 -53080 -49807 -1396 -125955 -34306
8492 -34306 -80594 -134312 -61087 84524 130701 79647 76204 9747 -384 -45406 -74620 -135275
8480 -135275 -170943 -185266 -29908 -23818 -19361 -49394 -32348 21752 35385 57855 -45422 -186506
8468 -186506 -81839 -25969 37064 -20440 -25342 21765 -39195 -121290 -167973 -73469 3070 -32081
8456 -32081 -99211 -34984 67851 -85797 -108016 -14920 96828 27668 -76295 -93532 -46383
8445 -46383 -62044 -138443 -44212 -367 -23374 -135618 -136600 -84833 -34186 17821 -41880 -49965
8433 -49965 22111 52314 22461 13664 -45151 -74640 14901 68840 80788 67051 -28657 -115068
8421 -115068 -27384 -48739 36235 59126 20707 27923 104161 71646 19824 53249 50792 -47881
8409 -47881 -35478 21953 23827 -21641 -41777 127977 149101 19105 -8996 -38821 -55136 -46472
8397 -46472 29084 29936 116101 5052 -75419 -17229 -27722 -6025 10102 58850 43462 523
8385 523 -11633 -15067 -60437 -83966 -65073 5525 -2128 -51528 -11447 -19982 -114992 -103899 -145790
8372 -145790 -135740 -121403 -74010 -47339 -85445 -94161 -93472 -44175 -20194 -31040 -61005 -6677
8360 -6677 -9524 -10252 -8934 68105 10290 -58892 -13521 -76657 -90737 -186675 -94125 22245 1248
8347 1248 -87032 -176600 -119333 -83904 -41376 -14034 -43142 -41185 27161 54712 -68135 -38307
8335 -38307 -25742 -95524 -103062 -108663 -30923 28667 13342 -24666 -170321 -123653 -14972 64915
8323 64915 37587 -47766 -31939 -35260 -13855 -4291 -139 66444 41363 -62761 -2249 32370
8311 32370 51508 135896 111407 -127560 -94885 -181821 -200286 -121122 -39024 -27020 -66496 -41760
8299 -41760 -100858 -132361 -109459 -23949 43496 -34418 -163443 -154644 -149236 -99537 -123649 -91083
8287 -91083 -112509 -51085 -205650 -207970 -123831 -163171 -85843 -150799 -101784 -94092 -137035 -113609
8275 -113609 -145452 -100729 -17932 -87223 23342 157803 14343 -82533 -67060 -20076 32146
8264 32146 23195 44460 -36999 -99469 -29428 -81200 -183128 -46369 59546 -18624 -35875
8253 -35875 -50957 -94531 -97002 -96643 -104355 11694 -9243 -13118 -116612 -60099 21887 52838
8241 52838 26760 28569 145404 33614 22539 29539 -99077 -113389 -30219 -84904 -85152 -50945
8229 -50945 33972 -2701 -89145 -83620 -29403 -42380 39855 38330 53596 83086 62561 35549
8217 35549 80749 92254 72484 -2339 19748 42555 -93185 -52380 -84008 -99781 -127335 -29946
8205 -29946 -81917 -156612 -204161 -175587 -94835 -53279 -67742 -65858 -135268 -192182 -255290 -222520
8193 -222520 -453963 -401099 20386 -57814 -96452 17779 22089 6908 49481 -27811 -55526
8182 -55526 19707 99199 133415 149473 -9188 -5237 -33616 -71752 -22255 5871 53258 -55113
8170 -55113 10142 63425 24784 7906 -66014 -45431 42278 -954 -68272 -20290 -24102 -17841
8158 -17841 37136 24442 7111 -35637 -45813 25322 -4327 -20599 -72695 -18466 -56461 -79601
8146 -79601 -121324 -140820 -45057 -1451 13922 -32296 84966 51316 -919 -20377 -71868 -36263
8134 -36263 6763 -6033 -3106 -53032 -66076 13554 -9290 81741 -24435 87929 107988 -58021
8122 -58021 -76070 -132316 -24332 -38640 -118974 -85784 -33047 -87846 39481 47711 23017 100134
8110 100134 136903 64942 24051 58025 37296 -8901 -36331 -70045 -16224 33729 59285 192922
8098 192922 106467 30324 -1422 85719 27242 18551 -35583 -162280 -89010 -25674 -16517 -58099
8086 -58099 -43087 -53574 -76406 -90793 -23246 39179 97662 118303 108883 103329 40767 -71668
8074 -71668 -105984 -62762 -60560 45575 -33249 22342 -54722 -124710 12615 42094 -63166
8063 -63166 -10973 23054 -58636 -53158 -70200 -107845 -143459 -57593 -41745 -37413 -45408 -64214
8051 -64214 -57382 -152344 -81356 63473 -21111 -46287 -142786 -75847 46483 38512 -36354 -43909
8039 -43909 -75156 -9536 -63595 -72051 23273 -47868 -91711 14199 56368 43697 14878 -72869
8027 -72869 -76542 -77747 26501 -85454 -148024 -55707 7724 19963 16372 -553 61356 -17688
8015 -17688 -93370 -4062 -58572 -86387 -151747 -54719 -19395 56701 3505 28873 17997 -25127
8003 -25127 -110873 -80046 6484 -65378 -48517 -123089 -69223 64328 33781 -38611 -33273 37044
7991 37044 -35528 -84176 -163616 -28923 -25367 -119699 -146845 -130144 -70560 -66955 -16777 -33063
7979 -33063 -45439 -20644 4528 -67873 -66330 -132682 -74238 -64000 -13693 -48955 -163125 -99450
7967 -99450 -46422 -70735 -84900 -80039 6671 -1713 -100097 -111006 -141285 -143764 -16109 5875
7955 5875 83902 93366 74009 -60858 -73044 -26139 -39795 -80921 13719 -46544 -69436 -115614
7943 -115614 -75757 1275 -59896 8368 26936 76055 50688 44769 67062 4351 118462 126767
7931 126767 69243 -48802 -43287 61911 103501 130902 70687 71196 21182 26115 -56435 16895
7919 16895 -53713 6562 -12850 -112915 -65401 34200 59983 59674 -37840 -80017 -102900 -54550
7907 -54550 -66037 -102315 -107143 -11540 30038 -60766 -85976 -127916 -58255 -60905 -61590 -88857 -12256
7894 -12256 39325 -77219 -89248 -3685 -45684 16434 1909 13696 58100 45781 94112 98398
7882 98398 53095 -51340 -74996 -59115 -62179 -6109 -2163 1642 22705 1352 -47341 -8103
7870 -8103 -43893 -92874 -62745 1090 -21387 -46241 -35553 5549 -3147 23254 7715 -7920
7858 -7920 4943 -154897 -197344 -122395 -33091 -20478 24633 -9554 20755 -42476 -61927 26058
7846 26058 -40650 -45932 -839 46886 50841 58296 54363 14918 29561 -25872 -68668 -6722 -6817
7833 -6817 -20103 -51026 -128486 -118650 -73944 9859 48497 43592 119204 51099 17968 -9488
7821 -9488 65907 38541 -65821 -55384 -144347 -117492 -82775 -75009 -126017 -139674 -84235 -77307
7809 -77307 -3102 30069 64467 121304 -5921 -55190 -73990 -65052 -18995 28402 -528 -110745
7797 -110745 -188381 -26972 132859 42941 108930 63574 -1062 11983 -95531 -135939 -57023
7786 -57023 -30558 14489 -54378 9809 8506 -82379 -17040 -17403 55503 -36362 -12964 -48678
7774 -48678 -44746 -5316 -36727 -59617 -20700 -11031 -82897 -39568 -851 -29751 -88876 -125729
7762 -125729 -118100 -3210 -18629 -34255 31614 -80586 -64795 -43587 -13458 -117915 -122868
7751 -122868 -10488 97 21662 41286 -22246 45271 44409 -2301 31428 81208 59103 13813
7739 13813 32841 79093 62993 -22340 -26547 -90335 16043 -12505 32518 -10856 59345 128704
7727 128704 156100 58346 -61048 -28460 -20288 -11239 -64125 -156888 -164057 -61393 -19550 -104310
7715 -104310 -121244 -68853 -102505 -39348 -38269 -46230 -95754 -78692 -80958 -44478 -21314 7126
7703 7126 -32110 -90810 -87935 -84540 -42513 -41452 12816 27130 -41981 -15592 93835 45218
7691 45218 -43365 -41858 -27366 13068 85532 -47272 -44036 -70756 -6228 -62327 -88495 -38628
7679 -38628 -62816 19274 66925 21690 19770 20972 44320 15670 -80821 -49188 30279 -18438
7667 -18438 -44046 -33836 11151 64176 -22762 -135899 -105212 -77205 -121138 -1812 -67258
7656 -67258 -128684 -51970 -38537 -94375 -16619 -1905 -82348 -39028 -45205 -48692 -55375 -13070
7644 -13070 6132 -56539 -49561 -71418 -76074 57710 19434 33511 6335 56836 54238 -48456
7632 -48456 30587 60765 111408 72561 -40810 -66197 -64628 -100239 -106939 -79679 -53528 -8929
7620 -8929 -11212 -13911 1961 3506 -4104 -20779 4991 -60835 -32706 -58270 -55655 -46226 -68337
7607 -68337 -107568 -106959 -165447 -155453 -189023 -143601 -41950 -54306 -65966 49484 14126 -11595
7595 -11595 8928 -29744 -74382 -148739 -144263 -1672 53833 7291 22988 -8775 -119725 -75636
7583 -75636 -106888 -88117 -128788 -48285 16192 13185 -13231 -16463 -11528 -32705 -81837 -40458
7571 -40458 40287 -34775 45933 17295 144768 65411 350 -58995 -129531 -36639 12043 14107
7559 14107 6341 -69197 -60977 -9145 41649 45546 11199 -47854 -101437 -4225 -30383 -68114
7547 -68114 -5837 -49606 -57098 36039 136703 98649 104970 35658 -2073 -18651 89574 114885
7535 114885 79182 4156 -142749 -140722 -77544 -99462 -100229 -153936 -104138 -100437 -26817 19992
7523 19992 23538 16079 -53266 -20869 -60769 25442 30206 43186 -29520 18090 -13888 20920
7511 20920 94680 -6038 -169637 -183805 -95482 -26231 -52973 -79757 -11669 -24663 -28984 18471
7499 18471 65379 -25148 -122288 -113143 -55059 7514 51654 147240 65057 97991 81435 -60818
7487 -60818 -91264 -94687 26398 -77259 -178403 -80064 -5269 66217 29289 -20279 21977
7476 21977 18072 18816 22636 48027 50914 64746 13860 90568 104605 97937 86150 80960 -23310
7463 -23310 -33142 -22630 -13635 19277 -1854 -7799 11225 28521 16118 78302 97333 113160
7451 113160 23718 55854 4906 -76575 71245 101717 88375 93055 -10297 1164 116749
7440 116749 125224 136488 57689 837 45524 24998 92687 7387 -110395 -68290 -20842 4345
7428 4345 -11253 -28227 47049 68422 105045 164389 110224 -61312 -55494 11195 4984 -54421
7416 -54421 -41751 -33062 -2568 76909 15104 39570 95286 81821 95528 57652 87075 46778
7404 46778 -24717 38496 70273 38790 7351 67191 -19942 -51966 -79538 -46750 -59686 -6459
7392 -6459 -37755 -106591 -3011 48004 87838 39516 8880 -86712 -163819 -60715 -2021 -4816
7380 -4816 41229 76864 33089 5188 75178 68286 -9440 -59736 9692 -25777 -80870 -10793
7368 -10793 -19276 -36270 -27606 16111 -18598 -4476 24312 44898 120986 -24594 56954 5321
7356 5321 -16829 41901 96094 6768 -48742 26816 4224 76625 117640 107259 4883 -42638
7344 -42638 -40824 -79322 -52654 1522 -52810 47901 150332 142382 58614 36715 24641 -46889
7332 -46889 13553 1633 74054 43777 -10343 11703 84583 126754 -5051 -85018 727 4933
7320 4933 -931 92595 130092 2800 -32930 -17932 -31888 57241 18025 30259 -17113 91477
7308 91477 130837 86298 10909 28113 3204 -32299 -19197 -98324 -153482 -96386 -81341 5325
7296 5325 -81186 -21497 47336 37225 -139717 -90765 51611 115051 129220 39496 81850 71858
7284 71858 15264 15349 52087 -12750 41529 126279 106061 -7877 15082 28788 82257 112436
7272 112436 -99989 -69550 78827 74099 80948 22787 85872 12245 28318 19370 109809 160428
7260 160428 85586 11891 87178 21293 -78990 -63191 27326 51058 -24867 -27676 -17874 -83317
7248 -83317 1791 11167 63547 107182 11953 -33943 -99196 -318 21343 -38599 31808 58971
7236 58971 124323 138061 39393 23038 7756 -48322 -93776 61535 25184 50869 47240 -19517
7224 -19517 61326 35807 84759 24975 -44879 53305 67956 -36720 -42866 6316 103580 20408
7212 20408 -59670 -41876 -16797 75807 120873 133717 192233 139229 91637 109681 137340 148888
7200 148888 149644 162666 149603 117289 43158 35612 40688 42470 25335 84411 -45247 56440
7188 56440 70850 43473 2831 36593 19148 40959 48121 27604 37517 -33389 -51933 -86523
7176 -86523 -31343 36921 -10619 -125162 1174 114145 -55755 -50331 -8589 -75545 -61968
7165 -61968 6035 87005 84731 45485 -210 -21296 -52074 -23993 6858 -26562 53200 76440
7153 76440 92022 85966 47598 13291 72529 62349 88756 80805 66003 25901 -32518 33684
7141 33684 -81167 -90191 -46763 -128695 -14224 37813 89852 49393 -44458 -58959 -71835 28627
7129 28627 90611 39661 14141 -29357 -155462 -133356 -117974 -23026 84884 35886 -14934
7118 -14934 -30894 -58229 -15816 -51135 29738 -70942 -49446 -45661 -20061 44136 142208 16191
7106 16191 -14677 25160 25657 94329 124872 76191 15243 122432 75770 -41249 57918 100192
7094 100192 -29382 -62409 -14490 -14307 -41701 -56594 5332 -11690 4203 97646 110285 88407
7082 88407 11886 41132 81740 47068 -19847 -9537 36727 46481 -31171 -33687 -36949 -87360
7070 -87360 -104045 -28830 51034 27074 -50487 13421 118369 -12773 -38887 -51542 -51005 -26877
7058 -26877 18863 722 -7136 23157 10816 79803 -60231 -55780 12602 108325 92131 48542
7046 48542 26924 -128321 -86593 -123847 -72576 -13142 -21091 -72500 -4514 -8723 -26189 -20605
7034 -20605 -47701 -2338 47718 105901 26664 -4258 26227 -46769 -50978 -53143 16657 -11912
7022 -11912 77220 147443 20628 -30222 113918 192461 82002 25975 -12517 10477 -588
7011 -588 105041 61520 85878 120844 74843 133560 87087 28411 -27134 -27955 87801 18000
6999 18000 59050 56926 20549 38296 -21874 -62635 46638 31790 116550 169101 171284 69658
6987 69658 114688 30961 51645 56915 91121 71781 60945 76041 68948 -7980 -36440 -29630
6975 -29630 8697 6296 -50518 -41464 87434 131411 106941 53370 37640 88379 94368 54327
6963 54327 -17115 36429 59270 -6027 -72940 -51306 -34575 21811 25941 47074 79764 60202
6951 60202 32709 44338 5538 36281 22878 43150 -1297 -10494 14953 -16513 23436 106599
6939 106599 19161 88136 29460 59483 77781 70848 82385 57306 -1502 15732 -69874 -35428
6927 -35428 60492 101103 49609 85294 100526 106057 91741 67068 86511 13453 26582 100678
6915 100678 124272 22752 45423 61739 -22387 -68657 5681 84811 58981 34610 23815
6904 23815 15324 51428 116865 139753 125832 68618 65984 123769 222118 220166 30364 15163
6892 15163 -6588 -22992 30191 31358 89188 71837 47808 30197 77165 34113 110800 93311
6880 93311 70162 138139 96547 16882 88655 118494 41818 45480 61829 87294 21968 -33961
6868 -33961 32790 -93532 -160666 -62023 -76616 -102120 -38112 24826 91655 133581 13027
6857 13027 25111 80688 48315 31734 21175 -40167 -31989 -84418 -47161 -11680 42389 64179
6845 64179 153993 175913 101713 111241 59989 14045 22060 72743 103562 66317 64730 135751
6833 135751 -13288 -55790 41604 38020 80138 138465 202930 32851 21311 36501 -11848
6822 -11848 41406 23864 81655 133412 95610 152378 106557 90739 162561 182751 191782 35033
6810 35033 43132 101868 218087 100566 -89073 74501 129261 103434 148223 146146 161162
6799 161162 130803 90500 114627 64977 137582 123512 52051 83743 156729 17653 19253 45706
6787 45706 18321 -24817 -64721 51265 138181 52177 84844 85589 138836 145837 102220 57741
6775 57741 -18130 27669 78056 -5494 44902 23465 62646 88055 100823 -53372 -41747 157758
6763 157758 225972 152369 51996 97660 144174 80778 33083 107016 154643 122961 177889
6752 177889 85002 38399 83245 -33378 34752 86573 113040 19341 61039 83116 159205
6741 159205 179691 133352 170963 136048 50160 183622 221328 169876 70596 92048 227098
6730 227098 268603 244532 204569 203848 301899 330415 333006 288936 344669 377027 369171 369120 290954
6717 290954 300879 342328 299298 364757 360570 305019 315925 357843 289822 259760 277945 318133
6705 318133 297267 370132 319140 332063 291416 244569 277950 229067 193725 238805 218925 131527
6693 131527 160394 136703 69701 18537 -12484 63169 92418 77610 146799 91916 92392 188877
6681 188877 166525 78491 44139 41303 65600 105522 99839 63640 100347 80511 62411 13155
6669 13155 -26473 11764 -30386 87944 50747 -60659 -8114 -93579 83857 151498 129362
6658 129362 136127 110989 88184 22453 88312 114745 25123 -35761 2376 30226 72308 43030
6646 43030 63986 69484 27356 70866 39439 2054 91663 161067 162252 124427 41219 162018
6634 162018 137181 77437 88258 162442 153945 28979 69354 67900 42419 110631 76295 116696
6622 116696 164681 152741 87683 -35752 -128122 -26209 -36943 44087 108465 82545 127900
6611 127900 167828 103291 14846 84807 137031 135305 104388 88892 40268 32844 24550 36898
6599 36898 26289 57171 55271 -26342 25618 74173 71274 91410 141936 92273 119722 161121
6587 161121 182395 201904 164833 2088 15122 -4855 9113 130269 63238 43949 25230
6576 25230 65924 104464 96931 29607 94680 82285 41153 45731 48857 141819 119817 121890 100548
6563 100548 74814 110848 -56595 -364 126075 102062 71657 70813 137228 86332 85817 123796
6551 123796 107260 208074 149265 20625 -35804 16939 81370 120825 86859 -19583 -27392
6540 -27392 -22666 55611 138916 216012 86869 130234 128836 133894 206987 166749 194409 165900
6528 165900 104217 124470 224591 171350 43909 -12262 51138 163024 226373 328650 205873
6517 205873 151979 163546 131395 154419 137872 127492 59624 133033 163800 239105 248261 165550
6505 165550 136675 152283 46058 41164 48923 117772 116331 61063 112258 205373 176155 78333
6493 78333 136041 187295 260462 165611 104459 223916 189721 177844 228975 316709 211197
6482 211197 163522 154304 45792 34635 108238 150446 193638 172362 126717 29776 -32879 25479
6470 25479 19379 117390 179979 155661 134719 113714 49392 245287 305138 205635 94723 114834
6458 114834 133473 133070 116285 160817 190171 214380 154108 117939 131115 143938 180876 198852
6446 198852 199051 204366 199610 122701 156744 202315 281305 223298 229819 199402 109668 126084 184246
6433 184246 172541 155502 40902 29161 75515 117090 149331 178879 152050 104478 101108 64762
6421 64762 -1460 -23601 79087 191719 198992 205116 138470 138676 126252 128292 173107 116187
6409 116187 107261 146479 147728 166823 102178 107666 99945 94070 137724 149306 44397 111104
6397 111104 197395 168061 176631 182320 169321 60033 96654 140076 157848 124159 190597 203261
6385 203261 127228 193312 248300 134662 130084 277128 264318 273383 211048 195244 218077 228750
6373 228750 343739 301036 191297 186031 206553 189720 172401 150367 274707 337766 219507
6362 219507 121282 300988 290232 326276 323207 241902 270566 339442 300052 275380 271386 169022
6350 169022 161659 128462 270884 283894 193661 147169 204985 278218 118301 221659 199461
6339 199461 238627 191891 210344 251111 335472 333876 350137 372587 334295 307379 372231 392141
6327 392141 418880 279958 337421 325496 301901 339273 345139 448564 355696 249192 266401
6316 266401 249265 254763 414223 252113 151527 257906 348166 332954 367890 364966 429127
6305 429127 425812 343456 352776 415963 392134 387242 338235 291314 222569 254625 324207 331007
6293 331007 285646 332432 262188 229474 248521 272029 273188 314993 335242 295064 318221 376623
6281 376623 328899 379004 290761 341296 260035 261560 273129 250197 301150 264992 259910 284420
6269 284420 281125 291347 349624 226975 255204 299985 279090 328733 307455 294202 440379
6258 440379 458097 486013 471081 417234 429401 466218 413584 351597 416655 477914 433873 368296
6246 368296 438846 532921 478910 365136 502797 423418 364865 432825 449301 455112 513765
6235 513765 444466 391162 378708 399641 451699 462439 439841 514349 431713 343857 340826 448357
6223 448357 494018 401350 439997 474162 426578 467319 523185 530959 544929 592927 532141 510806
6211 510806 621044 569253 573959 519735 564183 550676 617155 629914 566906 695421 806110
6200 806110 690783 704435 793464 841783 737432 884622 884764 842070 888554 1038953 1141960
6189 1141960 1190635 1199608 1215041 1275304 1203092 1109847 1007940 950019 992693 988336 915948 975687
6177 975687 1104967 1214758 1218511 1220676 1209936 1364466 1462735 1417323 1513005 1630121 1737457
6166 1737457 1735292 1857358 1924914 2008021 1997168 1965130 1835973 1545382 1387840 1350278 1333880
6155 1333880 1294514 1214626 1243016 1299513 1182751 1185528 1151561 1235086 1275949 1198311 1345380
6144 1345380 1382887 1445792 1499256 1473695 1516153 1562957 1576235 1644712 1522968 1417110 1400579
6133 1400579 1433341 1378911 1268960 1173536 1285624 1276872 1130123 1209095 1113975 1098974 1057488
6122 1057488 1048405 1064417 1085522 1128994 1211189 1181102 1105924 1110958 1248381 1272487 1166160
6111 1166160 1142494 1332836 1322989 1273503 1354672 1299369 1287524 1379439 1408320 1369221 1333663
6100 1333663 1311648 1338050 1353794 1343552 1331675 1353999 1387758 1352529 1370096 1361038 1435961 1478650
6088 1478650 1486096 1504976 1486932 1468323 1495613 1516453 1503442 1535343 1507960 1487313 1510285 1577286
6076 1577286 1607517 1552430 1599962 1677899 1741870 1701918 1600204 1473349 1610969 1781561 1819112
6065 1819112 1895160 1971330 1811826 1717650 1765635 1809327 1902065 1946767 1929392 1866468 1900234
6054 1900234 1945265 1975989 1961436 1953404 2165262 2064579 1942042 1985570 2137259 2185458 2166371
6043 2166371 2140822 2104477 2189974 2218013 2245637 2174307 2196074 2236765 2383822 2433009 2348942
6032 2348942 2370540 2393594 2474060 2433191 2494090 2660925 2678015 2733900 2594060 2623481 2646417
6021 2646417 2546124 2579242 2672836 2717354 2754477 2775764 2838632 2931647 2788542 2917420 3088843
6010 3088843 3088828 3096793 3051119 3201104 3174290 3251564 3392552 3377286 3384483 3354074 3410938 3438999
5998 3438999 3430200 3601272 3556600 3627443 3725150 3619607 3465979 3723505 3880928 3929645 3925071
5987 3925071 3919934 3929530 3956505 4018144 4082031 4144252 4229697 4219811 4241824 4256671 4319248 4325511
5975 4325511 4285004 4338782 4492972 4642848 4663410 4764340 4866034 4854854 4956347 5026090
5965 5026090 5078559 5196160 5304876 5384468 5371374 5497704 5560813 5560580 5687667 5893176 5994881
5954 5994881 6353939 6492902 6578067 6704691 6910682 6993556 7190091 7392655 7651468 7808115
5944 7808115 7999983 8192142 8335392 8573871 8805955 9030945 9243136 9374874 9629674 9855377
5934 9855377 10102296 10322425 10521674 10716654 10921035 11117061 11269108 11509275 11727731 11934392
5924 11934392 12111634 12233226 12377432 12402405 12523206 12775721 13010284 13112079 13271506 13432402
5914 13432402 13630142 13874982 14056067 14264124 14498949 14829963 14977616 15085478 15284426
5905 15284426 15725666 15896363 16211509 16725674 17151333 17578704 17993915 18451127 18993843
5896 18993843 19390075 19795051 20471028 21066919 21608490 22203745 22801260 23477929 24083121
5887 24083121 24588056 25300297 26082273 26999089 28009818 29220657 30536864 31847081 33179863
5878 33179863 34741507 36370133 38071790 40056275 42139986 44480594 46817865 49208457
5870 49208457 51284845 53122198 54855847 56643587 58797299 61276408 64273133 67834333
5862 67834333 72199116 77685927 84092131 91438668 99329453 107670259 116911840 127274188
5854 127274188 139180657 153630862 171304964 192511830 216598293 243750415 274949457
5847 274949457 308046484 339357750 367666903 388482677 403588212 418640797 429706713
5840 429706713 416458195 369019321 309089475 256987056 217173475 187833155 166651594
5833 166651594 151127937 138929514 128080639 117572797 107253242 97628605 88983955
5826 88983955 81605539 75503500 70586587 66415912 62903733 60021290 57703673 55875383
5818 55875383 54497691 53729028 53292642 53198932 53507062 54236604 55530461 57382067 60002622
5809 60002622 63386792 67655070 72980407 78580535 83442115 86406716 86250806 82721017
5801 82721017 76226846 68328543 60383227 53507576 48080014 43927705 40691895 38148548
5793 38148548 36125089 34510276 33250879 32269875 31528806 31376282 31374630 31437060 31626551
5784 31626551 31910935 32316976 32927505 33805722 35164700 36849675 38670128 40659400 42376339
5775 42376339 43250962 42619733 40321502 36756232 32823523 29258950 26368627 24163383
5767 24163383 22330169 20864651 19766906 18871418 18123324 17508418 16969893 16633225 16352796
5758 16352796 16223896 15986189 15483259 14895379 14277659 13581292 12839593 12238701 11757510
5749 11757510 11411968 10989041 10690858 10465123 10182862 9848476 9593615 9366356 9169948
5740 9169948 8975297 8720630 8598236 8445309 8256670 8216351 8148589 8062684 7927094 7940719
5730 7940719 8016207 7949135 7960787 7910034 7660750 7407037 7207296 6956844 6594576 6493840
5720 6493840 6321293 6145934 6000151 5935015 5920026 5764986 5671596 5600524 5575888 5578932 5503064
5709 5503064 5481707 5395959 5359966 5243887 5155088 5149030 5094768 5045680 4875803 4700813 4757737
5698 4757737 4736437 4700207 4624739 4606503 4582322 4565564 4476849 4512909 4499321 4484597 4490238 4378280
5686 4378280 4298486 4227518 4270507 4215163 4207300 4288067 4343703 4426043 4349401 4296979 4286165 4235798
5674 4235798 4271601 4248970 4272999 4360878 4383039 4312629 4376556 4334964 4237304 4324679 4410135
5663 4410135 4384781 4387196 4385119 4328194 4318603 4368368 4342004 4259995 4330674 4320889 4343926 4405338
5651 4405338 4358812 4381469 4421118 4460442 4375249 4349549 4422234 4371585 4297657 4377966 4417203
5640 4417203 4434533 4476509 4522954 4709102 4782941 4791871 4829463 4876982 5025190 4977340 4924591
5629 4924591 4921656 4950011 4924572 5004961 4918628 5006851 5009292 5055130 5077788 5083610 5120191 5117343
5617 5117343 5182871 5194213 5196180 5224458 5288884 5340069 5378289 5453064 5488414 5571827 5679501
5606 5679501 5883806 6043998 6219748 6474898 6726323 6939340 7109965 7289056 7403138 7536115
5596 7536115 7622472 7586829 7458628 7330017 7220229 7262066 7357352 7321222 7240023 7266160 7272699
5585 7272699 7383019 7436342 7570326 7685774 7810152 7935805 8165449 8342543 8483053 8649293
5575 8649293 8852199 8963608 9162427 9536809 9885000 10241121 10696239 10936750 11019267 11171790
5565 11171790 10978919 10735982 10671594 10600011 10572730 10610338 10844036 11058039 11289119 11397277
5555 11397277 11473806 11730673 12124836 12443888 12723922 13111290 13410719 13727209 14229646 14798944
5545 14798944 15485400 16201992 17014697 17692710 18126825 18523521 18670634 18385843 18144582
5536 18144582 18141335 17978926 17923628 17923899 18043061 18267471 18782102 19200271 19736559 20461477
5526 20461477 21152801 21842644 22529069 23377798 24246832 25372624 26459885 27690618 28929122
5517 28929122 29940047 30766558 31684086 32694122 33865518 35432305 37227992 38849978
5509 38849978 39595607 39743583 39443669 38432881 37403877 37003947 37123152 37566262 38282670
5500 38282670 39148626 40147553 41214498 42190459 43540781 45106815 46843635 48644464 50572839
5491 50572839 52647157 55065902 57474722 59599897 61329632 62363012 63070984 64286188
5483 64286188 66176239 68552894 71711505 75935735 81328550 87325395 93124518 98906348
5475 98906348 105159026 111970224 120936362 133017002 148354579 167821518 191679435 218761063
5467 218761063 243338507 257273607 255999411 239560894 211817077 182130549 158869082
5460 158869082 142710612 131662586 124234380 119197632 115653451 113479093 112714283 113394202
5452 113394202 115590130 119300574 125045598 132877429 142746893 154582837 168526987 185033970
5444 185033970 205152516 229943740 260170351 297913136 344718409 397408745 443827268
5437 443827268 467364016 459442190 420075024 358361170 295028976 245136275 209643497
5430 209643497 184362900 165775077 151543469 140327359 131641996 125048729 120166454
5423 120166454 116846211 115096824 115042533 116379514 119025287 123152731 129107527 136994666
5415 136994666 147139105 159781665 175417128 195172713 219324192 243977976 260390662
5408 260390662 261076737 245727021 215804790 179738328 149532474 127583450 111598656
5401 111598656 99473444 89903304 81985855 75386750 69936307 65461881 61454457 57863158
5393 57863158 54731122 51955731 49505547 47257698 45347021 43743086 42360821 41128007
5385 41128007 39870002 38636516 37459953 36349974 35274806 34302618 33289863 32422175
5377 32422175 31740233 31049799 30297354 29542254 29030535 28342351 27629244 27103419 26424529
5368 26424529 25817938 25276692 24651897 24045860 23665965 23159132 22765365 22383936 21919612
5359 21919612 21716728 21548785 21315679 21114968 20972228 20725299 20496761 20452165 20382590 20301489
5349 20301489 20312821 20258521 20252195 20262610 20313018 20353701 20272046 20276125 20173351 20016054 19823930
5338 19823930 19614264 19499209 19394545 19250610 19203192 19167343 19002477 18967529 18964338 19036509
5328 19036509 19129073 19200515 19307072 19425155 19532463 19635494 19740389 19890891 20058299 20267281
5318 20267281 20602567 20891840 21223142 21532378 21767282 21956864 22243229 22398621 22588371
5309 22588371 22838431 23227199 23544102 23797171 24224025 24414899 24785162 25040095 25178744
5300 25178744 25565615 25904869 26324487 26838926 27269844 27735556 28440554 29096641 29715485
5291 29715485 30421943 31271416 32183124 33195945 34165490 35239822 36449394 37657505 38880431
5282 38880431 40008192 41211118 42586688 44057406 45617683 47368187 49262130 51291954
5274 51291954 53471096 55945876 58926888 62347982 66612962 71668709 77507904 84098217
5266 84098217 91290098 99717347 109644643 121678922 136139167 153979617 176262032 202543623
5258 202543623 229645291 250288402 257070460 245686094 218368464 187860422 164627077
5251 164627077 149400675 139949908 134230484 131220834 129931488 130381469 132543834 136120175
5243 136120175 140938692 146758195 153327086 160241801 167070671 174184334 182507954 192917089
5235 192917089 206261172 223598834 245851586 274166933 310664457 357204205 410784945
5228 410784945 460678820 490403846 486507765 442819784 374674212 311035403 263478043
5221 263478043 231160906 209642645 195404111 185928437 180208698 177830454 178259107 180103709
5213 180103709 182260824 183105234 181030801 175641098 168325772 161443696 156819555 154968958
5205 154968958 156027843 160236122 167947868 179687652 196093681 217722004 243348179
5198 243348179 267813207 282851801 280901471 258691905 222494716 185793628 157550261
5191 157550261 137768660 123931979 114262725 107460612 102837125 100069001 98858504 98550147
5183 98550147 97867339 95886267 91809760 85340668 77186454 69377638 62918450 57750352
5175 57750352 53668681 50233680 47471008 45203646 43134221 41159094 39392547 37924019
5167 37924019 36469757 35084633 33838752 32734739 31605614 30612734 29565733 28561178
5159 28561178 27496939 26549849 25833815 25144654 24391182 23679018 22910149 22287103 21554917
5150 21554917 20941574 20379223 19825971 19337976 19034526 18786993 18502764 18293584 17915636
5141 17915636 17508166 17015394 16462424 15888980 15380478 15068012 14619976 14346119 14008547
5132 14008547 13701358 13464319 13176512 12809986 12560539 12347816 12161115 11933375 11704103
5123 11704103 11577384 11429369 11263670 11141893 10980791 10887713 10965864 11131484 11230509 11306253
5113 11306253 11247357 10988090 10619907 10091625 9616347 9207908 9001357 8621680 8331219 8152578
5103 8152578 7891894 7648695 7523469 7358212 7224267 7137213 7040204 6889155 6705828 6544497
5093 6544497 6440313 6449950 6427133 6294952 6414949 6367632 6327002 6323112 6278172 6200527 5944214
5082 5944214 5706627 5494232 5201004 5053516 4974088 4843421 4678680 4538984 4447429 4504562
5072 4504562 4381429 4252549 4243880 4134847 4078856 4062359 4012772 3866804 3747597 3739788 3686928
5061 3686928 3644591 3561145 3556712 3525080 3413123 3348389 3228199 3113168 3107643 3078710 2997712
5050 2997712 2975136 2979951 2862433 2851914 2811843 2838766 2793953 2755950 2703544 2615218 2609356 2459060
5038 2459060 2403763 2371735 2387295 2321965 2280902 2229538 2141981 2132500 2117058 2101453 2025228 2109593
5026 2109593 2105040 2104988 2083117 2061875 2051332 2011215 2026135 2071693 2090312 1934976 1878292 1793097
5014 1793097 1828020 1790017 1629800 1584379 1568291 1477968 1557856 1605014 1582576 1541002 1521332
5003 1521332 1456423 1320419 1421802 1403897 1300267 1325074 1397787 1437651 1249869 1195689 1119771
4992 1119771 1267062 1274296 1298494 1427386 1425182 1314176 1207801 1196080 1166463 1119889 1101178
4981 1101178 1109967 1083767 1079388 945669 973044 1033430 989429 1020729 1011818 1019741 992625 875969
4969 875969 976941 993965 1009931 975521 1019008 991345 1003308 1027099 958206 1005930 1008157 1036714
4957 1036714 984761 939040 967018 1005140 914098 900360 983118 1055714 966783 991270 992595 919841
4945 919841 897336 940616 950402 1018340 994510 843158 926885 971581 851112 855127 924385 947738
4933 947738 900325 972222 992064 983953 979808 975375 999187 908537 1001250 1068302 1056244 1087868
4921 1087868 1236174 1277591 1279207 1335687 1386949 1462125 1482827 1646845 1824225 1955660 1888204
4910 1888204 1822750 1717440 1409435 1276325 1277197 1325222 1269155 1234200 1136956 1169376 1211065
4899 1211065 1158639 1168020 1175190 1093641 1194469 1221784 1335187 1440854 1500088 1538409 1651452
4888 1651452 1695836 1871951 2035676 2249945 2544400 2858429 3080851 3029203 2813515 2430126
4878 2430126 2108967 1843743 1552228 1389753 1415591 1335618 1375975 1361093 1214105 1220678 1294463
4867 1294463 1275280 1225874 1273281 1174975 1165950 1189888 1111504 1202738 1194412 1220848 1264119 1328521
4855 1328521 1477047 1611214 1693197 1801790 1793416 1703500 1545955 1438058 1226105 1115009
4845 1115009 918667 834448 765612 694945 737396 818347 762567 746030 672098 627374 587180
4834 587180 597268 543956 568401 574734 538032 590812 456937 424160 463046 457932 370667 360335
4822 360335 463393 439080 461685 364715 372956 397682 296636 334160 195418 280302 399140
4811 399140 314851 262436 253554 218574 253592 329715 351743 234209 229575 307490 214031 123215
4799 123215 46782 120057 92439 120917 141650 113584 111019 108127 212971 179591 136096 136269
4787 136269 197589 120286 98977 9296 128010 60344 4096 -35668 -22220 16125 27005
4776 27005 -21980 30208 80226 122496 39101 72416 45495 73709 76944 92541 94379 38493
4764 38493 96039 65278 -35534 47927 42652 -22609 -36857 -20523 22927 -20122 19985 82927
4752 82927 93974 17100 -68715 -23155 124088 104068 120372 74931 34377 -10472 16486 6615
4740 6615 -10474 -97407 -44501 -45833 -40298 -53078 -18633 -2678 -7679 -33466 -390 18982 45656
4727 45656 26170 28880 34878 29304 -46774 26573 72882 72649 16943 -10699 70793 115071 88670
4714 88670 50904 117363 107972 52228 47704 86393 15269 -43125 47208 -22293 -88732 -42826
4702 -42826 -1319 72268 135617 137789 77697 7102 -24761 22439 73465 51293 49470 76412
4690 76412 139071 53317 56755 123325 100850 153907 167930 122847 40550 67309 24089 61799
4678 61799 59756 40291 38196 47279 80536 51523 61047 41921 -28836 -23962 95299 73113 93053
4665 93053 104239 41555 -16108 -27946 33561 -60205 -72283 73799 57245 -21782 -84848 -46210
4653 -46210 10724 23716 38351 62075 19055 -66754 -89957 -87785 -63412 -12294 -36997 -89876
4641 -89876 82323 20678 48600 50805 35056 32659 73516 85391 -26194 -47280 -16908 -87947
4629 -87947 -126492 -135149 -149988 -51974 -61127 24576 42548 55634 46715 -87182 -85109 -14126
4617 -14126 -9095 -12122 29844 -5804 18783 -22376 55030 60590 6853 34693 -91023 -142048
4605 -142048 -26857 6233 -29971 -67877 -89771 -24865 158308 98344 -71334 -54484 -29277
4594 -29277 60049 -209 -102312 -66816 -57108 -30716 41322 -6017 -15316 32227 -3449 15471
4582 15471 -17535 24623 19865 52606 64281 -14474 -72009 -71069 58410 53646 -38005 16311
4570 16311 60504 -72661 -103207 -131883 -60229 -63462 -107322 -61477 -2406 74445 53827 -13429
4558 -13429 -28670 -57617 -56207 -101833 -86053 -146728 -67094 -4546 -10290 38667 10990 -23267
4546 -23267 -88327 -125662 -12286 -91771 -155501 -58752 -47020 -75348 -21662 94158 54359
4535 54359 -12586 -59353 50138 55745 -61736 -67563 -13606 12380 61080 87208 62119 65972
4523 65972 36621 -46309 -7030 -10444 -50982 -129085 -23234 -147587 -186956 -118484 -105015 -32550
4511 -32550 11165 13356 -59230 -78786 -91213 45787 95230 98275 12752 15027 1588 -25501
4499 -25501 45305 19319 -100133 8311 -37836 6453 36130 -13350 42063 37559 75943 54019
4487 54019 89377 66466 60625 171528 167633 107481 166540 140419 119005 95718 142290 199668
4475 199668 99671 158973 136859 172858 259427 187992 137984 50026 107912 -3554 33005
4464 33005 8725 47059 49798 50246 145136 86124 87132 4171 -44215 -72092 59987 38161
4452 38161 -72662 -160182 -17633 93801 54334 71014 25268 -38740 60322 67605 32303
4441 32303 -17799 -45853 58274 128651 106073 27179 31588 8931 3645 -2289 37936 70095
4429 70095 91245 82250 89673 140593 82640 64783 63700 45919 96175 127923 126532 129111 102832
4416 102832 110647 123531 87028 89999 88722 118111 161761 111447 100628 51904 94510 97090
4404 97090 129537 162723 181034 277880 157550 140979 209800 181728 90259 140265 173344 119648
4392 119648 158067 171069 131921 187490 190388 292474 229148 190903 135440 114338 189067 280927
4380 280927 308435 277996 277947 205866 220944 351875 316405 306852 465925 481576 459424 474119
4368 474119 485741 553281 615017 540011 433154 421950 426449 449764 412934 301503 333995
4357 333995 330517 372510 395820 218586 172404 285096 322071 246163 270958 352406 355945 380927
4345 380927 306906 224967 156515 261676 321811 346493 324258 317084 371129 366847 421013 399979
4333 399979 380561 390603 381286 363770 296688 298405 315016 265996 248893 292544 224839 247677
4321 247677 231352 296389 271263 215065 330239 374609 332706 284279 291468 377066 330387 316546
4309 316546 382597 330633 359444 404280 393282 361790 296547 337191 335146 284612 321168 317177
4297 317177 407247 367578 350154 317384 338299 355678 293764 306027 301642 233337 267632 287450
4285 287450 270979 355506 387223 270274 283560 412800 292907 421062 483758 408193 438758
4274 438758 494346 600803 488109 464593 483959 571005 577263 538190 655639 664000 617611
4263 617611 652405 663457 658069 677377 620175 509344 571684 603807 651943 727684 770203 852020
4251 852020 984659 1036404 1210320 1432831 1520170 1530712 1503689 1288455 1154017 1191502 1127341
4240 1127341 1086460 1142567 1241681 1247157 1239683 1148492 1080296 1020400 944259 940022 932628 834526
4228 834526 835676 825761 832301 921172 981308 976365 1076289 1028514 1102977 1165249 1132985 1160060
4216 1160060 1115419 1093703 1050236 908522 981782 1059611 1020804 1056514 1079080 1122560 1167415
4205 1167415 1147194 1104514 1122411 1261191 1371765 1234741 1271375 1235331 1369894 1520058
4195 1520058 1550258 1650201 1692874 1772018 1783834 1878278 1979334 1951286 1986494 2051938 1918504
4184 1918504 2009657 2098896 1973598 1847771 1801334 1791520 1767218 1841834 1897403 1912383 1887007
4173 1887007 1841217 1844817 1996562 1950699 1981046 2027855 2153059 2221518 2121562 2246229 2239501
4162 2239501 2393664 2515563 2563811 2610132 2705212 2750265 2756138 2823305 2846550 2858551 2723795
4151 2723795 2746348 2737206 2660869 2609150 2620672 2687363 2681906 2744064 2716442 2732257 2696473 2754896
4139 2754896 2740360 2649249 2685255 2683182 2762761 2789617 2754305 2822886 2998447 2966189 2902715
4128 2902715 2932237 3046104 3046537 3089086 3213478 3260681 3303225 3450807 3481488 3452164 3545369
4117 3545369 3510373 3432181 3407117 3307168 3279264 3327868 3216300 3295464 3317264 3203248 3220870
4106 3220870 3235843 3216696 3152647 3219384 3304219 3432995 3455824 3506054 3562479 3472874 3518656
4095 3518656 3613634 3691142 3725247 3803193 3929837 3897180 3955767 3950322 4075278 4231875 4072075
4084 4072075 4129844 4161504 4121412 4091298 4023914 4082407 4201473 4274149 4117587 4124659 4197639
4073 4197639 4332913 4442935 4472982 4444271 4505312 4631673 4765452 4834976 5014973 5024292 4949537
4062 4949537 5069244 5020679 5127996 5218228 5437271 5508224 5567258 5688218 5635286 5742706
4052 5742706 5794230 5760504 5917965 5986335 6078147 6104212 6263078 6389701 6588375 6784340
4042 6784340 6907133 6952187 7164793 7323119 7466918 7544695 7579709 7802013 7909255 8010887
4032 8010887 8180729 8381598 8557428 8668208 8846003 9022747 9165165 9384269 9499288 9627742
4022 9627742 9809451 9898120 9921462 10087540 10281717 10435905 10630757 10801485 10925354 11145144
4012 11145144 11299353 11545806 11789896 12026702 12283557 12533782 12712732 12919585 13167101
4003 13167101 13357596 13629325 13911929 14172399 14413315 14684010 14915045 15233338 15556782
3994 15556782 15851204 16297460 16740917 17317400 17834642 18431227 19028079 19634328 20303133
3985 20303133 20994798 21753914 22547659 23507766 24465813 25441551 26287713 27252371 28257239
3976 28257239 29373347 30661633 32053098 33468672 34995305 36774163 38719025 40991921
3968 40991921 43727781 47020919 50807854 55309801 60492216 66516766 73931030 83147292
3960 83147292 94188276 108075466 125912069 148209038 172743106 193402298 203117971
3953 203117971 196498632 173802663 147131342 128638399 118788770 115328342 116828927 121321707
3945 121321707 126075505 127821134 123949660 113406926 99946949 89473022 83073224 79426575
3937 79426575 77786020 77904551 79195330 81227669 83111797 84083235 84022490 82924077 81111386
3928 81111386 78739064 75633198 71974011 68562921 65931800 64306171 63408173 63226446
3920 63226446 63457650 64021981 64935269 66070922 67690014 69857700 72636458 75935025 79828921
3911 79828921 84425979 89946024 96576494 104929199 114984112 126566204 138513390 148991940
3903 148991940 156695925 160841381 162038128 162245850 161831401 159497787 154701556 147387798
3895 147387798 138209224 128947672 121936230 117677411 115954122 116151679 117684590 120270318
3887 120270318 123613550 127084036 129906589 131683979 132751218 133728826 135315570 138242405
3879 138242405 143191111 150797182 161160171 173877891 187845477 201013938 211466565
3872 211466565 217094892 218821771 218223240 217272619 218227397 220573103 221963923 220071334
3864 220071334 214702843 207546057 200223205 193876423 188666278 184148324 180664375 178613519
3856 178613519 177762668 176370355 173348938 168220709 162135120 156301390 151407922 148105776
3848 148105776 146714946 147541207 150705349 155399316 160642305 165224660 168533005 170756589
3840 170756589 173279218 177941589 185484221 195797754 207051666 216789642 222329045 221643943
3832 221643943 213960543 201224154 186080902 169779192 155767274 146104880 139661187
3825 139661187 134891164 130665505 126176503 120976655 115399739 109850395 104676776 100603401
3817 100603401 97702860 96024490 94821658 93874599 93265763 93276041 94241923 96290144 99450100
3808 99450100 103670702 108706473 113864651 117741155 118755676 116093364 109688646 101629554
3800 101629554 93279679 86196559 81231820 78138715 76138392 74661367 73203493 71280003
3792 71280003 69206233 66999395 64798341 62938329 61439932 59963048 58619267 57353933
3784 57353933 56102021 55193200 54865108 55194415 56127078 57770558 59670171 61578697 62772791
3775 62772791 62690548 61286188 59025816 56661503 54713041 52994311 51514862 50192686
3767 50192686 49030986 48020242 47143760 46578993 46460287 46348886 46526807 46761395 46856831
3758 46856831 46933392 47126511 47506172 47927352 48519029 49346113 50341752 51427857 52765675
3749 52765675 54181287 55660965 56861076 57855404 58793981 59365957 59094776 57982286 56196331
3740 56196331 54036490 52290997 51171485 50511570 50241649 50151800 50381635 50724881 51155699
3731 51155699 51960010 53371061 54841604 56732678 59015942 61255372 63594871 65868367
3723 65868367 68287713 71020651 73995089 77358982 81222402 85702969 90957239 97556307
3715 97556307 104835780 111557996 116740942 119938352 120697735 118879459 115199924 110270701
3707 110270701 104076747 98382873 94214770 91116318 88970347 87847945 87656897 88340340
3699 88340340 89968129 92498035 96144949 100701676 106192447 112631348 119873991 127756507
3691 127756507 135963964 144567883 153827801 164479816 176993982 190837813 204139833
3684 204139833 213986639 217994257 214880734 207271936 197304947 185809880 175871717 168520812
3676 168520812 163369259 160281310 158869551 158009917 155994586 152271734 147443565 142774343
3668 142774343 139631164 138980151 141128715 145603027 151573264 158243627 164418561 169105433
3660 169105433 172091012 174221820 176323671 179455277 183912657 188530691 192219944 194993950
3652 194993950 197702677 200362289 202607092 204728263 206056512 206764994 207393758 207082456
3644 207082456 204238446 197857984 187235863 173951718 160386058 147184642 135941244
3637 135941244 128101676 123172981 120399897 118783472 117536805 115889125 113575894 110632368
3629 110632368 107774870 105830479 105481959 106795420 110198001 115507292 122294377 130215212
3621 130215212 138370031 145663151 150943210 153750607 154042726 152347432 149136474 144506658
3613 144506658 137776602 128942051 118041659 105596089 94058766 85142253 78474546 73477038
3605 73477038 69616015 66866007 64730766 62994018 61562496 60102498 58463262 56811530
3597 56811530 55534558 54885194 54808794 55427820 56656050 58341300 60219417 61621986 62057529
3588 62057529 61612310 60373621 59005688 57687878 55803464 52985909 49221220 44962594
3580 44962594 41097572 37890929 35531672 33637803 32027351 30823872 29467030 28351829
3572 28351829 27330125 26165779 25033986 24044300 23019590 22146070 21318692 20511860 19840258
3563 19840258 19200935 18642556 18128523 17630434 17115485 16708820 16253915 15888561 15595101
3554 15595101 15264882 14976741 14624302 14384942 14064463 13733042 13502817 13249765 13004270
3545 13004270 12617284 12327679 12086341 11694998 11502116 11223502 10929704 10770332 10557597
3536 10557597 10347862 10084234 9847213 9678632 9540491 9397205 9264040 9039121 8911862
3527 8911862 8759897 8586142 8436969 8369494 8170066 8033553 7930203 7822745 7632625 7424351
3517 7424351 7312891 7264147 7149848 7070573 7023955 6907805 6710341 6491212 6250594 6147553
3507 6147553 6004980 6003203 5881452 5706238 5640249 5614653 5548324 5427395 5304341 5133886
3497 5133886 5124119 5088039 5028285 4996916 4934248 4783758 4739146 4603269 4545842 4563686 4546475
3486 4546475 4444241 4401383 4345382 4353681 4359865 4317978 4214771 4168105 4087393 3934091 3934197 3876292
3474 3876292 3765145 3718631 3820255 3801069 3696113 3661852 3542757 3466978 3352074 3395577
3464 3395577 3404476 3370869 3289392 3252664 3225665 3240052 3155590 3114508 3065666 3082606 2993187 3010923
3452 3010923 2996965 2932403 2917267 2875399 2854542 2782221 2801296 2822660 2802287 2817323 2851038
3441 2851038 2778130 2726609 2595757 2607608 2666219 2780551 2753038 2722372 2783694 2862848 2799879
3430 2799879 2767916 2896635 2845390 2738274 2781170 2848761 2801198 2558769 2516676 2544547 2409894
3419 2409894 2495339 2492254 2576224 2584564 2554159 2468769 2366910 2386990 2476818 2505234 2612329
3408 2612329 2601363 2575379 2668081 2671383 2680277 2726088 2814725 2927377 2882229 2977361 3070423 2928610
3396 2928610 2900641 2947265 2876310 2828875 2840499 2765136 2800776 2823191 2803686 2642094 2674555
3385 2674555 2723732 2785630 2790875 2700485 2594881 2635444 2699869 2782247 2858529 2915338 2916481 2812829
3373 2812829 2942510 3015323 2934632 2922556 2980139 2997613 2942101 2893140 2986927 3068665 3064767
3362 3064767 3009002 2971298 3102595 3049387 2997817 2920511 2855243 2778519 2712129 2586866 2519455
3351 2519455 2466569 2551705 2590876 2674672 2732359 2601512 2579812 2663059 2700232 2606998 2566163
3340 2566163 2544012 2638012 2748002 2832929 2802146 2874278 2942810 3010244 3010759 3028332 3156791
3329 3156791 3142727 3052627 2876220 2870402 2851155 2838475 2782141 2682924 2769112 2817524 2747946
3318 2747946 2822889 2821862 2774044 2892990 2943542 2948922 3096856 3034838 3082840 3152900 3146676 3243834
3306 3243834 3333955 3388509 3418232 3430284 3429574 3498635 3569132 3627464 3697185 3685351 3756978 3870383
3294 3870383 3973804 4115732 4124973 4275751 4306565 4302023 4391731 4585996 4779329 4913976 5053846
3283 5053846 5274362 5441308 5729820 5846405 5997034 6290931 6617357 6972726 7289894 7796554
3273 7796554 8491834 9127959 9862238 10767151 11906417 13271896 15000738 17051685 19853564
3264 19853564 23212618 26915791 30259966 32303877 32527854 30217749 25946781 21546021
3256 21546021 18300450 16249106 14623150 13565785 12951110 12572697 12248595 12116063 12073681
3247 12073681 12090107 12251583 12377968 12678504 13259920 14002802 14856548 16014656 17434752
3238 17434752 19037210 21068737 23487620 26389450 30193302 34978364 41012160 47781151
3230 47781151 53763401 57807750 58985113 55369267 48146126 38965145 31366978 26306932
3222 26306932 22753458 20278153 18280370 16776027 15572927 14699065 13937611 13334551 12709025
3213 12709025 12218655 11811263 11684586 11763704 11801652 12001557 12377348 12960522 13594680 14501620
3203 14501620 15672619 17218088 19408213 21782194 24644941 27195196 29095009 29873422
3195 29873422 28613644 25786803 21659770 17560749 14477719 12359178 10915532 9802179
3187 9802179 8942922 8309196 7643311 7076034 6680248 6325133 5914678 5684313 5392130 5154807
3177 5154807 4939061 4599236 4366228 4263170 4213629 4107165 3854306 3704155 3684154 3635099
3167 3635099 3494859 3490266 3379780 3305975 3207769 3074066 3087958 2984875 2924523 2692640 2724338
3156 2724338 2626868 2495500 2433068 2499731 2420302 2203506 2202718 2318134 2230796 2212309 2111939
3145 2111939 2111435 2086653 1962454 1980248 1950170 1826763 1788713 1740779 1728329 1790068 1715990
3134 1715990 1623615 1655093 1756570 1662158 1497088 1443746 1450215 1407125 1344907 1361720 1280459
3123 1280459 1225670 1267459 1302527 1229650 1196365 1242593 1215562 1153736 1207316 1178729 1202350
3112 1202350 1098409 1059147 1088566 986057 987646 1115299 981878 948083 944111 894107 831523
3101 831523 873500 814972 624031 713435 838731 866030 882337 994353 900944 874533 785839
3090 785839 815131 756443 895731 776451 714106 686588 646640 609723 695708 720167 668578
3079 668578 644265 687778 535030 557515 666902 675189 644482 623082 625533 608754 597369 562586
3067 562586 581139 599457 536586 432836 433001 550736 638551 573934 535988 468769 400204 474944
3055 474944 622134 645067 578146 482608 505816 546834 549692 566592 538808 496513 463217 475631
3043 475631 462771 404513 467368 419294 430542 385725 339575 375727 436014 408459 437759 436856
3031 436856 377838 353566 348964 258813 340441 407424 366726 367693 500863 515050 385728 296493
3019 296493 336400 412128 430825 408939 323889 403951 458576 491770 480237 493629 518182 503059
3007 503059 315960 284870 378026 325582 328776 368977 387436 455658 451203 320966 322637 441188
2995 441188 485056 521245 433905 378809 412050 440933 297854 386904 506793 368332 392542
2984 392542 284820 287743 386799 415682 379120 368209 355769 451709 451145 467253 484537 540970
2972 540970 513322 537581 499298 451692 443160 549628 610361 438428 373642 541509 512059
2961 512059 441096 433005 498142 472310 456303 557058 606866 630331 562808 538869 552609 490521
2949 490521 452891 558455 584672 674277 703161 627951 671345 641654 639069 729194 760800 653496
2937 653496 654957 670136 558548 522150 583169 630524 509509 534996 560333 624037 642182
2926 642182 676285 633381 566115 591221 649855 649720 781925 850162 867433 952528 1017729 949215
2914 949215 886434 855633 954419 902316 954866 993284 990969 956641 948736 953682 931336 950281
2902 950281 799368 723490 742622 796431 662609 695299 826535 840939 843461 898467 905871
2891 905871 988975 1040236 1026026 1043982 1074631 1081738 1122774 1146188 1179846 1151160 1129470 1119302
2879 1119302 1027474 930502 905692 802311 713273 751405 713951 701981 679938 628543 587276
2868 587276 692614 694553 654320 697236 624653 578875 626714 605171 616487 492763 547631
2857 547631 593527 720544 661738 670672 671417 606023 566482 575141 628169 667295 563249 582227
2845 582227 531241 539468 457867 417414 462832 378278 437536 421311 368319 241154 177909 200638
2833 200638 243145 186430 256465 242341 277097 185942 259110 199632 209239 194917 148942 183065
2821 183065 138084 115497 179535 192970 146344 154524 190828 194130 219932 242816 144281 47930
2809 47930 52586 78384 126873 100949 164073 162663 194259 213327 238680 206825 148175 224514
2797 224514 189816 107024 123691 31809 73499 73837 43593 133108 160250 33397 141988 243878
2785 243878 111502 114730 184614 106047 40002 -40267 -54879 -51012 90824 181309 176448 227996
2773 227996 64348 75836 64165 60138 -26515 32822 95804 39689 68161 31503 37261 96043
2761 96043 58103 118029 103246 104486 61458 41496 -23948 911 42115 50479 28510 -40628
2749 -40628 -76460 -24112 33807 35009 67663 75290 154256 133228 147745 115057 25929 43498
2737 43498 88598 74710 11602 66741 112239 149400 64799 10148 943 36789 19843 -79508
2725 -79508 -11960 1284 99371 104695 111648 81573 66812 29171 25193 46862 -49444 -51741 9980
2712 9980 79149 130501 -7926 12696 78287 147130 105838 27435 24725 69085 37907 -56364
2700 -56364 51923 89880 67954 27799 -17347 -102653 -75844 -68356 -177423 -221888 -110766
2689 -110766 -107384 -59731 44268 80063 -2406 27533 56224 102176 -9427 -49354 -25771
2678 -25771 26080 66505 29624 24569 7758 -44526 29650 44582 -14514 52024 -39600 34194
2666 34194 98255 -31019 -40112 -79244 29063 -50601 -92887 68575 72196 67504 1916 -12043
2654 -12043 -47479 -90119 -145452 -93918 25485 61379 -73895 -32617 -7148 -18482 -30599
2643 -30599 -36121 -4872 -73899 -125174 -54070 24123 1378 -63537 -40959 6153 -121 -716 -679
2630 -679 2874 -29857 12243 -69147 19508 30660 -21145 54804 93462 54737 -33053 22704
2618 22704 142404 49226 13930 79069 80471 70989 -12460 -14683 -16866 -85310 -25577 -42506
2606 -42506 -11117 6164 32053 49473 36101 124461 114549 17852 -188853 -38854 -44363 -54176
2594 -54176 1954 -43820 38344 85534 88624 17579 4287 30334 106995 -33114 -138132 -108388
2582 -108388 -65115 -20215 7736 99486 -29521 -20377 30902 47722 -29007 -29310 -38793 124331
2570 124331 175085 77659 6760 -43305 13847 -84491 31098 146501 113179 -62760 -76897
2559 -76897 -33238 -111722 -111963 -18732 46949 -46812 -42263 -3370 -4101 -43976 -25046 2550 -63654
2546 -63654 -146383 -125664 -90168 -18355 2571 49354 123571 115001 9986 -142054 -36021
2535 -36021 -38708 -54095 68784 -64622 -91995 -12478 -58829 -137762 -25852 -38400 9155
2524 9155 5051 -47917 -29651 -194848 -183883 -54518 -102000 9113 -71550 -70970 30656 -46353
2512 -46353 -22727 701 -2125 68043 76619 -95355 -74835 -45050 25039 56830 16194 -99749
2500 -99749 -155307 -86329 -45736 -75285 -154622 -178706 -156580 -120018 20652 -6094 -102435 -145472
2488 -145472 -107845 -16358 -6603 -21743 9999 -18386 30309 85173 -19657 -82020 12950 28334
2476 28334 93999 30044 55021 -27027 -14791 -47741 44384 123409 -47066 -130900 -25845
2465 -25845 32362 -43920 -13182 -68201 -16460 36498 8801 61655 49930 -77160 -94680 -31620
2453 -31620 -74296 -97250 -44514 9656 10563 -8425 74633 -26454 55498 28186 -52602 1690
2441 1690 7692 25569 -25963 -19903 2117 45008 -25169 -51696 -47132 -104382 12286 95262
2429 95262 122690 27355 2488 1852 -33548 -26698 -39784 -45837 -70348 -11060 -36371 2833 34016
2416 34016 70922 96116 -10147 -4572 8142 41373 -73745 -118398 -26013 -8633 -43728 -59245
2404 -59245 18793 -15853 60744 100221 113989 -45100 -38815 -21093 -101813 -125819 -24827 -3574
2392 -3574 -18469 25920 -93115 31413 -62077 -118759 -94883 -145256 -151288 -111944 -7380 25452
2380 25452 2719 40043 40665 79030 34199 -35554 22629 -38053 -117527 -95685 -41062 -53602
2368 -53602 -41694 25692 -31142 17165 64050 82557 111258 64816 66996 16068 -62298 22927
2356 22927 92478 138736 250193 254753 267526 266465 286411 359893 332000 307961 234667 207592
2344 207592 149328 154430 82963 77249 102457 148928 58907 26911 43020 117565 11121 21965
2332 21965 128066 82297 43160 65674 154795 179428 95753 939 60240 63 -56070 -36075
2320 -36075 87592 6461 41534 -12122 89838 102132 51449 47122 -17677 -58673 31671 64893
2308 64893 18425 -13534 -17511 36816 74413 -5285 -33275 3486 54849 117547 258782 164400
2296 164400 83218 38789 -63022 49223 32497 45418 112723 138767 90518 74564 -15213
2285 -15213 -34551 1587 37950 37759 -34203 -53033 5723 40482 65208 25353 -32075 -90110
2273 -90110 -77194 -24410 184381 197161 101438 98871 169631 155552 102578 24431 36818 91161
2261 91161 146640 130068 45712 117141 148616 36986 98799 152110 77739 -7702 -32987 99512
2249 99512 78593 41249 179827 126373 163014 72391 118783 202522 147153 197507 239624 214003
2237 214003 190969 300341 322791 234043 121428 176650 147154 154300 276205 265596 215831
2226 215831 264818 282292 311089 246855 295239 291021 266275 125413 290162 295842 299167 296828
2214 296828 220803 188634 229557 273778 257518 159122 240506 297758 225177 269355 272428 266005
2202 266005 252080 258401 251993 193959 115139 131278 215801 327039 373661 261614 300386 404625
2190 404625 318139 246830 288500 278439 340811 370550 344684 436212 487161 532135 514851 470842
2178 470842 415554 490619 503579 480675 580704 702507 681266 654520 687799 730935 754219
2167 754219 746822 727944 727576 769606 667308 692339 768487 872464 835670 881374 918032 779763
2155 779763 913947 1065501 1047467 925493 982120 1036350 1144999 1141198 1114947 1116999 1123948
2144 1123948 1129885 1203447 1280636 1335772 1354234 1355619 1232833 1232143 1439628 1501675 1588618 1572467
2132 1572467 1530199 1599846 1631071 1603426 1623895 1634599 1739466 1792393 1646333 1642672 1789972
2121 1789972 1944287 2035048 2135656 2207533 2316032 2432254 2619870 2792617 2935530 3136885
2111 3136885 3426930 3565565 3672333 3991099 4228881 4494502 4799179 5043501 5279818 5535507
2101 5535507 6044559 6520516 7132584 7774868 8509607 9242559 9930950 10715157 11875066
2092 11875066 13277876 14923127 17097391 19895985 23315600 27578814 33075397 40161534
2084 40161534 48307062 55064404 57429887 53943378 43357337 32217379 25315999 20510857
2076 20510857 17320563 14858703 12971566 11469015 10359375 9479112 8924544 8532869 8194070
2067 8194070 7755316 7112352 6397777 5874937 5378930 5023926 4716302 4471851 4184343 3982609
2057 3982609 3754141 3605818 3509449 3448292 3243345 3125474 3015715 2855167 2763963 2752238
2047 2752238 2611680 2425088 2258270 2249772 2197452 2151080 2076322 2026852 1970870 1780792 1737955
2036 1737955 1574767 1499138 1486738 1478180 1419740 1344811 1330857 1317065 1319416 1248358 1211065 1167734
2024 1167734 1071630 1072836 1099843 1068435 1009126 1032340 990977 962600 951893 1004743 963900 944729
2012 944729 1003371 971655 871799 835405 842657 867756 819941 825475 762323 730043 797473 805016
2000 805016 759979 791199 786123 714773 610964 642584 657427 590832 606941 623650 563097 511349
1988 511349 547795 572601 573797 513884 536194 400443 317888 388594 323681 281870 419620
1977 419620 460047 392969 354701 290209 216800 259600 262477 421750 374857 345980 365180 366148
1965 366148 275752 268096 342627 336294 276602 287758 361910 313569 238089 279596 271961 265282
1953 265282 305389 249955 267471 219645 256244 199264 152104 194139 160271 303170 262865
1942 262865 257212 294445 282950 322868 200629 218723 239973 190771 229249 163254 167593 181920
1930 181920 126834 65132 145878 176083 104960 194944 129902 14860 27946 85880 39440
1919 39440 205436 266788 270396 177179 120866 237607 218048 165678 35404 37602 59452 139203
1907 139203 221361 189988 165277 141929 152022 94255 178574 132149 94978 45507 113121 126902
1895 126902 84389 137510 53495 97909 201721 151338 113307 58422 131819 92998 116874
1884 116874 167710 190218 202774 138829 104884 148433 142982 154503 83033 123179 157541 116010
1872 116010 110561 122321 158534 123069 75834 57735 39244 51275 27624 29876 30284 75782
1860 75782 168825 128222 51392 -15996 -39843 -4894 -56750 40569 137773 51430 70986 99849
1848 99849 5539 -42860 39255 79906 151644 137894 150901 174583 84278 115303 80832 851
1836 851 19153 36561 -44581 -5934 16340 -19289 -23510 30621 49163 25245 78438 66473
1824 66473 82847 101199 179972 205908 176992 201199 212423 185423 244276 340333 373859 389836
1812 389836 343631 280886 249533 160450 138787 89900 102610 119841 181601 145116 121190 48544
1800 48544 203840 155200 170377 162641 118167 68999 17738 -7410 121772 74298 91786 150083
1788 150083 17836 -5293 64159 111911 156226 113305 31278 -63983 -62968 -15334 68643 17883
1776 17883 -6855 134531 83960 42297 -18306 42757 110060 45180 -51169 -90031 -10538 -30411
1764 -30411 15717 41174 194753 100517 -10709 -30967 22390 190242 44631 -101335 -55445
1753 -55445 8131 -55034 -95552 -7340 -36700 -43327 -56291 -116950 -72513 -74057 -90088 -120728
1741 -120728 -117751 -63198 22122 -35730 50806 -33074 35783 30062 116661 66458 51915 -41225
1729 -41225 56869 123592 -19 -64948 -143355 -85850 -22549 12132 71417 71541 95725 20011
1717 20011 -156393 -103578 -39635 -51850 -1939 78462 40628 -14096 -107076 -185725 -319
1706 -319 69253 60388 52652 -19258 -128381 -82527 -71673 -64942 40311 -26668 -61422 -115095
1694 -115095 -75178 -15808 -56785 -75069 41941 35113 79014 115367 90272 145419 -81569
1683 -81569 -3283 75611 14348 31452 42867 36824 59736 26455 73044 -22246 9521 34360
1671 34360 -54100 -33515 -122644 -107402 -22716 -1651 -70325 -1724 17788 39694 1007 -48779
1659 -48779 4722 51104 68358 9731 22788 -8740 16383 21333 13490 33322 -14587 27596
1647 27596 25538 63835 -14673 -79206 -15477 -50662 -14578 55249 48602 105379 21128 10565
1635 10565 20489 -54892 4658 82730 -27540 -142002 -73625 -44648 29330 58077 -42932
1624 -42932 -30025 -66566 -104998 -34524 -12763 -87683 -69052 -100413 -2944 29172 -2693 -147768
1612 -147768 -110591 -29693 -21540 22425 -26225 -114908 -97852 -19144 -44737 16778 -7560 -20628
1600 -20628 -1072 -36997 -22219 -20139 -75590 7155 -23989 24870 28901 -49704 18004 60674
1588 60674 48601 29322 -44472 -132736 2532 6814 -26064 -46163 52365 -34788 16091 89553
1576 89553 134470 45164 -2910 121339 11845 -16032 -13758 60739 -4532 -97803 -85352 -42475
1564 -42475 56646 24175 -36363 -31998 -2909 -7894 -6811 -82861 -113015 24198 97036 -16627
1552 -16627 -7047 51997 -26196 -87853 -25897 27060 -62853 -101340 -20380 34955 -83460 -137316
1540 -137316 55326 -49907 -84700 27868 55358 48200 3861 10545 -74878 17613 -21880
1529 -21880 43762 -7484 -89852 -12435 -24427 8706 25964 63204 91477 114102 53603 -65852
1517 -65852 54109 -29815 -9859 69613 -29597 -31321 -43161 -87807 -50693 -36242 40097 12490
1505 12490 -10450 51515 -43940 -109120 -99108 28153 64873 60066 37829 13318 -4493 110633
1493 110633 40841 -116392 -178037 -85738 -7526 -45493 57309 48343 39988 13352 31112 -9482
1481 -9482 -7095 9854 772 -67977 -315 26009 -26990 -35637 4464 -65630 -44182 -30172 -65254
1468 -65254 -88968 -114693 -133094 -148623 -115767 -111128 -85044 -97867 -29184 53983 26804 16344
1456 16344 -20465 5262 -52262 -11455 13400 6265 -17592 -88127 -75353 -33217 -65208 -127936
1444 -127936 14470 -49506 -68100 -133821 -97225 -111 -21292 32760 -17883 36190 41718 27108
1432 27108 68619 -20492 -132142 20032 90616 -58824 -25278 -70230 -90152 -2169 50592
1421 50592 11476 -11513 24840 10583 -79714 -49974 40980 37047 22864 58511 31916 75209
1409 75209 47029 -52633 4215 74901 29720 -24180 -118366 -212960 -182743 -100485 -147780 -92344
1397 -92344 -20405 40099 5105 -44326 2220 -17468 -116081 -109879 -76826 -54267 -61980 -85626
1385 -85626 -38726 -83744 -151098 -94504 -101586 -200051 -103772 -23795 -74643 -94036 -119575 -170300
1373 -170300 -230685 -248930 -137312 -73826 -70663 -82639 -17806 67411 36863 -35362 -18981 -30553
1361 -30553 -77480 35317 74302 111470 15010 -47902 -91143 -111189 -119439 -85485 -130726 -52604
1349 -52604 245 -74476 -82679 27903 13079 -149933 -88754 -118458 -91525 -74415 -66369 -17459
1337 -17459 25894 -25284 -36066 49124 117338 195760 61129 -28332 112005 47415 -78529
1326 -78529 -28738 5139 64848 -17291 -6399 63919 -39164 -58421 -86379 -147550 -67173 -82857
1314 -82857 -67909 -41734 -76974 -74486 -95414 -90406 3210 44322 15877 80991 -14403 -24734
1302 -24734 31895 61570 -61202 -33045 42777 166255 95300 14931 -101612 -49855 10797
1291 10797 82913 -60242 -106257 -125489 -131166 -3075 40624 56848 39072 -40446 10022 21447
1279 21447 6235 89810 151732 104106 11223 -14667 -20681 -49169 -18138 37088 -88068 -74363
1267 -74363 -23551 128108 30734 -52638 -57890 -63023 -40360 -19828 34719 51978 -48096 -103758
1255 -103758 -93233 -42802 -733 10456 46016 63658 -56670 -78567 -138460 -153423 -78595
1244 -78595 -53640 -51792 -34039 -106944 -11056 -58675 -28846 23684 -18473 -8828 44369 11649
1232 11649 48129 50031 42317 50250 34707 -65004 -93374 -85399 -102580 -68856 -24839 44522 67103
1219 67103 85734 -30063 -371 38431 41006 57932 -31146 -5208 -36369 -15130 12029 -11297
1207 -11297 15907 -5263 18861 27072 -54629 21893 28930 -76771 -69357 -91725 -86510 -43301
1195 -43301 2426 87282 116873 24989 21809 -96406 -45717 -20494 3007 -32675 77649 77674
1183 77674 182788 169297 135328 8283 9694 65093 -4145 -37144 -102143 -8158 81259 35005
1171 35005 8737 14515 -101861 -105927 -15293 3259 -138902 -119481 20929 -37523 -56343 -57102
1159 -57102 81265 22655 -14318 -33494 -65678 15536 -41222 1256 -5493 41983 109047 96518
1147 96518 -20099 -30500 50985 68808 90336 106638 -48916 -45830 -39243 -56785 -63487 -116571
1135 -116571 -120105 -17236 42483 -14557 -64083 -8003 28192 -41106 -39019 14550 -101474 -130224
1123 -130224 -102926 -81639 -13664 -12872 -28876 -27678 39579 63733 12232 -48454 -33513 61818
1111 61818 118431 8674 192 2432 -41220 -68328 -12871 39256 -20646 -42693 -62856 -121447
1099 -121447 -82640 8950 -24179 -108893 17959 54648 -95492 4437 -376 7460 80718 53829
1087 53829 61489 -28139 13741 118724 56299 8706 -56816 -6048 -24896 -9188 678 36430
1075 36430 1261 43263 6771 -40623 -16543 38910 69273 13778 -35180 11398 5232 -52486
1063 -52486 -21482 15653 -22274 25231 1233 6682 -5077 -119972 601 -44059 -52406 22638
1051 22638 19546 15097 -99385 -135346 -67696 26273 45805 129410 38077 69435 38619 -31380
1039 -31380 -10988 -34651 69513 109496 54995 -68948 -98706 -104146 -127448 -63156 103416
1028 103416 57558 92659 47752 -46488 -66718 -39912 -38619 19792 41386 75155 23753 -39197
1016 -39197 7896 24402 -56430 -105601 -111069 -58334 61986 -30983 -42961 29933 136282 173233
1004 173233 25335 17051 36643 104826 70001 130538 25974 46465 62496 63641 6660 -28329
992 -28329 -47798 -98177 -109486 -102508 -50614 -53571 -38182 -48420 -18282 -24623 -31514 -59063 -75491
979 -75491 -1797 4441 -32006 -105448 -96544 -69615 -22703 -34316 9883 101215 10364 6451 15638
966 15638 104104 61890 -48626 -116096 -71371 42850 26938 -36545 -19059 -15048 -59136 28070
954 28070 92116 67212 -40044 -52960 15030 -95789 -176887 -160178 -183759 -132273 -82732 -94740
942 -94740 -140069 -94886 5897 13628 100665 108360 88763 78816 34797 1789 -7991 12024 -25629
929 -25629 -124611 26776 79495 -11605 -21826 7343 -52109 2323 59258 4943 -12091 70349
917 70349 19353 6816 -96498 -61889 43441 -26167 -20622 -32036 -81057 -195993 -134759 15270
905 15270 28884 8031 -19377 -107077 -21368 63217 -48270 -57967 9594 21355 -28828 -13673
893 -13673 -27068 -78949 -113219 -93589 4755 -42671 9589 97000 62739 74671 14792 22919
881 22919 86868 -47351 -84413 31571 -48538 24659 24216 -6805 -59599 -76769 49075 -106694
869 -106694 -117258 -68220 -27872 55194 308 -83436 -40308 -17757 24374 34201 -29165 -52446
857 -52446 -21829 -58181 -89649 -107374 -26709 -34854 -50238 136211 87669 -5752 -19750 144
845 144 -47293 -70025 -41682 -10823 75038 104355 20390 -9549 34404 -26925 54596 22878
833 22878 21606 101132 44565 40043 -29416 -15532 -12489 32876 -57399 -116015 -1478 -52925
821 -52925 -69568 95994 -11563 -92757 -82811 -81383 1180 -42675 -81391 -842 -70904 -121720
809 -121720 -59686 -13298 -82367 -74471 -24546 47599 154089 131684 50777 -17102 -81764 -151326
797 -151326 -202134 -98942 15514 -76845 -39990 -37366 29368 66757 7417 -154507 -127165
786 -127165 -79732 18582 25104 2544 -76423 -59941 -45283 -38120 41748 -10749 41804 78418
774 78418 9372 -25403 -16054 -16615 68328 32348 6958 64715 67071 -47005 -11001 38194 -3982
761 -3982 -15832 -59281 -37235 -6517 -15972 -26453 80058 30326 106410 -5922 16518 71042
749 71042 118815 22746 -49983 -22102 76173 7499 89178 3154 -80133 -22112 -69995 64299
737 64299 -19653 -3518 -33617 -49947 -79076 -28558 -9865 27930 -63002 -38055 106186 28886
725 28886 8846 81008 78823 -38335 -35594 -58958 -30741 9191 -83032 -73191 8945 -68496
713 -68496 -28581 12206 -103551 -57757 2049 84963 172563 161776 108316 69735 104628 132534
701 132534 48327 101191 123473 222466 115775 -29314 30647 135903 46924 41346 2612
690 2612 10012 -49264 48205 13567 -19528 -45366 -69987 -78011 -19773 -9531 62703 61866 -42593
677 -42593 -65273 -129797 -112529 29057 43661 -25756 -51548 -63457 -53841 -104518 -7071 20396
665 20396 -16474 -61140 -68460 -40269 10490 -611 -47585 12591 11515 52932 93844 24382
653 24382 8370 49501 48973 25671 22799 -123032 -117914 -12444 9458 48632 28392 1274
641 1274 -29839 -15678 -59432 -167796 -43572 85884 58269 38178 34036 -37169 -6829 62164
629 62164 89519 -33326 56431 41994 52134 30998 8058 90255 -2260 42184 98761 69298
617 69298 37401 78984 90821 20850 -46025 18613 -35191 -6897 -69482 -74944 126514 104796
605 104796 84425 43182 -24879 35172 121021 78864 95626 15627 17608 423 -41946 6076
593 6076 51733 96394 87070 43301 -19551 -79466 36692 59122 37754 -995 -10955 -28160
581 -28160 34081 -11521 43610 41139 -19500 -62253 -21628 -45222 -29583 68673 36351 61330
569 61330 34911 72698 48128 74596 -6401 -59794 -16376 52898 120996 85093 99235 70906
557 70906 -15729 6958 -19516 -13137 19982 102264 117311 19625 -3241 -101273 -65066 -6723
545 -6723 -31572 -46858 -74744 -105328 -65430 -258 65242 81725 -800 7279 67880 111085
533 111085 34992 92363 165575 42623 76861 112814 84012 61768 47542 105958 -14040
522 -14040 23160 18113 13676 4013 -116799 -72205 -61111 -7607 24733 24741 40489 26688 80648
509 80648 46659 137476 166017 137849 10050 -32327 69546 152355 82510 33902 83073 30080
497 30080 -62427 -94445 -55531 31376 98829 115747 147123 104140 79102 81674 32954 42298
485 42298 62661 34604 11300 -44389 20363 124429 100898 63448 63642 29321 87137 683
473 683 -55722 49247 75230 148221 177779 160450 1508 -66153 -20721 -2143 94799 94600
461 94600 28026 21144 30735 152329 189529 -7791 -32425 -31930 -45463 61704 98186 45324
449 45324 -14161 -9321 -30433 -10215 14708 -51457 -34529 -47581 8202 -70722 -71937 -27305
437 -27305 -72065 3981 -550 93358 127885 92620 101325 85852 93481 98684 23790 3953 37607
424 37607 -25280 89719 38071 15591 92305 117194 137190 110452 -12823 -40723 69751
413 69751 33461 80326 73024 70037 51477 17283 5644 -7596 -83774 60942 26464 -68157
401 -68157 -100811 -110613 -115776 -162411 -77342 -34493 6025 77150 77011 -99 4871 14862 -70238
388 -70238 -62084 51562 55499 107487 30273 38822 -28729 -112340 -37356 45878 7054 629 57832
375 57832 -55981 -112883 -74105 -17217 -12286 67895 39973 10762 -113685 -93661 7660 -56610
363 -56610 -81241 -120812 -165233 -218340 -110532 -5933 -29864 -66792 -27692 -22464 -41530 -85182
351 -85182 -73682 36675 105000 -33160 -104247 -106410 -116204 -20294 -52952 -59054 41153 53411
339 53411 12224 -67914 -69951 -37738 54494 50837 77419 117188 52743 17350 -20408 -19225 67069
326 67069 106628 56208 8868 121745 85772 44552 83899 20210 44071 -52666 -8937 66370
314 66370 77892 57384 20721 -50772 -104960 37572 59006 122735 59026 18939 77826 107450
302 107450 48684 -90247 -40925 -27444 -16011 59643 2577 -42753 -103216 -80935 18816 1277
290 1277 -42715 -5612 -7589 -28320 -120747 -197571 -162325 -106176 302 52995 -4975 -120364
278 -120364 88849 154888 46322 -23356 -8474 -5326 -97279 18843 -48894 -72466 57757
267 57757 -123469 -67683 48297 31233 47214 23825 -26059 -154310 -156336 -51195 -71837
256 -71837 -52022 -103121 -69005 -49369 8128 4457 -44349 -45836 20795 45346 18976 26345 -80521
243 -80521 -6438 -37807 30494 52444 -8134 18729 8710 64167 -81902 -1920 10501 -21406
231 -21406 -60029 -39821 28040 64369 100269 -58842 -109057 -84421 11779 -3968 7951 34017
219 34017 27784 -20676 -29455 -67975 -34051 -27331 16482 -28315 97390 49244 7591 56765
207 56765 -36378 60838 87258 44433 51905 138459 120312 33162 10093 -71909 -2108 98106
195 98106 163879 161517 75440 63719 -26171 112514 4652 -39497 43693 14979 -8533 88719
183 88719 7867 18479 54003 -10607 -42051 -76142 -78514 58911 72723 -13869 18391 -36302
171 -36302 -57273 -32056 -21143 -18639 -24885 51548 52307 65587 8170 -27623 8487 -46944 16417
158 16417 23070 -42459 -104942 -66795 60363 106200 -74707 -18399 -38553 8182 82887 -34251
146 -34251 -103038 -54166 3331 9185 -12603 -11880 -10130 -40465 -108930 -69644 -34606 7264 68562
133 68562 44437 12512 82832 150898 62252 44806 60119 -4571 13719 -1548 28154 16614
121 16614 -32231 101487 107688 54400 43467 60101 89242 54113 97470 208625 90171 -42269
109 -42269 -23732 -36652 2482 55493 -13977 -70580 24150 63388 23355 46624 24957 40160
97 40160 57456 -10332 -43693 81445 81794 13444 -6263 45529 116533 85803 48954 -10932
85 -10932 -32428 -41954 6243 19819 -35740 -45332 35652 -7346 -51424 -65552 -1524 -40830 -27052
72 -27052 6732 46467 89102 55769 2886 10215 44295 17024 -37639 35272 11865 47975
60 47975 130531 82329 58590 47201 95331 46198 13793 46512 67556 34684 86377 83215
48 83215 -15903 8342 -2947 -50397 29732 -21468 16650 -59907 -45234 -81002 -63471 -13894
36 -13894 -95477 -12106 -14214 -20110 37939 106721 57591 910 41113 -883 -5239 46274 10034
23 10034 53129 100327 88601 47924 158414 132532 17654 41019 -27319 -8280 63951 103625
11 103625 88835 49121 -87434 -5727 29694 32096 8233 8818 17690 73237 73215
0 73215
$$ Imaginary data points
##PAGE= N=2
##DATA TABLE= (X++(I..I)), XYDATA
16383 -2203534 -2155074 -2152009 -2178342 -2080309 -2036254 -1991441 -1989871 -1899828 -1884631 -1908950 -1852097 -1784735
16371 -1784735 -1737929 -1754883 -1716851 -1660032 -1631834 -1546058 -1550262 -1515857 -1464821 -1449384 -1366265
16360 -1366265 -1338115 -1341012 -1398355 -1336857 -1258570 -1185820 -1164518 -1194733 -1136845 -1133542 -1135363 -1127364
16348 -1127364 -1020429 -1033806 -902850 -868277 -867298 -765363 -752172 -742205 -681309 -738854 -684922
16337 -684922 -716092 -644656 -611289 -519841 -511177 -531907 -516419 -516298 -554646 -423463 -337514 -284093
16325 -284093 -258945 -329326 -303967 -241065 -239665 -228631 -83709 -86340 -50532 -47565 -62106 37837
16313 37837 62752 74504 157912 171873 140303 227076 317482 302168 303748 272744 381031 349084
16301 349084 361709 448638 502253 494394 363158 407799 521817 456147 509006 610775 705385
16290 705385 704696 705281 741259 786227 746422 828820 840974 767296 845629 889191 861091 948758
16278 948758 885811 940258 1009256 1067015 1073240 1176484 1194378 1140148 1107180 1188503 1212105
16267 1212105 1254761 1344540 1271976 1220149 1204000 1271310 1288155 1400903 1390491 1427222 1429895
16256 1429895 1484472 1535329 1492375 1435064 1496178 1549898 1588087 1602206 1523004 1615800 1739185
16245 1739185 1711495 1677233 1746199 1744775 1785259 1774299 1778818 1783737 1828606 1880222 1879518 1868987
16233 1868987 1893835 1936509 1894688 1858856 1942067 1956994 1942865 1955293 2055692 2132000 2051653
$$ [...]
##END NTUPLES=NMR SPECTRUM
##END=
