##TITLE=1H_EC-3224(7-1)
 CDCl3
 8 sc, 
 20.1.2022
##JCAMPDX= 6.0         $$ Bruker NMR JCAMP-DX V2.0
##DATA TYPE= NMR SPECTRUM
##DATA CLASS= NTUPLES
##ORIGIN= UXNMR, Bruker Analytische Messtechnik GmbH
##OWNER= root
$$ XWIN-NMR		Version 3.5
$$ Thu Jan 20 12:49:48 2022 Russian Standard Time (UT+4h)  she@DPX200
##.OBSERVE FREQUENCY= 200.131346
##.OBSERVE NUCLEUS= ^1H
##.ACQUISITION MODE= SIMULTANEOUS
##.ACQUISITION SCHEME= undefined
##.AVERAGES= 8
##.DIGITISER RES= 18
##SPECTROMETER/DATA SYSTEM= spect
##.PULSE SEQUENCE= zg30
##.SOLVENT NAME= CDCl3
##.SHIFT REFERENCE= (INTERNAL, CDCl3, 0, 15.7248)
##AUDIT TRAIL= $$ (NUMBER, WHEN, WHO, WHERE, WHAT)
$$ ##TITLE= Audit trail, XWIN-NMR		Version 3.5
$$ ##JCAMPDX= 5.01
$$ ##ORIGIN= Bruker BioSpin GmbH
$$ ##OWNER= she
$$ F:/spectra/data/she/nmr/H-F/1/pdata/1/auditp.txt
$$ ##AUDIT TRAIL=  $$ (NUMBER, WHEN, WHO, WHERE, WHAT)
(   1,<2022-01-20 12:48:30.29 +0400>,<she>,<DPX200>,
      <created by zg, POWCHK disabled, PULCHK disabled
       configuration hash MD5:
       00 E9 B6 7A A2 85 ED C7 34 08 36 98 17 FE 4E 26
       data hash MD5: 16K
       B7 27 D2 BE 4C 7F 2B F6 10 51 F5 DE 89 A2 38 AF>)
(   2,<2022-01-20 12:48:36.31 +0400>,<she>,<DPX200>,
      <Start of raw data processing
       efp BC_mod = 2 LB = 0.24 FT_mod = 6 PKNL = 1 PHC0 = -15870.69 PHC1 = 13.80078 SI = 16K 
       data hash MD5: 16K
       A6 67 66 A6 E9 69 5E 39 87 EB 30 CE BF C0 E1 F4>)
(   3,<2022-01-20 12:48:51.71 +0400>,<she>,<DPX200>,
      <pk PHC0 = 2.147205 PHC1 = -3.4 
       data hash MD5: 16K
       C1 21 D8 88 DF EF EE 10 CA 4F E1 88 50 30 80 D9>)
(   4,<2022-01-20 12:48:55.18 +0400>,<she>,<DPX200>,
      <abs ABSG = 5 
       data hash MD5: 16K
       99 6D DD 11 26 2F 61 C8 46 C1 00 D0 8F 76 5A D9>)
$$ ##END=
$$ 
$$ hash MD5
$$ FA 71 26 1C 43 A0 45 A8 2B 22 CD 73 49 26 54 19
##$RELAX= 
##$RELAX= 
##$RELAX= 
##$RELAX= 
##$RELAX= 
##$RELAX= 
$$ Bruker specific parameters
$$ --------------------------
##$DU= <F:/spectra>
##$EXPNO= 1
##$NAME= <H-F>
##$PROCNO= 1
##$TYPE= <nmr>
##$USER= <she>
##$AMP= (0..31)
100 100 100 100 100 100 100 100 100 100 100 100 100 100 100 100 100 100 
100 100 100 100 100 100 100 100 100 100 100 100 100 100 
##$AQSEQ= 0
##$AQ_mod= 1
##$AUNM= <au_zg>
##$AUTOPOS= <>
##$BF1= 200.13
##$BF2= 200.13
##$BF3= 200.13
##$BF4= 200.13
##$BF5= 200.13
##$BF6= 200.13
##$BF7= 200.13
##$BF8= 200.13
##$BYTORDA= 1
##$CFDGTYP= 0
##$CFRGTYP= 5
##$CHEMSTR= <none>
##$CNST= (0..31)
1 1 145 1 1 1 1 1 1 1 1 1 1 1 1 1 1 1 1 1 1 1 1 1 1 1 1 1 1 1 1 1 
##$CPDPRG= <>
##$CPDPRG1= <>
##$CPDPRG2= <>
##$CPDPRG3= <>
##$CPDPRG4= <mlev>
##$CPDPRG5= <mlev>
##$CPDPRG6= <mlev>
##$CPDPRG7= <mlev>
##$CPDPRG8= <mlev>
##$CPDPRGB= <>
##$CPDPRGT= <>
##$D= (0..31)
0 1.2 0 0 0 0 0 0 0 0.06 0 0.03 0 0 0 0 0.0002 0 0 0 0 0 0 0 0 0 0 0 0 
0 0 0 
##$DATE= 1642668509
##$DBL= (0..7)
120 120 120 120 120 120 120 120 
##$DBP= (0..7)
150 150 150 150 150 150 150 150 
##$DBP07= 0
##$DBPNAM0= <>
##$DBPNAM1= <>
##$DBPNAM2= <>
##$DBPNAM3= <>
##$DBPNAM4= <>
$$ [...]
##$SUBNAM2= <"">
##$SUBNAM3= <"">
##$SUBNAM4= <"">
##$SUBNAM5= <"">
##$SUBNAM6= <"">
##$SUBNAM7= <"">
##$SUBNAM8= <"">
##$SUBNAM9= <"">
##$SW= 18.0517287032376
##$SWIBOX= (0..15)
0 0 2 0 0 0 0 0 0 0 0 0 0 0 0 0 
##$SW_h= 3612.71676300578
##$TD= 16384
##$TD0= 1
##$TE= 0
##$TE2= 300
##$TE3= 300
##$TEG= 300
##$TL= (0..7)
0 120 120 120 120 120 120 120 
##$TP= (0..7)
150 150 150 150 150 150 150 150 
##$TP07= 0
##$TPNAME0= <>
##$TPNAME1= <>
##$TPNAME2= <>
##$TPNAME3= <>
##$TPNAME4= <>
##$TPNAME5= <>
##$TPNAME6= <>
##$TPNAME7= <>
##$TPOAL= (0..7)
0.5 0.5 0.5 0.5 0.5 0.5 0.5 0.5 
##$TPOFFS= (0..7)
0 0 0 0 0 0 0 0 
##$TUNHIN= 0
##$TUNHOUT= 0
##$TUNXOUT= 0
##$USERA1= <user>
##$USERA2= <user>
##$USERA3= <user>
##$USERA4= <user>
##$USERA5= <user>
##$V9= 5
##$VALIST= <valist>
##$VCLIST= <CCCCCCCCCCCCCCC>
##$VD= 0
##$VDLIST= <DDDDDDDDDDDDDDD>
##$VPLIST= <PPPPPPPPPPPPPPP>
##$VTLIST= <TTTTTTTTTTTTTTT>
##$WBST= 1024
##$WBSW= 4
##$XGAIN= (0..3)
0 0 0 0 
##$XL= 0
##$YL= 0
##$YMAX_a= 387275
##$YMIN_a= -559113
##$ZGOPTNS= <>
##$ZL1= 120
##$ZL2= 120
##$ZL3= 120
##$ZL4= 120
##$ABSF1= 15.75791
##$ABSF2= -2.29394
##$ABSG= 5
##$ABSL= 3
##$ALPHA= 0
##$AQORDER= 0
##$ASSFAC= 0
##$ASSFACI= 0
##$ASSFACX= 0
##$ASSWID= 0
##$AUNMP= <proc_1d>
##$AZFE= 0.1
##$AZFW= 0.1
##$BCFW= 0
##$BC_mod= 2
##$BYTORDP= 0
##$COROFFS= 0
##$CY= -3
##$DATMOD= 1
##$DC= 0
##$DFILT= <>
##$DTYPP= 0
##$F1P= 0
##$F2P= 0
##$FCOR= 1
##$FTSIZE= 16384
##$FT_mod= 6
##$GAMMA= 0
##$GB= 0
##$INTBC= 1
##$INTSCL= 0
##$ISEN= 128
##$LB= 0.24
##$LEV0= 0
##$LPBIN= 0
##$MAXI= 10000
##$MC2= 0
##$MEAN= 0
##$ME_mod= 0
##$MI= 1.114404
##$NCOEF= 0
##$NC_proc= -6
##$NLEV= 6
##$NOISF1= 3.799351
##$NOISF2= 2.8
##$NSP= 0
##$NTH_PI= 0
##$NZP= 0
##$OFFSET= 15.72485
##$PC= 1
##$PHC0= -15868.54
##$PHC1= 10.40078
##$PH_mod= 1
##$PKNL= yes
##$PPARMOD= 0
##$PSCAL= 0
##$PSIGN= 0
##$REVERSE= no
##$SF= 200.130005343705
##$SI= 16384
##$SIGF1= 3
##$SIGF2= 2
##$SINO= 5.538805
##$SIOLD= 16384
##$SREGLST= <1H.CDCl3>
##$SSB= 0
##$STSI= 16384
##$STSR= 0
##$SW_p= 3612.71676300578
##$SYMM= 0
##$S_DEV= 0
##$TDeff= 16384
##$TDoff= 0
##$TI= <>
##$TILT= no
##$TM1= 0
##$TM2= 0
##$TOPLEV= 0
##$USERP1= <user>
##$USERP2= <user>
##$USERP3= <user>
##$USERP4= <user>
##$USERP5= <user>
##$WDW= 1
##$XDIM= 16384
##$YMAX_p= 519709897
##$YMIN_p= -568431
$$ End of Bruker specific parameters
$$ ---------------------------------
##NTUPLES= NMR SPECTRUM
##VAR_NAME=  FREQUENCY,     SPECTRUM/REAL,   SPECTRUM/IMAG
##SYMBOL=    X,             R,               I
##VAR_TYPE=  INDEPENDENT,   DEPENDENT,       DEPENDENT
##VAR_FORM=  AFFN,          ASDF,            ASDF
##VAR_DIM=   16384,         16384,           16384
##UNITS=     HZ,            ARBITRARY UNITS, ARBITRARY UNITS
##FACTOR=    0.220516191357247, 1,           1
##FIRST=     3147.01425467563, 0,            0
##LAST=      -465.702508330155, 0,           0
##MIN=       -465.702508330155, -568431,     0
##MAX=       3147.01425467563, 519709897,    0
$$ Real data points
##PAGE= N=1
##DATA TABLE= (X++(R..R)), XYDATA
$$ [...]
8536B61624N325j00402N5882k3251O3472J465o0470n7397N8044l5303M9460J6655
8524B35104p0936O3657R9333q2862o9858M7196L5023J26682n6830k2345l2455
8513B71709m4492K3717j534k5184N1829k3696M8373m4129n2200m1586n4751R3208
8501B01264J4056k5252P8306n4673j09652L9788J295k0856P3968J7873q5561J7160
8489A47716j9876M3155L0557m8764Q5819L9397r962J8034q5200p4783o0397J12222
8477A77918Q5118m2155L5246j44682P7580L9083k4207l068L8098O7046m6661K1990
8465B81306o0992L5451R339M7533j25467p0893J77953p8491l7391J9332O4412
8454B62092j8996j24366J9065J50240l8743j05392j00035O372P1073K3622r260
$$ y = [261624, 266949, 166547, 222429, 199178, 262650, 264115, 203645, 146248, 204292, 168989, 218449, 235104, 164168, 227825, 327158, 244296, 174438, 221634, 256657, 383339, 326509, 304164, 271709, 227217, 250934, 249400, 224216, 276045, 252349, 300722, 256593, 204393, 162807, 108056, 201264, 215320, 190068, 268374, 213701, 104049, 143837, 145132, 124276, 198244, 216117, 130556, 147716, 127840, 170995, 201552, 152788, 238607, 278004, 268042, 286076, 200876, 126093, 65696, 177918, 263036, 220881, 256127, 111445, 189025, 228108, 203901, 200833, 238931, 305977, 259316, 281306, 220314, 255765, 265104, 312637, 187170, 116277, 294230, 215739, 178348, 197680, 262092, 243096, 118730, 137795, 288035, 249292, 143900, 43865, 50237, 121310, 144932, 135672]
8443A35672K5328Q6789o0493R106N6828N2364o8924m1999J02098Q7803q6357L2172
8431C30387K0951r6493k65884o7071J91111O7346L2080O5748n4279m1351l9056
8420A43489M0012o9053j14941R0461M0188P6994L15l0873j7813p2248P6392P9222
8408B42145r8795q4047M4208J10180o5823j64550P4653R0308N172j8992m7973
8397H6486r807K594L5795j9443J7828l761P524O2368R2878p3353p2860j485j8131
8384A06633M9511o6122P0260l9268j08527J52350k8589p834l9796K122J9521L0100
8372A40361n203L2268l5151o5174l9741M8910K5394n1909o2473K7830N7933N2283
8360A25328j7008j22315p5126Q3845L5115j4228J38046J8755K7292K8207r1055
$$ y = [135672, 161000, 247789, 187296, 196402, 253230, 305594, 236670, 194671, 296769, 384572, 298215, 330387, 351338, 254845, -11039, -78110, 113001, 180347, 212427, 278175, 223896, 182545, 143489, 183501, 114448, -493, 89968, 130156, 207150, 207465, 176592, 158779, 86531, 162923, 242145, 143350, 59303, 103511, 213691, 147868, -16682, 57971, 148279, 153451, 134459, 86486, 76679, 79273, 115068, 95625, 113453, 109692, 117216, 179584, 272462, 199109, 126249, 124764, 106633, 156144, 90022, 160282, 121014, 12487, 164837, 136248, 128414, 88618, 90740, 110261, 140361, 135158, 167426, 132275, 67101, 27360, 76270, 101664, 49755, -12718, 15112, 73045, 125328, 108320, -13995, -89121, -5276, 29839, 15611, 153657, 172412, 199704, 227911, 136856]
8349A36856j1701O8404m0597q3170P7545P5100K9806r5670q4115n0109N0448j7720
8337E5077j5162O2803j3646k2866R288M2148J7084p7956l9313R4690L619L0814
8325A46580j00732l2626Q8102J9119q170j06570j15277P4493k1524O7818O7533
8314G8746R3366p0886o9258K2308K4910N5042p2067j59475k4241J63980R1648
8303A34073m3233o0243J4325K9457k0077L7810N291m9417M6823K8232j30587Q6449
8291G8903J46546r2156j38977j9498J7945Q7275l0758r687q1661O925J1049M792
8279a9302J0724m5919m6763J02114R157o0952O1211N1464L8708p1982j28365k0035
8267a19940J60504N6858q8529j18596q8822N7269L4700N877M6669L7062J28812
$$ y = [136856, 125155, 193559, 152962, 69792, 147337, 222437, 252243, 156573, 72458, 22349, 72797, 55077, 39915, 102718, 89072, 66206, 75494, 117642, 134726, 56770, 17457, 112147, 115766, 146580, 45848, 13222, 101324, 120443, 112273, 5703, -109574, -35081, -56605, 11213, 78746, 172112, 101226, 31968, 54276, 79186, 134228, 62161, -97314, -121555, 42425, 134073, 90840, 30597, 44922, 74379, 54302, 92112, 97403, 47986, 94809, 123041, -7546, 78903, 225449, 133293, -5684, -25182, -7237, 80038, 49280, 39593, -42068, -35143, -24094, -19302, -8578, -54497, -101260, 854, 10011, -50941, 10270, 61734, 100442, 28460, -99905, -119940, 40564, 97422, 8893, -109703, -198525, -141256, -106556, -100679, -54010, -16948, 111864]
8256A11864j67982m3436O975p405Q5246l7167p462N7179j7050L3861o6392J5240
8244c6529k393K1726K370P1329N5455P5646O564L0536q6180o6157M2911r9611
8232A5667o9802P6766l6283n3049N1662J38306k0206j32107O2982l6056p488l1586
8220d1194J8264O0934l9577N5516J4707j05857m691J16548r1584N283J03150p1543
8208A9956l3476O7436R7389k8766j33409q1749J11314p2367J2N5342k2635q333
8196b9286O200m4977l033P0953M34730j41884j57066o9158l77J2164j00220J31083
8184A09129m000j33319k0080J04927l305k0384k2229L2747j07426R7714M0713
8173G4487j1865j1641q7217l3422M181n878k0049M1067P2139J3237K2303n504
$$ y = [111864, -56118, -99554, -92579, -99984, -14738, -51905, -59367, -2188, -19238, 14623, -51769, -36529, -38922, -17196, -14826, 56503, 111958, 187604, 194168, 224704, 138524, 72367, 115278, 15667, -54135, 22631, -13652, -66701, -15039, 123267, 103061, -29046, 33936, -2120, -9608, -41194, -22930, 38004, -1573, 53943, 68650, -37207, -41898, 74650, -16934, -11651, 91499, 19956, -13520, 53916, 151305, 122539, -10870, -92619, 18695, -53672, -53660, 1682, -20953, -29286, -23086, -68063, -71096, -143, 434587, 292703, 135637, 66479, 66102, 78266, -21954, 109129, 105129, -28190, -48270, 56657, 53352, 32968, 10739, 43486, -63940, 33774, 74487, 62622, 50981, -36236, -69658, -65477, -71355, -91404, -50337, 21802, 35039, 57342, 51838]
8161E1838m3492J07484p5373j29811K7180M5176l7344L3989o140j09060N6118
8150g9435M9213M0693m8174j7127O3946n4257J0873N4430j49375L3709o569m109
8138a06182L0614M9178K223K5979m0608K4506k3497j6162r554n2238J1953L386
8126a00402K0537L4827K7769N904r2383L4092R0138N3961L353Q594j0186L8156
8114A14360L2372k01450j58486R5746J35035R3990n8729n2894O8835l4818j0591
8103B3370q0893k9407L1395N4046j00391K3479j3665n062N9979J3399O9935q915
8091C7270k3465L9438n4567J502j8047j05664J9950J0518J0104L6286n7176L1081
8079g2770Q6334j1493j3148l0761o9204K9137j4386L5059J998O0478p1280o3588
$$ y = [51838, 8346, 115830, 40457, -89354, -62174, -16998, -54342, -20353, -26493, -135553, -79435, -30222, 10471, -37703, -54830, 9116, -45141, -34268, 20162, -129213, -95504, -102073, -106182, -75568, -26390, -24167, 1812, -38796, -14290, -37787, -53949, -63503, -115741, -103788, -100402, -79865, -45038, -17269, -11365, -103748, -69656, 20482, 74443, 77796, 86390, 76204, 114360, 146732, -54718, -213204, -117458, 17577, 111567, 52838, -56, 68779, 33961, 23370, -57523, -86930, -55535, -1489, -101880, -78401, -92066, -97128, -37149, -23750, 46185, 37270, 13805, 53243, -1324, 178, -17869, -123533, -103583, -93065, -82961, -46675, -103851, -72770, 13564, 2071, -11077, -41838, -111042, -81905, -96291, -61232, -59234, 1244, -70036, -133624]
8067a33624R4293J14093l9385m1719J46347p6899q7761q1911K4721M4545l8924
8056g6224k1095K9692p865j5393o5643k0007J81559k4806m4623k8187l6555L8772
8044i0375L2545j6466L2099l4659L1317R6057l9499q5144n964k0802J10729j13373
8032a03535J1186M7082n190N8251j29877M4863J7411j1383J54733o3964j43980
8021a24403P8150K6645q4114N6117O0127q4407O9635L323J39099m668p5210o9568
8009i274q2256m5434O8043J61211n8766q5146O579K0074P7971J5549o7752K2258
7997B3057L9519P8620m1067o3913j1724l9170N5765N382l6755j4982p1385j25
7985g6778K6781K3835j05542k3745J66933J5402j2595L9768l481q418k4320l2218
$$ y = [-133624, -39331, 74762, 35377, -6342, 140005, 63106, -24655, -106566, -81845, -37300, -76224, -97319, -67627, -75492, -90885, -156528, -176535, 5024, -19782, -64405, -92592, -129147, -90375, -57830, -74296, -42197, -76856, -45539, 50518, 11019, -74125, -80089, -100891, 9838, -103535, -92349, -45267, -50457, 7794, -122083, -77220, -59809, -71192, 83541, 19577, -124403, -46253, -19608, -103722, -47605, 12522, -71885, -2250, 1073, 140172, 135504, 60294, -9274, -91530, -136964, -68921, 92290, 33524, -51622, -45043, -24969, 53002, 68551, 799, 23057, 62576, 141196, 100129, 36216, 24492, -14678, 41087, 46469, 9714, -5268, -76653, -76778, -49997, -26162, -131704, -155449, 11484, 26886, 14291, 54059, 50578, 42160, 17840, -14378]
7973a4378n175j01494N4223j7019P7796Q0597j24843l0629J5060R601o2527J19341
7961E53J5530n1110n5030J05676Q9201j10311m227k1155o5144j01575J21537J27449
7949E1394l5928j7954l3714L1122M4479L8744N6759l3423j47982l9870K0148N736
7937f0489j5765K9886J29304l5353l8256m6639J082m641M040m9017l7448j3186
7925a36482L0189n801P5903PJ7273p5040M1396K9414J750n778n2492j3969M3843
7912d9787L4002k7730O237j2987O8076J14007l8480p4822m7783r062o3347Q1869
7900a9807M2710L4853j74565L9142M3416l7087Q0636n3545L1044j3100P0549k7875
7888A6371j31256O3231J20925q3897J4054N1659l1356p3923Q2064p2448l9161
$$ y = [-14378, -19553, -121047, -66824, -83843, -6047, 74550, -50293, -80922, -65862, -56261, -118788, 553, 16083, -35027, -90057, 15619, 104820, -5491, -9718, -30873, -96017, -197592, -76055, 51394, 15466, -2488, -36202, -5080, 39399, 78143, 134902, 101479, -46503, -86373, -66225, -60489, -76254, -46368, 82936, 47583, 9327, -37312, -36230, -40871, -36831, -85848, -123296, -136482, -106293, -112094, -36191, -36184, -18911, -93951, -52555, -23141, -21391, -27169, -79661, -93630, -49787, -15785, -43515, -37278, -50265, 17811, 131818, 93338, 18516, -29267, -38329, -101676, -19807, 22903, 57756, -116809, -77667, -34251, -71338, 9298, -44247, -13203, -26303, 44246, 16371, -114885, -51654, 69271, -14626, -572, 51087, 19731, -54192, 27872, -44576, -83737]
7877h3737K580j9082m3810N1124p4743O3757j8921N6392n8367R4044M8728n4072
7865c6107o5875L2833R8502k2882m7102K4773M644o2994r8129m6065J66548l3971
7853h5825n8200Q4198O1439k3455k7918o4602N4058J8149l6066J00003R386n0338
7841a9171j9299R3654r7289n727J7955J8253O972q1799l2684O3010l6449o6778
7829a59352J3406P2285O4712j7348m0954l9068o6614M5791R4241P992K9223O512
7817A0826P8397K3390o8433m0810k4646m68l5243N2770M0385o8623j803q321k7210
7804f9789K3927L1981p8364j09499J28670P5380k1330k56566k92841L77526p652
7793a98557L0897j7979M5004Q0590j8332M8753M2235n9733J154M8150L6629r4911
$$ y = [-83737, -81157, -100239, -144049, -92925, -167668, -103911, -122832, -66440, -124807, -30763, 17965, -36107, -101982, -69149, 29353, 6471, -40631, -15858, -11214, -74208, -172337, -218402, -51854, -85825, -144025, -59827, 1612, -21843, -49761, -114363, -60305, -42156, -78222, 21781, 31167, -19171, -38470, 55184, -42105, -47832, -29877, -11624, -4652, -86451, -119135, -56125, -92574, -159352, -145946, -73661, -8949, -26297, -67251, -106319, -172933, -127142, -32901, -24909, 4314, 10826, 89223, 112613, 44180, 3370, -21276, -21744, -56987, -4217, 36168, -32455, -34258, -42579, -69789, -45862, -13881, -92245, -201744, -73074, 2306, -19024, -275590, -568431, -190905, -198557, -167660, -185639, -140635, -60045, -78377, -29624, 12611, -47122, -45968, 2182, 38811, -56100]
7781e6100p2330L9498R8192p5623j1844J06589k5608o7099M0139o7321j37336
7770b28843J54149J26805p4196j061O1705J0668j15172p7538O6042j5279o0437
7759a53157P4645M496m4570N4778Q4395N5692r4602r7261L3629P7656J5894n8098
7747d6503n7276J2680M8783K9811J5549m8988k5609R8729l6292r8150n4306P3020
7735h8552N3757K1696l8643q7723O2629R2553o2574R6665K7967O6241k1174q8648
7723C4194k3539k3462j0729L708P1422n481L2204l663r9198n8923N4305O2264
7711C3102j8678J4282J0974p7482k1375J875P4907l9756o2867M4561L59q8372
7699a28470J35164L8174j35025l089J0099Q4710l0660o9216p987K7561j05784
$$ y = [-56100, -128430, -88932, 9260, -66363, -78207, 28382, 2774, -64325, -24186, -91507, -228843, -74694, 52111, -22085, -23146, 38559, 49227, -65945, -143483, -77441, -92720, -153157, -78512, -74016, -118586, -63808, 20587, 76279, -18323, -115584, -81955, -4299, 11595, -46503, -103779, -91099, -42316, -12505, 3044, -45944, -71553, 27176, -9116, -107266, -161572, -88552, -34795, -13099, -51742, -139465, -76836, 15717, -46857, 49808, 77775, 144016, 122842, 34194, 10655, -12807, -23536, -19828, 51594, 46113, 78317, 74654, -24544, -83467, -29162, 33102, 14424, 28706, 39680, -37802, -59177, -57302, 17605, -22151, -85018, -40457, -40098, -128470, 6694, 44868, -90157, -93246, -83147, 1563, -29097, -98313, -106300, -78739, -184523]
7688a84523N0723M878P0034M91O5702J2844J0438k049j06936m3482N5713o1069
7676a27236K6641J2596l3000R1539m6586K3023q9797J1805p561l7563J46565Q2843
7664E3269l7471l2043k463n2873r19J5855N1071m0703n3723J14447Q7872o3372
7652C8947r2449l4303k9157J59944J6139j17517J02659o401k78k2566p6246J18510
7640E7282j02574j5043k041J1566p6001K4279k3715M2225j6658m2922J13188j2344
7628d2758r2078J9165M6478j5665N9515o6443k0454J36141R6247j14255J8070
7617B3963l655j42160J6247m5803N1339K3937M1127O0880p3825l9767k2142K4156
7605h5703N2861O4385j10311O3973o8810L4069o9391L476J26697p6632p648n4240
$$ y = [-184523, -133800, -128922, -58888, -58397, 7305, 20149, 30587, 28538, -78398, -121880, -66167, -127236, -100595, -87999, -120999, -29460, -76046, -53023, -142820, -131015, -138576, -176139, -29574, 53269, 15798, -16245, -18708, -71581, -72500, -56645, -5574, -46277, -100000, 14447, 102319, 38947, -53502, -87805, -116962, 42982, 59121, -58396, 44263, 37862, 37584, 15018, -61228, 57282, -45292, -60335, -62376, -50810, -126811, -102532, -126247, -84022, -100680, -143602, -30414, -42758, -134836, -115671, -69193, -84858, -25343, -91786, -112240, 23901, 120148, 5893, 23963, 20308, -121852, -105605, -151408, -100069, -76132, -35005, 25875, -47950, -87717, -109859, -85703, -32842, 31543, -78768, -14795, -83605, -49536, -118927, -115451, 11246, -65386, -73034, -127274]
7593a27274j9508j8014m0766L8317P4940M3045L6896N0441L0519m8325j08755
7582h8484M3252P7474j50741p5284L0407p25J37418n9399j3794J81k4331R1365
7570c2661l5481O1479J3578M1261J159N219r6878o5618M2436O3556q8127l8258
7558a28335O1006K5554k280j3508K3378P0504Q765m185j07140N1871P247P950
7546H27o1881O1537K1617j34640R126J4806J1921r628O5787o1238L6233L4087
7534a1446L0029l9035M1844j03912Q1795O1915l4978n3629q9909P9577J7204n798
7522b6343L9878O6270M7217j07916j16390O6128P758K3934J6835o9048N7519M2087
7510D7929o1403L481p4289O2010L2145n3960l5488K1118J40370K0392o7932n9200
$$ y = [-127274, -146782, -164796, -205562, -167245, -92305, -49260, -12364, 38077, 68596, 20271, -88484, -45232, 32242, -118499, -193783, -163376, -164101, -26683, -86082, -99876, -99695, -124026, -32661, -68142, -6663, 6915, 48176, 49335, 54554, -42324, -107942, -65506, -1950, -90077, -128335, -67329, -41775, -44055, -57563, -34185, 36319, 45084, 40899, -66241, -14370, -7123, 827, -61054, 483, 22100, -112540, -103414, -88608, -76687, -86315, -20528, -81766, -45533, -11446, 18583, -20452, 21392, -82520, -725, 61190, 26212, -27417, -117326, -37749, -20545, -26343, 13535, 79805, 127022, 19106, -97284, -31156, -23398, 536, 17371, -51677, 5842, 47929, -13474, -9993, -84282, -22272, 9873, -44087, -79575, -58457, 81913, 102305, 34373, -24827]
7498b4827M1630l5155j07350P3848O934N82Q9078j09059k5649Q2358o1650j6240
7486h5500l2719P9387J11209q6771k717p150p0899m8629P0642J4409M8721l5267
7474d5284J6598R6869o3634l8320N9617K4773O40M7072p869n9572M8492j065l1159
7461D7158L1934J1089o2959m883q4920O6317J01314q0815L7346l5747r3147j3095
7449h0408J14345m0898L6522N0454O2288j6508K948j34519o4138J3085n730O931
7437e5628q47j6916L9237J33384l3533o9q0875j21742O3212O0713M229o8514n6698
7424a34047N5515N1889o595P9975J7544l8530m5560m9542m960R0976L5858k8968
7412B3555j6018m9464j0123P0596k1066j13277J7240n7418R1029K9607o8364M5906
$$ y = [-24827, 16803, -18352, -125702, -51854, -44920, -44338, 44740, -64319, -89968, -7610, -69260, -85500, -118219, -38832, 72377, -14394, -17111, -24261, -95160, -143789, -73147, -58738, -10017, -45284, -28686, 68183, 4549, -33771, 25846, 50619, 51259, 98331, 90462, 30890, 79382, 78317, 47158, 79092, 90181, 27222, 22339, -62581, 3736, 105050, 24235, 61581, 25834, -67313, -80408, 33937, -6961, 29561, 80015, 142303, 125795, 128743, -5776, -69914, -56829, -62559, -55628, -56475, -73391, -34154, 99230, 65697, 65628, -15247, -136989, -73777, -13064, -8835, -77349, -134047, -78532, -26643, -33238, 46737, 64281, 25751, -19809, -69351, -74311, 16665, 52523, 23555, 7537, -41927, -52050, 18546, -2520, -115797, -98557, -155975, -64946, -35339, -103703, -57797]
7400e7797J43865r5267L318O3435k6356o307N093q9491J6043K0100k485M4307
7388A8458r5461m5866M6960Q0511M091j35620q358J45165N9768j3150m3370q8372
7376g5244k0875J8207l3845L5090J5217r732r379P9503q747J4507n188O6555K2985
7363H9054j5991p1596L911J8929j9303K0764j07624J6150L6371J00784J7106l2387
7351E6168j8657m1581J6927l9587n90l7996k0145l0657n0455J17892O9968l9145
7339a7858M9597r4980m5113O0489k852n28q7013O3443N1943o700r320k280J6897
7326b4275k0842O333M6320j5221k9563r8065R9047M6331n0210l5060K2037O2760
7314I592m1994L9264m0682j2705J5443j04279R4420p292o477N6018J7206n543
$$ y = [-57797, 86068, -9199, -5881, 57554, 31198, 24891, 29984, -59507, -43464, -23364, -25849, 18458, -77003, -122869, -75909, 4602, 8693, -126927, -135285, 9880, 69648, 56498, 13128, -75244, -96119, -77912, -111757, -76667, -61450, -71182, -80561, -1058, -9805, 4702, -486, 66069, 89054, 73063, 1467, 5378, 24307, 5004, 25768, -81856, -65706, -29335, 71449, 88555, 56168, 37511, -4070, 12857, -26730, -27320, -65316, -85461, -116118, -166573, -48681, 21287, -17858, 31739, -63241, -108354, -47865, -50717, -51245, -138258, -74815, -22872, -29572, -38892, -41172, -24275, -45117, -38784, 7536, -7685, -37248, -135313, -36266, 10065, -40145, -75205, -53168, 9592, -32402, 6862, -33820, -46525, -31082, -135361, -40941, -48233, -54710, 1308, 18514, 12971]
7302A2971m1112j7893J08353j5283j5323N1533p1717l4347j3149j6059J9068P0642
7290C7684n415M1200r2390j7132k2373J25312l7911l9098N2298K186L0753K2262
7278I7376r2617K904L0008k2843J958l3547j16003q3962R0053P6066P598M9575
7266F566l3612M1421N1387l3736m0272m4945j6479P3407N2020n1815m2612J9923
7254a8747j2112k6718j52087M2531J52071j265K4338O074O3899j0287l2879O453
7242D1271l21l4716n4821J540L1657j4562P4j5742j13658L8075l9982Q9193J30136
7229E8144o2575k6592o0616j3031N999J08620q229J1326l2577K4458o7035Q795
7217e3313L1186P0434q9638L381N3581P233o7994m8995L2466K554J0761K3328
$$ y = [12971, -28141, -46034, 62319, 47036, 31713, 83246, 11529, -22818, -35967, -52026, -32958, 37684, 32269, 73469, -18921, -36053, -58426, 66886, 28975, -10123, 42175, 44361, 75114, 97376, 4759, 7663, 37671, 14828, 16786, -16761, -132764, -216726, -126673, -50607, -43009, 6566, -27046, 14375, 65762, 32026, -8246, -53191, -69670, 3737, 55757, 3942, -38670, -18747, -30859, -57577, -209664, -167133, -15062, -16327, 8011, 14085, 77984, 67697, 34818, 41271, 40950, 6234, -48587, -47047, -15390, -29952, -29878, -45620, -159278, -121203, -161185, -71992, 58144, -4431, -31023, -91639, -104670, -98671, 9949, 1720, 13046, -19531, 4927, -62108, -53313, -22127, 48307, -41331, -37950, 15631, 22864, -45130, -94125, -61659, -59105, -48344, -25016]
7205b5016K9260L1834p3182p4938k6843J2989j500N4087J22590o0116m660J5036
7193d59L733K622p946J9921p6017L2037k7611l0370M3296m2982P1168O4675j14922
7180f2855k4879N0043O0872j14952m2362J28043j1240O0503n8951Q281O4766J4028
7168G1297r712J2199j3242j6006O1451o1845j04504j4875Q4349N350n4170j9312
7156e9020L7296J01822j13018K3712R5997r1118q5844N4889o4275N9758j02723
7145a42524M4856J1855j8972R9898M8098l5901O5865J1184M6007k2254k8873N8794
7133A38033j28058L6348j6590k2676j38347o1497J22769L8730J2664n8975Q2570
7122D971j9389j28000R9502J34053j00891J3812Q0049o529p5797L8064m3034j38404
$$ y = [-25016, 4244, 36078, -37104, -112042, -138885, -125896, -127396, -73309, 49281, -10835, -15495, -459, 3274, 5896, -2050, 17871, -58146, -26109, -53720, -84090, -40794, -83776, -12608, 52067, -62855, -87734, -37691, 23181, -91771, -134133, -6090, -17330, 43173, -15778, -7497, 57269, 71297, 61585, 73784, 60542, 44536, 105987, 44142, -60362, -75237, 9112, 14462, -39708, -59020, -21724, 80098, -32920, -9208, 86789, -4329, -90173, -35284, -99559, -39801, -142524, -97668, -85813, -104785, -4887, 43211, 7310, 73175, 84359, 130366, 108112, 79239, 138033, 9975, 46323, 29733, 7057, -131290, -192787, -70018, -31288, -18624, -77599, 4971, -14418, -142418, -42916, 91137, -9754, 4058, 84107, 77578, 1781, 39845, -3189, -141593]
7110a41593J05429L57M6795k7013p6053L8686J37419j26259Q037Q094M9075R8012
7098A20986r8943O0462J2315q6500j857p2290J41862K9170m0053k7010j31603
7087i3461L1739N6798J8748J04370L8142J5068o6912r1328m2889K6362n7586L1209
7075b9740K4600l1361N6299M4560K1604q5786M4808J0290M310m293J2244K9570
7063I7105K0064n7765p6971L8904K4816o6188N3306n5820K868L6625j0158M6704
7051E3490K731M9342o3590p0532M0852N6664J7862n2241j18712K9920J29154l705
7039G1235j7482K9465r8978O740m9866J00412P3102r1538N2919K2170m0353m3165
7027A4661J4745m3806l8657N209M0820M455j8497K6491R0087O5135n2352K6725
$$ y = [-141593, -36164, -35807, 10988, -16025, -92078, -53392, 84027, -42232, -34195, -26101, 22974, 120986, 22043, 82505, 94820, 8320, 6463, -65827, 76035, 105205, 65152, 38142, -93461, -61722, -4924, 13824, 118194, 156336, 171404, 104492, 13164, -29725, -3363, -60949, -29740, -5140, -36501, 19798, 64358, 85962, 176, 44984, 55274, 59584, 55291, 67535, 97105, 117169, 59404, -17567, 21337, 46153, -20035, 33271, -22549, -19681, 16944, 6786, 53490, 56221, 105563, 41973, -28559, 12293, 68957, 86819, 34578, -84134, -54214, 74940, 71235, 53753, 83218, -15760, -9020, -58886, 41526, 114628, 23090, 76009, 98179, 57826, 14661, 29406, -14400, -53057, -47848, -7028, -2573, -21070, 5421, 95508, 160643, 108291, 135016]
7015A35016l0674l3586P3339K8389l6759p0413M9590J2549n1236l7070j08094
7004f8949j4692J10524M3114K0980j20982r3649J00700O9062l3755K6770L1830
6993G0953M7137p5980j4161o8226J11448L5477k323J5109J3801r113k2932m0411
6981F0779n5285N2439O0092k4988j14406N1447J2199M0439K8294q0702j02521
6970g2213K1024J23302P4990q5992L2097O3080K7255o4559m3071J28729l71n0247
6958A54024k0574o3309P9156J6986n237m7645j2482r5129K1960Q7802j38685k3327
6946d6460o592M061Q2392O9455Q0748k0546l4510j37594j954N2103n5589J9326
6934D840K0815L5495L0541j19292m0823P0799j8706k161j8812L7629J4341k0352
$$ y = [135016, 104342, 70756, 144095, 172484, 135725, 65312, 114902, 127451, 76215, 39145, -68949, -83641, 26883, 69997, 90977, -30005, -123654, -22954, 46108, 12353, 39123, 70953, 118090, 42110, 27949, -40277, 71171, 106648, 104325, 119434, 133235, 124122, 101190, 60779, 5494, 57933, 118025, 93037, -21369, 30078, 42277, 82716, 111010, 30308, -72213, -51189, 72113, 147103, 61111, 93208, 156288, 183543, 118984, 75913, 204642, 204271, 154024, 133450, 70141, 149297, 166283, 161046, 113401, 100919, 5790, 27750, 115552, -23133, -46460, -53052, -48991, 33401, 102856, 183604, 163058, 128548, -9046, -11000, 41103, -14486, 4840, 25655, 61150, 91691, -27601, -68424, 2375, -16331, -18492, -37304, 325, 14666, -5686]
6922e686r6622J5465l6598q247J20765M3236p5480n2420m9692J52759K7420N7459
6910I2359o7926n2269o1930m3032O0708k4140O7538O3496L5239r6077j1362M6724
6898I328r19N411J21684k0646p186n4882J0701k1152l1853j0492Q0758j4488K5165
6885I1429q5040l8828o726K8123K8900l867K8415K1747J3392o3938N6045R890
6873G9542N1797J10928j44076k5443J3448J07n4529R1055L2248j50222J4630J6739
6861C6224p72j5418J6173R0129P086n2029M653j0639K357n1828j5719R6844N7173
6848A64234l9929Q999j5383P1829o7590L7631l0883K2309J3021Q8658R0129p768
6836C35257j06085O8585L1452L8182R5137M5515j267l3735n1203r1633q9544n374
$$ y = [-5686, -102308, -86843, -123441, -131688, -10923, 32313, -43167, -95587, -145279, 7480, 34900, 92359, 24433, -27836, -89766, -132798, -72090, -96230, -28692, 34804, 70043, -26034, -37396, 9328, 8409, 13820, 135504, 114858, 107672, 52790, 63491, 42339, 10486, -6, 80752, 66264, 91429, 6389, -32439, -39165, -11042, 17858, 13991, 42406, 64153, 77545, 13607, 69652, 79542, 131339, 242267, 98191, 72748, 86196, 86303, 31774, 122829, 155077, 4855, 19485, 36224, 35452, 20034, 36207, 126336, 133422, 81393, 86046, 75407, 77764, 25936, 10217, 107061, 164234, 124305, 133304, 117921, 189750, 122160, 159791, 128908, 151217, 164238, 252896, 343025, 335257, 229172, 297757, 329209, 367391, 462528, 508043, 506776, 473041, 421838, 330205, 240661, 235287]
6824B35287m494q6051q1471Q8021l0797j24572m352P3231K8120l8204l8124R18
6812A7512J0430Q2281N8318Q796N8216j34288K1737M976k2238j02723J9935J0801
6800C3753J7240J7984J1996o3589J40705k4453j78490R4234L5453O4467j22537
6789B6763n8263P0855m3065j31217K8975O9705j8069M2378l451K0865J23429m6080
6777H2825O2195m4698q3853P4661O4785l0385o6016M2263l0864q127j22872K5801
6765c4285M6949m413l8704N9099Q6257l2184R415J4578m7334L2807m5378M8513
6753I5320m2669o2917N645K4346o7675P3421q3406K0953R5342p9186k1970m7468
6741i0264J2788r440k4349k286O2593R2124M5721j33323l5008J41133J5970k4293
$$ y = [235287, 230793, 144742, 63271, 151292, 120495, -4077, -8429, 64802, 92922, 54718, 16594, 17512, 27942, 110223, 168541, 177337, 235553, 101265, 123002, 127978, 105740, 3017, 22952, 33753, 50993, 68977, 80973, 17384, 158089, 133636, -44854, 49380, 84833, 149300, 26763, -31500, 39355, -3710, -134927, -105952, -36247, -54316, -11938, -15389, 5476, 128905, 82825, 145020, 100322, 16469, 91130, 155915, 125530, 59514, 101777, 70913, 62786, -60086, -34285, 12664, 8251, -30453, 28646, 114903, 82719, 92134, 106712, 59378, 92185, 46807, 95320, 52651, -10266, -4621, 19725, -47950, 25471, -57935, -36982, 58360, -20826, -42796, -90264, -77476, -86916, -111265, -113551, -50958, 41166, 86887, -46436, -81444, 59689, 75659, 51366]
6729E1366L4506r6733M1139O6996r106n8510o71n9836M9584N6467k772n6839k4124
6716h533K6841K2324J3487m2869k5555m152J5347Q1260M2580L2724j01348q8407
6704c6301O0728r0055L0134Q5521o542N8265n1669l1623L2239o7556J757M7859
6692C2757n9127R4576P736k2114Q794j20565J205K1473J3740J0950K3380J80537
6680A93342m1579l5024l7060n5646j0709L0249N4232n8789k8246L1676M1399q818
6668G5027P063m9562k4407K3356q849J278N5060l3485n5858L7428M0135k6122
6656D1064m246p4671m5704k5140k5896J33420J791o419o5862P1383L9913n743
6644C3890K0735n7071j2421J04405K1131r6015l3116Q4293J30448j40261K3149
$$ y = [51366, 85872, -10861, 30278, 97274, 88168, 29658, 28987, -30849, 18735, 75202, 72430, 15591, -8533, 18308, 40632, 54119, 11250, -14305, -18457, -3110, 78150, 120730, 153454, 52106, -36301, 24427, -65628, -35494, 50027, 43485, 101750, 50081, 18458, 50697, -16859, -15102, 32757, -26370, 68206, 75942, 53828, 62622, -57943, -56738, -35265, -21525, -10575, 12805, 193342, 151763, 116739, 79679, 24033, 13324, 43573, 97805, 39016, 10770, 42446, 83845, 75027, 82090, 32528, 8121, 31477, 22628, 23906, 78966, 45481, -10377, 27051, 67186, 41064, 36818, -37853, -83557, -108697, -134593, -1173, 618, -5801, -71663, -280, 39633, 33890, 54625, -2446, -14867, 89538, 110669, 14654, -18462, 65831, 196279, 56018, 79167]
6633G9167L1897j0690p9153n6787m1178P5513J72627j9859k0622q889m0047O8054
6621A50033J7488j23801L4676Q5346p1031N6050m1383J1444m069P0995K4427j19159
6609I1016q3281q3738N3660J05498o9705o505R4890N4949l4042n4052l9670p15
6597B8305O0095n8271p6064o4797P9993L7871R7886Q3456j44256j774Q185L002
6585E3631j797o2866N7192p0206L0416N6600j20428J57223j039n8223k7467J8109
6573C1145q6700l3143Q2315j32516J04644J40373j21407q2962K4854m208J16887
6562C9282M3506L069n5536p2747J20731m563k8034L1131j00028K1929j5382R4876
6550G8234N9633J3952p9863m0176J1024R5237K6784k3188N4261j17282k2236N9183
$$ y = [79167, 111064, 100374, 21221, -35566, -76744, -1231, 171396, 151537, 130915, 122026, 81979, 150033, 167521, 43720, 78396, 163742, 92711, 148761, 107378, 118822, 114753, 185748, 210175, 91016, 7735, -76003, -22343, 83155, 13450, 6945, 101835, 156784, 122742, 68690, 29020, 28305, 88400, 30129, -45935, -110732, -30739, 7132, 105018, 188474, 44218, 42444, 50629, 53631, 51834, -11032, 46160, -24046, 6370, 62970, -57458, 99765, 98726, 40503, 13036, 31145, -55555, -88698, -6383, -138899, -34255, 106118, -15289, -98251, -73397, -77605, 39282, 82788, 85857, 30321, -42426, 78305, 73742, 45708, 76839, -23189, -1260, -16642, 78234, 137867, 151819, 71956, 31780, 42804, 138041, 164825, 141637, 195898, 78616, 56380, 115563]
6538A15563p2835j5792O4659l0367k4540p0983J8435r6751K431P6684P5242k7149
6526A4597l7943N1717J0604j5523J0295M900j293R0156O5405j8163j24840K2611
6514G2523k3732J09238j73690R3669P099k8882m2414J2445J00440Q59m839l8121
6502H4595J0310j9792k4817j465m5901Q2182J1151n5616J2759O621J4152j23293
6490d9114J01640P4066n2241N0408j555j32093N8532l1943O3649m8535j6855N5299
6478G1258k8132n092Q4824J6903n8067m3474k2480q437J19846L8068l8379k1146
6466A05692L1846k4619m487m764m9830P8985P25o7951j2623Q7097P2235q1872
6454A30434l6064j1299P7069j3012m4516k3768L9606Q49k9141P4168m0417j4611
$$ y = [115563, 42728, 26936, 91595, 61228, 36688, -34295, -15860, -112611, -110180, -33496, 41746, 14597, -23346, 28371, 38975, 23452, 33747, 38647, 37354, 127510, 192915, 174752, 49912, 72523, 48791, 158029, -15661, 78008, 85107, 56225, 13811, 26256, 126696, 127555, 122716, 84595, 94905, 75113, 50296, 48831, 2930, 85112, 96263, 40647, 53406, 60027, 74179, -49114, 52526, 126592, 74351, 124759, 123204, -8889, 49643, 17700, 81349, 32814, 15959, 71258, 43126, 38034, 122858, 139761, 81694, 38220, 15740, 7303, 127149, 165217, 126838, 105692, 137538, 112919, 108432, 103668, 53838, 132823, 133548, 65597, 52974, 140071, 212306, 130434, 94370, 83071, 160140, 147128, 102612, 78844, 118450, 119299, 90158, 164326, 123909, 109298]
6442A09298k5923O32p6970o5765L9069k0643O5902J06172o6468p7107Q5122l5231
6430C8088m4255k1768K7115l312k360K4042L3216j08413m2519M1674M7647J50872
6418A40027n0574l0304O7081o5360m5310P5236L2234L0922p8653o1895O5671q3760
6406d685j645O9270n5886L2929L0864Q175j0886R8593n4057j9506J09152L5320
6394B37638r3037o6923R8886r094r0749P4028o5533K4682l4725J5143L08o5555
6382B5069M2698K9663L677q9596Q6652M9442l8281l1763L2537M547j5559j8125
6370H0961o6455M1161O1087L5168J9209k5630Q661k6975J4840J30023o6731p8713
6358A26606L8198j37679p072P1044j10783K6611R8374J9784M6732p0348P0580
$$ y = [109298, 83375, 84007, 7037, -58728, -19659, -40302, 25600, 131772, 65304, -11803, 73319, 38088, -6167, -27935, -820, -4132, -6492, 17550, 50766, -57647, -100166, -58492, -10845, 140027, 89453, 59149, 126230, 60870, 15560, 90796, 123030, 153952, 75299, 13404, 79075, -4685, -6330, 62940, 7054, 39983, 70847, 79022, 68136, 166729, 112672, 93166, 202318, 237638, 144601, 77678, 176564, 167470, 76721, 150749, 85216, 109898, 75173, 90316, 90624, 25069, 67767, 97430, 101107, 11511, 98163, 147605, 109324, 77561, 110098, 114645, 99086, 80961, 14506, 55667, 116754, 151922, 171131, 145501, 154162, 127187, 142027, 272050, 205319, 126606, 164804, 27125, 20053, 91097, -19686, 6925, 105299, 125083, 171815, 101467, 172047]
6347A72047R8486J0680k8578j26128o9846J7575n0433o6934k1972Q896M2254N0432
6335C6479Q6851R9389j0334k7735q4931k0377J80918m7007k3163p4155J5094j4968
6323A16061n2360k8550J03608K2111r976L7170o7101j6955K5246j4541M3276N6872
6311B14861n1544j5241M2806o1114L0809L95j11626N649m6292J41346N2666P3
6299B02788m5074O475P0370l104r7887m3514O4769N7455j8008k6797L5156J4925
6287B17554m4392K0413J2181R6676k0931k03239O8816J36552l8002j9151l4510
6276A91967j17191L5434r264r573M1994j8614M4938K3527m4615P0582p6480K4091
6264A56796K5868R4157j4056L4882J09088k0585r7346Q007j6089j09488O5949
$$ y = [172047, 270533, 281213, 252635, 126507, 56661, 74236, 23803, -43131, -65103, -56207, -13953, 36479, 123330, 222719, 212385, 184650, 99719, 79342, 260260, 213253, 190090, 115935, 131029, 116061, 63701, 35151, 138759, 160870, 150894, 188064, 120963, 104008, 129254, 114713, 157989, 214861, 163317, 148076, 190882, 129768, 160577, 160972, 49346, 54995, 8703, 150049, 202715, 202788, 157714, 164189, 234559, 231455, 133568, 90054, 154823, 212278, 194270, 167473, 202629, 217554, 173162, 193575, 205756, 302432, 281501, 78262, 147078, 283630, 245628, 226477, 191967, 74776, 110210, 100946, 91373, 133367, 114753, 159691, 183218, 138603, 209185, 132705, 156796, 182664, 276821, 262765, 297647, 406735, 386150, 288804, 296811, 280722, 171234, 237183]
6253B37183o201k310K1623o201p6133R9218j5875n834j10735K0940J29525K5755
6241C10955k1584l4973l9173Q9984p3017k9969k23J1965n7486K3464K1114n8938
6229A42119M8596N3790m3036P8317l3179K4307Q521n3152N5936R4844o004j19634
6217B51425O3398Q5327M1172O6601N8318k1317O0115Q704j6320j00822m0799m3607
6205D12195o1114k3717R1547l8898L2669J39637o0322j10019J3783L3548L8833
6194D68142K8426J31353k9233R7457M5587J17957L7696r7851P5694k1655j16232
6183G37341p6268j04008m9491j8643k7455n0188o4752K967J04276Q6178l9498
6172E00459M8691L9670o1411n2277k4345O4200J12736q882J4907J9879j62376
$$ y = [237183, 230982, 228672, 250295, 244094, 167961, 267179, 251304, 245470, 134735, 155675, 285200, 310955, 289371, 254398, 215225, 305209, 232192, 202223, 202000, 213965, 156479, 179943, 201057, 142119, 190715, 244505, 201469, 279786, 246607, 270914, 279435, 226283, 282219, 377063, 371059, 251425, 314823, 400150, 441322, 507923, 566241, 544924, 605039, 613743, 597423, 496601, 455802, 412195, 351081, 327364, 418911, 380013, 412682, 552319, 491997, 381978, 395761, 429309, 468142, 496568, 627921, 598688, 696145, 741732, 859689, 897385, 799534, 875228, 853573, 737341, 661073, 557065, 507574, 488931, 461476, 411288, 346536, 349503, 453779, 539957, 500459, 549150, 588820, 527409, 475132, 450787, 514987, 627723, 618841, 633748, 653627, 491251]
6161D91251l9691R9202m1833j31442L7004K1874j31639j1936J00544l759N1967
6150D41542m4175k8614r3644L2088k7364j4625Q8879l6904o5444j25069M6068
6139A72738P2954L6465Q7187l188l3349k5956j10333M6927L3162p2303N9829o0711
6127B03422p3164Q5561j0365L7313n7909J06698K2509m2524k4899j4665n9176
6116A72801L2024M8111Q4815j29731m0215n45K6192K3274N0586K5910K1864l8184
6104B76902P171R9191k6972r2660j00798m8962R8614N6667l5194K7300M7922m5867
6092B63314M3396q799m2911j0612r8308J31934J07571J5436o2051k5043q1252
6081B32675r5056R5888J01591m9728l8009P415o5046O9552n741k2579K7660o1494
$$ y = [491251, 451560, 550762, 508929, 377487, 414491, 436365, 304726, 292790, 393334, 389575, 441542, 397367, 368753, 275109, 307197, 279833, 265208, 354087, 317183, 251739, 126670, 172738, 245692, 282157, 369344, 366156, 332807, 306851, 196518, 243445, 276607, 204304, 264133, 203422, 130258, 215819, 205454, 242767, 184858, 291556, 314065, 271541, 246642, 231977, 172801, 204825, 252936, 337751, 208020, 167805, 167260, 193452, 216726, 267312, 293222, 315086, 276902, 284073, 383264, 356292, 263632, 162834, 113872, 212486, 269153, 233959, 261259, 309181, 263314, 306710, 297911, 255000, 244388, 146080, 278014, 385585, 401021, 338970, 313927, 232675, 137619, 233507, 335098, 285370, 247361, 254776, 189730, 259282, 253541, 230962, 258622, 197128]
6069A97128K4037K3010k3699J1040J07114j2624p966q9956K4389J7323m7489k0982
6057B01325J37415M4726o6300j16003N538j4345J0013O9084J18811j65769p3667
6046A50828Q2447J2292K3096N359k0595J6406M5952J9594j0140j4599l9121P7433
6034C48952M2386n7352k597l9117r5751M8832L3906K6847P2147j03135K9537K8089
6022C32744O9453Q4394K3248j12155n0825p975n1246O8674r1546j9872J21157
6011C66051q0706L8758m4110J28495n589J7474R4876K701o3078j00770M396N5080
5999D13578Q1034k8773j60144R4087k1987p7689M3544n151Q6544K3004P037j8931
5987D36153N8518k0306Q5281r1831o0704O4991J2542N744j8055j6099M2853M4078
$$ y = [197128, 221165, 244175, 220476, 231516, 338630, 326006, 318040, 228084, 252473, 269796, 222307, 201325, 338740, 383466, 317166, 201163, 206701, 192356, 202369, 271453, 390264, 224495, 150828, 233275, 245567, 268663, 274022, 253427, 269833, 315785, 335379, 325239, 310640, 271519, 348952, 391338, 333986, 331389, 292272, 196521, 245353, 279259, 306106, 378253, 275118, 304655, 332744, 402197, 486591, 509839, 397684, 346859, 338884, 287638, 356312, 264766, 244894, 366051, 285345, 324103, 279993, 408488, 402899, 420373, 515249, 517950, 454872, 354102, 358498, 413578, 494612, 465839, 305695, 399782, 377795, 300106, 343650, 338499, 425043, 448047, 455084, 436153, 494671, 474365, 559646, 467815, 407111, 472102, 484644, 490388, 472333, 456234, 499087, 543165]
5975E43165M5892n3214o9102K1789n4064k706Q9479M2384q3356Q1082j8591l384
5963E39374L5312l5058k6915R021m408p7618L4943M2658q398J75055M8949O5943
5951G98858o811p4800P725m2425O2925J0636r565l4861J50422J3441j15552R87
5939G60980Q0348M4513n5440N264j2158N8802r090J4135p2813K9444n8070o5387
5927G20528R7938L3918K9306n6637n3069J2291J5664R2802n2797N4502J73003
5916A067449q780l0629J06576k4219p352J55233N8409J2738n9141r1427K57151
5905A436008L14111K0265R2806R8652L8709O1421J60494N6120L7777j68317k52006
5894A896040k23667o1158k9321n4098l7776o0694n4378O9568K5238j9499m3443
$$ y = [543165, 589057, 535843, 466741, 488530, 434466, 431760, 521239, 563623, 480267, 561349, 542758, 539374, 574686, 539628, 512713, 521734, 517326, 439708, 474651, 517309, 508911, 683966, 732915, 798858, 792047, 717247, 724972, 682547, 745472, 756108, 746543, 711682, 862104, 875545, 759993, 760980, 841328, 885841, 830401, 835665, 823507, 882309, 873219, 887354, 814541, 843985, 785915, 720528, 818466, 852384, 881690, 825053, 771984, 784275, 799939, 892741, 839944, 894446, 1067449, 1058669, 1028040, 1134616, 1110397, 1103045, 1258278, 1316687, 1329425, 1270284, 1178857, 1436008, 1750119, 1770384, 1863190, 1961842, 2000551, 2061972, 2222466, 2278586, 2316363, 2148046, 1896040, 1672373, 1611215, 1581894, 1527796, 1490020, 1429326, 1374948, 1444516, 1469754, 1450255, 1406812]
5883A406812J00880J38266K2505K3350R0514M3056J79012J47642J72698K07786
5873B532521K49965K54032K79858N03898N27215O50988M34133K79929j59405m27933
5863E125201n97413o41436l66339j92915j26503j89669j79176j79866j11240q4312
5853B456332j76033J9721k9858J0723J2372K5363P3230K5753J22762J28201J24327
5842B792893J45329M14349L04667L04092L66362N68998O56335M75607M78651J5341
5832F522624l69733n96771o47536n76159n11493m25353l20617k52544k09565q4136
5822B528717j36381j79637p3170j18402o9425J28181k4445l1708L6453R6883L5873
5811B192939l7897R9606J57791R3879Q5176J9966J82689J52268L6654L302k8710
$$ y = [1406812, 1507692, 1645958, 1668463, 1691813, 1782327, 1825383, 2004395, 2152037, 2324735, 2532521, 2782486, 3036518, 3316376, 3820274, 4347489, 4998477, 5432610, 5712539, 5553134, 5125201, 4527788, 3886352, 3520013, 3327098, 3200595, 3010926, 2831750, 2651884, 2540644, 2456332, 2280299, 2300020, 2270162, 2280885, 2293257, 2318620, 2391850, 2417603, 2540365, 2668566, 2792893, 2938222, 3352571, 3657238, 3961330, 4327692, 4896690, 5553025, 6028632, 6507283, 6522624, 6152891, 5556120, 4908584, 4332425, 3820932, 3395579, 3074962, 2822418, 2612853, 2528717, 2392336, 2212699, 2139529, 2021127, 1951702, 2079883, 2055438, 2023730, 2060183, 2157066, 2192939, 2155042, 2254648, 2412439, 2506318, 2591494, 2611460, 2794149, 2946417, 2983071, 2986373, 2957663]
5800B957663j09130j81201l88992l13039o9181j07469j98482m6302l1361q8938
5790A423568J02985p8692m8397r783R471j3969j649j3388m0593n8975o8006r2626
5778A109946j7553J3583R1496o6765K3811j2540l3751m3027o7341L2491J00619
5767A130969M7118r2180N730N5715j5387n7191o059L3567J1857j3206l5423j52939
5755I12571N4712R9476j5964J8721J182P5275R003q5074r9680p9896l7259J71572
5743A024639l5922r920J20853k0801j6225L4149o2922K74l8771n6516J09299L942
5731A052079R6264j19927J9489M84l7930N7204Q3865p0485j16530P4677L8114
5720A077304J0684L7233k0944l7739J9314J46578L6693j25380l0409M4564M1111
$$ y = [2957663, 2848533, 2667332, 2278340, 1965301, 1896120, 1788651, 1590169, 1543867, 1512506, 1423568, 1526553, 1447861, 1399464, 1389681, 1399152, 1385183, 1383534, 1370146, 1329553, 1270578, 1202572, 1109946, 1092393, 1105976, 1197472, 1130707, 1154518, 1141978, 1108227, 1065200, 997859, 1030350, 1130969, 1178087, 1085907, 1091637, 1147352, 1131965, 1074774, 1068715, 1102282, 1114139, 1100933, 1065510, 912571, 967283, 1066759, 1050795, 1069516, 1070698, 1145973, 1154976, 1069902, 970222, 890326, 853067, 1024639, 988717, 978797, 1099650, 1078849, 1062624, 1096773, 1033851, 1034125, 995354, 938838, 1048137, 1052079, 1148343, 1028416, 1047905, 1048389, 1010459, 1067663, 1151528, 1081043, 964513, 1039190, 1077304, 1087988, 1125221, 1104277, 1066538, 1085852, 1232430, 1269123, 1143743, 1113334, 1157898, 1199009]
5709A199009j8842o1864P4518j4367P8398m8028j11465R6042M1924N6136q1898
5698A209563k2714k6425j8931O2152N7886m910n346K2436j64244P5601J44746
5687A329814N4718r3684m899K7325J6280J19446r9592r416l5425l6056m2737Q2221
5675A307995M9096q2678P4203m9554Q1681J38571k400M28q2363J0737N1864n8351
5663A439229r1160N3589j0504Q8352K6522M5899O0447m6210j5347K7798J5405
5652A594020P9495l9249p6661J8719O1718m0722o5674m1446J17180M2838Q4370
5641A734588J0677j7435M9640k3106M988m7745K9626J0961N7301M4778N227L7851
5629A897351J62089j2147K5816R94q581J3602J07905L0289M4316l4917J2210K35584
$$ y = [1199009, 1180167, 1118303, 1192821, 1178454, 1256852, 1208824, 1097359, 1193401, 1235325, 1291461, 1209563, 1186849, 1160424, 1141493, 1203645, 1261531, 1256621, 1251275, 1273711, 1109467, 1185068, 1329814, 1384532, 1290848, 1285949, 1313274, 1329554, 1449000, 1349408, 1339992, 1304567, 1268511, 1225774, 1307995, 1357091, 1274413, 1348616, 1299062, 1380743, 1519314, 1516914, 1517342, 1434979, 1445716, 1497580, 1439229, 1348069, 1401658, 1391154, 1479506, 1506028, 1551927, 1612374, 1566164, 1550817, 1578615, 1594020, 1673515, 1634266, 1557605, 1576324, 1638042, 1597320, 1531646, 1490200, 1607380, 1650218, 1734588, 1745265, 1727830, 1777470, 1754364, 1759352, 1711607, 1741233, 1752194, 1809495, 1854273, 1859500, 1897351, 2059440, 2047293, 2073109, 2074103, 2065522, 2079124, 2187029, 2217318, 2261634, 2226717, 2238927, 2474511]
5617B474511n250L1648J63923N9868N8342J25032J83892J22274j0121Q6873M6970
5606C337962n7782q1320p7768J7687J2972K5696O9514K8655o3374P6646M1738
5595C330626J38500L6537L7556k2193R7699N0776L7695J57376J66692J81217K30102
5584D442583K93459J42931J14015k7293j83202j54836j72016j42861l8207j75012
5574D099561p9028k0992N9698J4716J356j75368J9712j60562j54721L3218k2648
5563C614942M4127k7643L1077J9527J6586J0457O7151M7452l934O6470j33459
5552C752753n1016M5143j43211p9167j4073n580q5N4761k0744q4162p6020N9467
5540C438066l3172r8794K6611k9692l7814p2254o0835J12724p8066l9468J23018
$$ y = [2474511, 2469261, 2500909, 2664832, 2724700, 2783042, 2908074, 3091966, 3214240, 3204119, 3290992, 3337962, 3280180, 3198860, 3121092, 3138779, 3151751, 3177447, 3246961, 3275616, 3212242, 3288888, 3330626, 3469126, 3505663, 3543219, 3521026, 3618725, 3669501, 3707196, 3864572, 4031264, 4212481, 4442583, 4736042, 4878973, 4992988, 4965695, 4782493, 4627657, 4455641, 4312780, 4274573, 4099561, 4020533, 3999541, 4059239, 4073955, 4075311, 3899943, 3919655, 3759093, 3604372, 3637590, 3614942, 3659069, 3631426, 3662503, 3682030, 3698616, 3709073, 3776224, 3823676, 3819742, 3886212, 3752753, 3701737, 3746880, 3603669, 3524502, 3510429, 3504849, 3504764, 3559525, 3538781, 3454619, 3378599, 3438066, 3404894, 3306100, 3332711, 3303019, 3265205, 3192951, 3132116, 3244840, 3166774, 3127306, 3250324]
5529C250324j9316L1390P143M0273l0045J4601Q3302J39097P0287r1521q535k6998
5517C460002J22042M0272j784M221j03934M0281j0083O3094P593q480r831J4487
5505C617880L6626P2037N8293k1803M7682M9614Q7434P1690j00507n2596M7465
5494C913815J04020k498p5582m08k9015P4169K8297J40690N981o2241L5920P1012
5482D204160J5812O9669K4280j6629j04582P402M9126O7289J27864L8858K4999
5471D508248j29691O1599L7732L2370N6803p1472M6612J64547n5241k2088L6533
5460D665952R5457L3554R2923J45985n9847k3532R561J09047J24700N6031n4628
5449E195203j01596L2586J25590O7288N2073N744J41386J04876J91754M8350R3578
$$ y = [3250324, 3231008, 3262398, 3269541, 3309814, 3279769, 3294370, 3377672, 3516769, 3587056, 3495535, 3487000, 3460002, 3582044, 3622316, 3620532, 3624753, 3520819, 3561100, 3551017, 3614111, 3621704, 3613224, 3603393, 3617880, 3654506, 3726543, 3784836, 3763033, 3810715, 3860329, 3947763, 4019453, 3918946, 3866350, 3913815, 4017835, 4015337, 3939755, 3939347, 3910332, 3984501, 4012798, 4153488, 4159469, 4097228, 4133148, 4204160, 4219972, 4289641, 4313921, 4297292, 4192710, 4200112, 4249238, 4316527, 4444391, 4483249, 4508248, 4378557, 4440156, 4477888, 4510258, 4567061, 4495589, 4542201, 4706748, 4651507, 4629419, 4665952, 4761409, 4794963, 4887886, 5033871, 4974024, 4950492, 4960053, 5069100, 5193800, 5249831, 5195203, 5093607, 5126193, 5251783, 5319071, 5371144, 5376888, 5518274, 5623150, 5814904, 5863254, 5956832]
5438E956832J7298J9688J02941j7534m3072o252J50657J1027R5348N5970K6069
5427F368972n796O7158J22997N5210J1625J07319M8794P7847Q8075J53861J32082
5416G228144L4682J74203K25232K39408J44683O3087P9138J05105R7791j0997
5406H380476J8474Q4875R3435O1153K20102J06243Q1959K53099J70178J45499
5396I615493J06295J14086J84079O6520N6762Q8485J67034K11216J60398P2704
5386A0843072K02303K16497J75211J44061J50290J51868K65144R3961K18944J30792
5376A2592143J56693L10216J82576L37088K35542L98446K89104K88420K80414
5367A5070642L79354J65022J39014L16819J53374K44565K33425J03353K81265
$$ y = [5956832, 5974130, 5993818, 6096759, 6079225, 6036153, 6029901, 6180558, 6191585, 6286933, 6342903, 6368972, 6363176, 6430334, 6553331, 6608541, 6620166, 6727485, 6776279, 6854126, 6942201, 7096062, 7228144, 7262826, 7437029, 7662261, 7901669, 8046352, 8109439, 8188577, 8293682, 8391473, 8380476, 8398950, 8483825, 8577260, 8638413, 8858515, 8964758, 9046717, 9299816, 9469994, 9615493, 9721788, 9835874, 10019953, 10086473, 10143235, 10231720, 10398754, 10609970, 10770368, 10843072, 11045375, 11261872, 11437083, 11581144, 11731434, 11883302, 12148446, 12242407, 12461351, 12592143, 12748836, 13059052, 13241628, 13578716, 13814258, 14212704, 14501808, 14790228, 15070642, 15449996, 15615018, 15754032, 16070851, 16224225, 16468790, 16702215, 16805568, 17086833]
5358A7086833K18103J44555L01581L45975K21580L30366L69331K38971K90705
5349A9548000L21494K73170L38086M82983M09919L23425L94949L93354N90663
5340B3076043M47889M15882M64782M94432L50740M08912M38834N71904M64235
5331B7133653N24495N69594O51130O27695O22426N11674L50447L92156K92517
5322C1675787K73905M98476M04287N91004Q15657P39754P19518O60636P44691
5313C7123715P25262M78359O02918O72542P02847P01179R36268J153883J145902
5304D4242875J426838J518882J684670J742768J696572J596260J609921J634642
5296E7153428J610994J923945K410364K632608K980182L093452L169570L167343
$$ y = [17086833, 17304936, 17449491, 17751072, 18097047, 18318627, 18648993, 19018324, 19257295, 19548000, 19869494, 20142664, 20480750, 20963733, 21373652, 21697077, 22092026, 22485380, 23076043, 23523932, 23939814, 24404596, 24899028, 25249768, 25658680, 26097514, 26669418, 27133653, 27658148, 28227742, 28878872, 29506567, 30128993, 30640667, 30991114, 31383270, 31675787, 31949692, 32448168, 32852455, 33443459, 34259116, 34998870, 35718388, 36379024, 37123715, 37848977, 38327336, 38930254, 39602796, 40305643, 41006822, 41943090, 43096973, 44242875, 45669713, 47188595, 48873265, 50616033, 52312605, 53908865, 55518786, 57153428, 58764422, 60688367, 63098731, 65731339, 68711521, 71804973, 74974543, 78141886]
5288G8141886L384411L482963M014938M120420L937984L714706L365932L241880
5280A07405120L650798M664048O214862Q148240J0144888J2293066J5222998J8904800
5272A86648820K2067675K0986729J7390333J0852856K657059k311556j929122
5265B56362794J468696L689675L742534L731345M679308O570510P971070P687436
5257B95903368O273864N451498O755813P542846P122216O166067M970900N869065
5249C46055637Q680697J2442600J5642540J8960986K2250782K7842477K8983944
5242D80859663K4816200J4034034m891844k2732942l1323383k7589800k0021628
5235D13150300j3753455r588440n598874l519696l034416o843579j3346136j7970179
$$ y = [78141886, 81526297, 85009260, 89024198, 93144618, 97082602, 100797308, 104163240, 107405120, 111055918, 115719966, 121934828, 130083068, 140227956, 152521022, 167744020, 186648820, 208716495, 229703224, 247093557, 257946413, 260603472, 258291916, 256362794, 257831490, 261521165, 265263699, 268995044, 273674352, 280244862, 288215932, 295903368, 302177232, 307628730, 314384543, 321927389, 329049605, 335215672, 340186572, 346055637, 354736334, 367178934, 382821474, 401782460, 424033242, 451875719, 480859663, 505675863, 519709897, 514818053, 492085111, 460761728, 433171928, 413150300, 399396845, 389808405, 384209531, 380689835, 377655419, 370811840, 357465704, 339495525]
5227C39495525j8636190j6023916j3110161r995384p762163o491865m815829k856691
5219B59803326j330736j188351j756179j375361p94785j898785m147922r740782
5211B37570425j5637408j8707622j6317524j2848673j0743883q779836o616104
5204A47919375m559378l788818m085940n697325p054407p780671p589502p019446
5196A00343888o348940n597575m888689m222245l895353l856866l748356l501033
5188F4284831k791845k409155k142681j899539j759467j963398k043221k041160
5180D7234365j810391j664393j560684j242400j246902j001624q75214q03240
5172C7029517q00469p77608q55106q54696q73795q40846q31645p90907q09872
$$ y = [339495525, 320859335, 304835419, 291725258, 281729874, 273967711, 267475846, 262660017, 259803326, 258472590, 257284239, 255528060, 254152699, 253357914, 251459129, 247311207, 237570425, 221933017, 203225395, 186907871, 174059198, 163315315, 154535479, 147919375, 143359997, 139571179, 135485239, 129787914, 122733507, 114952836, 107363334, 100343888, 93994948, 88397373, 83508684, 79286439, 75391086, 71534220, 67785864, 64284831, 61492986, 59083831, 56941150, 55041611, 53282144, 51318746, 49275525, 47234365, 45423974, 43759581, 42198897, 40956497, 39709595, 38707971, 37832757, 37029517, 36229048, 35451440, 34596334, 33741638, 32867843, 32026997, 31195352, 30404445, 29594573]
5163B9594573p33292n52722m62328l51867m48627k90928l90164m52449o16629
5154B5295567r36873r25525q85858p82495n42060m81578m26009m68861m19963
5145A9426345l90027m11920l67996m36544n94643l70748l07738m40762l36968
5136A5768999k20449l21018l89945k16473l03746l47773l00635k35419j40776
5127A3292765k12181k62573k64672k55869l29914k48958k51434j63060l12978
5118A0991126k31795j87684j02549k15827k45321j96010j29543k57589l00009
5109I124799j78622j71468j21991j00509j17094j99682p5788o5486j88488j63444
5099G742227n9750r1933j49817j50656j22257j67762q8705l4764p3903j3875j99580
$$ y = [29594573, 28861281, 28308559, 27846231, 27494364, 27045737, 26754809, 26364645, 25912196, 25295567, 24358694, 23433169, 22547311, 21764816, 21222756, 20741178, 20315169, 19846308, 19426345, 19036318, 18624398, 18256402, 17819858, 17225215, 16854467, 16546729, 16105967, 15768999, 15548550, 15227532, 14837587, 14621114, 14317368, 13969595, 13668960, 13433541, 13292765, 13080584, 12818011, 12553339, 12297470, 11967556, 11718598, 11467164, 11304104, 10991126, 10759331, 10571647, 10469098, 10253271, 10007950, 9811940, 9682397, 9424808, 9124799, 8946177, 8774709, 8652718, 8552209, 8435115, 8235433, 8159645, 8094159, 7905671, 7742227, 7682477, 7590544, 7440727, 7290071, 7167814, 7000052, 6911347, 6876583, 6802680, 6788805, 6589225]
5088F589225o8185m3625j07074j03878j00210m3856j41275m1187j30838p6792
5078E732305O402j53957j11644o3590j17092p0852j13817M9390l6070l3619J2857
5067E100313j11536m4033m9634j39439j03099k3344o7128m3328m7164n9103o4006
5056D348499m4914j46903r928O253j6009k0004n9895p8366j5406l1675j01346
5045C830306j27452o4222l2628k3498p081k3683J2993n0003j07902r5164P560
5034C319226m2706N657q5977o9693k8486o6912j02769j6137M5009r397m6797j45016
5022B756002j63933M6347Q8463o0464n0723m4952j60055M7526K3961m6489J848
5011B437531L2573p0373m2361j03536o9432k1567m6472J16963M7668m3283L5190
$$ y = [6589225, 6521040, 6477415, 6370341, 6266463, 6166253, 6122397, 5981122, 5939935, 5809097, 5732305, 5738707, 5584750, 5473106, 5409516, 5292424, 5221572, 5107755, 5157145, 5121075, 5087456, 5100313, 4988777, 4944744, 4895110, 4755671, 4652572, 4629228, 4562100, 4518772, 4471608, 4412505, 4348499, 4303585, 4156682, 4146754, 4153007, 4136998, 4116994, 4057099, 3978733, 3963327, 3931652, 3830306, 3702854, 3638632, 3606004, 3582506, 3575425, 3551742, 3564735, 3514732, 3406830, 3311666, 3319226, 3276520, 3282177, 3196200, 3126507, 3098021, 3031109, 2928340, 2912203, 2957212, 2947815, 2901018, 2756002, 2592069, 2638416, 2726879, 2666415, 2615692, 2570740, 2410685, 2458211, 2482172, 2435683, 2437531, 2470104, 2399731, 2357370, 2253834, 2184402, 2162835, 2116363, 2233326, 2280994, 2237711, 2272901]
5000B272901j32015q8318o5228N285j0776l3241M8187J0424j7460q3355J6897
4989A923301j01670j99375k2465j7964O2843K9063K3000j0385m0761m2128m1451
4978A562008j2080k9983l5639N7749M8893o4030O0379o5133K4566l4784J6701
4967A528647o1378o2006O1090j03670J3505m3860n3725O4911J7741M4968K5503
4956A431726o0963p4757O3869P9916K186p2375l2736l2226K094n549N8495K4021
4944A383701n0050l430J24822K6029M1432L1097m1599O0690K4844n5922o392L412
4932A538634M5161M1732j1785O6216M9228K15081J55225J3138J40832p177p0198
4921B176087p2238o1242m1316j46261R4802J17454O0437J22949L8839J08850J56925
$$ y = [2272901, 2140886, 2052568, 1987340, 1992625, 1981849, 1948608, 1996795, 2007219, 1989759, 1906404, 1923301, 1821631, 1622256, 1599791, 1581827, 1644670, 1673733, 1696733, 1686348, 1645587, 1603459, 1562008, 1549928, 1519945, 1484306, 1542055, 1590948, 1526918, 1587297, 1522164, 1546730, 1511946, 1528647, 1467269, 1405263, 1466353, 1362683, 1376188, 1332328, 1278603, 1343514, 1361255, 1406223, 1431726, 1370763, 1296006, 1359875, 1439791, 1441977, 1369602, 1336866, 1304640, 1306734, 1301185, 1359680, 1383701, 1333651, 1330221, 1455043, 1481072, 1522504, 1553601, 1512002, 1572692, 1597536, 1541614, 1535222, 1538634, 1583795, 1625527, 1613742, 1679958, 1729186, 1944267, 2099492, 2112630, 2253462, 2246285, 2176087, 2103849, 2042607, 2001291, 1855030, 1949832, 2067286, 2127723, 2250672, 2289511, 2398361, 2555286]
4910B555286L622j5284o2570J7119K9123K4740R108J4819N8138N9518K29615J46093
4898C069327J86334J44642J09630j05436k39043k78802k57325r5383j60606o4456
4888B308882q2209o8634o9298o0874M118J21289p4733j20990k8166j46843K867
4877A785409k9858L9608L0244J2597j9204K3199Q9972p0113j0675o3184o0886
4866A727109p6748j67173j33842o7262p0365k7795o2130M8427n3160o6079l2535
4855A018447o27p5758p3271J4682m2455q5607r873O8025M0857o3047j3141N4456
4843H32688o7587m3878N443N7264q8723J0825j15577O4503K2291J6006l9349J290
4831F55196J26093q1977k4844j23934N5175j4345o9413M37O4923O8638j55866
$$ y = [2555286, 2558908, 2543624, 2481054, 2498173, 2527296, 2552036, 2561144, 2575963, 2634101, 2693619, 2923234, 3069327, 3255661, 3400303, 3509933, 3404497, 3165454, 2886652, 2629327, 2533944, 2373338, 2308882, 2226673, 2158039, 2088741, 2027867, 2031985, 2153274, 2078541, 1957551, 1929385, 1782542, 1785409, 1755551, 1795159, 1825403, 1838000, 1818796, 1841995, 1931967, 1861854, 1851179, 1787995, 1727109, 1650361, 1483188, 1349346, 1282084, 1211719, 1183924, 1121794, 1170221, 1117061, 1050982, 1018447, 1017820, 942062, 868791, 883473, 841018, 755411, 745538, 813563, 854420, 791373, 778232, 832688, 765101, 721223, 726666, 783930, 695207, 706032, 590455, 654958, 677249, 693255, 653906, 655196, 781289, 699312, 674468, 550534, 605709, 591364, 521951, 522388, 587311, 655949, 500083]
4820E00083K9746J42840R7930j38503p7181L8214m2009M9229r9532K5301N4301
4809E80419l2281L6410r5502p630N5410R2600n0430m7357q4680q7028q512J98785
4797E50204q750l0890N0397r1603l6055j1082K266j2306P839R9720P534j883J2599
4784E37990n2220j07507p7186Q9570k3283k1411r224J53393r035l4831J124k8394
4772D18986l0294M5654o780m7410q923L8478j173m127q1263P5608R3903L7340
4760E29999r2761o3792J46030q048l6820n7079J602N4495K6991o6455j21910N6828
4748C69080P1397P3475J7262K1852o5927m2893l9159K0392O8272j12203o3467
4737C18081J32176J20469Q682J8129p6580p4956J7263j3645M6290J32301o5735
$$ y = [500083, 529829, 672669, 770599, 632096, 554915, 593129, 551120, 600349, 500817, 526118, 580419, 548138, 584548, 489046, 481416, 536826, 629426, 578996, 531639, 446959, 359931, 351419, 550204, 541454, 510564, 560961, 469358, 433303, 422221, 424487, 412181, 420020, 519740, 527274, 525391, 537990, 485770, 378263, 301077, 390647, 367364, 345953, 336729, 490122, 481087, 446256, 447380, 418986, 388692, 434346, 427566, 380156, 371233, 409711, 408538, 404411, 323148, 398756, 492659, 529999, 437238, 373446, 519476, 511428, 474608, 417529, 419131, 473626, 500617, 434162, 312252, 369080, 440477, 513952, 531214, 553066, 487139, 444246, 405087, 425479, 493751, 381548, 318081, 450257, 570726, 579408, 597537, 520957, 446001, 463264, 449619, 495909, 628210, 562475]
4726E62475j00485J3152m150R749n1430J4797Q533m9036o6727j5998L5k0223R0245
4713C90937P5836q178k3801k8416M1030m9659r558K1639o760k1044j7538J34175
4701D98663j00716k815l6267L5545R6300l1441J0807L5923O7056n4694j13827
4690D04534l3487P3502m3702k9792N2751N5030k1853l1940M5583o4026n755n0634
4678C50211K6735j11310R4914M5577J5018j8115L0442j4621L1582P8888o5829
4667D63492P3394q2255k6815K6074j10695J5596R6498J6076R0333m8670j21588
4656C91440K9594J21888j9426j03335j0785K9788k0807J09712j8778O544p078
4645E08757m9159L3123J6504M3466n1967q8284l0478Q888J33919K6950l3008O2260
$$ y = [562475, 461990, 475142, 470992, 480741, 429311, 444108, 452641, 403605, 336878, 320880, 320915, 300692, 390937, 466773, 458595, 434794, 406378, 447408, 397749, 388191, 409830, 403070, 382026, 364488, 498663, 397947, 395132, 358865, 394410, 490710, 459269, 470076, 505999, 573055, 518361, 404534, 371047, 444549, 400847, 371055, 423806, 478836, 456983, 425043, 470626, 406600, 400845, 350211, 376946, 265636, 360550, 406127, 421145, 403030, 433472, 418851, 450433, 529321, 463492, 536886, 454631, 427816, 453890, 343195, 358791, 455289, 471365, 561698, 513028, 391440, 421034, 542922, 523496, 420161, 409376, 439164, 418357, 528069, 509291, 515835, 508757, 459598, 492721, 509225, 552691, 500724, 412440, 381962, 390850, 524769, 551719, 518711, 580971]
4633E80971J29780l5469o1789n8057l2993N6870j31657K7680J13048N333k7081
4622E66636J4847O1495m1735K7092J7757j09143r6275l9581K15450p4357l870
4611E38316O8691j5747J0681J4440K2760j1717m4873J2914P1655l743K0631j03447
4599E80561n0965Q025Q0120M4258p1807m9673M3213N8070R2906L8299j31864o6468
4587E74675J0315N3754r6074L9978J61505j3685l3024p0382R834p1190L0775n014
4575E91467J929j7379j8300J7318M3352J04372j9194K7297k193L755r7689M4544
4563F79279J0367p973p0026q7800N4886J75400o5798j18394O6087Q8387P9344
4552H03759J548K889l2464N0658r275o8571p3772R2467l4393j4837J38721J34238
$$ y = [580971, 710751, 675282, 613493, 555436, 522443, 579313, 447656, 475336, 588384, 593717, 566636, 581483, 642978, 601243, 628335, 646092, 536949, 440674, 401093, 616543, 542186, 538316, 607007, 591260, 601941, 616381, 639141, 627424, 582551, 595465, 667120, 663377, 684008, 580561, 529596, 537621, 617741, 661999, 590192, 540519, 583732, 641802, 734708, 773007, 641143, 574675, 584990, 638744, 542670, 582648, 744153, 730468, 697444, 627062, 636896, 565706, 596481, 591467, 593396, 576017, 557717, 575035, 618387, 722759, 703565, 730862, 728669, 732424, 634735, 679279, 689646, 681673, 611647, 523847, 578733, 754133, 688335, 569941, 636028, 724415, 803759, 805307, 808196, 775732, 826390, 817115, 748544, 674772, 767239, 732846, 718009, 856730, 990968]
4540I90968o3260j07749l9745N1304N2549Q4382n9825J815q4656m2479j2697N402
4528G76009q7261J394O2866m3519N4166j4544J54743J2161O839j9688K374P9334
4516I84874n9037J8246O4557P144j2414R17m8349l6056n2070J25168L6932r5061
4504I34851J01284K5371m6418k6312k7008l484M0172r611J05862J4598k9612j6442
4492A063251p4245k8943N6164L9299L4396L7225m9334N3518j0123j11161m599
4481A005448K03729Q523j29110j0260M7295J5628M8179Q7103o7714j22o1858q8457
4469A058384R5260k9640j04844J08286n9216o176R251k6968m4234O2643O6406
4458A129152r907J5175J01416K1086K1615j467m8986R393J9003K3707N3299l2532
$$ y = [990968, 927708, 819959, 780214, 831518, 884067, 968449, 908624, 910439, 825783, 783304, 770607, 776009, 688748, 690142, 753008, 709489, 763655, 749111, 903854, 916015, 922854, 903166, 905540, 984874, 925837, 944083, 1008640, 1015784, 1003370, 1004287, 955938, 919882, 867812, 992980, 1029912, 934851, 1036135, 1061506, 1015088, 988776, 961768, 958284, 998456, 988845, 1094707, 1109305, 1079693, 1063251, 989006, 960063, 1016227, 1055526, 1089922, 1127147, 1077813, 1131331, 1121208, 1010047, 1005448, 1209177, 1217700, 1088590, 1078330, 1125625, 1141253, 1189432, 1276535, 1208821, 1208699, 1146841, 1058384, 1153644, 1124004, 1019160, 1127446, 1068230, 1062054, 1071305, 1044337, 1000103, 1062746, 1129152, 1119245, 1134420, 1235836, 1256922, 1278537, 1277070, 1228084, 1237477, 1256480, 1280187, 1333486, 1300954]
4446A300954L2004j16046L3392M5134p1246M4325j255L9563q9639m7616O2966
4435A232536P3007Q2875K1851m5838k0345l7533L9124l5221K2022L5709j7396
4424A350791L2640M971k14427J07694Q0387q977K3961p4381L5908J402M0478m6536
4412A333911J03080O1302N777j59718R451J87525O6179Q986o5680l4921o855k9363
4400A479674n3786k3203j3213J48166j2759n0031j252p137k5907O384k760n3026
4388A391150P2195O0739k9993J3639l5624M8651R5474K9266L762m2882l1169J01200
4376A676408L4073k2233l1263L405n5021P3592J07866l3598p9289j356L9934L0319
4364A742837p1168J04886O2037r2514K1544L5164N9479n165l8020N939J02530
$$ y = [1300954, 1332958, 1216912, 1250304, 1295438, 1224192, 1268517, 1267262, 1306825, 1217186, 1169570, 1232536, 1305543, 1388418, 1410269, 1364431, 1344086, 1306553, 1345677, 1310456, 1332478, 1368187, 1350791, 1383431, 1388402, 1173975, 1281669, 1362056, 1353079, 1377040, 1302659, 1338567, 1339969, 1380447, 1333911, 1436991, 1498293, 1504070, 1344352, 1353803, 1541328, 1607507, 1616493, 1550813, 1515892, 1509037, 1479674, 1425888, 1402685, 1389472, 1537638, 1524879, 1474848, 1473596, 1466459, 1440552, 1446936, 1444176, 1391150, 1463345, 1524084, 1494091, 1507730, 1472106, 1520757, 1616231, 1645497, 1649259, 1606377, 1575208, 1676408, 1710481, 1688248, 1656985, 1660390, 1605369, 1678961, 1786827, 1753229, 1673940, 1672584, 1712518, 1742837, 1671669, 1776555, 1838592, 1746078, 1767622, 1802786, 1862265, 1857100, 1819080, 1825019, 1927549]
4353A927549J64999l622J0230j12706r8655K2093l0025J1526J29556j7447p5606
4342A927892N9698k1317l9860P792Q1541k4398l8039j1162n550Q7048N094p3116
4330A955623M9127J0937J55664l038m6235M534P3991l2516P5100M5953O2882Q2329
4318B434351Q8785l267K4192Q055j11226K8990N8270j40164L5591o563j7889l8290
4306B360835k0122m9805k0240O3117O4090L7165L5835k1966M5555J01001O4311
4295B659776O7993M5612K5992R4339J33609J41711J99112Q5270J57280L7578O290
4284C654562m0698n8313n5693K5822j43842j09440l266p8964j23527O0406R6086
4273C223133k6375K5010R0783O3363j667J0992O5745l7897J02201O5530K2223
$$ y = [1927549, 2092548, 2088926, 2099156, 1986450, 1887795, 1909888, 1879863, 1891389, 2020945, 2003498, 1927892, 1987590, 1966273, 1926413, 1934205, 2015746, 1991348, 1953309, 1942147, 1936597, 2023645, 2028739, 1955623, 2004750, 2015687, 2171351, 2168313, 2122078, 2126612, 2200603, 2168087, 2243187, 2289140, 2352022, 2434351, 2523136, 2519869, 2544061, 2552116, 2440890, 2469880, 2528150, 2387986, 2423577, 2417014, 2399125, 2360835, 2340713, 2290908, 2270668, 2333785, 2397875, 2435040, 2470875, 2448909, 2494464, 2595465, 2659776, 2727769, 2773381, 2799373, 2893712, 3027321, 3169032, 3368144, 3453414, 3610694, 3648272, 3654562, 3613864, 3555551, 3499858, 3525680, 3381838, 3272398, 3269132, 3190168, 3066641, 3127047, 3223133, 3196758, 3221768, 3312551, 3375914, 3374247, 3385239, 3450984, 3413087, 3515288, 3580818, 3603041]
4262C603041J78523J18649J27217J62521N3181K4263L8089M7154J46822L9156
4252D538616q9139M4057j29547N1667r0916k8016o9025L1614P2850n6818L8221
4241D313564K3166o692L3471l522L8658q0010M2534J26827J18602J04033R1529
4230D802160K28319J20688k5570k3581k1653l6494J03028O4483J75829J75735
4220E562944j1326R9232j1530n4826n2019j97584m3250n2188O531j02031q0942
4209E063011O3026p6899n2160M4751j0482J14515J01003J45089P7985O5398Q5568
4198E620805K04901J13366P0841M604k778k9324R8282L2092j1849K8988j09569
4187F020359j70221q8126n6883j65625j55310l399k6091n2237L0517P390n849
$$ y = [3603041, 3781564, 3900213, 4027430, 4189951, 4243132, 4267395, 4305484, 4352638, 4499460, 4538616, 4449477, 4493534, 4363987, 4415654, 4324738, 4296722, 4227697, 4259311, 4332161, 4275343, 4313564, 4336730, 4330038, 4363509, 4359987, 4398645, 4318635, 4361169, 4487996, 4606598, 4710631, 4802160, 5030479, 5151167, 5125597, 5102016, 5080363, 5043869, 5146897, 5211380, 5387209, 5562944, 5551618, 5650850, 5639320, 5584494, 5532475, 5334891, 5291641, 5239453, 5245984, 5143953, 5063011, 5126037, 5049138, 4996978, 5041729, 5031247, 5145762, 5246765, 5391854, 5469839, 5535237, 5620805, 5825706, 5939072, 6009913, 6014517, 6011739, 5982415, 6080697, 6112789, 6100940, 6129928, 6020359, 5850138, 5762012, 5705129, 5539504, 5384194, 5380795, 5354704, 5302467, 5332984, 5340374, 5334525]
4176E334525J16378M411O8655J00416o648J2739J14227l7077O8380L6243K4785
4165E837034J45076R5434J57435M0198J8006Q7858J6430j41247K7586J5679O682
4154F306171l1338j2544r8620m8916J7752L8952k7371Q8404J23761J5639m443
4143F367447N0064J33677Q7249Q8547r9713Q924J25610J14109R2051o980J15444
4132G076429Q4506m5095N6261J30391O8410N8632R8462K3868R7903J87860M5318
4121G882945K3440J03781J22378R9516J84078K30058Q6132L7428J05816J09461
4111H985033O8010K41338R1613J11170R3837J25408J22569K20902K12637K08668
4101A0481185J94787R9234J23246O0887J90588J15763J85784J61589K40178K00368
$$ y = [5334525, 5450903, 5455314, 5523969, 5624385, 5617737, 5630476, 5744703, 5707626, 5776006, 5812249, 5837034, 5982110, 6077544, 6234979, 6275177, 6293183, 6381041, 6397471, 6256224, 6283810, 6299489, 6306171, 6274833, 6262289, 6163669, 6114753, 6132505, 6171457, 6144086, 6232490, 6356251, 6371890, 6367447, 6417511, 6551188, 6638437, 6726984, 6627271, 6636195, 6761805, 6875914, 6967965, 6960985, 7076429, 7160935, 7115840, 7172101, 7302492, 7370902, 7429534, 7527996, 7551864, 7649767, 7837627, 7882945, 7906385, 8010166, 8132544, 8232060, 8416138, 8646196, 8732328, 8769756, 8875572, 8985033, 9053043, 9294381, 9385994, 9497164, 9591001, 9716409, 9838978, 10059880, 10272517, 10481185, 10675972, 10775206, 10898452, 10959339, 11149927, 11265690, 11451474, 11613063, 11853241, 12053609]
4091A2053609J73083Q2914K55469K58596J46449L00994K04720J83310K01880L11511
4081A4172535L29635K31507P8480J77309K88142K50733K57580K69555K40233K86375
4071A6582084L41625K96679K81218K55056L30890L30226L73218L85401K59565
4062A9435962L32991L91719L82691N29411M60512L39498M61897M16504M19030
4053B3170215N27399N92727O20195N10349O69767O87516Q58365O51344O71250
4044B8959127P02256P01229N68704O48525N71840O55183M76256K22953K90205
4035C3796278L32456M23557N17306N36309O27931P15085Q26738R91126J386115
4026D0152901J578785J818569K206990K296003K283614J971364J280259M73860
$$ y = [12053609, 12226692, 12309606, 12565075, 12823671, 12970120, 13271114, 13475834, 13659144, 13861024, 14172535, 14502170, 14733677, 14812157, 14989466, 15277608, 15528341, 15785921, 16055476, 16295709, 16582084, 16923709, 17220388, 17501606, 17756662, 18087552, 18417778, 18790996, 19176397, 19435962, 19768953, 20160672, 20543363, 21072774, 21533286, 21872784, 22334681, 22751185, 23170215, 23697614, 24290341, 24910536, 25420885, 26090652, 26778168, 27636533, 28287877, 28959127, 29661383, 30362612, 30931316, 31579841, 32151681, 32806864, 33283120, 33506073, 33796278, 34128734, 34552291, 35069597, 35605906, 36233837, 36948922, 37775660, 38766786, 40152901, 41731686, 43550255, 45757245, 48053248, 50336862, 52308226, 53588485, 54062345]
4018E4062345p7685l10118j92449J54780O19123Q96546J430924J865767K060811
4009F0510044K279175K588374K948148L272212L792522M342457M752965M519478
4001H9005375M038092L207005K740461K985074M363543O187421Q260828R979014
3993A30766813J2191203J4348030J6716411J7217492J4945796J1882239N547656
3986B23615640J79853k311583n74531K823354N364390O467365Q305854J1261147
3978B55131489J4334005J5456088J3768816J0794141O559390L336554J679238
3971C21059721J044508J354931K177995M558156O536295Q582732J1803441J7393198
3963C74510977K5096159L1793821K7373741J6585648l143711k7480232m1742576
$$ y = [54062345, 53984660, 53674542, 53482093, 53636873, 54255996, 55152542, 56583466, 58449233, 60510044, 62789219, 65377593, 68325741, 71597953, 75390475, 79732932, 84485897, 89005375, 93043467, 96250472, 98990933, 101976007, 106339550, 112526971, 120787799, 130766813, 142958016, 157306046, 174022457, 191239949, 206185745, 218067984, 223615640, 223795493, 221483910, 220909379, 223732733, 229097123, 235564488, 243870342, 255131489, 269465494, 284921582, 298690398, 309484539, 316043929, 319380483, 321059721, 322104229, 323459160, 325637155, 330195311, 336731606, 345314338, 357117779, 374510977, 399607136, 431400957, 458774698, 475360346, 472216635, 444736403, 402993827]
3956D02993827l9536244k6398134j6151953j0103267o925488m503566j901958
3949B97473217O60752J786185J724145o35393m298864q311550j2015987j5259340
3941B61123165j6626756j4417593r992824o382813l900265k711811k060966p23672
3933B04306465p86090k603786o102357j2574213j7089689j7702507j4402902j1346788
3925A21698133q790636o653733m684921l315419j948077j277968j149980j234148
3917I2643251k050391k727788k971218k814598k696029k478495k088972k131817
3909G2683943k260653k294703k285164k199422j837896j073864n12687k57894
3901E9961660j33289j40474n91569j342693j913831k355459k192055j619705j356231
$$ y = [402993827, 363457583, 337059449, 320907496, 310804229, 303878741, 299375175, 297473217, 298133969, 299920154, 301644299, 301008906, 296710042, 288398492, 276382505, 261123165, 244496409, 230078816, 220085992, 213703179, 209802914, 207091103, 205030137, 204306465, 203520375, 200916589, 194814232, 182240019, 165150330, 147447823, 133044921, 121698133, 112907497, 106253764, 101568843, 98253424, 96305347, 95027379, 93877399, 92643251, 90592860, 87865072, 84893854, 82079256, 79383227, 76904732, 74815760, 72683943, 70423290, 68128587, 65843423, 63644001, 61806105, 60732241, 60219554, 59961660, 59828371, 59687897, 59096328, 57753635, 55839804, 53484345, 51292290, 49672585, 48316354]
3892D8316354q37491j34722J33840M66390Q52800J323455J485069J442291R18514
3883E3966500M45040j58304m30942l34435o40169o08654q85309j346901j657519
3874D8349307j712301j690148j539186j367276j076391j039437q09905q10757
3866C8303906j114388j323073j351118j322999q76237n47692k77365j27144J94268
3857C1558158L52939N57067M17694M76235K85799J99623J86902N74531R50056
3848C5559004J042808J033431N50485k97516j109498j599152j968438k134079
3840C1077045j984379j661666j191573j038966r85777j044246j055250j010336
3832B1104852q22503q94856o18753l52824m24810k36477j86596j47602j22688
$$ y = [48316354, 47478863, 47344141, 47477981, 47944371, 48797171, 50120626, 51605695, 53047986, 53966500, 54411540, 54253236, 53822294, 53487859, 52847690, 52239036, 51353727, 50006826, 48349307, 46637006, 44946858, 43407672, 42040396, 40964005, 39924568, 39114663, 38303906, 37189518, 35866445, 34515327, 33192328, 32316091, 31768399, 31491034, 31363890, 31558158, 31911097, 32468164, 32885858, 33362093, 33647892, 33847515, 34034417, 34608948, 35559004, 36601812, 37635243, 38185728, 37888212, 36778714, 35179562, 33211124, 31077045, 29092666, 27431000, 26239427, 25200461, 24214684, 23170438, 22115188, 21104852, 20282349, 19387493, 18768740, 18415916, 17991106, 17754629, 17568033, 17420431, 17297743]
3823A7297743J02711P1282L77215L99157M69121N44048L83412L51339k36956o02878
3813A9156194r07807r88693j002998q76784p21948n35581m23208m73959m08741
3804A2816475l96288l16092k92343l04248k18726j86833j77507j33696k23414
3795A0567328o710j33212k07687k08938n3074l1974l4547j03713j19461m3362
3785I624650n4762p5561j78697j35469q1215j20892q486j61837L1681M3678j52376
3774H730714k5177N9612n4317K4752P5288p4111k581N53n9958J9258L9417n7807
3762H675643r7628Q472J2564J30906J9047o7960J31249Q4785J74889J02974j36455
3751I038486R798O238R4262n4890q3426L9268Q8144K05724Q5492m5243N4864K54368
$$ y = [17297743, 17400454, 17471736, 17848951, 18248108, 18717229, 19261277, 19644689, 19996028, 19759072, 19156194, 18248387, 17259694, 16256696, 15379912, 14657964, 14122383, 13699175, 13225216, 12816475, 12420187, 12104095, 11811752, 11507504, 11288778, 11101945, 10924438, 10790742, 10567328, 10560618, 10427406, 10219719, 10010781, 9957707, 9925733, 9891186, 9787473, 9668012, 9624650, 9569888, 9494327, 9315630, 9180161, 9098946, 8978054, 8969568, 8807731, 8839412, 8883090, 8730714, 8705537, 8765149, 8710832, 8735584, 8810872, 8736761, 8734180, 8734733, 8674775, 8694033, 8733450, 8675643, 8578015, 8586487, 8599051, 8729957, 8749004, 8681044, 8812293, 8897078, 9071967, 9174941, 9038486, 9048284, 9054522, 9148784, 9093894, 9010468, 9049736, 9137880, 9343604, 9429096, 9383853, 9438717, 9693085]
3739I693085J98031L15834K43545K76031L44248M40572M25489N77699M83394M75481
3729A3473409O61057N40559O99343P80403N42096M53111L39147l9247l47779m84837
3719A6617262o84315o63878n38372l03755l06320p5076J22451J30417K81552M99608
3709A5079574N88785O15299P05464Q84274J030878J092404J330029J296279J391046
3700B4014032J641738J550276J375839J255160O38567j04136p11756j190048j296133
3691B7173539j145183r04856m67057m08630k96494k18500k49981k66020l80244
3682B2836574o32252n77839k60778J86503L74986O54316R67504J108953J055691
3673B5713658P80926O58664L73599K46316K15022J88656J91740J05594J67874
$$ y = [9693085, 9891116, 10206950, 10450495, 10726526, 11070774, 11511346, 11936835, 12514534, 12997928, 13473409, 14134466, 14675025, 15374368, 16154771, 16696867, 17149978, 17489125, 17449878, 17102099, 16617262, 15932947, 15269069, 14730697, 14426942, 14120622, 14045546, 14167997, 14298414, 14579966, 15079574, 15668359, 16283658, 16989122, 17873396, 18904274, 19996678, 21326707, 22622986, 24014032, 25655770, 27206046, 28581885, 29837045, 30475612, 30371476, 29659720, 28469672, 27173539, 26028356, 25123500, 24656443, 24247813, 23951319, 23732819, 23482838, 23216818, 22836574, 22204322, 21626483, 21365705, 21552208, 21927194, 22581510, 23549014, 24657967, 25713658, 26494584, 27153248, 27526847, 27773163, 27988185, 28176841, 28368581, 28474175, 28642049]
3664B8642049K47135M53894M48396L35192K42023P0566j04412n06793j035229
3655B8792821j429638j872469j876149j632817j380871r29044o17564l48164j89404
3646A8516701p2341j70736m22538l50189l73595k86437J48240K03512M33813O66233
3636A8292663J013196J004847Q93971P89247M66711K67095p6891m91587o16063
3627B1543189r69814j111760j226868j439200j386395j374107j032518p54851
3619A2247676o05336n13137m58486l49237l84941j86837j05233j10530j1659l8168
3609I484112K0802J32500J55037K28456J80239K50298J93825m8332k64046j55719
3599A0177172q0072o8280l06136m18677m71781n23731l49606k21213k72395k12393
$$ y = [28642049, 28889184, 29343078, 29791474, 30126666, 30368689, 30439255, 30334843, 29828050, 28792821, 27363183, 25490714, 23614565, 21981748, 20600877, 19671833, 19054269, 18706105, 18516701, 18444360, 18273624, 17851086, 17500897, 17127302, 16840865, 16989105, 17192617, 17626430, 18292663, 19305859, 20310706, 21204677, 21993924, 22460635, 22727730, 22650839, 22159252, 21543189, 20573375, 19461615, 18234747, 16795547, 15409152, 14035045, 13002527, 12247676, 11642340, 11129203, 10670717, 10321480, 9936539, 9749702, 9644469, 9533939, 9522280, 9484112, 9504914, 9637414, 9792451, 10020907, 10201146, 10451444, 10645269, 10596937, 10332891, 10177172, 10097100, 10028820, 9722684, 9304007, 8832226, 8308495, 7958889, 7737676, 7465281, 7252888]
3589G252888o7765j56031j08226o5321n8966M140p1185K2035J5925l5891N7482
3578F789085j0564J6177J18161J11071M4849J77734J24433J19179K34443J79825
3568G904393L77055L84856N13547O28390N82395O41688R40056J034261Q69523
3559A3876164J000928P35122L88881m03615j027348j447361j393090j051072r05314
3550I773295p28528o32625n34381l05853l24048l87752l54362j76028j57969j94192
3540E977557k42954j75190r0715p4017j62715q0788o5688o9339k03320j31495
3530D681336Q088r5401n4557L3438q2708l8387n1010r5704m2658n9978n1115J6549
3518D167893l0049L5550j2004q3717r7275p2070O9790j04587j02844o0875N9353
$$ y = [7252888, 7185123, 7029092, 6920866, 6855545, 6796579, 6800719, 6729534, 6751569, 6767494, 6731603, 6789085, 6778521, 6794698, 6912859, 7023930, 7068779, 7246513, 7370946, 7490125, 7724568, 7904393, 8281448, 8666304, 9179851, 9808241, 10390636, 11032324, 11972380, 13006641, 13876164, 14877092, 15612214, 16001095, 15597480, 14570132, 13122771, 11729681, 10678609, 9773295, 9044767, 8412142, 7877761, 7571908, 7247860, 6860108, 6505746, 6329718, 6171749, 5977557, 5734603, 5559413, 5468698, 5394681, 5231966, 5151178, 5085490, 5016151, 4812831, 4681336, 4689424, 4594023, 4539466, 4572904, 4490196, 4451809, 4400799, 4305095, 4262437, 4202459, 4151344, 4167893, 4137844, 4173394, 4161390, 4077673, 3980398, 3908328, 3978118, 3873531, 3770687, 3709812, 3769165]
3507C769165O9900m0522k1553n4351N1517l2504p4602O7757l1992j26163m5207
3496C531445P6831q2417O1208L6110k3987J3657M804j05793N1928k7702n9235
3485C476849m8990J3083K8276n3672j8076Q6586j8889q727O115K49R6773j26978
3473C432599k2124O7309M479k3983n1656R0816j861o8754O4203k516j26770K9864
3461C391606j8375j7314O3034L5082N2768l0546j1447n5670J2998K7343N3719
3450C503198J8162O4399N7320K4359M4828o2765J10118M3426n5888N3928l2096
3439C768989N8426R692K6596N2594r3594o3991J55688O6904l9369k2171Q0309
3428D000073O4948J14518Q4647K6390j9761N4122J02492Q1400J04393M8735J60282
$$ y = [3769165, 3839065, 3798543, 3776990, 3722639, 3774156, 3741652, 3667050, 3734807, 3702815, 3576652, 3531445, 3608276, 3525859, 3587067, 3623177, 3599190, 3612847, 3617651, 3511858, 3563786, 3536084, 3476849, 3427859, 3440942, 3469218, 3415546, 3397470, 3484056, 3465167, 3456440, 3462555, 3462804, 3559577, 3432599, 3410475, 3477784, 3482263, 3458280, 3406624, 3497440, 3495579, 3426825, 3491028, 3488512, 3361742, 3391606, 3373231, 3355917, 3418951, 3454033, 3506801, 3476255, 3464808, 3409138, 3422136, 3449479, 3503198, 3521360, 3585759, 3643079, 3667438, 3712266, 3649501, 3759619, 3803045, 3747157, 3801085, 3768989, 3827415, 3837107, 3863703, 3916297, 3822703, 3758712, 3914400, 3981304, 3941935, 3919764, 4000073, 4065021, 4179539, 4264186, 4290576, 4270815, 4324937, 4427429, 4508829, 4613222, 4661957, 4822239]
3417D822239K59267K16357J07229K59408K51460M11391M67518M46500O37554Q17039
3407H695962Q64451N91546K40558k92079q62187r51343r04740m46012l22250k39081
3397F374825k71789j5440j40937j74189L8020j9008m9372m2400o0559N3725P22
3386E693598n1947j5597p9493J49947R8021O7455p2565J22779Q1061Q5316J7079
3375F095654J15412N7655p8930Q3956J19798J4686J55237J49019M9825L8795r736
3364F791371J52178J23054J33899O6085R2244P2138N6603Q2119R6130Q5255K29161
3353G980237R1737R6254J48637J55154K16397Q0101K05975J81300Q8507K52247
3343I496546J75058J79369J57426J93090L06678K15035K08484R9066J20106O2164
$$ y = [4822239, 5081506, 5297863, 5405092, 5664500, 5915960, 6327351, 6794869, 7241369, 7878923, 8695962, 9560413, 10151959, 10392517, 10100438, 9238251, 8286908, 7382168, 6936156, 6613906, 6374825, 6103036, 6087596, 5946659, 5772470, 5810490, 5791482, 5742110, 5699710, 5639151, 5692876, 5693598, 5641651, 5626054, 5546561, 5696508, 5794529, 5861984, 5789419, 5912198, 5993259, 6078575, 6095654, 6211066, 6268721, 6189791, 6273747, 6393545, 6408231, 6563468, 6712487, 6762312, 6801107, 6791371, 6943549, 7066603, 7200502, 7266587, 7358831, 7430969, 7487572, 7569691, 7665821, 7751076, 7980237, 8071974, 8168228, 8316865, 8472019, 8688416, 8768517, 8974492, 9155792, 9244299, 9496546, 9671604, 9850973, 10008399, 10201489, 10508167, 10723202, 10931686, 11030752, 11150858, 11213022]
3333A1213022J83206J18617K05786R2153N313J56585J86969N7938J40497K92983
3323A2653069K96757J02836K08238L28456L78891K77213L76106M50995L36499
3314A5409060M59637M64313M93897M70613K65692L91436M60332M58915M40890
3305A9314785M46151M62457M86123N37363N56728M23936M88985N56992N38619
3296B3812139N90022O78424O48434Q34200R19059J090538J245296J345007J425793
3287C2588912J257660R47632N93099L30398K14307N17602N40099P26093Q34606
3278C8550408J023151J162227J244391J546977J762516J959828K365681K536576
3270E2151755K813588L004643L049205L037343L189592K821266K465763K197304
$$ y = [11213022, 11396228, 11514845, 11720631, 11812784, 11818097, 11974682, 12161651, 12219589, 12360086, 12653069, 12949826, 13052662, 13260900, 13589356, 13968247, 14245460, 14621566, 15072561, 15409060, 15868697, 16333010, 16826907, 17297520, 17563212, 17954648, 18414980, 18873895, 19314785, 19760936, 20223393, 20709516, 21246879, 21803607, 22227543, 22716528, 23273520, 23812139, 24402161, 25080585, 25729019, 26563219, 27482278, 28572816, 29818112, 31163119, 32588912, 33846572, 34794204, 35387303, 35717701, 35932008, 36449610, 36989709, 37715802, 38550408, 39573559, 40735786, 41980177, 43527154, 45289670, 47249498, 49615179, 52151755, 54965343, 57969986, 61019191, 64056534, 67246126, 70067392, 72533155, 74730459]
3262G4730459J742372J104088O04933K22136J19958L06681J65069l4667j20884
3253G8840145j068280j728640k343186k442928k604076l023526l401577l727938
3245E8499994l836631l711125l442641l064711k934292k494285k138034k055731
3237C4822544j754505j712295j492339j364067j219241j116422r90925q77008
3229B4295742o35404n10399m15297l14439j45970o58L8852l00281n94306j036836
3219B0381004j165341j124094q64247p47645o37982m88543n22016n53265m43903
3210A3833968m08636l91466m20609l42502k74542l01860k92795k58326k37386
3201A0905846j83395k58841k22204j93843l50634j83852r5678r3171j79252j09598
$$ y = [74730459, 76472831, 77576919, 78181852, 78403988, 78523946, 78830627, 78995696, 78961029, 78840145, 77771865, 76043225, 73700039, 71257111, 68653035, 65629509, 62227932, 58499994, 54663363, 50952238, 47509597, 44444886, 41510594, 39016309, 36878275, 34822544, 33068039, 31355744, 29863405, 28499338, 27280097, 26163675, 25172750, 24295742, 23660338, 23149939, 22734642, 22420203, 22274233, 22273575, 22312427, 22012146, 21417840, 20381004, 19215663, 18091569, 17227322, 16479677, 15841695, 15353152, 14831136, 14277871, 13833968, 13425332, 13033866, 12613257, 12270755, 11996213, 11694353, 11401558, 11143232, 10905846, 10722451, 10463610, 10241406, 10047563, 9696929, 9513077, 9417399, 9324228, 9144976, 9035378]
3191I035378j57313k60414j45023j60960j06952j81306p1846j81564p5195r1583
3181G603222j63267q4696j23717j37909j8046q2159j50047o3503j17869j8117
3171F643892j35413j06321j20998j3824m048l0209n1830n7310k3114p5299j06028
3160E919498j19482l4750n3269n6841Q152r5262j43259n4567o2127q8713L1484
3149E250864N0257j32993m8459k0412n1404q8542q2382j8268n7853l1104k7815
3138D741889n4722o4347J08015j7470r3638o4843m0919n7664L3669o0874j21181
3127D307915o5755n0743l8310p4136K9197L452o9789O2725j0316L5018P91j19359
3115D010690p4547k8825O3300n4787K7774L5945J5439j23633q857M9031O9450
$$ y = [9035378, 8878065, 8617651, 8472628, 8311668, 8204716, 8023410, 7951564, 7770000, 7694805, 7603222, 7439955, 7355259, 7231542, 7093633, 7075587, 6993428, 6843381, 6779878, 6662009, 6643892, 6508479, 6402158, 6281160, 6267336, 6263288, 6233079, 6181249, 6123939, 6100825, 6025526, 5919498, 5800016, 5765266, 5711997, 5655156, 5663308, 5568046, 5424787, 5370220, 5308093, 5219380, 5250864, 5301121, 5168128, 5119669, 5099257, 5047853, 4959311, 4876929, 4858661, 4800808, 4769704, 4741889, 4687167, 4622820, 4730835, 4713365, 4619727, 4554884, 4513965, 4456301, 4489970, 4429096, 4307915, 4242160, 4191417, 4153107, 4078971, 4108168, 4111620, 4041831, 4104556, 4094240, 4129258, 4130049, 4010690, 3936143, 3907318, 3970618, 3915831, 3943605, 3979550, 3994989, 3871356, 3862499, 3911530, 3980980]
3104C980980o2364j50798p8660j3958K0023O7699n5401N308r22O0112N1215j1243
3092C811991l5496M5048M1400q4461r2281r018J05328m4632K1074j5597o9308
3081C674048j22385J7684O1350M8049K4580n6240q4564K1737L4410N3250k2763
3070C649156N3565J37470r5039m5943M1193r0915J2504j1723J14978k0937J40339
3059C884648k3476m5167k3867k4546Q907P2304M5153n8286Q1338j0714J01860
3048D008154N0391k7342j749J11807o1386O309l4822j2856L4793J18538J3885
3037D205722J2316O0422J09042J63260M6687P317J00309J17919M1086N2480J22943
3026E039503J25190k9470P0467J33228q233J43866J08663J24280J77014J35137
$$ y = [3980980, 3918616, 3767818, 3689158, 3675200, 3695223, 3762922, 3707521, 3712829, 3711907, 3772019, 3823234, 3811991, 3776495, 3821543, 3862943, 3778482, 3686201, 3677183, 3782511, 3737879, 3758953, 3743356, 3674048, 3551663, 3569347, 3630697, 3678746, 3703326, 3647086, 3562522, 3584259, 3618669, 3671919, 3649156, 3702721, 3840191, 3745152, 3699209, 3740402, 3649487, 3661991, 3650268, 3765246, 3744309, 3884648, 3861172, 3816005, 3792138, 3767592, 3776499, 3848803, 3893956, 3835670, 3917008, 3906294, 4008154, 4058545, 4031203, 4029454, 4141261, 4079875, 4086184, 4051362, 4038506, 4073299, 4191837, 4205722, 4218038, 4278460, 4387502, 4550762, 4597449, 4604766, 4705075, 4822994, 4864080, 4916560, 5039503, 5164693, 5135223, 5205690, 5338918, 5330685, 5474551, 5583214, 5707494, 5884508, 6019645]
3016F019645K36347K53158J40029J90810K02582K19738K59637J63865K87240K73406
3006H246457Q3123J05098J22139L3347j2958o6840n8183m2264j14340j4301N8652
2995H339930k9182l8105J4911J38175l5537M2996R2753J77054L06511J36032J24854
2984I270392K37409K73787K75928M64241L59797L86276M40442M92137N16090M03827
2974A3120326L83855L51870L74922J39490L01769J22230L0137l5405k4910j01626
2964A4662658q8293n3730J6370J73686J56958p017P5343L48851L10431L41180
2954A5936437M12061N75049P32016P75864Q25723R63527J084235J035483J139763
2945B3480158J234450J155784J128225Q28106O73812M09907M03087J17825L3433
$$ y = [6019645, 6255992, 6509150, 6649179, 6839989, 7042571, 7262309, 7521946, 7685811, 7973051, 8246457, 8329580, 8434678, 8556817, 8590164, 8577206, 8510366, 8452183, 8409919, 8295579, 8281278, 8339930, 8310748, 8272643, 8287554, 8425729, 8390192, 8433188, 8525941, 8702995, 9009506, 9145538, 9270392, 9507801, 9781588, 10057516, 10521757, 10881554, 11267830, 11708272, 12200409, 12716499, 13120326, 13504181, 13856051, 14230973, 14370463, 14672232, 14794462, 14824599, 14789194, 14764284, 14662658, 14574365, 14520635, 14537005, 14710691, 14867649, 14860632, 14935975, 15284826, 15595257, 15936437, 16348498, 16923547, 17655563, 18431427, 19257150, 20220677, 21304912, 22340395, 23480158, 24714608, 25870392, 26998617, 27826723, 28500535, 28910442, 29313529, 29431354, 29464787]
2936B9464787l2604K2605J22394J30363K754j4053j5726l3629L0390O7721L33817
2925C0078819L46987M25538N56665Q32831J054638J104862J443555J961840K464100
2916D0269835K930715L180887K821833J618268j43930k059466l572852l766137
2908D1279153l295781k924040k292775j888360j570477j320443j101110r12310
2900B5973857p39180o39344n66955l41090l11968p5327o1680j9448J91595K22036
2890B3632496L33314K63470L05555N88682N09532M09761K51096J6098k62549p53802
2880B5293653q75589j122573j272401j409362j309239j092717r62529q68992p59496
2871A5620755p88375n94765m96153n29558m88911n39282l68207l58843l47631
$$ y = [29464787, 29432183, 29454788, 29577182, 29707545, 29710299, 29696246, 29680520, 29646891, 29677281, 29745002, 30078819, 30425806, 30851344, 31408009, 32240840, 33295478, 34400340, 35843895, 37805735, 40269835, 43200550, 46381437, 49203270, 50821538, 50677608, 48618142, 45045290, 41279153, 37983372, 35059332, 32766557, 30878197, 29307720, 27987277, 26886167, 25973857, 25234677, 24595333, 24028378, 23687288, 23375320, 23299993, 23238313, 23218865, 23410460, 23632496, 23965810, 24229280, 24534835, 25123517, 25633049, 26042810, 26293906, 26310004, 26047455, 25293653, 24418064, 23295491, 22023090, 20613728, 19304489, 18211772, 17249243, 16380251, 15620755, 14832380, 14237615, 13741462, 13211904, 12722993, 12183711, 11815504, 11456661, 11109030]
2862A1109030k80877j80544l36292k76877k98206l30067k17774l23391k73872
2853H591130k60548k54399k39209j05696k41197l12462k38651j59855j85900j27037
2843F466176j33979k87010j84965j69164l2481j29904j14515j66619l8677p3988
2833E134874k29904j08186p0657r8012j42810l5174M314q6359n1252j28553n4733
2822D133548r6511k02746m9051o1842j16962r868K1209m7493j18971j69679P5518
2811C357152n4244j35623q7791m108j222r6247n4979N6635r7566q8249J4044n1703
2799B756099k7815R346p7428q5692l6352k7086o5178k1980Q1763j31063m8782
2788B325832L818p5393q9505R20p9204p8941K5797j6414m9055j59123k8279P4168
$$ y = [11109030, 10828153, 10647609, 10311317, 10034440, 9736234, 9406167, 9188393, 8865002, 8591130, 8330582, 8076183, 7836974, 7731278, 7490081, 7177619, 6938968, 6779113, 6593213, 6466176, 6332197, 6045187, 5860222, 5691058, 5658577, 5528673, 5414158, 5247539, 5208862, 5134874, 4904970, 4796784, 4726127, 4628115, 4485305, 4450131, 4454445, 4368086, 4316834, 4188281, 4133548, 4037037, 3834291, 3785240, 3723398, 3606436, 3596568, 3617777, 3570284, 3451313, 3281634, 3357152, 3302908, 3167285, 3079494, 3075386, 3074164, 2977917, 2922938, 2979573, 2882007, 2793758, 2807802, 2756099, 2728284, 2737630, 2660202, 2574510, 2538158, 2511072, 2445894, 2423914, 2505677, 2374614, 2325832, 2329650, 2254257, 2164752, 2165672, 2086468, 2007527, 2033324, 2016910, 1967855, 1808732, 1780453, 1854621]
2776A854621o7848o3259N0725j4683L2168l7810q3405j0738J2265j30018q9482
2765A452536R4002J0054j03689q4561K5674L0255k3756r600K955M5963R7795k8275
2753A509353o9841j45777o0489P0784M8551j49351m2779O4822n1470L7268k7706
2742A183365r8668p1732N6279m5273N5928J34857q8252p2170O6576K6104j74157
2731I72857O6758O616j73207j0221R0105r5642O0428P1937P0637J8328o3964m0103
2719I74529L4017r5981n5901R6712j00454j09486Q3314Q7526l9980N0767j9569
2708I05494l2333L2079k3145j833k508P781J1331k073P9682j14869l1461K7485
2696H55630j950j4890o1268l1878J73275n3844j7440J02281m0666n9710J16746
$$ y = [1854621, 1786773, 1723514, 1774239, 1759556, 1791724, 1753914, 1670509, 1659771, 1672036, 1542018, 1452536, 1546538, 1556592, 1452903, 1368342, 1394016, 1424271, 1400515, 1390915, 1393870, 1439833, 1537628, 1509353, 1439512, 1293735, 1233246, 1304030, 1352581, 1203230, 1160451, 1225273, 1173803, 1211071, 1183365, 1084697, 1012965, 1069244, 1023971, 1079899, 1214756, 1126504, 1054334, 1120910, 1147014, 972857, 1039615, 1046231, 873024, 862803, 952908, 857266, 917694, 989631, 1060268, 1078596, 1014632, 974529, 1008546, 912565, 856664, 953376, 852922, 743436, 826750, 914276, 874296, 925063, 905494, 873161, 905240, 882095, 880262, 877754, 885535, 896866, 894793, 974475, 859606, 828145, 855630, 853680, 838790, 777522, 745644, 918919, 865075, 847635, 949916, 909250, 849540, 966286]
2685I66286M297p6936p4913Q722Q9070M9514R0359l7917o7229l1670R3606K1744
2673A034933q8238k1146k0493Q6867Q4841m097J7442J5919n7757L2153N5396L9061
2661A174881J65026R7426j21272k4362O8408O7317n0325K8435O1564L4965l2658
2650A469405P005Q8866p1918N9059L0712m7942k9667L3716J26529K7622n5172
2639A638215m180n5262Q3364J34000P1626R5681M1955M585J46105L0718K7099
2628B213906J23978J854m8603K8985n6330M1725k7950m6657P8027j4647l4999
2617B259289m7359n3863O1684M8274p0928o7442J09888N4510q943p8609J35388
2606B341889J04201L4166l2885l3623J35818N0099J1680K2816P1501J0401l816
$$ y = [966286, 970583, 893647, 818734, 827456, 916526, 966040, 1056399, 1018482, 951253, 919583, 1013189, 1034933, 946695, 925549, 905056, 991923, 1076764, 1072667, 1090109, 1106028, 1048271, 1080424, 1135820, 1174881, 1339907, 1437333, 1316061, 1291699, 1360107, 1427424, 1377099, 1405534, 1467098, 1502063, 1469405, 1476410, 1565276, 1493358, 1552417, 1583129, 1535187, 1505520, 1539236, 1665765, 1693387, 1638215, 1634035, 1578773, 1662137, 1796137, 1867763, 1963444, 2005399, 2009984, 2156089, 2186807, 2213906, 2337884, 2339738, 2291135, 2320120, 2263790, 2305515, 2277565, 2230908, 2308935, 2294288, 2259289, 2211930, 2158067, 2219751, 2268025, 2197097, 2129655, 2239543, 2294053, 2285110, 2206501, 2341889, 2446090, 2480256, 2447371, 2413748, 2549566, 2599665, 2611345, 2634161, 2705662, 2716063, 2712247]
2595B712247J40226J79660p241j13890r1719L860K245j65469r4571j4729p5698
2584B474921j22525q1965j10482j04541N5197o1341Q2681j16390k8585Q4275o0876
2573B010369K8165p3304R1647n262k7849o8660j8707J05926N8879j39401j3558
2562A948245L3759L6094P670j5611K8838L0201Q688o0297m2346r3269j5085k13399
2550A653488j41151m9967P746j38661q1691l999q9508P3592P3833j77217r3230
2539A033235m2396r7243k664M2622N0739K3937m4271l9200p8538L0544m0806P396
2527H43355n7865j9377O7274k1264k668J935k7386o7349N9070q7335q2018p4117
2515E32255J0096j6656o0992l2444J2700J9694M3724q2185r608q2620L349Q0294
$$ y = [2712247, 2852473, 3032133, 3024892, 2911002, 2819283, 2823143, 2825388, 2659919, 2565348, 2550619, 2474921, 2352396, 2270431, 2159949, 2055408, 2110605, 2049264, 2131945, 2015555, 1986970, 2071245, 2010369, 2038534, 1965230, 2056877, 2051615, 2023766, 1955106, 1936399, 2042325, 2101204, 1961803, 1948245, 1982004, 2018098, 2025768, 2010157, 2038995, 2069196, 2077884, 2017587, 1975241, 1881972, 1866887, 1653488, 1512337, 1462370, 1470116, 1331455, 1249764, 1245765, 1156257, 1229849, 1303682, 1126465, 1033235, 990839, 893596, 890932, 933554, 984293, 1008230, 963959, 924759, 846221, 876765, 835959, 843355, 785490, 766113, 833387, 812123, 809455, 811390, 784004, 716655, 775725, 688390, 606372, 532255, 542351, 525695, 464703, 432259, 444959, 464653, 508377, 426192, 416584, 333964, 337313, 417607]
2503D17607r239l5699o3251R551O5648r119m2075k3997k8473J08720r4578l4166
2491B60929j02010n0709J08621P8226n9268m4637p9312J31864M6381p2398O1144
2480B78831l7322p4936J1605K0895L97n6903l8114M6800j650o2506j7278J6257
2468H6076J03905q048j6649J26936p552n7325j7919o5629n597j42812J55342K6693
2456A77421J1756m5069r2077k1974j1806L9356Q52R7326J2525m6222j20154L8474
2444D0408M8563J1792Q364K5391r1297j6969J64443p738q0140k2204l3110R0486
2432A37989k7221K1804q9816M8159L6782n1883J1865N4777L8889Q3493L6111m8410
2420B52539j26601k692q6941N001k4919K9569L5173j2081L8466p3273L7835L9074
$$ y = [417607, 408368, 372669, 309418, 318969, 384617, 375498, 333423, 309426, 280953, 389673, 295095, 260929, 158919, 108210, 216831, 295057, 235789, 191152, 111840, 243704, 290085, 217687, 278831, 241509, 166573, 178178, 199073, 199470, 142567, 104453, 151253, 149603, 87097, 69819, 86076, 189981, 181933, 165284, 292220, 284668, 227343, 209424, 143795, 138198, -4614, 150728, 177421, 189177, 144108, 52031, 30057, 18251, 57607, 58459, 155785, 168310, 122088, 1934, 40408, 88971, 100763, 109127, 134518, 43221, 26252, 190695, 182957, 102817, 80613, 47503, 137989, 110768, 132572, 42756, 90915, 127697, 75814, 87679, 142456, 181345, 264838, 300949, 252539, 125938, 123246, 36305, 41306, 16387, 45956, 81129, 69048, 107514, 34241, 72076, 111150]
2408A11150m3257l5293P0903k856L4016Q3765k6479n0425J516m6810N0533q4104
2396F2659L7Q5539k7961Q5498k947O007j6302l4384K7757j8918k3494R7873J3205
2383B54569j23151M7349R2467R4704j1384p8428n2885l3421L2162K3099K6753
2372B71834j23709m7330k2982M6044m1863n2380j935J19254j3520P7769n3758
2361A57424j02475K1552O0460N6093l834p0578l1429j6319N6765K8925J2827Q30
2349A70241j34521N570Q4863m108m5876K7390p7434o5828P3752J3369J5113P7070
2337A39601n817L2525j06575J1045O4370l0543j1104K8027J6184o3956k901R60
2325G1816O4733j00956q1812J05928N4137m5206p615L5853o119R3611j46418K5612
$$ y = [111150, 67893, 32600, 103503, 100647, 134663, 218428, 191949, 141524, 143040, 96230, 146763, 62659, 62696, 148235, 120274, 205772, 202825, 208832, 192530, 158146, 185903, 166985, 143491, 241364, 254569, 131418, 178767, 271234, 365938, 354554, 276126, 223241, 189820, 221982, 245081, 271834, 148125, 100795, 77813, 123857, 81994, 29614, 27679, 146933, 133413, 211182, 157424, 54949, 76501, 136961, 193054, 189220, 118642, 87213, 70894, 127659, 156584, 169411, 170241, 35720, 41290, 126153, 122045, 76169, 103559, 26125, -39703, 34049, 47418, 62531, 139601, 133784, 166309, 59734, 70779, 135149, 104606, 93502, 121529, 137713, 73757, 70856, 71816, 136549, 35593, -46219, 59709, 113846, 68640, 61025, 96878, 90759, 184370, 37952, 63564]
2313F3564n174m9480N9304J15524p4139o89m2277Q4769M0640m9120p1191j5802
2301E5929m5783L4983J05430J986n7402K6633P0570L9352O2606o5023q7438j6918
2289A24925k4633j6709P5779K9583r6241J1155J05474O6761o9833J18522r1711
2278B33072P4455m8445j9643o1588J1904j6228p2405R1460k8611r540J04927j2608
2266B46750N134k8628o9996J10960R322j6547k9328K3914k4182J7770L0741M8829
$$ y = [63564, 58390, 8910, 68214, 183738, 109599, 108910, 66633, 151402, 192042, 142922, 71731, 55929, 10146, 45129, 150559, 152545, 95143, 121776, 192346, 231698, 294304, 229281, 141843, 124925, 100292, 83583, 159362, 188945, 92704, 103859, 209333, 276094, 206261, 324783, 233072, 307527, 259082, 239439, 177851, 189755, 173527, 101122, 192582, 163971, 154431, 259358, 246750, 251884, 223256, 153260, 264220, 273542, 256995, 227667, 251581, 227399, 245169, 275910, 324739]
$$ [...]
##END NTUPLES=NMR SPECTRUM
##END=
