##TITLE=1H_EC-3222x
 DMSO, 8 sc, 
 6.2.2020
##JCAMPDX= 6.0         $$ Bruker NMR JCAMP-DX V2.0
##DATA TYPE= NMR FID
##DATA CLASS= NTUPLES
##ORIGIN= UXNMR, Bruker Analytische Messtechnik GmbH
##OWNER= root
$$ XWIN-NMR		Version 3.5
$$ Thu Feb  6 14:47:10 2020 Russian Standard Time (UT+4h)  she@DPX200
##.OBSERVE FREQUENCY= 200.1315
##.OBSERVE NUCLEUS= ^1H
##.DELAY= (6, 6)
##.ACQUISITION MODE= SIMULTANEOUS
##.ACQUISITION SCHEME= undefined
##.AVERAGES= 8
##.DIGITISER RES= 18
##SPECTROMETER/DATA SYSTEM= spect
##.PULSE SEQUENCE= zg30
##.SOLVENT NAME= D2O
##.SHIFT REFERENCE= (INTERNAL, D2O, 0, 15.7039)
##AUDIT TRAIL= $$ (NUMBER, WHEN, WHO, WHERE, WHAT)
$$ ##TITLE= Audit trail, XWIN-NMR		Version 3.5
$$ ##JCAMPDX= 5.01
$$ ##ORIGIN= Bruker BioSpin GmbH
$$ ##OWNER= she
$$ F:/spectra/data/she/nmr/H-F/1/audita.txt
$$ ##AUDIT TRAIL=  $$ (NUMBER, WHEN, WHO, WHERE, WHAT)
(   1,<2020-02-06 14:46:27.35 +0400>,<she>,<DPX200>,
      <created by zg, POWCHK disabled, PULCHK disabled
       configuration hash MD5:
       00 E9 B6 7A A2 85 ED C7 34 08 36 98 17 FE 4E 26
       data hash MD5: 16K
       ED 03 1F 91 BA 8F 83 5B 72 32 3C D9 83 A8 21 6C>)
$$ ##END=
$$ 
$$ hash MD5
$$ C4 54 39 23 45 66 10 5A 75 5A 14 94 AC B6 52 34
##$RELAX= 
##$RELAX= 
##$RELAX= 
##$RELAX= 
##$RELAX= 
##$RELAX= 
$$ Bruker specific parameters
$$ --------------------------
##$DU= <F:/spectra>
##$EXPNO= 1
##$NAME= <H-F>
##$PROCNO= 1
##$TYPE= <nmr>
##$USER= <she>
##$AMP= (0..31)
100 100 100 100 100 100 100 100 100 100 100 100 100 100 100 100 100 100 
100 100 100 100 100 100 100 100 100 100 100 100 100 100 
##$AQSEQ= 0
##$AQ_mod= 1
##$AUNM= <au_zg>
##$AUTOPOS= <>
##$BF1= 200.13
##$BF2= 200.13
##$BF3= 200.13
##$BF4= 200.13
##$BF5= 200.13
##$BF6= 200.13
##$BF7= 200.13
##$BF8= 200.13
##$BYTORDA= 1
##$CFDGTYP= 0
##$CFRGTYP= 5
##$CHEMSTR= <none>
##$CNST= (0..31)
1 1 145 1 1 1 1 1 1 1 1 1 1 1 1 1 1 1 1 1 1 1 1 1 1 1 1 1 1 1 1 1 
##$CPDPRG= <>
##$CPDPRG1= <>
##$CPDPRG2= <>
##$CPDPRG3= <>
##$CPDPRG4= <mlev>
##$CPDPRG5= <mlev>
##$CPDPRG6= <mlev>
##$CPDPRG7= <mlev>
##$CPDPRG8= <mlev>
##$CPDPRGB= <>
##$CPDPRGT= <>
##$D= (0..31)
0 1.2 0 0 0 0 0 0 0 0.06 0 0.03 0 0 0 0 0.0002 0 0 0 0 0 0 0 0 0 0 0 0 
0 0 0 
##$DATE= 1580985986
##$DBL= (0..7)
120 120 120 120 120 120 120 120 
##$DBP= (0..7)
150 150 150 150 150 150 150 150 
##$DBP07= 0
##$DBPNAM0= <>
##$DBPNAM1= <>
##$DBPNAM2= <>
##$DBPNAM3= <>
##$DBPNAM4= <>
##$DBPNAM5= <>
##$DBPNAM6= <>
##$DBPNAM7= <>
##$DBPOAL= (0..7)
0.5 0.5 0.5 0.5 0.5 0.5 0.5 0.5 
##$DBPOFFS= (0..7)
0 0 0 0 0 0 0 0 
##$DE= 6
##$DECBNUC= <off>
##$DECIM= 24
##$DECNUC= <off>
##$DECSTAT= 4
##$DIGMOD= 1
##$DIGTYP= 9
##$DL= (0..7)
0 120 120 120 120 120 120 120 
##$DP= (0..7)
150 150 150 150 150 150 150 150 
##$DP07= 0
##$DPNAME0= <>
##$DPNAME1= <>
##$DPNAME2= <>
##$DPNAME3= <>
##$DPNAME4= <>
##$DPNAME5= <>
##$DPNAME6= <>
##$DPNAME7= <>
##$DPOAL= (0..7)
0.5 0.5 0.5 0.5 0.5 0.5 0.5 0.5 
##$DPOFFS= (0..7)
0 0 0 0 0 0 0 0 
##$DQDMODE= 0
##$DR= 18
##$DS= 0
##$DSLIST= <SSSSSSSSSSSSSSS>
##$DSPFIRM= 0
$$ [...]
##$SUBNAM2= <"">
##$SUBNAM3= <"">
##$SUBNAM4= <"">
##$SUBNAM5= <"">
##$SUBNAM6= <"">
##$SUBNAM7= <"">
##$SUBNAM8= <"">
##$SUBNAM9= <"">
##$SW= 24.9337058887773
##$SWIBOX= (0..15)
0 0 2 0 0 0 0 0 0 0 0 0 0 0 0 0 
##$SW_h= 4990.01996007984
##$TD= 16384
##$TD0= 1
##$TE= 0
##$TE2= 300
##$TE3= 300
##$TEG= 300
##$TL= (0..7)
0 120 120 120 120 120 120 120 
##$TP= (0..7)
150 150 150 150 150 150 150 150 
##$TP07= 0
##$TPNAME0= <>
##$TPNAME1= <>
##$TPNAME2= <>
##$TPNAME3= <>
##$TPNAME4= <>
##$TPNAME5= <>
##$TPNAME6= <>
##$TPNAME7= <>
##$TPOAL= (0..7)
0.5 0.5 0.5 0.5 0.5 0.5 0.5 0.5 
##$TPOFFS= (0..7)
0 0 0 0 0 0 0 0 
##$TUNHIN= 0
##$TUNHOUT= 0
##$TUNXOUT= 0
##$USERA1= <user>
##$USERA2= <user>
##$USERA3= <user>
##$USERA4= <user>
##$USERA5= <user>
##$V9= 5
##$VALIST= <valist>
##$VCLIST= <CCCCCCCCCCCCCCC>
##$VD= 0
##$VDLIST= <DDDDDDDDDDDDDDD>
##$VPLIST= <PPPPPPPPPPPPPPP>
##$VTLIST= <TTTTTTTTTTTTTTT>
##$WBST= 1024
##$WBSW= 4
##$XGAIN= (0..3)
0 0 0 0 
##$XL= 0
##$YL= 0
##$YMAX_a= 551563
##$YMIN_a= -366034
##$ZGOPTNS= <>
##$ZL1= 120
##$ZL2= 120
##$ZL3= 120
##$ZL4= 120
##$ABSF1= 10
##$ABSF2= 0
##$ABSG= 5
##$ABSL= 3
##$ALPHA= 0
##$AQORDER= 0
##$ASSFAC= 0
##$ASSFACI= 0
##$ASSFACX= 0
##$ASSWID= 0
##$AUNMP= <proc_1d>
##$AZFE= 0.1
##$AZFW= 0.1
##$BCFW= 1
##$BC_mod= 2
##$BYTORDP= 1
##$COROFFS= 0
##$CY= 11.3945322036743
##$DATMOD= 1
##$DC= 2
##$DFILT= <>
##$DTYPP= 0
##$F1P= 16.9975609425685
##$F2P= -3.02152046262296
##$FCOR= 0.5
##$FTSIZE= 0
##$FT_mod= 4
##$GAMMA= 1
##$GB= 0.15
##$INTBC= 1
##$INTSCL= 1
##$ISEN= 128
##$LB= 0.24
##$LEV0= 0
##$LPBIN= 0
##$MAXI= 10000
##$MC2= 0
##$MEAN= 0
##$ME_mod= 0
##$MI= 1.114404
##$NCOEF= 0
##$NC_proc= 0
##$NLEV= 6
##$NOISF1= 3.799351
##$NOISF2= 2.8
##$NSP= 1
##$NTH_PI= 0
##$NZP= 0
##$OFFSET= 15.70392
##$PC= 1
##$PHC0= -9782.583
##$PHC1= 5.800813
##$PH_mod= 1
##$PKNL= yes
##$PPARMOD= 0
##$PSCAL= 0
##$PSIGN= 0
##$REVERSE= no
##$SF= 200.130013532006
##$SI= 16384
##$SIGF1= 3
##$SIGF2= 2
##$SINO= 400
##$SIOLD= 16384
##$SREGLST= <1H.CDCl3>
##$SSB= 0
##$STSI= 0
##$STSR= 0
##$SW_p= 3612.71676300578
##$SYMM= 0
##$S_DEV= 0
##$TDeff= 0
##$TDoff= 0
##$TI= <>
##$TILT= no
##$TM1= 0
##$TM2= 0
##$TOPLEV= 0
##$USERP1= <user>
##$USERP2= <user>
##$USERP3= <user>
##$USERP4= <user>
##$USERP5= <user>
##$WDW= 1
##$XDIM= 8192
##$YMAX_p= 0
##$YMIN_p= 0
$$ End of Bruker specific parameters
$$ ---------------------------------
##NTUPLES= NMR FID
##VAR_NAME=  TIME,          FID/REAL,        FID/IMAG
##SYMBOL=    X,             R,               I
##VAR_TYPE=  INDEPENDENT,   DEPENDENT,       DEPENDENT
##VAR_FORM=  AFFN,          ASDF,            ASDF
##VAR_DIM=   8192,          8192,            8192
##UNITS=     SECONDS,       ARBITRARY UNITS, ARBITRARY UNITS
##FACTOR=    0.0002004,     1,               1
##FIRST=     0,             0,               0
##LAST=      1.6414764,     0,               0
##MIN=       0,             -366034,         0
##MAX=       1.6414764,     551563,          0
$$ Real data points
##PAGE= N=1
##DATA TABLE= (X++(R..R)), XYDATA
0 0 0 0 0 0 -6 8 0 8 -8 12 -16 20 -24 32 -39 48 -56 64 -80 95 -108 127 -148 172 -196 227 -259 295 -334
29 -334 376 -426 478 -537 602 -671 748 -835 924 -1026 1139 -1261 1398 -1548 1712 -1898
45 -1898 2102 -2336 2599 -2900 3248 -3657 4145 -4738 5480 -6433 7713 -9536 12350 -17305
59 -17305 28545 -108077 181784 448821 24880 -279455 -183912 45271 -4164 -75007 40113
70 40113 177482 23879 -214721 -194109 79108 203481 52173 -124098 -77117 53099 67437
81 67437 2224 30200 97359 41427 -115654 -149125 2293 166222 170587 49167 -77171
92 -77171 -128263 -84545 29081 114319 85185 -24038 -96596 -80939 -15597 56824 106335 67774
104 67774 -72959 -180279 -96925 103766 174664 39054 -101356 -76496 17217 20494 -12783
115 -12783 49790 136337 62442 -126729 -170226 13050 190046 154903 -2425 -80517 -48891
126 -48891 1400 38476 73905 65719 -15529 -86669 -46931 61671 107217 52525 -22035 -57060
138 -57060 -63866 -38960 35018 104814 74778 -36707 -99338 -50458 22762 39386 34042 43819
150 43819 14323 -76936 -119870 -21542 115223 115057 -16367 -107032 -70568 1980 24298 27144
162 27144 39308 4199 -94121 -131806 -14340 132626 110093 -61543 -161898 -85918 34213
173 34213 53799 6192 -13689 -11323 -38328 -63947 -29735 39067 60728 13055 -51304 -78512
185 -78512 -48512 26012 88791 69164 -27864 -97533 -60063 32754 72321 40119 1570 -16167
197 -16167 -38643 -53926 -6947 82920 98777 -5776 -109113 -76678 39124 80569 17928
208 17928 -30776 -6459 6544 -35833 -43606 39330 101454 28023 -95661 -97350 19992 91990
220 91990 44809 -17677 -11395 3906 -32386 -52806 21440 112274 76279 -65567 -131314 -28584
232 -28584 110956 112321 -8475 -86118 -43597 28899 33362 1850 6957 33963 9879 -53373
244 -53373 -61482 16498 87369 55922 -37417 -75817 -26448 30332 31964 10545 14807 18235 -23319
257 -23319 -65895 -27667 65297 88106 -1454 -87249 -60188 29705 61688 21767 -8652 -5230
269 -5230 -17120 -47564 -26877 51393 84691 9865 -84155 -75328 16737 66280 26262 -21959
281 -21959 -17930 -2196 -20167 -34416 4514 55187 41136 -28648 -66433 -31786 26991 50970
293 50970 30245 -12262 -48427 -45730 4563 56848 50073 -7425 -47590 -32959 2164 17982
305 17982 21155 26743 15711 -24949 -53373 -22030 40413 57424 9765 -37928 -34230 -4849 7521
318 7521 8807 21636 24695 -9417 -48934 -34152 25163 56323 22965 -27538 -40255 -17216 8045
331 8045 25691 34471 18640 -23340 -52402 -27924 30467 59084 27371 -27571 -48334 -20803
343 -20803 19987 33572 16568 -5449 -12664 -11534 -12392 -8132 12991 34257 20581 -25540 -52796
356 -52796 -20962 38059 54324 8986 -40126 -40209 -3417 21077 19384 12853 7847 -10352 -35294
369 -35294 -28832 15447 50112 28880 -24808 -47363 -18482 20252 28417 10700 -5714 -11477 -15545
382 -15545 -15328 931 24594 27096 -2853 -36281 -34323 2780 32904 24989 -5549 -23104 -20040
395 -20040 -12526 -4149 15729 34138 17098 -32881 -57106 -15377 47308 50712 -8234 -49465 -24072
408 -24072 18974 18660 -7824 -5378 19073 11343 -29378 -37724 11297 53901 27261 -32222 -46450
421 -46450 -5072 29433 20198 265 727 3104 -15322 -28233 -2267 39479 38803 -8971 -43424
434 -43424 -23801 18719 31333 12381 -4036 -5993 -8647 -13538 -1069 25731 31304 -80 -33550
447 -33550 -24930 12695 32595 16449 -7427 -12252 -5438 -4288 -2757 11090 25950 16163 -15265
460 -15265 -32347 -13497 21505 34261 15095 -14194 -26682 -12744 12356 26328 17427 -4265
472 -4265 -16775 -10357 2939 10022 12319 13360 5728 -13025 -24004 -5641 26897 32641 1162
485 1162 -28580 -21376 5947 16798 7535 2470 5290 -3953 -22064 -18986 11068 31823 11999
498 11999 -24384 -31379 -5775 14930 11051 -31 -3904 -8835 -19746 -17409 6562 26041 12087
511 12087 -22080 -34205 -11108 15605 15806 -1399 -10531 -7782 -7257 -12075 -6672 10785 20393 3759
525 3759 -24343 -28981 -1528 26812 22533 -6533 -24313 -13324 6816 11296 3733 2004 3977
538 3977 -3842 -17404 -12840 12920 29577 12136 -20110 -27100 -3066 20248 16990 795 -5713
551 -5713 -3640 -5298 -8164 777 16827 17213 -5123 -23017 -14738 9533 20400 8415 -7773 -11113
565 -11113 -5739 -1661 1789 9006 13684 3035 -17202 -22903 -692 25410 22922 -5750 -24088
578 -24088 -10922 11271 12462 -87 -828 9830 5582 -14157 -17617 10232 33117 15418 -21175
591 -21175 -26338 4676 26588 13755 -6534 -4898 6106 928 -11228 -2012 21797 23722 -5155
604 -5155 -26591 -12252 17572 23272 3297 -10884 -5890 1341 -1912 -2661 8579 15093 657 -19127
618 -19127 -17018 5313 19771 9683 -8649 -13911 -6590 -91 1846 3957 5814 2280 -9120 -15587
632 -15587 -7760 8592 16706 4773 -13812 -18094 -3869 11097 10965 -434 -7474 -5325 -2225 -3202
646 -3202 -126 7549 10226 -857 -16318 -15306 4031 19433 11798 -8699 -16710 -5563 6606
659 6606 6075 730 1781 3571 -3821 -12818 -7046 10481 16945 1354 -16798 -15109 2326 12338
673 12338 5396 -4150 -3640 -965 -6339 -9391 1053 15405 10400 -11646 -22114 -6030 14031 12915
687 12915 -3654 -10597 -1965 3632 -2540 -5714 4917 13960 2737 -16442 -15409 8026 22409
700 22409 8396 -12798 -13745 1989 9390 2147 -1390 5638 8009 -4076 -14128 -5483 13813 18697
714 18697 2264 -14239 -10969 4764 12357 5500 -2218 -1713 842 -1847 -4268 1811 11033 7992
728 7992 -6889 -14164 -4446 10476 12270 767 -8170 -5705 520 950 -1212 2031 7120 2892 -9737
743 -9737 -13730 287 15429 10428 -7602 -14385 -3153 7868 4852 -2433 -181 4205 -1020 -10653
757 -10653 -7551 8446 16745 3168 -15366 -14326 4455 14627 4762 -7402 -4134 4494 1224
770 1224 -7266 -4005 9986 12075 -3894 -15880 -6873 10801 13620 -55 -10348 -5661 3182 3206
784 3206 -1753 292 6907 3571 -9107 -12772 1189 15616 9617 -8062 -13527 -1960 7616 4211
798 4211 -2155 -804 3333 -430 -7490 -5220 6499 11588 2248 -9973 -10394 2289 10004 5127 -4235
813 -4235 -3986 591 -314 -3894 -635 7109 7613 -3039 -11992 -6345 6877 11656 2426 -8590 -8094
828 -8094 1226 5487 1505 -1892 1541 2950 -2908 -8326 -2186 8947 9439 -2858 -11443 -5410 5397
843 5397 7142 -118 -3577 -433 1774 -3093 -6169 709 10292 6732 -7800 -13418 -1684 11578
857 11578 8168 -4479 -7819 -287 4179 -802 -3284 2449 7112 674 -9360 -7861 4599 12066
871 12066 3741 -8731 -8715 2211 7011 819 -4157 1124 5429 -956 -9559 -4437 9149 11087 -1565
886 -1565 -12171 -6658 5521 8311 600 -4516 -1672 2277 -558 -4274 -246 7605 5753 -5889
900 -5889 -10840 -1459 10040 7246 -4316 -7438 -12 4193 -497 -3640 1434 6239 2025 -7374 -8093
915 -8093 2570 10738 5197 -5923 -8816 230 6734 2407 -3059 -661 3967 51 -6703 -3853 7041
930 7041 9503 -614 -10008 -6139 5301 8846 1488 -5398 -2666 3387 2243 -3637 -2637 5529 7940
945 7940 -1888 -10321 -4422 8118 9787 -1365 -7513 -2671 3844 2879 -2125 -1056 3967 3014 -4827
960 -4827 -7781 159 9417 6043 -5787 -9866 -695 7602 3672 -4310 -3489 3069 2114 -4546 -5399 2652
976 2652 8163 1678 -7883 -7867 1994 7817 2671 -5660 -4590 2198 2438 -3374 -3809 3779 6761 -2232
992 -2232 -10602 -4760 7251 9078 -1658 -9033 -3695 4232 3997 -2314 -3074 2139 3920 -2024 -6974
1007 -6974 -1620 7934 6914 -4050 -8650 -1211 7263 3652 -3663 -3335 2968 2898 -3384 -4820 2083
1022 2083 7956 3101 -6368 -7487 1561 8570 4665 -4719 -5443 1185 4543 -42 -3131 1722 5179
1037 5179 955 -6394 -4654 4731 7969 980 -6445 -4153 3059 4737 -475 -3528 519 4048 34
1052 34 -5541 -3397 5843 7608 -1921 -9165 -3566 5844 6164 -1979 -5341 -346 3447 -170 -4172 -1311
1068 -1311 4985 3527 -4883 -7926 -428 7263 4263 -5177 -7089 621 5163 -484 -5476 -1157 5629
1083 5629 2069 -6594 -6880 2675 8409 1754 -7404 -6102 2136 5698 -173 -4473 -1229 3860 1036
1098 1036 -5415 -3642 4755 7130 -1439 -8668 -3418 6165 6377 -2002 -5637 19 4821 1349 -4098
1113 -4098 -1713 5080 5364 -2380 -7023 -886 7096 5751 -2437 -5906 170 4516 1595 -3000 -694
1128 -694 4406 3077 -3558 -5202 1632 7392 3212 -5236 -5711 1858 6511 1790 -4103 -2363 3359
1143 3359 3122 -3016 -4540 1901 5998 767 -6479 -5002 3251 5980 -174 -5434 -2499 3022 2261
1158 2261 -3584 -3950 2563 4841 -1937 -8203 -3383 5779 6102 -3153 -8081 -1679 5383 2716 -4513
1173 -4513 -4110 2620 3713 -2667 -6739 -1200 6331 3573 -4853 -7016 252 5850 2053 -5007 -3535
1188 -3535 2987 3360 -2964 -5339 1433 6708 1567 -6334 -5344 3184 6923 927 -5359 -2842 3283
1203 3283 3157 -1725 -3021 1703 4965 -113 -5045 -2715 4338 5640 -946 -5350 -1576 4153 3370
1218 3370 -1715 -2876 2306 4215 -461 -4785 -1177 5354 5196 -2351 -6040 -655 6027 3983 -2898
1233 -2898 -4248 1360 3867 -269 -4157 -738 4800 3064 -4118 -5656 1123 6519 2166 -5145 -4188
1248 -4188 2045 4388 -1064 -4585 -428 4910 1757 -5224 -4587 2516 6617 163 -6462 -3824 3380
1263 3380 4404 -1337 -4666 -350 3619 450 -4786 -2872 3576 4738 -1996 -6729 -1912 5217 3971
1278 3971 -3521 -5329 703 4753 217 -4910 -1740 4192 3820 -3114 -5787 -135 5995 3202 -4034
1293 -4034 -4661 1455 4413 281 -3619 -828 3879 2398 -3245 -3990 2119 6030 1017 -4743 -3706
1308 -3706 3039 4958 -372 -3841 -530 3933 2260 -2874 -2864 2340 5176 317 -4747 -2487 3977
1323 3977 4945 -1166 -4412 -666 3949 1746 -3235 -2726 2895 4563 -1600 -5614 -1428 5382 4108
1338 4108 -3472 -5612 308 5120 2069 -4271 -2882 3066 3589 -2088 -5484 -167 5293 2320 -4527
1353 -4527 -4771 1565 4954 371 -4334 -2339 3340 2725 -2770 -3893 1032 4817 835 -5022 -3471
1368 -3471 2915 4863 -581 -4451 -1471 3285 2444 -2423 -3193 1616 3642 -320 -4295 -1986 3681
1383 3681 3675 -1988 -4447 -288 3997 2410 -2766 -2913 1997 3407 -1151 -4049 -764 4334 3391 -3103
1399 -3103 -4712 707 4962 1914 -3273 -3125 1953 3770 -840 -3822 -146 3929 1875 -3373 -3674
1414 -3674 1613 4650 800 -4106 -2963 2764 3534 -1011 -3959 -112 4241 1542 -3803 -3320 2658
1429 2658 4827 -340 -5039 -2010 3633 3396 -1711 -3678 342 3501 218 -3706 -2180 3361 4012
1444 4012 -2000 -5127 -713 4636 2829 -3204 -3581 1300 4031 -221 -3993 -1071 3864 3017 -3016
1459 -3016 -4082 961 4733 1479 -3799 -2866 2121 3888 -629 -3546 -191 3442 1764 -2963 -2928 1865
1475 1865 4350 809 -4140 -2336 3105 4095 -989 -3878 -287 3320 1615 -3006 -2498 2299 3852
1490 3852 -163 -4187 -1550 3440 3548 -1617 -3729 -110 3791 1243 -3054 -2013 2668 3469 -1292
1505 -1292 -4327 -646 4282 2667 -3147 -4008 626 4240 807 -3878 -1839 2755 2874 -2376 -4051
1520 -4051 447 4152 1448 -3780 -3414 2422 3875 -451 -4036 -1399 3265 2298 -2537 -3314 1256 3946
1536 3946 -22 -4090 -2072 2889 3625 -1217 -3971 -786 3499 1681 -2970 -2768 1642 3462 -738
1551 -738 -3916 -1124 3406 2650 -2372 -3958 444 3787 958 -3137 -2188 2211 2435 -1608 -3750 -476
1567 -476 3726 1693 -3009 -3443 1332 3636 537 -3324 -2203 2370 2782 -1381 -3239 20 3220 1382
1583 1382 -3043 -2877 1596 3770 -243 -3720 -1778 2790 2809 -1538 -3366 480 3383 949 -3123 -2354
1599 -2354 2276 3608 -641 -4020 -1786 3449 2939 -2074 -3498 1287 3682 555 -3205 -1299 3415
1614 3415 3116 -1858 -3681 667 4090 1714 -3073 -2744 1982 3355 -740 -3472 -594 3810 2102
1629 2102 -2820 -3524 1551 4329 638 -3851 -2106 2871 2997 -1257 -3202 564 3624 1003 -2783
1644 -2783 -2379 2449 3695 -152 -3779 -1281 3271 2882 -1294 -3216 656 3605 923 -2937 -1935
1659 -1935 2472 3066 -1073 -3676 -629 3505 2101 -2619 -3118 736 3057 535 -3001 -1873 2415
1674 2415 2685 -1417 -3559 141 3451 1557 -3450 -3147 1253 3037 -306 -3762 -1364 2520 1742 -2143
1690 -2143 -3257 486 3417 538 -3426 -2461 2104 3017 -1266 -3629 -698 3149 1547 -2798 -2889 1543
1706 1543 3630 -36 -3842 -1889 3223 2612 -1769 -3625 50 3342 1417 -3007 -2464 2337 3311 -714
1722 -714 -3630 -309 3816 2116 -2805 -3051 1470 3592 496 -3251 -1618 2682 2574 -1310 -3295 10
1738 10 3453 1377 -2669 -2578 1630 3025 -12 -3850 -866 2743 1993 -1800 -2713 998 3203 665
1754 665 -2899 -1704 2020 2991 -183 -3024 -740 2897 2209 -1701 -2640 873 2999 453 -2836 -1588
1770 -1588 2812 2789 -1394 -3382 27 3024 1428 -2384 -2525 1672 3295 -343 -3127 -625 3048 2122
1786 2122 -2318 -3167 683 3321 682 -3229 -1922 2073 2734 -1283 -3112 64 3122 1136 -2741
1801 -2741 -2490 1465 3259 -70 -3340 -1318 2618 2396 -1728 -3331 709 3319 787 -3126 -1982
1816 -1982 2350 2860 -1215 -3184 -905 2913 1893 -1858 -2688 588 3265 296 -2839 -1517 2284
1831 2284 2477 -1386 -3170 48 3312 1314 -2338 -2157 1491 2745 -346 -3059 -731 2464 1988 -1921
1847 -1921 -2632 495 3233 1204 -2786 -2297 2023 2804 -1081 -2979 -239 2840 1427 -2303 -2128 1429
1863 1429 2819 151 -2579 -1205 2234 2445 -1355 -2798 48 2801 1005 -2344 -1990 1800 2808
1878 2808 -600 -3286 -621 2615 1928 -1917 -2606 786 3078 491 -2831 -1582 1937 2498 -1196 -3091
1894 -3091 -163 3106 1497 -2702 -2492 1504 3367 -178 -2855 -1345 2719 1635 -1622 -2771 417
1909 417 2740 674 -2452 -1775 2163 2524 -924 -3101 -491 2738 1587 -1833 -2416 744 2627 244
1925 244 -2687 -1134 2554 1895 -979 -2850 138 2613 1435 -2095 -1764 1481 2439 -401 -2839 -944
1941 -944 2427 1859 -1706 -2714 481 3136 644 -2316 -1612 2051 2289 -882 -2892 9 2564 1577
1957 1577 -2040 -2360 1075 3258 579 -2941 -1334 2189 2186 -1410 -2797 446 2690 795 -2334 -1484
1973 -1484 1914 2837 -406 -2738 -658 2591 1906 -2041 -2621 893 2640 405 -2490 -1478 2347 2531
1989 2531 -1276 -2743 -27 2576 1189 -2226 -2245 1265 2509 -214 -2764 -971 2226 1514 -1510 -2727
2005 -2727 439 3044 712 -2557 -1596 1754 2424 -397 -2526 -261 2414 1169 -2093 -2266 1241 2444
2021 2444 148 -2373 -1471 1860 1860 -1117 -2298 148 2416 846 -2367 -1872 1390 2302 -366 -2432
2037 -2432 -666 2304 1910 -1652 -2378 671 2372 43 -2604 -1520 1971 2253 -735 -2907 -344 2647
2053 2647 1373 -1979 -2327 950 2704 -73 -2574 -1187 2021 1902 -1216 -2313 181 2931 1022
2068 1022 -2234 -1636 1400 2416 -378 -2499 -594 2204 1229 -1695 -2060 853 2428 140 -2396 -1414
2084 -1414 1696 2280 -982 -2255 -68 2306 885 -2339 -1822 1293 2287 -396 -2401 -615 2428 1819
2100 1819 -1653 -2545 476 2597 687 -2022 -1449 1642 2468 -614 -2367 -182 2359 1210 -1739 -1897
2116 -1897 697 2563 118 -1996 -1292 1836 2108 -955 -1995 125 2509 916 -2124 -1590 1305 2124
2132 2124 -75 -2256 -602 2305 1601 -1367 -2234 438 2308 176 -2213 -1085 1590 1717 -1084 -2373
2148 -2373 -109 2287 910 -1893 -1802 962 1990 -98 -2291 -769 2111 1636 -1363 -2686 387 2215
2164 2215 644 -2341 -1766 1329 1967 -543 -2603 -605 1903 1365 -1737 -2173 758 2387 430 -2348
2180 -2348 -1097 1744 2009 -1142 -2167 135 2021 937 -2152 -1651 1402 1796 -380 -2031 -589 1831
2196 1831 1417 -1657 -2253 783 2239 -93 -2193 -833 1530 1802 -770 -2291 306 2063 1123 -1953
2212 -1953 -1960 948 2440 133 -1960 -824 2187 2004 -1502 -2316 129 2316 716 -2083 -1501 1298
2228 1298 2413 -211 -2290 -598 2191 1482 -1189 -1752 442 2503 270 -2078 -1009 1791 1922 -777
2244 -777 -2132 -211 2184 1089 -1631 -1647 876 2039 -440 -1998 -605 1563 1264 -1402 -2050 234
2260 234 2046 291 -1921 -1230 1611 1859 -575 -2034 -367 2076 1148 -1510 -2156 935 2238 32
2276 32 -2183 -1041 1976 1753 -1160 -2278 105 2436 927 -2248 -1515 1024 2236 -168 -2061 -483
2292 -483 1788 1797 -1361 -1764 371 2098 436 -2007 -1350 1332 1698 -407 -1902 -20 1742 831 -1595
2309 -1595 -1374 958 2036 17 -1730 -878 1646 1201 -1103 -1848 158 2337 680 -1771 -1118 1281
2325 1281 2083 -416 -2211 49 2178 1183 -1420 -1868 855 2245 95 -2029 -1193 1551 2227 -811
2341 -811 -2057 334 2100 1137 -1716 -1625 1194 2016 56 -2502 -906 1775 1678 -1146 -1869 606 2086
2358 2086 396 -1818 -1231 1168 1868 -469 -2036 -237 1819 673 -1223 -1729 524 1698 186 -2072
2374 -2072 -689 1637 1460 -868 -1917 252 1883 261 -1518 -1292 1114 1923 -666 -1964 -252 2165
2390 2165 1244 -1262 -1662 727 2010 -62 -1896 -801 1622 2082 -786 -2214 30 2143 1014 -1642
2406 -1642 -1593 1090 1896 115 -2029 -805 1882 1460 -1030 -1666 55 1898 474 -1640 -1205 750
2422 750 1456 -156 -1845 -236 1690 859 -1214 -1538 587 1644 121 -1599 -426 1345 1592 -862
2438 -862 -1771 323 1823 468 -1732 -1458 1144 1824 -547 -2097 -104 1751 1268 -1599 -1684 677 2365
2455 2365 376 -2152 -1194 1503 2038 -473 -2070 -628 1737 1099 -1476 -1649 725 1957 -210 -1891
2471 -1891 -712 1435 1350 -823 -1598 52 1996 717 -1373 -1585 1104 1816 -220 -1469 -354 1350
2487 1350 905 -1224 -1688 550 1686 572 -1626 -360 1476 1217 -1033 -1732 284 1698 704 -1485
2503 -1485 -1223 1112 1886 -602 -1870 -569 1723 1352 -1364 -1635 631 1862 372 -1849 -1151 1364
2519 1364 1465 -705 -2043 -485 1737 1101 -1435 -1616 888 1839 315 -1404 -1017 1247 1524 -650
2535 -650 -1785 -165 2019 796 -1191 -1179 503 1888 -111 -1440 -621 1505 793 -1046 -1318 493
2551 493 1673 206 -1560 -696 1003 1191 -854 -1374 -9 1370 775 -1292 -1399 698 1908 -424
2567 -424 -2038 -288 1616 1234 -907 -1598 520 1835 497 -1409 -1345 1088 1465 -240 -1941 -486
2583 -486 1590 1238 -1168 -1570 238 1909 488 -1650 -1150 1299 1391 -526 -1664 -141 1509 799 -1137
2600 -1137 -1129 652 1439 37 -1533 -655 1592 1154 -1233 -1355 359 1434 119 -1555 -721 1006 1448
2617 1448 -407 -1703 261 1234 1115 -1214 -1161 650 1544 -74 -1513 -562 1369 1555 -896 -1714 150
2634 150 1869 506 -1761 -1210 967 1760 -224 -1787 -493 1375 1039 -649 -1600 374 1644 181
2650 181 -996 -874 1083 1167 -148 -1552 -73 1289 746 -1171 -1108 662 969 110 -1450 -395 1373
2667 1373 810 -1012 -1718 297 1735 287 -1257 -1096 1017 1370 -369 -1720 -15 1718 646 -1415
2683 -1415 -1386 784 1517 -54 -1530 -592 1388 1456 -534 -1550 -42 1546 589 -1420 -1226 1142 1514
2700 1514 -244 -1714 -421 1489 1321 -821 -1513 316 1343 297 -1257 -983 773 1318 -567 -1346
2716 -1346 -87 1350 931 -815 -1062 593 1434 -36 -1206 -546 1160 869 -616 -1318 243 1404
2732 1404 208 -1253 -1014 771 1469 -677 -1501 -59 1755 694 -1063 -1294 900 1542 -2 -1589
2748 -1589 -904 1204 1304 -853 -1461 -216 1687 265 -1310 -1320 534 1587 -31 -1497 -791 1278
2764 1278 1233 -480 -1395 201 1416 470 -1416 -1230 758 930 -105 -1410 -238 1085 770 -657 -1213
2781 -1213 650 1335 -6 -1188 -505 1085 1051 -755 -1046 129 1290 506 -1260 -696 986 1432 -302
2798 -302 -1583 -135 1313 699 -922 -1422 675 1404 9 -1747 -978 1089 1239 -894 -1318 -87 1272
2815 1272 528 -1146 -1184 883 1426 68 -1283 -682 916 1000 -458 -1466 203 1408 488 -1114 -1122 801
2833 801 1011 -511 -960 -117 1080 491 -823 -1051 348 1102 -274 -1270 -341 718 1122 -364 -1423
2850 -1423 408 1328 241 -1297 -668 1060 1404 -401 -1453 -281 1417 679 -959 -1251 282 1387
2866 1387 299 -1341 -795 844 1058 -515 -1296 -328 1489 667 -771 -1339 463 1261 218 -1215 -711
2883 -711 887 906 -427 -1222 586 1349 466 -1000 -1016 547 1177 -314 -1239 -196 909 397 -1008 -1043
2901 -1043 318 1321 -9 -1099 -499 1245 1241 -507 -1467 27 1692 337 -1006 -890 898 1201 -294
2918 -294 -1452 -182 1415 1122 -920 -1308 396 1513 390 -1229 -568 677 1179 -549 -1596 -142
2934 -142 1526 1097 -1109 -1018 179 1213 94 -1455 -520 917 792 -626 -1152 -103 1052 375 -963
2951 -963 -1091 415 1349 -24 -1307 -385 883 690 -658 -882 522 1507 -16 -1332 -191 961 1050
2968 1050 -654 -990 220 1244 509 -1057 -1015 505 1513 -550 -1282 -335 1190 988 -690 -1098 164
2985 164 1286 530 -1052 -1253 1131 1115 -351 -1066 -463 1156 906 -711 -975 393 1108 321 -1127 -639
3003 -639 911 1074 -451 -1361 -166 1025 509 -938 -1030 691 1386 -132 -1230 -436 1128 841 -1189
3020 -1189 -1019 47 1313 320 -1077 -742 776 895 -430 -1040 35 1338 568 -746 -972 537 1159
3037 1159 -53 -1102 -608 1190 1112 -864 -1387 387 1234 714 -970 -702 561 1059 -62 -1351 -387
3054 -387 1401 781 -755 -1090 320 1296 216 -1122 -716 1009 1164 -344 -1019 142 888 348 -666
3071 -666 -941 660 1190 -226 -1194 -511 751 910 -614 -1293 406 1050 14 -1009 -607 785 1044
3088 1044 -474 -1130 -262 1303 552 -757 -1022 435 1013 20 -1377 -431 1036 1179 -298 -1121 47
3105 47 1244 493 -639 -1252 541 1108 -165 -1120 -414 947 809 -738 -998 418 1054 329 -1042 -951
3123 -951 687 1155 -421 -1076 -384 1244 165 -790 -790 383 1075 -181 -1335 -333 1120 998 -887
3140 -887 -975 400 961 2 -930 -514 750 835 -363 -1045 -47 1112 762 -563 -841 415 1085 69
3158 69 -1079 -348 960 824 -547 -1184 -294 1015 300 -925 -826 455 1321 -246 -810 -636 1002 778
3176 778 -660 -955 83 915 482 -896 -1100 759 1113 -189 -924 -285 1087 735 -904 -841 359 1249
3194 1249 -109 -970 -773 737 569 -845 -1198 417 1094 525 -899 -855 401 1120 -372 -1001 -146 958
3212 958 353 -776 -1092 453 840 322 -1046 -842 1003 780 -205 -919 191 1045 489 -924 -817 504
3230 504 1291 -149 -1008 -189 1067 711 -637 -1023 42 1041 272 -980 -625 634 543 -387 -746 -203
3248 -203 1081 492 -897 -786 79 983 306 -675 -559 695 502 -434 -912 23 1018 294 -1068 -503 568
3267 568 880 -124 -1024 -99 863 427 -675 -998 601 1058 155 -962 -435 891 1050 -304 -1106 -334
3285 -334 997 349 -556 -873 297 1043 -340 -831 -744 845 688 -658 -813 -32 1032 344 -762 -815
3303 -815 805 709 28 -797 -160 755 656 -530 -692 501 804 8 -1002 -257 613 670 -271 -882 -175 822
3323 822 128 -573 -813 603 886 -423 -1001 -279 705 488 -748 -861 433 1279 162 -694 -229 619
3341 619 605 -295 -1161 -72 1123 492 -778 -643 475 1054 171 -1022 -390 587 887 -307 -791 -82
3359 -82 682 183 -618 -547 320 772 -377 -866 -92 741 494 -634 -804 310 1007 219 -711 -427 739
3378 739 726 -17 -805 129 882 393 -610 -617 595 893 -80 -1080 -218 993 439 -182 -886 62 924 122
3398 122 -621 -566 346 721 -240 -986 -275 813 320 -371 -782 379 1095 -167 -946 69 406 619 -409
3417 -409 -586 -28 816 307 -621 -529 404 838 -281 -924 -157 428 492 -842 -999 189 772 309 -689 -425
3437 -425 433 846 -60 -825 -21 1097 581 -495 -789 276 817 130 -824 -470 811 910 -661 -725 428
3456 428 1218 102 -598 -530 213 723 -181 -647 -167 613 490 -783 -800 542 842 102 -651 -435 726
3475 726 680 -594 -755 -98 751 252 -784 -689 274 608 113 -813 -186 610 606 -490 -796 379 919 233
3495 233 -873 -603 596 727 -604 -845 -129 930 620 -347 -877 549 770 -106 -776 -59 584 701
3513 701 -529 -739 -187 768 266 -776 -362 220 919 -41 -963 -167 521 477 -483 -558 341 616 48 -485
3533 -485 -438 758 739 -438 -925 13 586 322 -507 -691 695 995 -145 -886 -139 636 716 -278 -759 384
3553 384 821 42 -600 -549 486 657 -288 -854 0 672 375 -650 -721 447 885 -195 -442 -1029 531
3572 531 510 -143 -501 243 406 359 -636 -594 449 881 38 -947 -175 816 117 -484 -715 -88 640 39 -661
3593 -661 -515 531 598 -41 -773 34 759 184 -869 -668 331 375 -26 -894 -239 545 595 -484 -691 121
3613 121 796 473 -794 -625 349 683 -320 -1058 -97 654 717 -694 -525 339 821 405 -1436 -283 580
3632 580 808 -377 -527 175 729 222 -747 -697 445 777 -255 -515 -277 660 296 -424 -822 26 789
3651 789 37 -480 -260 535 581 -300 -893 -130 576 356 -550 -712 520 891 414 -652 -229 470 659 -515
3671 -515 -696 -107 739 250 -860 -449 494 617 -240 -794 -472 884 396 -480 -842 128 794 236 -751
3690 -751 -218 729 487 -468 -638 -73 656 336 -442 -481 422 796 -168 -613 -323 484 433 -245 -845 -83 650
3711 650 289 -386 -574 459 376 -193 -836 -42 666 278 -664 -523 163 785 -174 -503 -312 420 784 -479
3731 -479 -519 -99 691 282 -521 -450 517 765 70 -1114 -244 438 411 -267 -606 351 674 106 -738 -386 646
3752 646 717 -215 -643 2 477 288 -183 -340 291 876 290 -756 -467 820 666 -323 -374 89 603 272
3772 272 -604 -870 175 521 -419 -583 -130 629 374 -500 -874 231 581 10 -452 -50 537 607 -343 -666
3792 -666 -155 937 294 -564 -275 585 358 -32 -678 -172 503 543 -121 -675 -51 738 100 -752 -411 476
3812 476 729 -275 -511 -33 416 347 -510 -549 154 551 127 -889 -485 526 773 -412 -480 16 443 112
3832 112 -461 -605 351 817 -124 -646 -184 790 646 -375 -551 240 249 110 -837 -349 387 435 -545 -555 298
3853 298 656 551 -497 -352 656 632 -57 -659 -257 480 293 -397 -559 140 793 214 -738 -203 297 554
3873 554 -274 -301 -67 741 335 -423 -618 56 508 -221 -808 -453 347 503 -241 -747 247 644 103 -487
3893 -487 -361 298 544 -228 -539 -52 499 570 -328 -524 36 551 -105 -744 -166 484 437 -147 -597 30 661
3914 661 448 -435 -623 9 644 277 -496 -352 618 359 -382 -517 -121 729 230 -413 -276 419 725 109
3934 109 -743 -325 317 243 -148 -490 179 420 31 -569 -172 543 667 -243 -606 -95 646 305 -470 -547 84
3955 84 581 129 -707 13 574 243 -429 -289 166 607 62 -589 -226 499 599 -43 -393 -85 569 -34
3975 -34 -262 -724 184 553 -54 -547 -336 441 138 -287 -457 -29 1027 525 -445 -502 359 504 -310 -526
3995 -526 -239 831 89 -512 -337 -55 655 38 -744 -203 692 585 -331 -510 37 465 362 -402 -648 531
4015 531 867 70 -425 -161 586 408 -206 -218 307 613 303 -523 -426 550 499 21 -610 -128 534 195 -581
4036 -581 -373 176 561 159 -453 -121 414 85 -504 -524 -216 436 310 -600 -452 424 221 -382 -557 -161
4056 -161 552 505 -164 -600 44 741 -37 -634 -455 428 492 -3 -454 94 446 265 -235 -245 381 411 -172
4077 -172 -644 -395 284 524 -267 -801 85 412 -42 -629 -440 85 549 -350 -525 -194 152 467 -417 -511
4097 -511 442 801 317 -294 -97 532 159 -276 -590 108 311 268 -474 -432 209 470 -137 -302 -84 309 447
4118 447 -465 -652 -106 518 68 -376 -322 246 602 -226 -378 115 459 391 -516 -498 227 497 -195 -607 -186
4139 -186 442 523 -176 -207 200 630 -5 -370 -347 297 463 -394 -497 -193 791 409 -416 -471 56 523 479 -613
4161 -613 -658 348 538 -50 -794 -173 368 285 -266 -442 361 415 93 -435 -219 400 209 -379 -568 -90 412
4182 412 101 -574 -570 371 514 -217 -607 -116 189 17 -342 -506 330 297 -220 -571 -160 535 337 82 -421
4203 -421 167 395 271 -350 -408 66 484 -114 -278 66 574 199 -342 -303 -72 664 355 -380 -463 18 737
4224 737 -85 -481 -49 483 385 -194 -410 265 418 251 -642 -170 474 338 -419 -436 144 610 214 -526 -331
4245 -331 24 376 28 -228 -130 298 166 -335 -594 1 413 87 -759 -18 523 275 -218 -642 170 639
4265 639 267 -92 -387 234 435 -475 -328 -123 194 611 -308 -536 282 433 226 -473 -305 465 657 -35
4285 -35 -603 -148 285 273 -129 -412 95 508 -207 -442 57 349 354 -151 -592 14 669 29 -610 -149 344
4306 344 509 -35 -488 52 202 548 -34 -297 250 800 63 -467 -290 423 237 -346 47 -106 524 311
4326 311 -434 -329 206 489 98 -406 44 380 196 -85 -465 277 252 133 74 -13 297 654 27 -367 -14
4347 -14 296 8 -283 -254 399 524 157 -420 -400 526 192 -354 -466 12 554 100 -396 -387 159 260 -32 -321
4369 -321 -522 671 501 -236 -660 72 504 120 -481 -182 237 309 -29 -675 84 188 86 -654 -261 182
4389 182 330 -202 -424 -154 564 299 -313 -375 10 170 265 -312 -372 540 312 -263 -485 -171 504 202 -342
4410 -342 -306 120 331 -105 -435 -199 181 487 -238 -412 21 361 195 -461 -294 214 479 -124 -354 71
4430 71 259 300 -85 -387 -51 536 119 -727 -173 23 239 -268 -71 -262 654 -171 -397 -37 187 333 -98
4451 -98 -239 -204 218 758 -378 -142 183 529 112 -207 -68 318 328 187 -154 -143 233 163 -34 -553 -54
4472 -54 338 342 -281 -165 540 495 -257 -357 188 451 88 -263 -413 -4 227 117 -360 130 248 115 -256
4493 -256 -314 89 440 332 -28 -222 475 497 82 -208 -241 339 487 -359 -157 114 288 472 -185 -295 149
4514 149 149 -234 -442 251 233 162 -383 -10 296 517 -175 -351 -122 605 345 -211 -318 57 362 178 -60
4535 -60 -455 19 265 -269 -131 -193 331 285 -186 -46 216 334 39 -416 -9 322 243 -142 -442 166 452
4556 452 81 -498 49 6 434 -98 -396 26 244 107 -389 -180 223 205 -37 -128 -280 479 236 -188 -534
4577 -534 142 588 156 -225 -374 150 592 189 -379 -260 477 424 -205 -401 -27 536 -7 -483 -330 426
4597 426 631 92 -231 -133 475 231 -330 -476 -34 442 -73 -265 69 51 508 -266 -442 155 396 -125 -556
4618 -556 -265 -4 282 123 -269 16 320 -24 -220 -220 -91 273 389 -446 -154 360 173 -476 -352 95 375
4639 375 199 -155 -5 52 459 -139 -149 -273 293 450 -141 -152 -106 393 26 -48 -289 252 17 -215 -297 -133
4661 -133 346 250 -181 -661 300 445 -148 -234 -215 365 428 -343 -390 63 327 127 -420 -288 153 574 108 -323
4683 -323 -171 282 281 -103 -390 353 371 66 -373 -103 -90 116 -244 -396 -208 530 220 -429 -133 33 254
4704 254 160 -462 -226 247 381 -176 -136 531 153 -24 -361 -136 362 153 94 -343 -29 504 134 47 -370
4725 -370 -120 410 216 -72 -114 362 351 -260 -736 68 401 196 -86 -325 197 217 -157 -391 131 315 412
4746 412 -117 -387 142 180 36 -42 -360 389 295 -90 14 -212 526 108 -129 -92 22 219 -123 -413 93
4767 93 -10 218 22 -267 67 155 55 -517 -589 273 357 261 -454 -99 317 120 -430 -513 189 467 10 -302
4789 -302 -339 409 279 75 -385 23 556 310 -380 -294 144 474 28 -241 -77 341 182 -462 -396 -4 356
4810 356 79 -272 -164 248 382 36 -104 -110 349 33 -177 -142 -80 226 21 -463 -210 544 -14 40 -186 62
4832 62 578 166 -335 105 212 404 10 -437 -69 216 464 -341 -246 -14 276 11 -484 -415 168 389 14
4853 14 -444 -252 254 52 -5 -127 195 183 89 -352 -315 254 -34 -458 -479 243 390 67 -140 -39 177 537
4875 537 137 -545 -215 207 15 -297 -147 159 294 54 -262 -19 302 387 -278 -233 155 346 297 -300 -335
4896 -335 76 255 192 -145 17 206 42 70 -469 -248 629 434 -174 25 414 16 -509 -596 91 186 386
4917 386 -302 -78 283 349 51 -247 -325 23 257 222 -229 231 53 -57 -347 -146 372 200 139 -506 153
4938 153 143 280 -251 -244 135 481 -67 -379 98 94 315 69 -400 128 59 296 -182 -512 316 -19 11 -332
4960 -332 -208 232 192 -161 -265 72 96 217 -440 -351 229 306 -229 -167 -62 347 119 -178 -103 16 422 4
4982 4 -715 -24 152 162 -399 -413 25 346 202 -262 -470 328 541 -137 -384 -200 385 49 -185 -216 -23 111
5004 111 -62 -301 -138 110 57 -256 -367 68 189 322 -232 -91 67 436 132 -458 -338 319 233 30 6
5025 6 175 268 122 -478 -222 32 170 -218 -71 -260 232 208 75 -225 94 331 -95 -213 -253 241 131 -236
5047 -236 -222 -211 350 17 -161 -206 299 200 327 -75 25 71 -9 -170 -255 443 256 10 -257 -105 385 357 88
5070 88 -47 109 289 277 36 -133 29 0 78 -605 -142 103 16 -287 -440 43 362 130 -233 -220 303 236
5092 236 -8 -267 -185 218 50 -369 -60 -18 321 -112 -519 -153 -11 -28 -92 -313 49 349 -269 -45 -97 176
5114 176 222 11 -346 -268 119 -22 -164 -264 -21 -37 113 -239 -118 297 65 63 56 -32 481 235 -359 -299 -127
5137 -127 263 -105 -332 -31 397 127 -159 -183 34 309 57 -296 -47 196 231 -128 -47 104 331 147 -253
5158 -253 -262 58 418 104 -132 -498 290 450 3 -461 -99 442 -45 -178 77 84 348 119 -115 -141 368 199
5180 199 64 -241 37 43 -136 -439 -75 408 283 -12 -228 -325 296 35 -83 -122 -36 37 12 -200 -243 222 -42
5203 -42 -229 -54 143 276 195 -191 -202 6 476 38 -204 37 183 368 -89 -183 86 219 78 -260 -337 237
5225 237 133 -260 -224 -193 572 92 -222 -52 -81 330 317 -244 47 192 -163 -391 -439 186 185 14 -326 -123
5247 -123 132 368 -277 24 -267 359 93 -156 -221 -108 225 68 -275 55 404 -48 -121 -440 110 325 122
5268 122 -121 -366 95 281 -49 -263 -65 -8 327 -38 -539 -111 423 -159 -119 -146 360 140 170 43 271
5289 271 107 43 -222 -261 -10 228 85 135 -394 277 382 17 -391 -94 129 85 -364 -275 162 215 16 -370
5311 -370 -169 63 100 -57 -13 -6 57 168 -248 -147 363 180 -176 -419 75 434 433 20 -219 77 279 46
5333 46 -473 72 163 381 -235 -205 -147 411 325 -333 -174 91 421 88 -162 -207 94 -43 -353 -210 79 241
5355 241 198 -320 -325 205 49 19 206 -7 387 -214 -384 -187 165 -103 -92 -155 -37 246 110 -298 -136 343
5377 343 384 61 -54 -166 267 133 -74 -332 178 -81 65 -100 -218 241 227 -170 -354 -136 113 181 1
5398 1 -113 28 252 123 -231 152 129 177 65 -642 -103 126 90 -97 -44 -37 337 -167 -227 -121 483 266 -251
5421 -251 -104 -83 128 34 -366 -139 125 107 -147 -138 -197 321 17 4 -176 -296 -102 127 -221 -448 220 216 -115
5444 -115 -419 -106 65 233 -182 -87 32 532 65 -215 -135 216 490 -405 7 -20 177 110 -125 -412 -165
5465 -165 456 -358 -415 6 -193 228 248 -48 -48 109 103 -114 -228 179 269 -137 -134 -62 157 19 -155 -264 -19
5488 -19 210 -119 -360 -144 23 434 -150 -286 33 177 28 -379 -29 255 375 -15 -41 2 274 271 88 -226
5510 -226 -14 341 205 -31 163 210 311 -190 -61 -257 93 -50 128 28 181 381 -44 -254 8 127
5530 127 238 -264 -191 239 160 91 -541 -82 -60 70 98 -343 -45 422 388 -188 -299 73 338 -134 -196 -65
5552 -65 361 112 -102 -279 -18 93 140 -68 -106 232 132 67 -449 121 134 354 -262 -171 370 90 51 -230
5574 -230 -382 212 84 39 -84 -30 360 47 -237 -80 417 291 -41 -210 -157 234 245 -140 -159 -213 94 55
5596 55 -68 -370 13 41 -126 -133 -80 164 -66 -258 -66 -7 501 -101 -276 68 12 237 16 196 23 331
5618 331 -87 -142 -167 -217 303 -117 -427 -254 264 64 -123 -499 -52 268 109 -263 -130 228 64 -134 -157
5639 -157 -157 233 198 -275 -209 92 230 -217 -259 -209 423 301 -145 -272 150 190 171 -207 81 79 39 39 51 73 145
5664 145 -13 -132 -218 -131 418 -142 -229 118 22 252 -471 -385 -153 255 110 -4 -138 188 244 -292 -524 -22
5686 -22 389 202 -267 -277 -63 413 143 -211 -294 308 138 -17 -257 -88 329 145 276 -155 274 108 -135
5707 -135 -371 -3 -58 -207 131 -186 212 214 1 -171 -39 286 104 -26 78 -238 78 -212 -122 -79 -43 237
5729 237 -21 -174 -260 119 25 -190 -476 97 287 55 -212 186 164 -9 -156 -85 -224 170 32 -27 -44 111
5751 111 430 245 -184 -112 176 -42 -78 -151 -140 189 17 -424 -21 -113 -5 -107 -122 108 117 105 119 -73 67
5774 67 145 7 -82 -93 138 130 17 -211 208 365 8 130 -61 -8 87 -128 -78 -320 -73 322 -136 -227 -46
5797 -46 58 208 -219 -183 89 168 -62 -100 -181 403 -71 -132 -56 -156 389 -100 -214 -75 38 175 -160 -233 -202
5820 -202 339 -117 39 -353 -241 44 -259 101 -24 310 120 -30 -264 -216 251 48 -159 -344 -205 -39
5840 -39 22 -139 1 32 121 -261 -25 289 -1 70 -286 136 -9 191 -128 -209 121 267 269 -151 26 166 -50
5863 -50 237 -228 -102 14 288 -116 -223 -2 218 -56 -324 -107 77 -75 -106 -120 -60 242 404 -117 -194 40
5885 40 166 -50 77 113 58 254 -232 -285 112 475 63 -274 120 29 151 -407 -223 -220 183 -184 -262 -90 40
5908 40 202 -38 -588 18 18 130 -143 -176 49 -46 -97 -234 -51 162 218 -190 -213 60 167 141 -184 -199 228
5931 228 55 136 -387 -10 26 8 9 -73 30 268 120 -49 -84 274 212 -5 -161 -42 293 380 -379 91 -24
5954 -24 -10 126 -227 -271 19 35 210 -26 -203 152 101 -112 99 181 303 68 146 -250 207 370 -216 -22
5976 -22 -33 218 39 -103 -39 234 115 197 -33 -11 223 -192 -104 -44 -110 203 171 -321 -134 158 168 265 -421 122
6000 122 355 180 107 100 192 202 -272 -365 75 151 363 -166 -80 -50 -113 216 100 -14 259 41 24 -333 -129 23
6024 23 55 -156 -252 70 -52 27 13 -111 292 98 -41 -192 -154 399 88 84 -212 95 168 108 -160 -138 33 -13
6048 -13 -139 -546 28 -280 -135 75 -87 89 118 40 -343 41 132 37 2 -18 60 253 177 -251 -273 41 99 90
6072 90 -273 321 171 101 -314 -173 253 134 -170 183 -249 55 152 -31 -106 266 -344 -258 -149 -225 -161 122
6094 122 -119 -243 -326 233 13 -292 -166 44 372 -91 -202 -291 38 193 -1 -177 94 287 64 -222 -369
6115 -369 157 206 90 251 -53 -87 -156 202 -30 -156 232 236 135 -117 -142 85 80 -23 45 282 213 61 -55
6138 -55 87 117 30 -74 -115 119 78 -112 -79 129 -13 151 -359 22 -31 -115 152 84 170 460 -247 -18 -98 -147
6162 -147 68 95 -520 -156 180 201 89 -171 -26 -135 145 17 3 -65 152 -34 -196 -37 254 12 -197
6183 -197 -294 162 248 151 85 -64 241 -81 157 122 49 -41 -126 -91 -297 27 113 -148 -248 -89 35 321 -227
6206 -227 -203 -255 -81 -46 -532 84 10 183 -87 -214 -45 -139 420 -91 -62 132 -126 223 48 -172 34 299
6228 299 -125 7 243 219 453 39 -87 205 -16 22 -150 -82 304 46 -96 1 -157 200 -144 1 161
6249 161 146 430 -385 -228 134 28 -264 -75 -176 199 375 -5 -184 -74 464 221 -86 -152 -32 -60 -28
6270 -28 10 -25 -425 202 185 -152 55 -117 -219 -72 17 251 295 107 196 -143 -34 263 388 -102 30 57 170
6293 170 -138 102 -147 185 252 -199 -55 -59 62 -32 -98 -127 129 154 188 45 88 -70 -91 -196 36 99 -111 159
6317 159 -320 -295 -168 -244 -41 -138 20 -5 -146 -551 9 15 151 -40 -26 95 65 40 -92 -242 87 126 37 -93
6341 -93 271 -11 60 306 -109 228 192 357 197 -136 -7 123 -204 -245 -106 203 109 -253 103 116 -157 -2
6363 -2 -66 -201 -95 56 -170 -213 -48 299 20 -126 193 80 227 -207 -316 -67 -45 -137 182 -61 -118 96
6385 96 18 -37 84 205 89 20 -311 17 61 -121 -186 -5 197 304 72 12 -162 46 -174 -369 22 -122
6407 -122 211 22 -270 -315 84 -125 89 87 132 -162 34 -60 -6 49 282 -13 -132 -165 247 215 51 -3 130
6430 130 78 -133 -166 448 205 -130 0 -74 -138 137 -210 -134 -41 -24 105 -67 -62 -141 -5 -50 36 -170 9 324
6454 324 -90 -296 184 90 259 -100 31 -11 11 -144 -19 68 -119 224 194 -265 -53 -93 51 95 -80 -24 104
6477 104 -125 -99 333 31 59 -158 80 -6 -102 147 -324 -376 65 148 20 -83 -121 141 18 -45 20 360 161
6500 161 243 -133 109 29 81 -30 -282 2 40 306 -146 -43 174 222 -265 -22 142 181 -10 -191 -47 -205
6522 -205 144 -163 -4 -92 -203 256 165 -133 -28 -50 281 28 -297 201 -161 201 54 -91 -25 157 -89
6543 -89 -248 217 -62 14 -5 -88 -15 1 10 -131 -136 -129 93 202 13 297 310 -89 -49 -264 18 55 90 152 -127 3
6569 3 119 -82 -93 182 388 -232 93 75 207 371 -7 -44 -91 301 273 78 -29 -19 -23 -57 -188 -33 8 -29
6593 -29 -232 -108 207 183 233 66 30 8 132 24 -107 9 365 193 -208 -156 -69 104 209 -44 -166 -103 79
6616 79 -29 -81 148 78 -164 -314 -252 -49 151 -187 -346 -158 171 -106 60 -100 27 -336 175 -283 56
6637 56 134 -12 106 -161 96 487 -312 -228 -178 245 34 248 -184 9 77 -58 -49 39 49 371 111 -333 11
6660 11 184 395 -152 -124 195 -63 -42 -262 -98 118 168 -116 49 -291 156 227 -192 -132 -11 42 -157 21
6682 21 -197 -120 143 40 -21 -136 205 167 80 131 60 405 -42 -112 -145 88 309 -76 -183 96 61 263 -128
6705 -128 -59 -302 -12 -143 -7 58 26 -41 69 -145 -38 33 -87 82 116 122 178 -234 37 49 176 71 -117
6728 -117 -133 292 95 -50 -75 110 86 64 -8 -445 289 378 -20 -140 -466 227 -4 155 -58 247 258 -101
6750 -101 -112 -146 -65 99 -133 240 -39 -73 -118 -107 -2 -113 28 30 307 -49 15 18 65 -112 67 -260 132 219
6774 219 -271 -103 31 -104 -255 108 -20 397 -39 13 -137 47 77 172 -182 -104 16 159 -158 -108 212 -200
6796 -200 -40 -389 66 -76 266 153 -217 -97 118 -171 -28 -52 -153 -119 -410 -285 421 -10 -85 -22 117
6817 117 -19 62 -12 -33 266 250 244 -95 -98 120 172 106 95 117 79 -58 -82 -79 -1 117 -102 -16 -117 26 51 208
6843 208 -97 55 -49 -120 -232 -113 -46 -165 -99 -82 -31 -107 -97 -72 -15 122 187 112 -108 -127 135 -78 -200 -95
6867 -95 102 108 230 -90 27 -33 103 320 -69 -178 82 22 114 -159 -287 115 156 19 -191 211 67 -51
6889 -51 256 -16 -23 -99 -353 261 274 -28 -125 133 -341 -131 -28 -41 56 78 -237 299 8 -167 74 261 414
6912 414 20 -186 160 -189 -141 68 -67 132 306 -145 -120 327 -192 -97 -116 -126 -57 271 -144 137 -73 -153
6934 -153 174 23 29 111 138 -126 185 -116 26 281 -162 -354 160 58 -78 48 -68 153 318 114 -136
6955 -136 492 83 -28 153 -180 -5 168 -135 -18 -121 67 128 -289 -228 -120 100 154 7 378 126 107
6976 107 97 32 61 -118 128 67 -309 378 -82 -17 21 164 253 -25 8 -188 94 324 38 -27 -224 -124 12
6999 12 -75 -344 -65 51 -38 36 -200 -179 134 342 -134 -119 227 157 132 33 470 36 -316 -64 -75 49 -88
7022 -88 0 -145 64 32 -137 -16 67 20 -24 52 -246 -160 -13 -61 39 -271 106 -98 375 89 -99 -51 -253
7045 -253 -177 -66 24 176 15 53 -160 -42 20 51 18 7 423 41 240 -35 462 -140 169 -114 -152 -30 28
7068 28 127 -167 71 45 -101 132 -85 155 26 111 90 -155 77 68 -384 23 -144 225 -113 -222 125 386
7090 386 390 -30 34 80 -17 134 -18 -40 69 130 195 -97 17 144 5 23 -54 -193 -50 48 24 -117 -40 41 89
7115 89 0 79 151 177 132 96 -128 160 66 -173 181 -202 -195 12 -280 -49 236 331 -250 129 58 284 117 157
7139 157 64 169 -128 33 -225 -396 224 282 -67 187 255 -96 51 -241 -123 199 -323 -144 -46 142 -11
7160 -11 168 79 -5 -129 -177 -92 -99 -41 165 -142 -56 -128 -13 188 -19 -3 120 -355 52 -111 106 -53 -53 6 17
7185 17 172 -250 -294 -46 -37 9 87 98 85 -37 132 129 103 171 -318 27 255 275 -35 -34 36 40 -209 -212 -324 -2 127
7212 127 -142 -9 6 81 195 -327 65 31 -71 -50 -226 64 55 -34 146 367 147 -20 122 -76 -158 73 14
7235 14 -168 56 380 53 -87 -194 -66 232 56 -73 95 133 284 124 -301 -146 -280 104 -259 -118 -151
7256 -151 263 -17 -203 239 269 77 -200 161 -180 -82 -157 167 164 -176 104 144 -228 -107 8 -130 -13 -106
7278 -106 -47 50 -184 -144 101 157 128 166 117 116 -263 2 187 -323 194 -138 -143 -38 141 0 7 0 -264 75 -203
7303 -203 124 -164 -143 -269 294 -12 35 33 28 -56 -96 -292 -161 448 299 131 -322 -357 -252 113 31 256 -101
7326 -101 37 113 -87 -152 157 -34 256 178 -86 17 120 -194 46 6 149 57 22 130 -42 -149 -13 -28
7348 -28 -23 -34 -93 102 113 -55 -7 196 -153 67 -26 -122 -65 7 -231 195 -133 -354 56 76 -98 -74 -117 23 170
7373 170 -78 85 48 -38 -270 -145 -152 -10 351 -167 -40 -79 -247 67 3 -59 -37 28 269 170 -82 -8 -27 -13
7397 -13 3 258 1 29 -192 -7 219 27 100 -233 18 -83 -37 -41 -48 195 20 -127 -446 22 -144 -192 -107 347
7421 347 -32 256 -106 -107 -41 106 53 -238 171 -157 -354 88 72 -173 -62 150 217 -139 -21 -24 46 -81 2
7444 2 -112 -141 172 -241 -254 -87 264 -32 72 -42 -77 -6 18 -32 -192 215 286 -29 -83 -98 38 286 -255 -74
7468 -74 -128 70 17 70 -224 49 -9 -166 166 137 283 28 -96 -22 52 106 -81 232 67 -37 144 245 1
7491 1 119 250 -92 243 -142 65 34 -93 -3 -163 -22 -385 247 -187 332 41 -39 -84 -74 78 -205 21
7513 21 222 -170 -163 438 -174 -18 -115 210 -122 -145 -50 -152 -52 -266 -163 -128 152 402 -97 -65 117 65 52
7536 52 356 182 -222 85 -31 -88 44 56 35 -171 67 -19 95 -209 99 197 -117 133 153 210 190 -144 250
7559 250 59 -33 186 -127 -151 -31 70 420 124 179 40 256 -185 103 -147 -146 148 43 -73 79 -41 290
7581 290 -13 34 -6 213 62 -33 15 -30 -3 93 -92 23 19 9 0 -270 -65 -140 113 -95 -78 -311 -37 -84 82
7606 82 -80 32 44 71 165 414 61 -158 6 377 30 58 -246 -104 93 -190 -11 -144 -135 84 -28 -87 -111
7629 -111 -9 168 -185 -224 40 139 -86 380 31 -4 234 -30 90 -21 39 -9 -218 14 115 -48 36 -72
7651 -72 -156 5 127 -210 33 66 133 64 -223 92 -95 -116 119 -186 130 52 106 -56 35 -125 -41 96 56 30
7675 30 -64 -134 -13 -128 61 -23 -229 -85 10 89 -110 -13 -105 106 79 -1 94 -239 341 8 -29 40 -24 -36 -134
7700 -134 -167 46 -60 -121 30 67 49 93 -50 -86 98 -5 -234 -4 140 -336 174 97 143 158 -231 20 101
7723 101 140 -78 243 -32 232 297 165 87 -97 157 38 -181 -62 154 -46 -52 -54 151 -22 105 -169 -80 136
7746 136 257 -113 73 -264 -232 144 -154 178 -72 -193 -18 25 -52 156 -6 -182 15 -110 -62 84 44 -2
7768 -2 -8 120 -154 70 -24 148 -23 -36 -87 10 201 276 63 157 281 305 95 -47 3 -130 96 -346 -66 174
7792 174 26 -60 -290 286 59 -4 -92 -84 -58 213 -236 126 230 206 15 -152 -76 -132 105 -196 -7 -69 65
7815 65 128 -35 73 85 -356 134 43 2 24 -142 67 16 282 251 -95 227 -114 -34 253 94 119 -3 -68 335
7839 335 -79 213 61 -243 -59 -60 -93 -38 133 -62 60 4 211 -206 74 -256 224 239 94 410 176 127
7861 127 -322 241 -299 274 -187 5 187 -121 -25 58 -124 -109 106 -18 -21 69 -122 -84 -37 -26 -139 26 -48
7884 -48 -132 228 94 251 70 -42 200 -98 92 70 -55 -3 100 57 -32 177 -69 80 7 70 -13 -190 -93
7907 -93 34 -23 -224 43 87 -78 120 -274 -105 26 167 -115 12 -140 221 21 -11 165 129 258 114 -234
7929 -234 -98 102 -60 -45 184 -15 138 -148 5 102 -93 194 -118 260 131 163 40 -366 -153 54 -75
7950 -75 66 -8 59 353 150 52 -27 -109 -110 -60 -368 210 -326 -91 199 -116 -31 30 309 216 31 -96 140 -66
7974 -66 -61 83 102 4 -57 -239 48 -47 26 -5 49 181 -224 28 -209 490 50 -84 -90 21 46 -12 241 74 151
7999 151 73 -50 149 -21 173 42 -153 -133 220 67 -4 206 -113 -75 -3 347 68 -116 -136 101 36 40 -222
8022 -222 -53 -84 -86 96 133 205 48 -311 -12 -31 241 53 -87 -123 26 -72 -22 -166 127 34 147 -68 -166 277
8046 277 -126 -25 -76 -3 -71 8 -188 -5 -133 149 35 -240 -2 140 -19 -199 82 22 187 185 10 -77 144
8069 144 -43 153 -188 -226 -81 -31 203 -359 93 378 158 24 -158 160 171 260 193 51 164 -173 -99 1
8091 1 25 53 255 -236 -6 396 197 342 20 -28 -75 -87 -227 9 -171 70 -58 -94 -212 342 80 43 303
8114 303 -135 162 34 -40 23 -18 -373 -146 -36 45 87 23 85 -57 56 -230 -67 40 91 290 235 -28 -223
8137 -223 -173 -187 114 219 117 -53 85 -25 -284 44 0 -88 -472 -109 -170 134 135 -1 54 155 -167 116 -286
8160 -286 2 15 68 247 123 -144 -311 -85 -296 182 -77 80 -20 -102 -218 -349 -39 53 -9 127 -87 410
8182 410 228 267 -52 68 -70 210 45 226 -101
8191a01
$$ Imaginary data points
##PAGE= N=2
##DATA TABLE= (X++(I..I)), XYDATA
0 0 0 0 0 -8 8 0 8 -16 16 -16 24 -32 40 -48 56 -72 85 -101 120 -142 164 -192 222 -254 294 -335 383 -435
28 -435 491 -556 626 -703 788 -882 983 -1096 1219 -1353 1502 -1663 1841 -2041 2257 -2501
44 -2501 2771 -3073 3417 -3809 4257 -4783 5402 -6149 7068 -8239 9774 -11894 15025 -20125
58 -20125 29879 -55286 258067 551563 -81624 -366034 -159727 170552 116206 3746 58410
69 58410 154397 -4131 -176712 -87690 175996 197690 -39846 -212911 -93574 91161 110739
80 110739 14342 4767 39896 -16115 -128452 -99049 67961 169509 79252 -77563 -142595
91 -142595 -84283 27095 119923 122177 18760 -104861 -129355 -48969 42105 79860 63681 -6554
103 -6554 -106679 -130828 -4627 148512 122287 -72711 -189862 -96233 49806 63636 7225
114 7225 27146 68425 -15247 -155579 -130008 70661 187173 72868 -102095 -121055 -13168
125 -13168 66521 71308 50253 9681 -58465 -84908 -11300 88468 90165 35 -67419 -56812
137 -56812 -14876 21816 58299 66129 -1942 -100086 -110882 -15206 67346 56311 10963 -4273
149 -4273 -27468 -81978 -83350 20576 115851 64981 -73956 -118581 -26814 65015 63107 22235
161 22235 5376 -23421 -78330 -68141 53210 150411 73804 -96368 -138501 -7876 110514
172 110514 82537 -10299 -40561 -19931 -19921 -25782 11736 62125 51960 -14942 -65356 -56102 -3544
185 -3544 53578 70233 17167 -68566 -91257 -14712 75433 79171 10035 -40175 -40317 -30440 -21004
198 -21004 23489 80273 60054 -45074 -108535 -36367 79768 85894 -8034 -59691 -20334 11394
210 11394 -15329 -18816 46427 76858 -9547 -108225 -70963 56951 99473 16201 -56940 -35535
222 -35535 3868 -10929 -20214 40472 92725 27198 -97870 -111007 23019 135452 84754 -53666
234 -53666 -99743 -17096 64285 50599 -2291 -6968 16363 -1576 -44688 -31073 46805 87295
246 87295 26587 -64215 -72664 1841 56053 35737 -5166 -9385 -2391 -26871 -45101 1487 73564
259 73564 60908 -39598 -99632 -37825 58765 67333 1709 -36096 -20440 -11929 -22783 858
271 858 57180 58200 -27584 -96029 -49776 52831 79378 12362 -43830 -28867 1711 -6072 -16096
284 -16096 16118 47662 15554 -49966 -62421 -4551 51002 46945 1039 -40545 -51150 -22731
296 -22731 28996 57492 25309 -36295 -57514 -18803 26095 32122 15993 5547 -8103 -34168
308 -34168 -38784 5030 55855 47296 -14588 -53075 -28508 14412 24814 13250 10657 6003 -21629
321 -21629 -41486 -11476 43074 50974 -1622 -48671 -39905 1662 28177 28402 16253 -7763 -37218
334 -37218 -41096 -161 49051 50285 -1588 -49721 -44926 1524 39595 34442 2267 -21196 -19713
347 -19713 -7135 -195 5467 17784 23234 885 -35738 -40806 4849 51629 41687 -16703 -54457
360 -54457 -31005 17752 35324 16773 -3333 -9949 -18986 -26427 -8068 30721 44384 6022 -43155
373 -43155 -44202 1552 38056 29649 -2382 -18760 -15204 -7747 -787 12954 24370 14331 -16533
386 -16533 -35511 -16358 23589 39667 14648 -20191 -28148 -10564 6763 13776 20664 21956 -2087
399 -2087 -39028 -39958 11939 59492 37982 -28421 -53755 -10529 35555 25995 -8702 -9532 12833
412 12833 6292 -24966 -21688 26470 51556 9695 -45716 -40352 14565 43068 18475 -11542 -10825
425 -10825 -2305 -10684 -14599 11724 39060 21142 -28220 -46763 -10056 33287 31997 -611 -19745
438 -19745 -13754 -6265 -4520 6054 22245 15918 -17307 -36795 -14464 25449 33147 4362 -21533
451 -21533 -18092 -2031 3925 4534 11815 16336 414 -24378 -26733 2505 31736 28365 -3123 -28386
465 -28386 -25253 359 22826 24210 4564 -17378 -20415 -4945 10846 12875 6273 1001 -6657
478 -6657 -17293 -16687 5872 28880 20386 -15737 -36022 -15319 16528 20788 2120 -8350 -5406
491 -5406 -8515 -17410 -8202 18047 25912 -2738 -34283 -27169 6807 23816 9843 -8080 -11207
504 -11207 -9669 -11313 -4387 14781 22645 621 -28449 -27396 5104 27483 16506 -8177 -15784
517 -15784 -6590 -286 -1248 2941 14530 15163 -4815 -24534 -16805 14480 32487 14993 -17103 -25170
531 -25170 -4148 17564 16194 1648 -3475 -1052 -4604 -10749 -1930 19224 24006 -746 -27892
544 -27892 -21504 9537 27262 13421 -8875 -12880 -4760 -1022 -1183 5882 15572 8678 -12174 -21832
558 -21832 -4583 19576 21614 1404 -14468 -11051 988 7357 7896 8908 7670 -3183 -16282
571 -16282 -11971 12126 29378 15353 -15111 -24490 -2464 20344 15986 -1465 -4320 5270 3057
584 3057 -11465 -8945 16423 28526 3057 -28746 -22538 13673 29242 7300 -16519 -11007 4065
597 4065 1554 -8396 58 17517 11593 -17073 -29411 -5965 22097 18078 -8820 -20743 -9281
610 -9281 2353 143 -2393 4744 6207 -8153 -21453 -11694 11735 18863 807 -17609 -16171 -2344
624 -2344 6123 4695 2184 522 -3671 -10820 -10494 856 13778 13338 -3062 -17762 -13270 5085
638 5085 16763 9547 -5577 -10523 -4061 2437 2806 3547 6497 4862 -6040 -14922 -7105 12321 19756
653 19756 4521 -15940 -16750 347 12697 7374 -1995 -2909 -659 -5148 -9129 -1088 12899 12681
667 12681 -5530 -18832 -9931 10285 15333 2180 -8150 -5533 263 -1691 -2920 5803 14060 4466
681 4466 -15130 -17615 3231 20295 11722 -7916 -12254 570 7822 1506 -2573 5910 11301 -995
695 -995 -15242 -7860 14838 21339 1775 -17867 -11536 8372 13843 2889 -3697 2796 4426 -5172
709 -5172 -11025 703 16561 13773 -6198 -18063 -7585 10236 13646 1879 -7487 -5194 645
722 645 -935 -2310 2947 8221 2553 -10255 -12588 1152 13678 8923 -5102 -11718 -5288 3601
736 3601 3825 -74 667 3633 -1149 -10230 -8864 5611 15741 5490 -12806 -14594 1570 11945
750 11945 4896 -4704 -3253 1988 -1791 -7942 -2574 11203 12731 -3580 -18215 -10004 9897 15746
764 15746 1122 -11218 -6123 4084 2002 -6023 -2114 8672 7295 -8403 -15767 -2016 14237
777 14237 11072 -5994 -13605 -4378 6152 5228 -1515 -1094 3655 439 -9232 -8491 6426 15355 4081
792 4081 -12963 -12951 2084 10707 4076 -4168 -2434 2124 -681 -5531 -1667 8278 9464 -1867 -11971
807 -11971 -6850 6871 11623 2436 -6914 -4847 1723 2106 -1425 940 6579 4283 -6213 -10419 -990
822 -990 11010 10509 -2141 -10997 -5967 4492 7241 1049 -3265 -155 1498 -2884 -5676 1232 9521
837 9521 6131 -6909 -11616 -1988 9032 7101 -2084 -5740 -945 1933 -1643 -3789 2699 8735 2538
852 2538 -10179 -11036 3091 13201 5633 -8283 -8848 1049 5763 209 -3065 2081 4808 -1975 -9212
867 -9212 -4470 7916 11106 -539 -11325 -7160 5298 8554 43 -5116 -320 4171 -1630 -7881
881 -7881 -1258 9964 8332 -5868 -12604 -2938 9418 8309 -2138 -6816 -1837 3268 856 -2422
895 -2422 1018 6443 2949 -7290 -8698 2817 11740 4985 -7272 -7755 1629 5823 288 -3276 1441
910 1441 4930 -190 -7545 -4597 5704 10114 1558 -9073 -7642 3208 8334 2119 -4479 -1886
924 -1886 3008 -44 -5013 -1400 7456 6903 -3871 -10582 -2836 8137 8514 -1621 -7530 -2542 4031
939 4031 2558 -2610 -1806 5048 5173 -4738 -9360 -750 10085 7732 -4479 -9140 -1168 6096 3383
954 3383 -2274 -1147 2920 1434 -4656 -5388 3472 9520 2847 -8423 -8983 2487 9147 2631 -5872
969 -5872 -3691 2906 2393 -4026 -3674 3791 7022 -963 -8760 -5117 5221 8671 660 -6740 -4050
984 -4050 3112 3194 -2305 -2696 3756 4918 -3467 -9239 -1078 9345 6965 -5119 -9994 -1696 6081
999 6081 3983 -3222 -3760 1735 2953 -2823 -6277 421 7599 3983 -6639 -8838 1217 8036 2743
1014 2743 -5284 -4013 2631 2365 -3191 -3840 3228 6612 141 -7830 -5677 4620 8964 1487 -6826
1029 -6826 -5279 2971 5319 -201 -3156 1216 4737 -187 -5613 -1891 6511 7218 -1195 -6733 -2230
1044 -2230 5255 5585 -506 -3294 682 4038 155 -4265 -780 6790 6118 -3582 -8435 -688 8690
1059 8690 6257 -3113 -5608 564 4689 373 -3158 199 5237 2631 -5252 -5775 2580 8327 2748
1074 2748 -6640 -5959 2731 6193 -403 -5516 -362 5108 1016 -6594 -4923 4795 7700 -592 -8659
1089 -8659 -4918 4350 6040 -1352 -5777 -803 3706 515 -4972 -2549 4634 5001 -3808 -8541 -1479
1104 -1479 7251 4564 -4536 -6877 302 4489 572 -4873 -1924 4341 3332 -4462 -6690 932 7416
1119 7416 3353 -5646 -6282 1267 5639 1208 -3643 -1151 3919 1553 -3956 -3907 3243 6664 845 -6137
1135 -6137 -4536 3675 6746 707 -4951 -1789 4113 3119 -2604 -3278 3456 5903 -333 -6404 -2276
1150 -2276 6060 6498 -1064 -5499 -1018 4597 2535 -2928 -2252 3482 4770 -2262 -6378 -801 7534
1165 7534 5013 -4336 -7503 831 6875 2332 -5000 -3425 3374 3609 -2898 -5566 870 6595 1973
1180 1973 -6205 -5892 2425 6677 547 -5891 -3324 3205 2869 -3636 -4600 1889 5445 -558 -7347 -4184
1196 -4184 4473 6064 -2031 -6919 -2672 3691 2893 -2758 -3367 1063 3528 -961 -5481 -1628 4837
1211 4837 4119 -3127 -6028 -309 5350 2304 -3567 -2995 1900 3428 -1290 -4186 44 5465 3695
1226 3695 -3982 -5614 1119 6717 2878 -4323 -3733 2326 4345 -281 -3662 454 5158 2173 -4001
1241 -4001 -3847 3189 6952 1105 -5652 -3066 4001 4697 -1107 -4155 753 5397 1297 -4672 -2598
1256 -2598 4150 5973 -840 -6520 -2236 4912 4407 -2227 -4618 392 4108 508 -4305 -1634 4427
1271 4427 3843 -3116 -6505 -443 5934 2949 -4487 -5353 1423 4585 -339 -4922 -1275 4116 2570
1286 2570 -4411 -5612 1375 5993 1393 -5818 -4378 2542 4319 -661 -4377 -610 3285 945 -3933
1301 -3933 -3161 2716 4688 -649 -5779 -2780 4128 4316 -1571 -4583 -417 3912 1316 -3480 -2610 2727
1317 2727 3947 -995 -5070 -1435 4588 4277 -2373 -4814 135 4570 1704 -3080 -2121 3217 3741 -2444
1333 -2444 -5047 97 5873 3160 -4053 -4974 1908 5848 1240 -4385 -2063 3706 3507 -2587 -4168
1348 -4168 1244 5553 1489 -5179 -3570 3308 5158 -667 -4764 -1484 3873 2502 -3040 -3222 2260
1363 2260 4339 -592 -5104 -1952 3979 4579 -1683 -5063 -840 4043 2175 -2876 -2702 1751 3356
1378 3356 -850 -4094 -741 4147 2905 -3044 -4116 877 4117 1258 -3806 -3022 2466 2882 -1842
1393 -1842 -3949 20 4502 2146 -3868 -4465 1543 5214 472 -4303 -2530 2803 3069 -1648 -3492
1408 -3492 471 3985 986 -3803 -2789 2636 4710 -789 -4678 -2164 3602 3607 -1871 -3863 373 3981
1424 3981 816 -3695 -2352 3418 4487 -1398 -5216 -1008 4420 2963 -2512 -3687 1036 4054 164
1439 164 -3899 -1115 3717 3012 -2721 -4234 882 4923 1838 -3880 -3311 2374 4110 -715 -4236 -348
1455 -348 4285 2094 -3276 -3401 2257 4611 666 -4384 -2314 3047 3339 -1528 -3535 378 3271 982
1471 982 -3134 -2216 2484 3957 -715 -4507 -1468 3561 3081 -1617 -3427 -43 3745 946 -3157 -1591
1487 -1591 2666 3217 -1456 -4093 -529 3874 2418 -2537 -3687 646 4004 592 -3524 -1633 2680
1502 2680 2775 -2116 -4294 301 4487 1528 -4011 -3757 1841 4304 -138 -4008 -1631 3206 2436 -2464
1518 -2464 -3896 995 4189 206 -4569 -2756 3055 3976 -1280 -4350 -793 3583 1792 -2968 -3029 1524
1534 1524 3523 -753 -4143 -1568 3612 3338 -2240 -4244 305 4153 1010 -3157 -2430 2323 2789 -1524
1550 -1524 -3812 -160 3813 1690 -3048 -3552 1400 3857 36 -3258 -1723 2691 2670 -1757 -3066 949
1566 949 3928 1306 -3532 -2567 2448 3681 -17 -3335 -1232 3221 2691 -1671 -2906 928 3543 974
1582 974 -3114 -1973 2829 3952 -665 -3793 -1111 3627 2593 -2093 -2762 1685 3385 430 -3264
1597 -3264 -1095 3126 3266 -1317 -3743 -266 3977 1971 -2815 -2995 1326 3613 -249 -3816 -792
1612 -792 3826 2339 -3108 -3827 1264 4049 589 -3871 -2595 2693 3156 -1441 -3631 -4 3446 1183
1628 1183 -3295 -2858 2093 3983 -247 -4176 -1539 3100 2634 -2093 -3116 903 3390 510 -3545
1643 -3545 -1853 2759 2836 -1628 -3813 -333 3440 1927 -2455 -3434 885 3591 90 -3301 -1522 2730
1659 2730 2258 -1776 -3487 -51 3444 1145 -3174 -2805 1410 3078 -402 -3379 -1254 2455 2047 -2262
1675 -2262 -3486 669 3652 542 -3672 -2374 2561 3295 -865 -3256 -183 2991 1583 -1993 -2601
1690 -2601 1661 3414 247 -3847 -2031 2650 2941 -1428 -3614 125 3467 1437 -2904 -2116 2110
1705 2110 3434 -711 -3502 -511 3419 2200 -2293 -3287 846 3790 882 -3254 -1917 2677 2983
1720 2983 -1679 -3681 257 4044 1224 -3350 -2815 2004 3420 -468 -3428 -985 2737 2075 -1936
1735 -1936 -2862 849 3365 664 -3180 -2331 2242 3327 -596 -3746 -368 3236 1459 -2341 -2412 1061
1751 1061 2998 -14 -3094 -1050 2684 2355 -1373 -2981 21 3082 1960 -2280 -2327 1310 2669 -267
1767 -267 -3371 -966 2955 2375 -2204 -2944 617 3495 733 -3064 -2180 1666 2656 -1022 -3077 -216
1783 -216 3236 1494 -2849 -2979 1396 3466 -350 -3889 -1321 2718 2535 -2042 -3159 430 3416 626
1799 626 -3236 -2052 2067 2994 -943 -3660 -492 2907 1862 -2332 -2679 1002 3343 94 -3122 -1245
1815 -1245 2674 2677 -1614 -2964 216 3247 1453 -2231 -2227 1548 3156 -136 -3103 -988 2650 2136 -1996
1832 -1996 -2941 854 3324 626 -2995 -2214 1995 2687 -1054 -2986 -120 2759 1237 -1975 -2390 1186
1848 1186 3129 396 -2946 -1398 2399 2629 -1250 -3021 -3 2896 784 -2663 -2153 1908 2573 -768
1864 -768 -3030 -530 2679 1704 -1820 -2659 521 3355 363 -2873 -1910 2043 2499 -1325 -3037 138
1880 138 3267 1558 -2708 -2377 1575 2595 33 -3099 -996 2229 2092 -1366 -2757 388 3007 1032
1896 1032 -2754 -2246 1939 3033 -679 -3139 -236 2927 1462 -1943 -2198 1408 2834 18 -2549
1911 -2549 -966 2285 2353 -1139 -2832 -73 2823 1033 -2214 -1932 1280 2856 -690 -2907 -685 2779
1927 2779 1853 -1887 -2478 792 3023 594 -2527 -1662 2033 2371 -907 -2892 -191 2643 1386 -2289
1943 -2289 -2561 1280 2994 -330 -3085 -1152 2184 2202 -1073 -2622 20 2657 786 -2290 -1911 1705
1959 1705 2790 -621 -2871 -526 2442 1818 -1733 -2482 743 2537 -54 -2788 -1457 2606 2179 -1165
1975 -1165 -3119 -165 2736 1372 -2160 -2237 1227 2616 67 -2576 -1084 2515 1858 -1636 -2565 477
1991 477 3013 356 -2438 -2109 1762 2343 -666 -2698 -457 2324 1264 -1961 -2587 1022 2692 -210
2007 -210 -2734 -1151 2048 2055 -1256 -2428 -250 2656 787 -2094 -1751 1403 2379 -384 -2514 -731
2023 -731 2303 1561 -1471 -2241 354 2407 569 -2333 -1626 1996 2073 -1070 -2501 -129 2806 1228
2039 1228 -1980 -2068 1343 2590 -18 -2539 -1067 2381 1811 -1450 -2581 52 2741 938 -2344 -1770
2055 -1770 1581 2375 -350 -2568 -378 2536 1745 -1804 -2197 758 2957 347 -2415 -1055 1875 2430
2071 2430 -857 -2338 277 2787 1019 -2095 -1919 1430 2281 -457 -2645 -861 2418 1890 -1412 -2090
2087 -2090 437 2436 458 -2350 -1531 1625 1801 -1260 -2482 -149 2627 1206 -1968 -1953 983 2626
2103 2626 291 -2458 -1155 2058 1540 -1362 -2618 252 2581 663 -2187 -1736 1300 2064 -490 -2638
2119 -2638 -813 2050 1422 -1598 -2141 520 2430 236 -2511 -1414 1954 2320 -777 -2560 -189 2186
2135 2186 1105 -1842 -2019 1196 1933 -355 -2526 -865 2187 1447 -1271 -2386 305 2451 586 -2142
2151 -2142 -1105 1598 2191 -479 -2082 -315 2603 1129 -1880 -2124 1053 2251 -58 -1974 -1217 2262
2167 2262 2122 -1230 -2237 194 2437 995 -2033 -1954 1378 2187 -418 -2461 -973 2224 1414 -1405
2183 -1405 -1839 662 2049 542 -2103 -1407 1649 1641 -727 -2383 -127 2102 913 -1787 -1868 1147 1867
2200 1867 -182 -2182 -681 1995 1699 -1525 -1865 371 2261 458 -2041 -1340 1573 2231 -378 -2399
2216 -2399 -209 2259 1356 -1517 -2004 916 2542 409 -2189 -1091 1736 2005 -643 -2277 -188 2165
2232 2165 1171 -1630 -1660 809 2120 -73 -2071 -1021 1961 1569 -1087 -2223 136 2268 490 -1788
2248 -1788 -1290 1289 1875 -519 -2212 -240 1813 1088 -1415 -1542 584 2136 144 -2012 -680 1822
2264 1822 1646 -1050 -2346 72 2257 768 -1973 -1311 1277 1985 -324 -2287 -536 2344 1449 -1796
2280 -1796 -2192 529 2388 129 -2427 -1423 1711 2107 -838 -2447 -283 2150 1102 -1945 -1723 590
2296 590 2083 -148 -2222 -1143 1523 1217 -1061 -2012 122 1740 567 -1561 -1569 1037 1772 -574 -2108
2313 -2108 -354 1926 773 -1259 -1681 665 1951 90 -1987 -757 1696 1652 -871 -2078 173 1985
2329 1985 782 -1491 -1361 1244 2137 -221 -2038 -717 1955 1787 -1044 -2030 328 2126 585 -2176
2345 -2176 -1498 1422 1877 -549 -2182 -702 2125 1364 -1506 -1738 511 1779 57 -2161 -1036 1685
2361 1685 1594 -1209 -1696 361 1808 838 -1426 -1369 826 1563 -39 -1945 -517 1692 744 -1456 -1417
2378 -1417 778 1834 52 -1809 -1235 1610 1624 -834 -2141 -26 2007 658 -1693 -1660 1197 2032
2394 2032 -175 -2328 -854 1809 1463 -1429 -2011 369 1843 482 -1887 -1110 1267 1880 -518 -2156
2410 -2156 -719 1801 1053 -1403 -1590 473 1968 317 -1660 -885 1268 1413 -555 -1885 -90 1711
2426 1711 670 -1229 -805 1011 1747 -150 -1959 -465 1671 994 -950 -1672 827 1762 256 -1845
2442 -1845 -1011 1291 1403 -717 -1954 -101 1903 902 -1692 -1833 960 1878 -135 -1924 -902 1482
2458 1482 1589 -1153 -2052 445 1937 616 -1908 -1378 1076 2135 -89 -1812 -538 1752 1315 -1083
2474 -1083 -1720 418 1698 318 -1874 -1518 910 1427 -820 -1367 -101 1503 914 -1479 -923 680
2490 680 1495 -93 -1477 -728 1570 1234 -1199 -1542 350 2021 179 -1797 -1036 1441 1688 -684 -1793
2507 -1793 -173 1650 1063 -1421 -1540 849 2055 42 -2024 -840 1775 1604 -1290 -1798 3 2135
2523 2135 885 -1618 -1324 1265 1717 173 -1866 -723 1574 1128 -880 -1815 262 1412 357 -1745
2539 -1745 -1092 1180 1214 -442 -1867 -118 1641 708 -1142 -1499 217 1473 -398 -1394 -567 1453 1041
2556 1041 -865 -1281 572 1756 543 -1504 -1099 1209 1425 -817 -1997 7 1871 1142 -1170 -1649
2572 -1649 740 1827 38 -1351 -973 1733 1622 -664 -1607 -154 1831 800 -1589 -1381 575 1532
2588 1532 -184 -1689 -486 1304 1522 -693 -1348 432 1663 456 -1096 -983 959 1588 -507 -1436
2604 -1436 -507 1556 686 -1289 -1610 669 1378 -231 -1573 -474 1341 1208 -976 -1419 240 1614
2620 1614 292 -1327 -1018 927 1566 -341 -1849 -458 1673 734 -1385 -1587 968 1670 16 -1821
2636 -1821 -1135 1481 1324 -934 -1758 111 1670 651 -1042 -1634 773 1678 84 -1542 -732 1083
2652 1083 1036 -940 -1302 112 1546 722 -1440 -1136 933 1192 -573 -1665 -62 990 689 -1018 -1057
2669 -1057 625 1296 -7 -1505 -483 1210 1261 -698 -1531 411 1608 460 -1461 -989 915 1441
2685 1441 24 -1572 -91 1494 1091 -1184 -1685 371 1855 295 -1494 -1018 1100 1692 -487 -1578
2701 -1578 -347 1348 842 -958 -1391 532 1582 328 -1406 -654 1100 1129 -479 -1453 28 1728
2717 1728 562 -1314 -1096 1079 1319 -466 -1168 -179 1319 644 -659 -1233 582 1671 102 -1519
2733 -1519 -240 1399 1202 -939 -1505 366 1630 561 -1444 -850 866 1398 -280 -1502 -465 1658
2749 1658 968 -1117 -1488 530 1453 371 -1469 -980 973 1546 -391 -1737 -307 1354 967 -771
2765 -771 -1471 471 1032 134 -1175 -639 1269 1240 -378 -1476 321 1417 550 -1189 -911 760 949
2782 949 -129 -1014 -299 1499 684 -1272 -1038 702 1524 -203 -1583 -775 1336 1211 -602 -1253 281
2799 281 1464 528 -1098 -1333 757 1360 -272 -1410 -593 1285 1225 -771 -1586 375 1423 153 -1520
2816 -1520 -1053 819 1226 -394 -1707 -506 1263 772 -914 -1322 480 1508 6 -968 -695 786
2832 786 1099 -707 -1265 26 1248 640 -1107 -696 709 1171 -138 -1355 -270 1203 585 -851 -797
2849 -797 688 1419 -8 -1250 -512 1045 1074 -497 -1235 79 1319 454 -1189 -926 770 1289 -61
2866 -61 -1643 -887 1219 998 -602 -1421 -119 1637 253 -1390 -1292 1046 1132 72 -1210 -470 1173
2883 1173 775 -978 -1079 -31 1287 210 -1019 -653 890 981 -482 -1322 -19 1454 398 -1236
2899 -1236 -863 816 899 -62 -1175 -121 1400 681 -870 -998 421 1407 58 -1439 -447 1021 1074
2916 1074 -626 -1416 -98 1135 518 -992 -995 657 1486 147 -1405 -472 1249 1142 -430 -1483 -71
2933 -71 1203 600 -1413 -666 535 1176 -255 -1480 -298 1325 710 -636 -1337 218 1177 413 -757
2950 -757 -366 998 977 -317 -1287 -130 1210 425 -1003 -837 741 961 -291 -1171 -256 1240 803 -659
2968 -659 -1003 442 1207 318 -1002 -706 902 1087 -400 -1342 -78 1528 780 -900 -1051 351 1345
2985 1345 191 -1517 -531 988 1271 -625 -1265 17 1085 769 -1108 -880 667 1285 -134 -1233
3001 -1233 -370 1096 748 -582 -1160 388 1144 397 -1248 -569 747 981 -514 -936 -149 1163 845
3018 845 -1091 -1182 722 1232 -341 -1260 -412 964 902 -642 -1236 270 1198 476 -1338 -761 920 1332
3036 1332 -369 -1113 22 1317 638 -829 -1243 372 1202 138 -1159 -722 758 1175 -393 -1228 -179
3053 -179 1057 321 -561 -949 547 1198 -55 -1306 -396 791 1015 -501 -932 269 1038 56 -714 -402
3071 -402 179 1037 -356 -1163 104 1093 716 -677 -883 408 1181 20 -1283 -463 875 942 -576 -1039
3089 -1039 196 1261 377 -1164 -722 671 1217 -68 -1205 -10 947 479 -564 -1069 343 1202 285
3106 285 -1183 -703 790 1136 -770 -1335 -448 1289 490 -769 -1093 649 882 189 -898 -469 935
3123 935 604 -814 -1145 91 1087 458 -1123 -828 791 794 -390 -856 -252 853 666 -716 -1024 536
3141 536 1316 233 -972 -572 813 965 -738 -891 9 1093 411 -868 -678 812 1073 -449 -1166
3158 -1166 -442 967 730 -464 -1149 543 1394 196 -1023 -892 782 1151 -334 -1037 -92 1185 575
3175 575 -946 -958 532 1040 -52 -1461 -322 652 755 -251 -914 330 909 223 -550 -504 569 1080
3193 1080 -470 -1138 -315 923 473 -591 -969 220 1264 301 -953 -499 561 915 -221 -1310 8
3210 8 1113 190 -964 -1078 277 863 -196 -788 -241 649 406 -694 -906 523 932 92 -1221 -790
3228 -790 706 1022 -115 -1154 -355 1002 631 -973 -811 357 1014 100 -992 -323 941 745 -556
3245 -556 -927 209 1338 185 -796 -624 722 762 -63 -824 -485 667 580 -719 -888 -30 1144 -30
3263 -30 -887 -483 723 995 -312 -781 63 1023 487 -656 -782 329 986 -76 -704 -203 897 740
3281 740 -805 -1051 240 926 432 -931 -1009 557 1026 -35 -823 -134 993 467 -1081 -736 431 1125
3299 1125 -44 -1043 -619 782 923 -642 -1039 147 922 521 -611 -658 562 828 -354 -778 -124 747
3317 747 567 -321 -796 391 1039 -124 -1114 -730 898 919 -484 -1101 187 949 247 -799 -674 250
3335 250 750 17 -937 -309 719 853 -767 -768 243 873 213 -612 -710 766 954 -22 -927 -175 783 348
3355 348 -495 -732 502 1019 -29 -858 -312 616 547 -254 -1006 -82 714 491 -719 -776 319 999 85
3374 85 -958 76 837 741 -781 -1129 -6 961 133 -768 -702 838 631 -318 -1216 -331 475 468 -812 -807
3394 -807 300 737 -35 -1016 -131 761 731 -318 -956 192 823 475 -712 -690 96 486 -81 -789 -273
3413 -273 942 535 -581 -737 -46 1092 304 -681 -376 548 899 -154 -1104 -45 453 263 -537 -565 321
3432 321 846 222 -929 -457 538 393 -510 -646 -111 802 318 -634 -585 671 767 -71 -820 -328 574 469
3452 469 -625 -640 487 770 59 -806 -506 735 947 -701 -1049 243 817 197 -575 -722 435 795
3470 795 179 -612 -83 644 537 -449 -634 262 802 465 -639 -364 455 462 -152 -930 -155 885 378 -532
3490 -532 -744 241 490 92 -767 -565 460 737 -414 -835 76 956 305 -818 -544 234 802 -112 -908
3509 -908 -464 670 686 -717 -1103 633 1154 187 -604 -506 233 550 -281 -764 -115 629 424 -730 -520
3528 -520 421 672 -126 -1050 -307 479 685 -682 -719 83 500 2 -860 -340 689 664 -91 -910 -233 694
3548 694 295 -163 -599 67 707 80 -727 -445 646 638 -584 -743 -182 865 263 -995 -705 131 662
3567 662 -184 -754 -509 893 711 -622 -749 284 750 159 -875 -589 485 607 -300 -608 -199 790
3585 790 408 -623 -620 249 604 -31 -459 -297 760 465 -359 -506 442 773 140 -623 -600 224 635 -94
3605 -94 -726 -175 568 391 -829 -964 184 1026 143 -701 -300 501 720 -332 -710 7 807 338 -510
3624 -510 -244 337 779 -88 -636 -330 899 718 -251 -608 394 859 17 -490 -515 135 641 -9 -782 139
3644 139 602 141 -498 -867 452 822 59 -826 -361 487 592 -504 -604 -79 819 481 -512 -498 543
3663 543 655 8 -601 -275 765 575 -361 -709 -16 602 274 -688 -255 642 690 -128 -708 215 605 483
3683 483 -276 -432 213 899 -53 -860 124 588 450 -635 -486 -5 688 144 -681 -492 568 459 -155
3702 -155 -749 -333 854 348 -383 -724 249 530 118 -745 -458 631 655 -218 -543 -19 747 285 -562 -301
3722 -301 405 868 66 -625 -332 570 674 -422 -516 12 582 256 -638 -311 698 662 -189 -880 -203 818
3742 818 291 -491 -404 497 740 -60 -620 -474 630 447 -403 -495 19 840 64 -661 -202 710 487 -111
3762 -111 -673 -2 592 498 -433 -585 227 630 180 -560 -742 659 684 -396 -801 5 695 510 -494 -488
3782 -488 461 410 -79 -574 -275 98 766 -484 -620 455 602 50 -522 -305 108 541 -210 -708 -231 472
3802 472 318 -798 -408 333 866 -15 -451 -252 463 639 -398 -887 104 749 350 -481 -448 516 902 -371
3822 -371 -564 -4 816 126 -684 -636 166 694 -7 -523 -688 611 345 -85 -617 72 618 242 -474 -263
3842 -263 409 552 66 -548 -149 528 462 -587 -534 136 933 458 -537 -319 359 493 100 -581 -44 387
3862 387 527 -521 -597 318 429 -89 -524 -406 452 326 -262 -499 -24 570 466 -602 -667 139 600 -78
3882 -78 -574 -320 494 258 -360 -642 336 711 215 -609 -197 575 354 -54 -530 75 435 431 -647 -612 21
3903 21 633 107 -643 -203 473 552 -19 -265 12 608 293 -463 -415 652 473 -197 -334 -54 414 218 -429
3924 -429 -561 214 589 62 -653 -375 93 600 -135 -452 -82 592 392 -637 -363 477 543 -20 -859 -207
3944 -207 296 183 -478 -603 46 354 107 -624 -247 324 722 -95 -821 3 563 210 -494 -633 215 597
3964 597 137 -702 -335 567 372 -522 -457 68 501 529 -523 -482 437 624 -121 -615 72 493 396 -413 -401
3985 -401 34 291 136 -594 -276 301 408 -348 -516 -34 667 450 -376 -548 457 673 -131 -743 -214 738
4005 738 212 -85 -608 81 482 226 -295 -510 468 467 -46 -597 33 336 410 -346 -302 91 659 106 -580
4026 -580 -192 453 329 -186 -626 108 518 -31 -514 -609 396 581 -189 -376 -372 350 643 -321 -641 217 183
4047 183 -296 -635 -469 345 173 -375 -470 -157 474 232 -456 -441 293 682 52 -563 -218 436 535 -147 -164
4068 -164 136 529 11 -499 -388 384 140 -81 -643 -50 295 435 -517 -619 181 593 23 -277 -658 240
4088 240 591 -330 -511 -4 323 371 -312 -315 334 808 91 -283 -247 556 377 -602 -586 372 507 -4 -751 -487
4110 -487 142 274 43 -828 -274 511 270 -282 -164 53 381 -230 -533 -440 271 371 -157 -354 56 361
4130 361 -85 -452 -445 396 586 199 -549 74 308 323 -344 -582 66 428 100 -504 -258 33 544 -238 -485
4151 -485 -73 280 320 -287 -230 166 140 -173 -358 -89 40 361 -165 -708 256 365 438 -427 -297 305 438
4172 438 -107 -571 -92 481 166 -379 -92 67 526 65 -457 -314 410 454 -52 -723 -302 828 162 -526
4192 -526 -364 225 313 -78 -613 -81 585 596 57 -360 238 277 2 -654 -328 337 406 -286 -352 -177 358 135
4214 135 -563 -198 152 678 -161 -620 -61 480 380 -331 -419 -7 492 61 -191 -552 70 264 -327 -455
4234 -455 -256 539 341 -304 -455 267 517 -68 -300 -294 156 154 -249 -727 23 378 530 -279 -182 374 403 -24
4256 -24 -380 -188 374 425 -593 -826 178 305 69 -573 -173 444 306 37 -524 38 458 355 -238 -389
4276 -389 343 389 44 -725 -355 258 171 -64 -178 157 433 72 -268 -284 161 225 -38 -736 -227 314 328 -293
4298 -293 -480 -21 380 156 -299 -371 553 504 -373 -570 -3 602 287 -65 -438 299 534 -6 -660 -102 383
4319 383 548 -137 -304 127 653 57 -183 -232 233 457 57 -581 197 464 -110 -224 -494 228 647 -92
4339 -92 -505 -91 574 182 -264 -446 68 528 342 -299 -309 378 103 -404 -332 -359 406 524 -109 -535 98
4360 98 409 47 -330 -310 225 669 -248 -205 -106 342 -29 -91 -49 -30 319 -120 -13 -275 405 322 -248 -464 41
4383 41 528 109 -355 -306 267 471 333 -475 -214 561 348 -235 -286 324 171 114 -518 -197 219 577 -32
4404 -32 -430 22 646 251 -689 -254 201 437 17 -399 331 604 154 -245 -192 45 322 -282 -606 -176 241
4425 241 413 28 -380 -113 542 230 -362 -659 159 291 12 -458 21 373 286 -9 -266 -182 266 74 -369
4446 -369 -367 242 142 13 -419 -208 154 -102 -281 -149 147 505 -62 -522 -372 381 503 -211 -295 -99 279
4467 279 6 -176 -251 205 444 -104 -310 234 542 75 -164 -232 132 312 108 -340 -477 257 154 -90 -592
4488 -592 -128 217 316 -466 -300 24 540 4 -492 -292 224 415 -246 -291 -174 341 42 -507 -324 349 159
4509 159 -128 -149 -35 348 216 -488 -568 94 376 12 -467 45 280 536 -20 -446 -155 435 165 -665 -266
4530 -266 288 285 30 -428 -236 266 435 -281 -208 183 495 119 -463 -566 -77 246 -147 -380 -365 441 269
4551 269 -291 -279 376 178 72 -405 -93 465 353 -239 -221 -206 344 380 -153 -481 164 331 121 -45 -190
4572 -190 487 477 -251 -481 231 222 -79 -172 -315 98 541 -203 -383 67 248 137 -132 23 335 106 -93
4593 -93 -315 -296 402 97 -204 -583 -46 520 79 -274 -434 37 381 146 -237 -207 555 61 -216 -348 45
4614 45 531 208 -540 -183 348 232 -222 -64 -207 406 223 -237 -369 240 137 -161 -270 -280 367 344 -136
4635 -136 -604 -122 479 -31 -434 -114 232 586 -11 -500 -122 146 192 -421 -458 78 405 -140 -658 -86 264
4656 264 160 -309 -526 32 367 250 -351 -51 357 335 -27 -224 -207 346 335 -564 -335 -3 522 214 -164
4677 -164 -27 146 497 -420 -212 178 296 211 -180 -230 137 534 -262 -350 -69 382 356 -309 -104 -196 222 111
4699 111 -460 -217 273 127 -262 -108 28 261 476 -341 -239 220 263 254 -278 -192 366 98 -371 64 -321
4720 -321 95 202 -170 -52 157 250 -39 -202 -155 429 286 -192 -36 26 152 -288 -130 -234 325 199 145
4741 145 -620 -2 198 148 -21 -245 33 352 104 -115 -289 212 -72 -107 -286 -75 403 209 -120 -275 339
4762 339 15 -12 -438 -141 406 -138 -215 -270 62 552 -216 -588 -53 241 292 -320 -346 114 393 508 -194 -479
4784 -479 43 406 304 -213 -263 543 101 -55 -311 138 430 118 -156 -28 295 260 -191 -149 -207 43 269
4805 269 -373 -365 198 615 -108 -366 -264 543 407 -173 -376 284 194 98 -393 -199 100 356 129 -40 -115 438
4827 438 531 -47 -467 -127 156 30 -365 -233 68 342 -198 -394 -87 209 578 -203 -549 168 375 1
4847 1 -345 -200 430 82 -92 -292 102 410 -37 -319 -197 62 205 -52 -432 10 385 90 -266 -324 -6
4868 -6 559 41 -421 -23 370 234 -199 -209 172 635 179 -275 -285 510 214 -131 -221 -137 154 67 -271 -518
4890 -518 90 338 9 -225 -267 -48 193 -390 -129 133 191 83 -77 -175 -142 119 174 -167 -158 168 389 -40
4912 -40 -262 27 209 226 -228 -288 226 127 -230 -182 34 317 126 -6 -651 286 377 256 -1 -324 338 382
4934 382 -97 -250 -113 476 181 -419 -7 89 221 -75 -256 -80 347 165 -222 -415 -105 579 15 -265
4954 -265 15 394 187 -43 -372 70 426 367 -175 -220 288 341 39 -286 -308 137 483 66 -362 181 290
4975 290 48 -287 2 123 143 -163 -343 -138 462 56 -293 -394 50 215 -26 -161 62 -101 392 4
4995 4 -276 163 341 -92 -303 -207 59 170 -25 -311 -84 231 -126 -131 -267 354 414 73 -567 -15 313 215
5017 215 -43 -342 14 221 -10 -345 -112 59 417 -140 -300 -126 372 198 23 -167 -61 343 56 -126
5037 -126 -26 66 612 116 -163 -198 28 175 -519 -29 148 201 236 -397 -377 279 393 -472 -231 -307 210 146
5059 146 -283 -275 274 94 -49 -165 -176 -39 171 -262 -294 -62 393 -34 -353 -315 231 304 -339 -427 142 297
5081 297 33 -141 -151 -64 466 104 -297 8 32 72 -67 -377 53 147 171 -134 -401 149 76 -54 -349 -238
5103 -238 355 38 88 -416 -69 289 106 -260 -230 245 463 387 -405 -71 76 168 -283 -149 227 146 -157 -276
5125 -276 -20 150 368 -97 -162 -47 342 69 -397 -90 414 165 210 -202 -122 338 30 -461 -63 183 305
5146 305 -133 -373 -68 158 319 -324 -31 -1 246 -142 -86 -211 -70 337 142 -610 -181 110 0 162 -204
5167 -204 -29 158 358 -406 -179 363 336 -231 -320 -253 321 23 -81 -274 -31 318 104 -221 -149 199 314
5188 314 -67 -251 -147 34 -265 -329 -362 11 206 174 28 53 109 157 -150 -397 279 187 342 -349 -318 360 232
5211 232 -48 -514 -93 221 109 -435 -159 -64 219 -167 -111 -39 480 232 -324 -303 -87 -96 76 -22 156 367
5233 367 197 -7 -372 -173 317 211 -127 -181 54 -50 181 -230 -36 621 62 -79 -333 -240 219 44 -221
5254 -221 -365 7 101 -236 -191 -214 176 430 -158 -182 18 287 26 -324 -99 -21 158 -368 -341 24 354 160
5276 160 -361 -132 -64 162 -64 -231 -133 -115 381 17 -13 -134 184 -153 98 -396 31 211 -346 -391 -58 139
5298 139 -5 -17 -68 -211 428 -102 -280 -110 361 280 -371 -236 27 108 -39 -282 -247 216 176 -233 -207 -162 22
5321 22 270 122 65 -86 346 74 -357 3 148 219 425 -551 -193 562 271 7 30 392 20 12 -223 -234
5343 -234 276 81 -313 -152 -8 168 -99 -1 -307 -151 597 -152 -168 -443 126 -139 -169 -48 185 261 -7
5364 -7 -528 62 -14 191 -351 -197 132 97 -156 -192 -241 -104 311 -149 87 -142 185 141 -68 -493 70 88 192
5387 192 -212 21 41 371 41 -362 35 253 -58 -172 -505 223 31 208 -305 183 98 102 209 -259 134
5408 134 580 171 -203 -217 182 423 -69 -84 -70 -95 216 -104 -101 325 332 -261 -285 -158 -96 315 -390 -335 -7 542
5432 542 393 -132 -13 -16 370 -27 -344 -30 429 122 322 -381 128 198 -9 -441 -47 -50 231 164 -123 7
5454 7 -17 400 -283 -426 173 468 440 -144 90 252 50 174 -356 101 175 118 -220 -18 80 166 -401 -146 -23
5477 -23 183 453 221 -212 97 -9 -122 -28 -315 220 21 -36 -168 -116 41 294 -251 -70 -64 -1 -87 -150 -226
5500 -226 451 18 -11 -233 -178 429 104 -249 -90 236 146 -152 -164 -181 403 74 121 -111 24 69 -174 -35
5522 -35 20 183 262 173 -354 24 267 -17 -214 -150 -27 197 -120 38 -121 187 186 -306 69 72 149 91 -294 -72
5546 -72 422 50 -247 -328 -132 279 192 6 -265 427 358 275 -127 12 111 27 59 -209 123 239 104 -144 -118
5569 -118 -32 -63 -67 -231 -161 131 421 -350 -249 -8 45 59 -98 -146 78 -6 75 104 108 214 313 -125 -148 99 467
5594 467 5 -163 55 -113 247 -31 -227 -102 -15 102 -413 -96 94 236 303 -158 99 12 34 -572 -402
5615 -402 133 147 65 -107 -156 413 288 -75 -218 184 264 125 -262 -163 297 283 -37 -119 -51 158 482 -176 -370
5638 -370 229 319 -66 -41 -176 -141 -213 -89 -191 -17 176 241 -55 -344 253 111 -77 -160 -73 -77 323 100 -261
5661 -261 -124 65 314 -26 -174 70 -99 215 -45 -131 568 152 -327 -185 176 -147 -54 -239 -155 303 339
5682 339 -144 21 84 242 -1 -204 -149 191 113 36 -30 -362 70 75 -74 -20 82 104 -95 -316 -142 -18 193
5705 193 82 -268 -109 255 -141 -275 -171 249 244 -180 -91 9 299 390 -113 -172 186 113 -197 -140 -87 104 226
5728 226 -188 -153 -20 123 151 -311 -345 164 252 392 -154 19 267 302 -165 -20 75 467 129 -297 -17 91
5750 91 288 97 -281 109 299 382 86 -74 -117 32 -90 29 -104 324 -105 91 32 -65 291 0 -196 -175
5772 -175 -63 -30 71 -187 -25 54 125 0 -167 -9 111 -68 -215 6 317 394 63 -327 103 69 198 72
5794 72 59 167 105 210 -266 -127 -23 303 -229 -153 -40 211 221 -133 34 74 50 -115 -142 -60 101 -25 72
5817 72 -299 186 127 29 -178 -288 85 55 16 -167 21 35 141 105 -147 43 60 42 -182 -61 -194 366 -48
5840 -48 -312 90 233 -38 -302 -248 -199 73 -87 -164 -167 228 101 -279 -221 -55 188 -102 166 -270 353 154
5862 154 90 22 74 291 284 -116 3 60 80 -22 96 -209 170 -48 -32 -107 -89 400 179 -480 -223 61 161
5885 161 45 -238 358 294 341 -209 -80 264 -2 213 -148 13 68 -5 371 -133 124 226 51 -77 -69 -124
5907 -124 266 -94 -423 83 203 184 -17 22 -85 202 -118 -80 -195 91 192 -67 -303 -432 81 184 176 -94
5929 -94 38 35 251 -63 120 -35 308 68 -136 114 70 89 -129 -136 140 -214 -26 -248 -27 158 131 -75 -173
5952 -173 -312 187 -38 -234 170 71 113 -145 -103 85 121 268 -51 -103 -2 209 46 -221 -46 37 415 -35
5974 -35 -107 -88 248 78 -50 -41 -193 223 179 -103 38 204 90 -3 -10 -95 202 5 -373 -340 -27 -24 -284 130
5998 130 -278 34 34 -241 -277 57 127 -121 -51 -30 -3 -86 -69 -418 -293 117 206 -253 -234 -3 152 -219 -530 67
6022 67 122 104 -374 -235 81 15 -67 -137 85 151 95 -39 -19 206 233 -134 -120 160 144 106 66 12 147 308 222
6047 222 -180 -61 243 324 15 -237 146 85 404 -314 -412 -70 -101 26 -100 86 185 230 -56 -266 -113 295
6069 295 153 -41 -113 -55 187 -294 -162 53 -347 64 94 -140 -266 247 -26 -55 -52 229 20 118 -176 66
6091 66 135 89 -190 -192 43 303 -142 30 -213 106 284 164 -234 -197 108 96 -14 -190 96 196 40 0 -152
6114 -152 213 194 47 -162 30 -19 132 272 17 -246 203 -12 -150 343 21 75 -18 -33 18 214 -93 -184
6136 -184 121 169 220 -295 -310 98 -55 19 -225 -256 111 48 -137 -16 -66 120 156 11 -317 22 10 125 -92
6159 -92 -135 91 72 301 63 -93 75 170 -239 -126 346 -141 110 -239 -153 51 -85 11 -102 72 406 -3
6181 -3 -245 -362 79 201 -14 88 143 138 -81 -105 -65 -32 231 116 -370 -380 -108 137 72 -313 -442 -39 23 -113
6205 -113 -63 326 -130 133 -306 -21 215 96 -544 -128 89 111 177 -15 -15 33 39 -156 2 -265 8 179 -126
6228 -126 -124 42 123 -193 -29 -115 -4 0 -260 -349 -98 312 108 -72 -78 74 181 -198 -465 -50 290 206 21
6251 21 -67 -8 360 198 -54 261 44 8 100 -174 147 94 -177 67 -135 121 160 -41 112 -130 66 237
6273 237 61 -153 -31 98 -55 -9 -59 109 270 -134 -146 253 29 204 -69 -227 -233 -60 -147 174 135 225 258
6296 258 1 -37 142 -185 124 37 -165 -14 -62 138 -114 160 43 -222 -76 87 174 145 -354 2 -17 -194
6318 -194 171 -148 -136 264 220 163 -61 -267 -18 193 -45 104 -100 -1 -36 -498 -143 63 106 158 35 -147
6340 -147 141 -118 116 -136 -160 -85 201 66 -451 -40 268 -11 112 -294 24 97 224 -109 -112 178 136 18
6362 18 -107 55 126 -88 -376 4 -149 202 -198 -44 -14 164 86 -151 -183 339 263 30 -387 86 -148 95
6384 95 -189 -169 117 241 37 131 -269 350 104 -45 -104 29 -115 142 352 -198 -255 403 183 -170 126 30
6406 30 363 -188 -197 -171 422 216 68 -198 59 187 -64 -188 -122 232 29 -308 -235 -98 82 -22 -61 -104 -33
6429 -33 -23 -51 -212 -315 430 2 -104 96 -211 120 52 -45 -246 -416 -176 -224 -316 92 5 -25 31 -151 412
6452 412 255 -14 -141 -341 235 373 -274 -90 69 -78 150 -70 -205 337 -17 -140 109 -62 -183 92
6472 92 -20 -55 -52 85 130 -1 -27 222 -35 -46 -231 -115 54 -160 -151 78 -217 134 161 -440 -167 105 256
6495 256 -300 -308 -73 311 -205 -130 -91 111 98 -65 -157 91 328 226 -223 -60 280 129 193 -176 131 194 41
6518 41 -143 220 -67 138 -156 -324 141 -328 -130 74 -13 267 -299 118 -267 -28 137 45 -30 -177 -268 177
6540 177 193 15 -20 -24 -59 221 -195 -108 318 242 219 -244 -2 438 84 -211 -115 45 -11 7 -52 -211 -48 -91
6564 -91 -288 -82 416 212 -19 -65 -109 162 322 128 -216 91 -156 344 76 -110 -36 -151 -57 61 -43 -37
6586 -37 18 -17 23 -1 187 -160 -140 173 182 227 13 -74 74 -261 180 -250 -37 231 133 291 19 -5 91 -102
6610 -102 201 -177 51 319 55 -148 -304 -152 -129 -76 -264 63 176 146 -241 -58 -82 -174 -38 -85 198 26
6632 26 37 -113 15 12 -166 101 -102 167 89 264 -104 -161 -223 -74 18 -71 21 89 -88 -98 131 84 -29 18 144
6657 144 -333 -133 106 160 -42 -237 -54 68 -2 -277 -237 -302 77 -224 329 285 159 -49 -240 89 -199 -112
6679 -112 183 -119 132 60 213 -29 -5 137 116 114 -86 -71 302 186 154 -211 198 38 145 -166 7 253
6701 253 275 89 -81 -77 114 -128 58 -289 -62 240 296 -226 -200 -111 -66 -223 -84 -134 -311 121 168 40 -9
6724 -9 184 419 -94 -177 -18 22 -115 -194 94 10 64 -9 81 -24 72 -18 107 -85 -48 208 203 28 378 126 180
6749 180 -256 -63 78 -39 233 65 8 208 104 87 -48 99 39 179 -284 -99 9 -21 -88 -57 196 196 159
6772 159 -304 -109 -49 157 162 -49 205 138 23 -66 10 51 336 191 -361 -203 -96 137 244 -226 0 -22 259
6795 259 -315 -189 -81 -215 152 -146 233 114 -30 -160 -132 -112 238 -57 -213 -117 435 187 -150 326 -39
6816 -39 -13 265 -72 59 62 198 218 43 -168 -37 168 -76 -29 24 248 -219 72 178 -173 -22 110 -354
6838 -354 -92 -204 141 -163 -92 179 -24 -68 375 74 26 186 -60 -154 29 213 -64 -156 110 220 -43 130
6860 130 -236 188 197 -4 -239 7 -171 -114 -23 -89 -242 -140 336 129 -261 -51 36 -200 -188 -11 -85 179 -168
6883 -168 -114 85 30 18 -37 -235 -54 286 -324 33 18 -292 210 -287 100 -121 12 418 -42 -34 168 5
6905 5 84 -24 -130 73 56 -333 -278 -269 -118 171 -30 -99 214 275 104 40 -110 127 259 -283 -249 13 82 124
6929 124 -115 164 -186 4 209 149 -46 41 -39 71 -51 116 -26 57 -30 44 -1 115 111 -156 -10 102 292
6952 292 -121 -28 -27 48 -256 -169 -154 268 -20 -141 54 -305 184 154 55 99 -22 22 40 -34 -111 220 -57 -264
6976 -264 -56 -38 106 -140 -42 -176 53 101 -96 -133 -131 58 275 -157 -171 -4 100 192 -195 48 37 279 -183
6999 -183 14 -177 -29 -141 85 91 267 -288 -249 -144 217 165 -314 -77 -148 83 74 -72 -350 226 160 228 79
7022 79 -47 -245 -16 28 -511 -118 9 -124 -75 -283 70 115 5 57 -228 7 -9 234 -25 326 -248 255
7044 255 -80 266 105 -98 -143 84 -245 -347 117 34 200 201 -64 10 95 -129 -29 152 221 -324 -29 214
7066 214 4 -145 155 7 333 66 -255 -14 192 217 -104 7 27 -46 31 -51 -97 5 -114 -58 219 -115
7088 -115 119 -30 99 46 212 129 175 -12 -50 179 3 25 196 81 14 306 139 -60 -120 -74 -46 13 -13 -227
7112 -227 205 14 31 -49 -67 251 262 20 -169 144 462 45 -101 -16 187 87 59 -24 95 151 -90 -190 46
7135 46 -17 99 -79 -210 -44 332 -29 -193 -121 142 -241 -206 -99 -177 130 -69 179 98 59 85 191 -242 146
7158 146 241 130 86 48 242 297 38 32 -196 -63 215 147 -150 172 -5 76 -8 -152 232 125 69 -357 58
7181 58 -111 75 257 -26 139 -58 228 -5 94 146 375 113 -116 89 183 -124 -34 -26 -197 34 168 73 260
7204 260 70 184 -24 -157 179 -383 -166 6 -445 277 270 188 -100 65 69 -15 -85 -45 119 -36 34 -115 -202
7227 -202 -122 34 -402 -265 -4 -185 13 62 -42 243 -83 -17 102 189 114 -30 95 -191 -107 32 250 -47
7249 -47 -102 176 104 -54 -220 -178 -217 -37 -207 -118 -99 45 71 -346 57 -11 192 197 -20 -96 -55 71 -148 55
7273 55 102 147 -396 -159 179 -47 116 163 34 85 119 51 89 -313 336 -40 137 -85 -75 195 -120 -173 -306
7296 -306 273 -241 53 -29 35 135 -111 -76 105 105 400 -155 -57 -103 102 -184 80 -54 -91 186 82 -69 -123
7319 -123 93 -158 143 -102 218 42 -57 -175 76 396 337 -178 -258 -37 174 55 -47 194 72 107 1
7340 1 5 -17 -105 5 -273 85 -74 -38 -92 -110 -103 -77 352 71 -226 -222 98 229 192 -138 -53 322 -38 -45 5 -87 442
7367 442 190 -36 30 -111 186 165 74 -10 44 379 191 -42 0 38 56 -162 -88 59 -9 -88 140 -470 299 -106
7391 -106 90 197 -13 47 181 33 264 -156 239 -151 -167 124 -171 -121 -145 -285 -5 -369 -171 50 370
7412 370 91 -150 41 136 -45 26 -176 -36 156 328 337 127 105 -37 417 78 6 -39 268 -137 275 -444
7434 -444 -80 -127 303 -46 -199 210 -35 -213 -153 40 -101 126 26 -119 -53 41 -246 -276 -228 -140 -103 -90 -279
7457 -279 -37 -109 60 60 19 -164 65 -234 -99 -48 145 32 -72 -63 217 44 68 103 -147 5 115 75 124 -54
7481 -54 198 -13 -72 133 -261 -70 289 126 18 63 137 -84 84 97 61 -129 -68 81 -1 -6 -149 25 -202
7504 -202 21 -120 152 -297 107 -18 50 153 166 -2 -238 -269 -10 100 182 39 -219 -97 112 264 -275
7525 -275 -139 -34 185 -107 109 78 401 65 -16 -71 -50 35 259 -107 59 -58 31 -40 41 -136 223 309 186
7548 186 409 -386 -275 77 -93 168 -80 194 -21 -113 132 -334 127 -202 6 119 -406 138 132 55 238
7569 238 254 196 36 -5 93 -63 -237 -45 -118 -261 -9 -160 153 128 170 515 -15 -100 0 41 -149 -65 -92 -17
7593 -17 -20 -195 -18 -25 299 3 -20 132 202 157 -58 -48 24 -22 -181 91 166 221 -16 74 -180 24 308 -33 20
7618 20 -489 -135 -6 -181 -9 -63 60 247 -86 -163 4 -101 -34 -154 84 -36 288 152 85 217 89 -40
7640 -40 -6 188 165 -135 -246 83 -113 209 337 -69 -172 246 126 -38 84 -240 -46 45 61 -53 17 -249
7662 -249 -283 -38 56 -98 -115 135 268 165 -108 -147 -368 152 86 204 -81 -21 -278 71 -48 144 -81 -10
7684 -10 -18 45 29 -291 -74 37 -148 18 216 312 100 73 -90 -80 -20 280 -27 -111 31 -44 -51 215 114 101 -5
7709 -5 -112 57 -78 -37 94 -45 -115 -1 -164 -156 -81 -107 -100 95 -133 256 -92 132 219 -15 129 -201 -359 148
7733 148 59 -72 -1 203 29 -128 -128 -179 -123 -17 223 -155 119 -62 -267 76 12 -167 53 -85 -186 -93 -97
7756 -97 -8 177 -134 -35 -110 -214 -49 -107 158 252 -44 157 92 -33 95 72 79 104 109 160 232 116 97 172 -209 193
7782 193 19 14 -142 110 -62 143 -200 234 162 -6 5 -71 41 -130 226 -330 98 128 -69 -19 228 -327
7804 -327 67 -433 39 -98 39 114 -145 -31 128 -71 -60 83 -253 -56 289 -34 -160 188 -7 237 -5
7825 -5 139 46 334 138 -52 -323 -80 -40 10 -56 -71 115 108 35 241 -72 -127 70 -128 57 -177 82 -129 -173
7849 -173 -69 14 138 -85 -201 234 -186 -68 169 163 -189 187 -12 172 -87 212 339 -22 -73 -82 149 4
7871 4 25 -36 86 -107 110 -59 179 -95 -145 -73 81 -47 -248 -2 -355 6 270 91 167 -86 -66 15 223
7894 223 -88 -73 -132 301 37 -135 19 -185 147 -143 -135 -147 78 -94 -186 -319 219 222 31 114 -57 21 -14 -103
7918 -103 52 88 -6 -67 10 31 129 -128 142 -51 -45 -240 118 -1 -89 -100 -155 -58 251 -35 54 -121 108 -81
7942 -81 103 -135 -284 -91 -39 46 -19 -89 6 145 157 91 2 -18 -179 -97 -93 -153 -123 -135 -88 47 -75 -230 -193 7
7968 7 290 111 -286 -1 256 -176 151 0 -101 -142 -190 88 -208 -223 -271 -95 -241 246 -190 -83 7 -103
7990 -103 -95 -219 205 -71 -194 -162 182 26 38 -43 7 -40 333 109 -65 175 204 44 166 81 -4 -11 -205 -95
8014 -95 68 149 134 113 100 -105 124 190 -204 55 67 -122 -52 -200 11 59 -86 11 -31 94 -168 -200 -308 -36
8038 -36 160 2 99 101 -132 -376 34 -29 138 -151 -41 44 38 -38 6 -52 130 -138 181 209 -171 -26 -261 -127
8062 -127 9 123 -69 -82 -54 58 426 4 27 118 208 -100 108 124 17 -3 48 38 30 -205 -241 124 -187 12
8086 12 76 54 1 -49 41 60 266 -174 -271 51 -78 -117 104 92 224 -414 -71 132 -114 -212 30 25 -263 92
8110 92 -152 30 61 -26 20 136 -191 189 41 274 -87 167 -84 -207 -36 209 171 -12 -39 91 -148 -102
8132 -102 -91 164 -419 126 -255 -181 186 16 108 -101 -348 -164 -36 -184 -266 -263 -71 -178 82 324 -21 -407
8154 -407 -213 218 109 -209 70 -101 -138 -98 215 -115 32 -9 125 -36 133 31 116 69 -28 92 155 154 -186
8177 -186 -120 -150 -253 -166 216 -30 198 37 -121 -96 -331 310 -66 69
8191F9
##END NTUPLES=NMR FID
##END=
