##TITLE=1H_EC-3222-x3s
 DMSO-d6
 8 sc, 
 28.07.2022
##JCAMPDX= 6.0         $$ Bruker NMR JCAMP-DX V2.0
##DATA TYPE= NMR SPECTRUM
##DATA CLASS= NTUPLES
##ORIGIN= UXNMR, Bruker Analytische Messtechnik GmbH
##OWNER= root
$$ XWIN-NMR		Version 3.5
$$ Thu Jul 28 13:48:13 2022 Russian Standard Time (UT+4h)  she@DPX200
##.OBSERVE FREQUENCY= 200.1313499994
##.OBSERVE NUCLEUS= ^1H
##.ACQUISITION MODE= SIMULTANEOUS
##.ACQUISITION SCHEME= undefined
##.AVERAGES= 8
##.DIGITISER RES= 18
##SPECTROMETER/DATA SYSTEM= spect
##.PULSE SEQUENCE= zg30
##.SOLVENT NAME= DMSO
##.SHIFT REFERENCE= (INTERNAL, DMSO, 0, 15.7513)
##AUDIT TRAIL= $$ (NUMBER, WHEN, WHO, WHERE, WHAT)
$$ ##TITLE= Audit trail, XWIN-NMR		Version 3.5
$$ ##JCAMPDX= 5.01
$$ ##ORIGIN= Bruker BioSpin GmbH
$$ ##OWNER= she
$$ F:/spectra/data/she/nmr/H-F/1/pdata/1/auditp.txt
$$ ##AUDIT TRAIL=  $$ (NUMBER, WHEN, WHO, WHERE, WHAT)
(   1,<2022-07-28 13:46:51.42 +0400>,<she>,<DPX200>,
      <created by zg, POWCHK disabled, PULCHK disabled
       configuration hash MD5:
       00 E9 B6 7A A2 85 ED C7 34 08 36 98 17 FE 4E 26
       data hash MD5: 16K
       21 46 9A 2D F7 D4 29 9F D4 C8 EF AB 40 23 6E 10>)
(   2,<2022-07-28 13:46:53.85 +0400>,<she>,<DPX200>,
      <Start of raw data processing
       efp BC_mod = 2 LB = 0.24 FT_mod = 6 PKNL = 1 PHC0 = -18191.35 PHC1 = 1.800683 SI = 16K 
       data hash MD5: 16K
       2C 72 0E D2 12 B4 7E 80 C3 82 E0 C8 42 2E 8D 2D>)
(   3,<2022-07-28 13:47:18.87 +0400>,<she>,<DPX200>,
      <pk PHC0 = 153.1098 PHC1 = 6.4 
       data hash MD5: 16K
       23 D3 6B DC 58 F3 CA E6 3E C0 B9 C4 79 65 AE 87>)
(   4,<2022-07-28 13:47:22.29 +0400>,<she>,<DPX200>,
      <abs ABSG = 5 
       data hash MD5: 16K
       A0 1B 71 C4 25 76 EF 1D 90 79 F0 0D B2 C6 3D FC>)
$$ ##END=
$$ 
$$ hash MD5
$$ 9E C1 DB 0E 46 7C 46 46 63 C1 1E F0 9D CD 43 38
##$RELAX= 
##$RELAX= 
##$RELAX= 
##$RELAX= 
##$RELAX= 
##$RELAX= 
$$ Bruker specific parameters
$$ --------------------------
##$DU= <F:/spectra>
##$EXPNO= 1
##$NAME= <H-F>
##$PROCNO= 1
##$TYPE= <nmr>
##$USER= <she>
##$AMP= (0..31)
100 100 100 100 100 100 100 100 100 100 100 100 100 100 100 100 100 100 
100 100 100 100 100 100 100 100 100 100 100 100 100 100 
##$AQSEQ= 0
##$AQ_mod= 1
##$AUNM= <au_zg>
##$AUTOPOS= <>
##$BF1= 200.13
##$BF2= 200.13
##$BF3= 200.13
##$BF4= 200.13
##$BF5= 200.13
##$BF6= 200.13
##$BF7= 200.13
##$BF8= 200.13
##$BYTORDA= 1
##$CFDGTYP= 0
##$CFRGTYP= 5
##$CHEMSTR= <none>
##$CNST= (0..31)
1 1 145 1 1 1 1 1 1 1 1 1 1 1 1 1 1 1 1 1 1 1 1 1 1 1 1 1 1 1 1 1 
##$CPDPRG= <>
##$CPDPRG1= <>
##$CPDPRG2= <>
##$CPDPRG3= <>
##$CPDPRG4= <mlev>
##$CPDPRG5= <mlev>
##$CPDPRG6= <mlev>
##$CPDPRG7= <mlev>
##$CPDPRG8= <mlev>
##$CPDPRGB= <>
##$CPDPRGT= <>
##$D= (0..31)
0 1.2 0 0 0 0 0 0 0 0.06 0 0.03 0 0 0 0 0.0002 0 0 0 0 0 0 0 0 0 0 0 0 
0 0 0 
##$DATE= 1659001611
##$DBL= (0..7)
120 120 120 120 120 120 120 120 
##$DBP= (0..7)
150 150 150 150 150 150 150 150 
##$DBP07= 0
##$DBPNAM0= <>
##$DBPNAM1= <>
##$DBPNAM2= <>
##$DBPNAM3= <>
##$DBPNAM4= <>
$$ [...]
##$SUBNAM2= <"">
##$SUBNAM3= <"">
##$SUBNAM4= <"">
##$SUBNAM5= <"">
##$SUBNAM6= <"">
##$SUBNAM7= <"">
##$SUBNAM8= <"">
##$SUBNAM9= <"">
##$SW= 18.0517283424941
##$SWIBOX= (0..15)
0 0 2 0 0 0 0 0 0 0 0 0 0 0 0 0 
##$SW_h= 3612.71676300578
##$TD= 16384
##$TD0= 1
##$TE= 0
##$TE2= 300
##$TE3= 300
##$TEG= 300
##$TL= (0..7)
0 120 120 120 120 120 120 120 
##$TP= (0..7)
150 150 150 150 150 150 150 150 
##$TP07= 0
##$TPNAME0= <>
##$TPNAME1= <>
##$TPNAME2= <>
##$TPNAME3= <>
##$TPNAME4= <>
##$TPNAME5= <>
##$TPNAME6= <>
##$TPNAME7= <>
##$TPOAL= (0..7)
0.5 0.5 0.5 0.5 0.5 0.5 0.5 0.5 
##$TPOFFS= (0..7)
0 0 0 0 0 0 0 0 
##$TUNHIN= 0
##$TUNHOUT= 0
##$TUNXOUT= 0
##$USERA1= <user>
##$USERA2= <user>
##$USERA3= <user>
##$USERA4= <user>
##$USERA5= <user>
##$V9= 5
##$VALIST= <valist>
##$VCLIST= <CCCCCCCCCCCCCCC>
##$VD= 0
##$VDLIST= <DDDDDDDDDDDDDDD>
##$VPLIST= <PPPPPPPPPPPPPPP>
##$VTLIST= <TTTTTTTTTTTTTTT>
##$WBST= 1024
##$WBSW= 4
##$XGAIN= (0..3)
0 0 0 0 
##$XL= 0
##$YL= 0
##$YMAX_a= 100694
##$YMIN_a= -165711
##$ZGOPTNS= <>
##$ZL1= 120
##$ZL2= 120
##$ZL3= 120
##$ZL4= 120
##$ABSF1= 15.7513
##$ABSF2= -2.30055
##$ABSG= 5
##$ABSL= 3
##$ALPHA= 0
##$AQORDER= 0
##$ASSFAC= 0
##$ASSFACI= 0
##$ASSFACX= 0
##$ASSWID= 0
##$AUNMP= <proc_1d>
##$AZFE= 0.1
##$AZFW= 0.1
##$BCFW= 0
##$BC_mod= 2
##$BYTORDP= 0
##$COROFFS= 0
##$CY= -3
##$DATMOD= 1
##$DC= 0
##$DFILT= <>
##$DTYPP= 0
##$F1P= 0
##$F2P= 0
##$FCOR= 1
##$FTSIZE= 16384
##$FT_mod= 6
##$GAMMA= 0
##$GB= 0
##$INTBC= 1
##$INTSCL= 0
##$ISEN= 128
##$LB= 0.24
##$LEV0= 0
##$LPBIN= 0
##$MAXI= 10000
##$MC2= 0
##$MEAN= 0
##$ME_mod= 0
##$MI= 1.114404
##$NCOEF= 0
##$NC_proc= -9
##$NLEV= 6
##$NOISF1= 3.799351
##$NOISF2= 2.8
##$NSP= 0
##$NTH_PI= 0
##$NZP= 0
##$OFFSET= 15.7513
##$PC= 1
##$PHC0= -18038.24
##$PHC1= 8.200684
##$PH_mod= 1
##$PKNL= yes
##$PPARMOD= 0
##$PSCAL= 0
##$PSIGN= 0
##$REVERSE= no
##$SF= 200.13000405091
##$SI= 16384
##$SIGF1= 3
##$SIGF2= 2
##$SINO= 5.538805
##$SIOLD= 16384
##$SREGLST= <1H.CDCl3>
##$SSB= 0
##$STSI= 16384
##$STSR= 0
##$SW_p= 3612.71676300578
##$SYMM= 0
##$S_DEV= 0
##$TDeff= 16384
##$TDoff= 0
##$TI= <>
##$TILT= no
##$TM1= 0
##$TM2= 0
##$TOPLEV= 0
##$USERP1= <user>
##$USERP2= <user>
##$USERP3= <user>
##$USERP4= <user>
##$USERP5= <user>
##$WDW= 1
##$XDIM= 16384
##$YMAX_p= 441876842
##$YMIN_p= -2501787
$$ End of Bruker specific parameters
$$ ---------------------------------
##NTUPLES= NMR SPECTRUM
##VAR_NAME=  FREQUENCY,     SPECTRUM/REAL,   SPECTRUM/IMAG
##SYMBOL=    X,             R,               I
##VAR_TYPE=  INDEPENDENT,   DEPENDENT,       DEPENDENT
##VAR_FORM=  AFFN,          ASDF,            ASDF
##VAR_DIM=   16384,         16384,           16384
##UNITS=     HZ,            ARBITRARY UNITS, ARBITRARY UNITS
##FACTOR=    0.220516191357247, 1,           1
##FIRST=     3152.3077044073, 0,             0
##LAST=      -460.409058598478, 0,           0
##MIN=       -460.409058598478, -2501787,    0
##MAX=       3152.3077044073, 441876842,     0
$$ Real data points
##PAGE= N=1
##DATA TABLE= (X++(R..R)), XYDATA
$$ [...]
$$ plain form
6680 81552 1026823 1669082 1580353 1444149 1376575 1400890 750181 1333830 1279211 1240513 1048788
6669 1048788 501790 539301 1406602 1143974 966402 720647 803869 694169 899237 1113951
6659 1113951 1411648 1638510 1757082 1775993 1347024 2181973 1860634 1841830 2051982 1555222
6649 1555222 2655612 2064547 1891452 1952012 2566608 2388249 2518608 2470354 2267531 1602341
6639 1602341 2350535 2284279 1348753 1076344 2117689 2158272 2219927 2464036 1383437 1490735
6629 1490735 1723660 1908767 1505852 1656688 1235861 1575731 2233354 2330418 1908009 2188499
6619 2188499 1935340 1705968 1783321 2284448 1669669 2195656 1734833 1544443 1804282 1438990
6609 1438990 1805330 1597400 1550580 1568501 1178864 1118257 1371467 2073328 2791540 2715185
$$ packed form
6680H1552R45271O42259q8729j36204o7574K4315o50709N83649n4619l8698j91725
6669A048788n46998L7511Q67301k62628j77572k45755Q3222j09700K05068K14714
6659A113951K97697K26862J18572J8911m28969Q34949l21339j8804K10152m96760
6649A555222J100390n91065j73095O0560O14596j78359J30359m8254k02823o65190
6639A602341P48194o6256r35526k72409J041345M0583O1655K44109j080599J07298
6629A490735K32925J85107m02915J50836m20827L39870O57623R7064m22409K80490
6619B188499k53159k29372P7353N01127o14779N25987m60823j90390K59839l65292
6609A438990L66340k07930m6820J7921l89637o0607K53210P01861P18212p6355
$$ plain form
6599 2715185 1767023 1814435 1855206 2244195 1978857 2035919 2248161 2040142 1976689 1731637
6589 1731637 2114069 2858739 3272352 2409995 2060359 2722228 2816050 1717961 2022758 2755276
6579 2755276 2796423 1922864 1711323 1779592 2477073 2616026 2720895 3401211 3791622 3415640
6569 3415640 1828196 1877695 1947216 2163723 2328313 2375908 2875682 2764873 2713061 2937867
6559 2937867 2628112 2524823 2594113 2501612 3199353 2625835 2600889 2997832 2566602 2725975
6549 2725975 3032914 2774418 1712435 2951776 3261770 3494212 3879297 3036666 2924957
6540 2924957 3207437 3189465 2465550 2768027 3425836 3174102 2874463 3249673 3955209 3890487
6530 3890487 3745337 3333319 3891089 4143532 4009756 4442151 4408747 3958051 3537356 4200338
$$ packed form
6599B715185r48162M7412M0771L88989k65338N7062K12242k08019o3453k45052
6589A731637L82432P44670M13613q62357l49636O61869R3822j098089L04797P32518
6579B755276M1147q73559k11541O8269O97481J38953J04869O80316L90411l75982
6569C415640j587444M9499O9521K16507J64590M7595M99774j10809n1812K24806
6559B937867l09755j03289O9290r2501O97741n73518k4946L96943m31230J59373
6549B725975L06939k58496j061983J239341L09994K32442L85085q42631j11709
6540B924957K82480j7972p23915L02477O57809k51734k99639L75210P05536o4722
6530C890487j45150m12018N57770K52443j33776M32395l3404m50696m20695O62982
$$ plain form
6520 4200338 4693637 3847352 4031965 4037157 3710491 3543151 3283043 3605658 3904805 3406319
6510 3406319 4058805 3963462 4207366 4799908 4317108 4419779 3972217 3806433 4051348 4265209
6500 4265209 3766162 3949026 3940424 4812593 4662543 4789062 4608588 3874284 4340776 4681460
6490 4681460 5262049 4668556 4132856 5325009 5507632 4996119 5039595 4529742 4622370 5018209
6480 5018209 4856340 4738431 4749246 5171170 4547273 4694343 4984764 5018632 5391298 5560136
6470 5560136 5620308 6538911 5467707 4704084 5107322 4846020 4820866 5708546 5610159 5387173
6460 5387173 5756757 5938607 5808657 6053930 6716671 6934973 6315772 6821730 7112194 6550259
6450 6550259 6403298 6623214 6762947 6039695 7430613 7711597 7128090 7432330 7756482
$$ packed form
6520D200338M93299q46285J84613N192l26666j67340k60108L22615K99147m98486
6510C406319O52486r5343K43904N92542m82800J02671m47562j65784K44915K13861
6500D265209m99047J82864q602Q72169j50050J26519j80474p34304M66492L40684
6490D681460N80589n93493n35700J192153J82623n11513M3476n09853R2628L95839
6480E018209j61869j17909J0815M21924o23897J47070K90421L3868L72666J68838
6470E560136O0172R18603j071204p63623M03238k61302k5154Q87680r8387k22986
6460E387173L69584J81850j29950K45273O62741K18302o19201N05958K90464n61935
6450F550259j46961K19916J39733p23252J390918K80984n83507L04240L24152
$$ plain form
6441 7756482 7099096 6812015 6770220 7220960 7112254 7037697 7155703 7473952 7931584 7568377
6431 7568377 6753999 7529774 7565922 6502644 6662513 7853458 7199866 6411636 6465042 7567434
6421 7567434 7820118 7798863 7705577 7749799 8840028 8320728 7901606 7400270 7440500 8157424
6411 8157424 8064423 7309200 7265748 7922952 8928254 9702248 8622075 8245651 8687274 8173042
6401 8173042 8842969 8218550 7456532 7899675 8638037 8637613 8730363 8809967 9112494 10316027
6391 10316027 10454102 10204820 10315623 10087136 10100399 10720662 10309753 9490704 9520749 9122489
6381 9122489 9853301 10828243 10983690 10769514 11181987 10908000 10590305 10896098 11499156 11224746
6371 11224746 11007002 11186253 11708749 11519890 10686567 11037822 11366386 10591996 11239229
$$ packed form
6441G756482o57386k87081m1795M50740j08706p4557J18006L18249M57632l63207
6431G568377q14378P75775L6148j063278J59869J190945o53592p88230N3406J102392
6421G567434K52684k1255r3286M4222J090229n19300m19122n01336M0230P16924
6411H157424r3001p55223m3452O57204J005302P73994j080173l76424M41623n14232
6401H173042O69927o24419p62018M43143P38362m24R2750P9604L02527J203533
6391A0316027J38075k49282J10803k28487J3263O20263m10909q19049L0045l98260
6381I122489P30812R74942J55447k14176M12473k73987l17695L05793O03058k74410
6371A1224746k17744J79251N22496j88859q33323L51255L28564p74390O47233
$$ plain form
6362 11239229 11665733 11958669 11792281 11763057 12657141 12722640 11725309 12250516 13183414 13157309
6352 13157309 12936166 13122395 14548524 15044045 14352777 14250518 15514475 14946700 14857476
6343 14857476 14851741 14629928 14710723 15072345 16050143 17295137 16813364 16706155 16955823 17178563
6333 17178563 16845207 16049235 17253156 18955961 18367469 19006227 19262787 18825892 19859035
6324 19859035 20219472 20076713 20210461 20941620 22405852 22877684 23441086 23408167 24979005
6315 24979005 25669807 26497345 27601492 29166069 30167322 30335772 32062490 32978617 33629575
6306 33629575 33595367 34896088 37055204 37798804 38240459 38647843 39127030 39598335 40630987
6297 40630987 40850012 42214725 42711483 42289579 42039105 42006397 42575872 42561176 43110767 43005908
$$ packed form
6362A1239229M26504K92936j66388k9224Q94084O5499r97331N25207R32898k6105
6352A3157309k21143J86229J426129M95521o91268j02259J263957n67775q9224
6343A4857476n735k21813Q0795L61622R77798J244994m81773j07209K49668K22740
6333A7178563l33356p95972J203921J702805n88492O38758K56560m36895J033143
6324A9859035L60437j42759J33748P31159J464232M71832N63402l2919J570838
6315B4979005O90802Q27538J104147J564577J001253J68450J726718R16127O50958
6306C3629575l4208J300721K159116P43600M41655M07384M79187M71305J032652
6297D0630987K19025J364713M96758m21904k50474l2708N69475j4696N49591j04859
$$ plain form
6287 43005908 43265883 43285728 44005839 44448675 45744722 46477371 47317873 47818908 49075849
6278 49075849 49700660 50994655 52457525 53925525 54387309 54912625 55805156 56596251 57541502
6269 57541502 58851135 59987942 60703424 60746325 61344175 63609256 63608367 63314163 62717846 62649826
6259 62649826 62622454 62584697 62629429 62936358 63483361 62939767 62251543 62213478 62088177 61789759
6249 61789759 60868399 60137547 60679686 60567939 60939415 62075909 61884856 61476529 61271277
6240 61271277 61834979 61925452 62584247 63137620 63108395 63587169 63319497 62280204 62295128 63044620
6230 63044620 62892273 62598214 61482253 60855737 60412910 58938553 57458305 56337258 54875453
6221 54875453 53009371 51392540 50026678 48852375 47272709 45159943 43241362 41550757
$$ packed form
6287D3005908K59975J9845P20111M42836J296047P32649Q40502N01035J256941
6278D9075849O24811J293995J462870J468000M61784N25316Q92531P91095R45251
6269E7541502J309633J136807P15482M2901N97850K265081q89k94204n96317o8020
6259F2649826k7372l7757M4732L06929N47003n43594o88224l8065j25301k98418
6249F1789759r21360p30852N42139j11747L71476J136494j91053m08327k05252
6240F1271277N63702R0473O58795N53373k9225M78774k67672j039293J4924P49492
6230F3044620j52347k94059j115961o26516m42827j474357j480248j121047j461805
6221E4875453j866082j616831j365862j174303j579666k112766j918581j690605
$$ plain form
6213 41550757 40665321 40062859 38746449 37321271 36525546 36546402 35227635 34297250 33892777
6204 33892777 33287558 33297134 32823031 32857435 31757975 32371211 32059099 32089232 32893129 32234236
6194 32234236 32929565 33488590 33816824 34688885 34796253 35125173 35325159 36039662 36908468
6185 36908468 37610479 38628374 39584366 40306164 41153076 41478264 41765573 43171874 43769054
6176 43769054 43874396 44553333 45932969 45567615 45211913 44422197 45154772 44993882 44458204
6167 44458204 44118301 44110689 43324673 42640477 42004591 40652918 40444033 39532863 38069639
6158 38069639 36949397 36167308 34743534 33517792 31859228 30454539 28629263 27940936
6150 27940936 27381003 25574585 24291551 23685705 22355444 21085319 19919109 19756451 19409982
$$ packed form
6213D1550757q85436o02462j316410j425178p95725K0856j318767r30385m04473
6204C3892777o05219R576m74103L4404j099460O13236l12112L0133Q03897o58893
6194C2234236O95329N59025L28234Q72061J07368L28920J99986P14503Q68806
6185C6908468P02011J017895R55992P21798Q46912L25188K87309J406301N97180
6176D3769054J05342O78937J379636l65354l55702p89716P32575j60890n35678
6167D4458204l39903p612p86016o84196o35886j351673k08885r11170j463224
6158C8069639j120242p82089j423774j225742j658564j404689j825276o88327
6150B7940936n59933j806418j283034o05846j330261j270125j166210j62658l46469
$$ plain form
6141 19409982 18491916 17930693 17853940 16369775 16049805 15880123 15242798 15220823 15067971 14551644
6131 14551644 14882283 14235143 13393275 13291383 12837087 13170691 12696094 11775123 11851285 12074150
6121 12074150 11512527 10980930 10612051 10840021 10798138 10899365 10388169 10080707 9847884 9753780
6111 9753780 9907998 10098445 10128245 10092984 9517401 9295011 9026211 10049740 9872868 9459248
6101 9459248 8433450 8065557 8769968 8257825 8199735 7437520 7415551 7723594 7353705 7961426
6091 7961426 8514828 8221662 7329469 7258704 7655705 7997486 7188232 6167690 6633678 7201745
6081 7201745 7554561 7788667 6785702 6314290 6283054 6790510 7168506 7081435 6849355 5916412
6071 5916412 6403602 7225573 7140746 7146488 6842072 6274899 5817215 6114775 6719814 7618521
$$ packed form
6141A9409982r18066n61223p6753j484165l19970j69682o37325k1975j52852n16327
6131A4551644L30639o47140q41868j01892m54296L33604m74597r20971P6162K22865
6121A2074150n61623n31597l68879K27970m1883J01227n11196l07462k32823r4104
6111I753780J54218J90447K9800l5261n75583k22390k68800J023529j76872m13620
6101I459248j025798l67893P04411n12143n8090p62215k1969L08043l69889O07721
6091G961426N53402k93166q92193p0765L97001L41781q09254j020542M65988N68067
6081G201745L52816K34106j002965m71412l1236N07456L77996q7071k32080r32943
6071E916412M87190Q21971q4827N742l04416n67173m57684K97560O05039Q98707
$$ plain form
6061 7618521 7609497 6616564 6515769 6476353 6934219 7003700 6986195 7255031 6486382 6555325 6635428
6050 6635428 6303385 6852414 7348489 7262889 6944208 6826745 6796108 7468922 7604995 6944040
6040 6944040 6630969 6897168 7252349 7268184 6941385 7805023 8321964 8590900 8918109 8701650
6030 8701650 8284631 7887063 7974197 7988012 8447083 8415358 8321518 8750980 8457169 8238335
6020 8238335 7520941 8264014 9168320 9123551 9256672 9272610 9909306 10284370 10374234 10848433
6010 10848433 10792009 11257113 11294007 11740173 11270769 11314134 11922173 12063958 12789586 13209472
6000 13209472 14305166 15213858 15041191 14678919 15271099 15806044 16356595 17546774 18461438
5991 18461438 20290481 20803700 20720680 21719396 22156796 23400827 23820471 24725636 25767602
$$ packed form
6061G618521r024r92933j00795l9416M57866O9481j7505K68836p68649O8943Q0103
6050F635428l32043N49029M96075q5600l18681j17463l0637O72814J36073o60955
6040F944040l13071K66199L55181J5835l26799Q63638N16941K68936L27209k16459
6030H701650m17019l97568Q7134J3815M59071l1725r3840M29462k93811k18834
6020H238335p17394P43073R04306m4769J33121J5938O36696L75064Q9864M74199
6010A0848433n6424M65104L6894M46166m69404M3365O08039J41785P25628M19886
6000A3209472J095694R08692j72667l62272N92180N34945N50551J190179R14664
5991A8461438J829043N13219q3020R98716M37400J244031M19644R05165J041966
$$ plain form
5982 25767602 26554180 27470680 29344285 29611051 29888934 31053472 30857423 31246222 31472804
5973 31472804 31486886 32713500 32250502 31457124 31582391 30950397 30975576 30050404 30393261 30163232
5963 30163232 30154942 30594373 30856466 31310008 31238332 31449871 31399019 31578273 31753083 32453735
5953 32453735 33221437 32533412 33330347 34102681 34294550 34678023 34393793 34098565 33894125
5944 33894125 33642616 32969568 33005361 32294884 31381060 31082245 30749076 30259939 28783501
5935 28783501 27570666 26978188 27017454 26866804 26628582 25413180 25415699 25775061 25298418 24910276
5925 24910276 24678123 24957961 25406058 24807078 24150855 24170987 23888767 23510317 24426628 25410842
5915 25410842 25509971 24906999 25006091 25452735 24879712 25021549 24141133 23052762 22218597 22235285
$$ packed form
5982B5767602P86578R16500J873605K66766K77883J164538j96049L88799K26582
5973C1472804J4082J226614m62998p93378J25267o31994K5179r25172L42857k30029
5963C0163232q290M39431K62093M53542p1676K11539n0852J79254J74810P00652
5953C2453735P67702o88025P96935P72334J91869L83473k84230k95228k04440
5944C3894125k51509o73048L5793p10477r13824k98815l33169m89137j476438
5935B8783501j212835n92478L9266j50650k38222j215402K519L59362m76643l88142
5925B4910276k32153K79838M48097n98980o56223K0132k82220l78450R16311R84214
5915B5410842R9129o02972R9092M46644n73023J41837q80416j088371q34165J6688
$$ plain form
5905 22235285 22539030 23207635 23031059 23518552 23130094 21831258 21375476 21084834 21014502
5896 21014502 20637862 20622737 20515502 20015248 20390785 21063519 21105901 21227627 20985682 20860966
5886 20860966 21061656 20995207 21054262 20778552 21304038 22053758 21632527 21393890 21054076 20854192
5876 20854192 20447087 19440746 19139818 18681909 18599570 18141959 16809268 16553661 16551436 15542059
5866 15542059 15136377 14958908 14280367 13251433 13001537 12478980 12636593 12371298 11363369
5857 11363369 12068054 12069528 11843312 11627169 10323568 10054993 9546686 9824231 9800355 9342190
5847 9342190 8693215 9247941 9049347 9149571 8403479 7569014 7480884 7424765 7568291 7529769
5837 7529769 7252153 7558726 7956419 7616877 7306439 7114277 7496790 7955743 7869922 7311668
$$ packed form
5905B2235285L03745O68605j76576M87493l88458j298836m55782k90642p0332
5896B1014502l76640j5125j07235n00254L75537O72734M2382J21726k41945j24716
5886B0860966K00690o6449N9055k75710N25486P49720m21231k38637l39814j99884
5876B0854192m07105j006341l00928m57909q2339m57611j332691k55607k225j009377
5866A5542059m05682j77469o78541j028934k49896n22557J57613k65295j007929
5857A1363369P04685J474k26216k16143j303601k68575n08307K77545k3876m58165
5847I342190o48975N54726j98594J00224p46092q34465q8130n6119J43526l8522
5837G529769k77616L06573L97693l39542l10438j92162L82513M58953q5821n58254
$$ plain form
5827 7311668 7436386 6801105 6286476 6730696 7236046 6871157 6188700 6407411 6553658 6638707
5817 6638707 6461482 6560766 7037592 7058736 6902321 6827313 6288095 5973274 6161978 5592114
5807 5592114 6543873 6512399 6815226 7047023 5979984 5407066 5818487 5899728 6077038 5371775
5797 5371775 4882503 5125683 5416545 4525505 5659472 6201700 6157422 5797562 5596001 5474515
5787 5474515 5218160 5344171 5545423 5413167 4976405 5217232 5077245 4915923 5497904 5688216
5777 5688216 5949152 6025329 5924048 5452574 5196635 4850744 4693018 4872435 4776480 5088288
5767 5088288 5435174 5541252 5679351 4541397 4476165 5005895 5028734 5261200 5840490 5753909
5757 5753909 4717876 4695901 4067847 4335730 5485096 5744056 5294947 4418770 4307129
$$ packed form
5827G311668J24718o35281n14629M44220N05350l64889o82457K18711J46247Q5049
5817F638707j77225R9284M76826K1144j56415p5008n39218l14821J88704n69864
5807E592114R51759l1474L02827K31797j067039n72918M11421Q1241J77310p05263
5797E371775m89272K43180K90862q91040J133967N42228m4278l59860k01561j21486
5787E474515k56355J26011K01252j32256m36762K40827j39987j61322N81981J90312
5777E688216K60936P6177j01281m71474k55939l45891j57726J79417r5955L11808
5767E088288L46886J06078J38099j137954o5232N29730K2839K32466N79290q6581
5757E753909j036033k1975o28054K67883J149366K58960m49109q76177j11641
$$ plain form
5748 4307129 5202775 4963459 5399135 5783962 4955453 3893943 3807141 4524127 4337248 4419272
5738 4419272 4611304 4732306 4667817 4657600 5225998 5221669 4937687 4733659 4185760 3910158
5728 3910158 3936813 3992195 4447323 4060424 4599222 5202965 5758309 5479816 5173787 5286463
5718 5286463 5094732 5197852 5066286 4762459 4815160 5815030 4585612 4649979 5256655 4903977
5708 4903977 4590860 4428649 4770952 4846535 4327535 4428560 5354304 4458698 4654299 4896293
5698 4896293 4670256 4038114 5131448 5353206 5232817 4909252 5669204 6047277 5884843
5689 5884843 5557670 6126194 6129490 5791216 5806181 6381616 6194135 5891385 6640331 5640616
5679 5640616 4704126 5967237 6477611 6764575 7138715 7603138 6954580 6132519 6588038
$$ packed form
5748D307129Q95646k39316M35676L84827q28509j061510q6802P16986j86879Q2024
5738D419272J92032J21002o4489j0217N68398m329k83982k04028n47899k75602
5728C910158K6655N5382M55128l86899N38798O03743N55344k78493l06029J12676
5718E286463j91731J03120j31566l03827N2701R99870j229418O4367O06676l52678
5708D903977l13117j62211L42303P5583n19000J01025R25744q95606J95601K41994
5698D896293k26037o32142J093334K21758j20389l23565P59952L78073j62434
5689E884843l27173N68524L296l38274J4965N75435j87481l02750P48946r99715
5679E640616r36490J263111N10374K86964L74140M64423o48558q22061M55519
$$ plain form
5670 6588038 6644970 7084359 6948356 6115826 5998105 6027545 5843698 6441934 6520114 5931543
5660 5931543 5486180 6450394 5748827 5911097 5752928 6646766 6197943 5935096 6133491 6192579
5650 6192579 5850959 6220024 6364135 6871647 7069013 6419306 5913568 6164280 7548965
5641 7548965 7712694 7246394 6075301 5763440 5379986 5569288 6233630 6558818 6836294
5632 6836294 6597079 6239930 6337575 6784159 7059756 5961501 5267876 5219984 5371646 5331660
5622 5331660 6651036 6522898 6611563 6744483 6463822 6244909 6714581 6437012 6159191 7150372
5612 7150372 7519395 7774060 7651906 7155011 6726063 6856716 6270077 6373765 7195243 7469349
5602 7469349 7144109 6983766 7202070 7918904 7898200 7726790 7430127 8014893 7473146 7011696
$$ packed form
5670F588038N6932M39389j36003q32530j17721K9440j83847N98236P8180n88571
5660E931543m45363R64214p01567J62270j58169Q93838m48823k62847J98395N9088
5650F192579l41620L69065J44111N07512J97366o49707n05738K50712J384685
5641G548965J63729m66300j171093l11861l83454J89302O64342L25188K77476
5632F836294k39215l57149R7645M46584K75597j098255o93625m7892J51662l9986
5622E331660J319376j28138Q8665J32920k80661k18913M69672k77569k77821R91181
5612G150372L69023K54665j22154m96895m28948J30653n86639J03688Q21478K74106
5602G469349l25240j60343K18304P16834k0704j71410k96663N84766n41747m61450
$$ plain form
5592 7011696 7804148 8086043 9104835 9458896 8783472 8400248 8258331 9007825 9194673
5583 9194673 9053024 9535982 9876433 10156432 9876003 9569324 9393945 8759110 9287847 10012906
5573 10012906 9956529 10770858 10940069 11927536 11405927 11375044 12237505 11987568 12257367 12224511
5563 12224511 12022758 12890549 12489078 12359031 12814783 13117242 14247638 13934012 14060175
5554 14060175 14349177 14913842 14131737 14745284 15824543 15976969 16048466 17185971 18465061
5545 18465061 18605017 18080988 17887943 18166277 18511796 19129283 19924552 19602912 19577952 20549305
5535 20549305 21163767 21377378 22001498 21835569 22449907 23162677 23365251 23534246 23857969
5526 23857969 24193470 24753284 25269380 27036655 27625331 27489936 28665669 29098583 28588358
$$ packed form
5592G011696P92452K81895J018792L54061o75424l83224j41917P49494J86848
5583I194673j41649M82958L40451K79999k80429l06679j75379o34835N28737P25059
5573A0012906n6377Q14329J69211R87467n21609l0883Q62461k49937K69799l2856
5563A2224511k01753Q67791m01471j30047M55752L02459J130396l13626J26163
5554A4060175K89002N64665p82105O13547J079259J52426P1497J137505J279090
5545A8465061J39956n24029j93045K78334L45519O17487P95269l21640k4960R71353
5535B0549305O14462K13611O24120j65929O14338P12770K02574J68995L23723
5526B3857969L35501N59814N16096J767275N88676j35395J175733M32914n10225
$$ plain form
5517 28588358 27892090 28494926 29157457 29483429 28971014 28948564 30169862 30816926 30933954
5508 30933954 31310548 30671103 30380083 29897864 29539574 29873334 30526412 30463581 30373191 30246264
5498 30246264 31530286 31941088 31828098 32264929 31417157 31488864 32846116 33496674 33339596
5489 33339596 32715370 32623559 32521674 34167182 34031349 34422900 34910792 34568474 34973217
5480 34973217 35229752 35934804 35583768 35609131 36053110 36219622 36415172 36899736 37068260 37285110
5470 37285110 37727055 38234890 39375241 39925408 39899370 39835336 39884847 40244213 41095827 40575984
5460 40575984 40343575 40286674 40560593 40202687 40160188 40225169 40310610 40360552 39985200 39645773
5450 39645773 39469902 39023405 37944082 36774527 37043852 37316882 35334263 35016643 35206642
$$ packed form
5517B8588358o96268O02836O62531L25972n12415k2450J221298O47064J17028
5508C0933954L76594o39445k91020m82219l58290L33760O53078o2831r0390j26927
5498C0246264J284022M10802j12990M36831q47772P1707J357252O50558j57078
5489C3339596o24226r1811j01885J645508j35833L91551M87892l42318M04743
5480C4973217K56535P05052l51036K5363M43979J66512J95550M84564J68524K16850
5470C7285110M41945N07835J140351N50167k6038o4034M9511L59366Q51614n19843
5460D0575984k32409n6901K73919l57906m2499O4981Q5441M9942l75352l39427
5450C9645773j75871m46497j079323j169555K69325K73030j982619l17620J89999
$$ plain form
5441 35206642 35730814 36068226 35452662 34794700 34585946 34467300 34369635 34234422 34976075 33995520
5431 33995520 34307720 33505651 33091370 32895013 32810547 33036161 32907078 32586290 31774291 32205508
5421 32205508 32048535 31245932 31488904 30923331 30547058 30597666 29284052 29096125 28951007
5412 28951007 28470815 28873296 28493852 27433055 27637460 28680431 27983554 27174852 27780426
5403 27780426 28199384 28236905 28747083 28432926 28510824 29064495 28824361 29247490 28879666 29214365
5393 29214365 29022659 28786894 29907650 30877652 30476833 30287687 29932477 30164239 30403474
5384 30403474 30281676 30602988 30992582 31186333 30876253 31550670 32641687 32960946 33347133
5375 33347133 33828543 33763958 33941356 35403222 36319485 36510199 37058363 37054687 37098313 38488596
$$ packed form
5441C5206642N24172L37412o15564o57962k08754j18646r7665j35213P41653r80555
5431C3995520L12200q02069m14281j96357q4466K25614j29083l20788q11999M31217
5421C2205508j56973q02603K42972n65573l76273N0608j313614j87927j45118
5412B8951007m80192M02481l79444j060797K04405J042971o96877q08702O05574
5403B7780426M18958L7521N10178l14157P7898N53671k40134M23129l67824L34699
5393B9214365j91706k35765J120756R70002m00819j89146l55210K31762K39235
5384C0403474j21798L21312L89594J93751l10080O74417J091017L19259L86187
5375C3347133M81410o4585J77398J461866R16263J90714N48164l676M3626J390283
$$ plain form
5365 38488596 39539300 40276312 40042365 39549420 39679307 40311031 41639129 41596029 42764417
5356 42764417 43699707 44194649 45522914 45924857 46590039 47061594 47976035 49041393 49945078
5347 49945078 50886056 51715815 52864118 53856837 54826057 55472084 56693261 57169193 57473241
5338 57473241 58262220 60286395 61380655 61561591 62293484 63906510 65585854 66530758 68665433
5329 68665433 69394727 70104385 71584470 73613941 74619052 76340398 78060572 80539883
5321 80539883 82348922 83060213 84733581 87157080 89430970 90949360 93580733 95537636
5313 95537636 97702439 100459409 102467623 104878781 107792131 110467717 113684476 116813725
5305 116813725 119517965 123126772 127314402 131590059 135863642 140193674 144681787 149003782
$$ packed form
5365C8488596J050704P37012k33947m92945J29887O31724J328098m3100J168388
5356D2764417R35290M94942J328265M01943O65182M71555R14441J065358R03685
5347D9945078R40978Q29759J148303R92719R69220O46027J221177M75932L04048
5338E7473241P88979K024175J094260J80936P31893J613026J679344R44904K134675
5329F8665433P29294P09658J480085K029471J005111J721346J720174K479311
5321H0539883J809039P11291J673368K423499K273890J518390K631373J956903
5313I5537636K164803K756970K008214K411158K913350K675586L216759L129249
5305A16813725K704240L608807M187630M275657M273583M330032M488113M321995
$$ plain form
5297 149003782 155170446 159993270 164871329 170232314 176277023 182033733 187618573 193626031
5289 193626031 199958749 206136548 212515174 219770132 226806109 233519369 240565966 248003756
5281 248003756 255563621 262606349 269715892 276683867 282707361 289455019 295488295 300076500
5273 300076500 303846624 307388298 309584648 311764590 312781609 311935074 311166241 309197091
5265 309197091 305549807 300412066 295705606 291637952 286906024 281248570 275600310 268772407
5257 268772407 261657105 253507987 244345672 235787007 226528306 218486628 211264643 204479647
5249 204479647 198539946 191961792 186312760 180494814 175571314 170499519 165486831 161722744
5241 161722744 157090036 153919489 151292529 147815952 145311704 143515138 141684991 139311534
$$ packed form
5297A49003782O166664M822824M878059N360985O044709N756710N584840O007458
5289A93626031O332718O177799O378626P254958P035977O713260P046597P437790
5281B48003756P559865P042728P109543O967975O023494O747658O033276M588205
5273C00076500L770124L541674K196350K179942J017019q46535p68833j969150
5265C09197091l647284n137741m706460m067654m731928n657454n648260o827903
5257B68772407p115302q149118r162315q558665r258701q041678p221985o784996
5249B04479647n939701o578154n649032n817946m923500n071795n012688l764087
5241A61722744m632708l170547k626960l476577k504248j796566j830147k373457
$$ plain form
5233 139311534 137646042 137766246 136914342 136343386 135460729 136842159 139136254 139308399 135698836
5224 135698836 130295128 124360544 115985752 110230610 106702211 103279703 100661322 97936846
5216 97936846 95342964 93022143 91929500 90193402 88743661 88291369 86978503 84847128
5208 84847128 84387942 83490928 83057693 83698972 83437603 83446624 83420096 83680829 85036776 86270361
5198 86270361 88243024 90293933 92891243 96629795 97979130 94259533 89809146 84111268
5190 84111268 77934835 73455624 69712410 66827251 64045021 62388216 60311271 59605651
5182 59605651 59357966 58250930 57143383 55409517 54594281 54212838 54804153 54057617 52873053
5173 52873053 52572495 52968603 53577010 52933758 52942731 53021695 53501144 54405391 55353091 55912747
$$ packed form
5233A39311534j665492J20204q51904n70956q82657J381430K294095J72145l609563
5224A35698836n403708n934584q374792n755142l528399l422508k618381k724476
5216I7936846k593882k320821j092643j736098j449741m52292j312866k131375
5208H4847128m59186q97014m33235O41279k61369R021k6528K60733J355947J233585
5198H6270361J972663K050909K597310L738552J349335l719597m450387n697878
5190H4111268o176433m479211l743214k885159k782230j656805k076945p05620
5182E9605651k47685j107036j107547j733866q15236l81443N91315p46536j184564
5173E2873053l00558L96108O08407o43252Q973P8964M79449R04247R47700N59656
$$ plain form
5163 55912747 57518679 56690683 54613044 52855020 50644353 48312949 46337319 44349765
5155 44349765 42656440 41873291 41256194 40284707 39394224 38520769 38073015 37855933 37169237
5146 37169237 37139502 37043884 36510789 36280368 35732655 35833267 34487379 34096263 34269439 34369138
5136 34369138 33385146 33178319 33677295 33647566 33610499 33314114 33352771 32195282 32072442 32233235
5126 32233235 32563791 32200565 31327921 31318065 31515390 31583385 31360684 31618726 31953341 31835765
5116 31835765 31397769 30296197 30302397 30514069 30433416 30938751 30930247 31439937 31824123 31856036
5106 31856036 31885201 31186291 32018773 32047990 31314841 31143901 31053091 30932293 30867405 31369270
5096 31369270 30966099 30504009 30813162 31230052 31400991 31752065 32125659 32268908 32414697
$$ packed form
5163E5912747J605932q27996k077639j758024k210667k331404j975630j987554
5155D4349765j693325p83149o17097r71487q90483q73455m47754k17082o86696
5146C7169237k9735r5618n33095k30421n47713J00612j345888l91116J73176R9699
5136C4369138r83992k06827M98976k9729l7067k96385L8657j157489j22840J60793
5126C2233235L30556l63226q72644r856J97325O7995k22701K58042L34615j17576
5116C1835765m37996j101572O200K11672q0653N05335q504N09690L84186L1913
5106C1856036K9165o98910Q32482K9217p33149j70940r0810j20798o4888N01865
5096C1369270m03171m62090L09153M16890J70939L51074L73594J43249J45789
$$ plain form
5087 32414697 32817962 32954236 32935651 33650838 34290117 33429814 33525297 33930012 33198882 33091148
5077 33091148 33283656 34801509 35493486 35107885 34850464 34968645 35143137 35135461 35647784 36113094
5067 36113094 37279889 37712405 38366870 39145772 39982111 40479787 40619682 40836176 41609765
5058 41609765 43014069 43541159 44095268 44988996 46515961 47367662 48278690 49967308 51604094
5049 51604094 51567098 53639192 55347555 55546286 57277240 59035939 59631683 60889265 62415902
5040 62415902 63576180 63641114 64062298 66021713 66172415 66223919 67013550 68308965 69658562
5031 69658562 70397224 71088667 72546299 73068250 73424968 73994880 74793606 75271770 76366971
5022 76366971 77042230 76832994 77712377 78346307 78982848 79457587 80262063 80436034 80163077
$$ packed form
5087C2414697M03265J36274j8585P15187O39279q60303R5483M04715p31130j07734
5077C3091148J92508J517853O91977l85601k57421J18181J74492p676N12323M65310
5067C6113094J166795M32516O54465P78902Q36339M97676J39895K16494P73589
5058D1609765J404304N27090N54109Q93728J526965Q51701R11028J688618J636786
5049E1604094l6996K072094J708363J98731J730954J758699N95744J257582J526637
5040F2415902J160278O4934M21184J959415J50702N1504P89631J295415J349597
5031F9658562P38662O91443J457632N21951L56718N69912P98726M78164J095201
5022G6366971O75259k09236Q79383O33930O36541M74739Q04476J73971k72957
$$ plain form
5013 80163077 80812839 80296779 80533588 80484603 79855305 79383355 78106462 78333281 77076667
5004 77076667 75705674 74303534 73258515 73275770 72606832 71068102 70442448 69429742 69301305
4995 69301305 68619453 67408897 66810268 66216883 66420137 65888819 65244196 63817728 63005608
4986 63005608 62563496 61767406 60897177 60781690 60429070 59347872 58338504 57306580 57121504
4977 57121504 56502394 55036023 54076341 52784236 52052180 51542253 51249614 49802324 49048571
4968 49048571 48554381 47910690 48055026 46809931 45708694 45248060 45489218 44653582 43789331
4959 43789331 42957257 43146237 43573862 43001200 42453049 42185579 41517182 41803677 42197538
4950 42197538 41580241 41705860 41277749 41370183 42049216 41772780 41253329 41972609 41838719 41354070
$$ packed form
5013H0163077O49762n16060K36809m8985o29298m71950j276893K26819j256614
5004G7076667j370993j402140j045019J7255o68938j538730o25654j012706j28437
4995F9301305o81852j210556n98629n93385K03254n31318o44623j426468q12120
4986F3005608m42112p96090q70229j15487l52620j081198j009368j031924j85076
4977E7121504o19110j466371r59682j292105p32056n09927k92639j447290p53753
4968D9048571m94190o43691J44336j245095j101237m60634K41158q35636q64251
4959D3789331q32074J88980M27625n72662n48151k67470o68397K86495L93861
4950D2197538o17297J25619m28111R2434O79033k76436n19451P19280j33890m84649
$$ plain form
4940 41354070 42094639 42282830 41817489 41817301 41150673 41390564 40767558 41301307 41298940 41886710
4930 41886710 42090675 41531435 41450883 41026671 41282895 41463138 41338676 41640216 41198790 41430765
4920 41430765 42721232 42777427 41663826 41254422 41468908 42102005 42596698 41811851 41931026
4911 41931026 41987659 42728872 42900791 41930551 42021382 41842639 41747828 41997767 42202021 42288885
4901 42288885 41285007 42332666 42982496 42444838 42653197 42521818 43009112 42762788 42503757
4892 42503757 42860139 42735065 43324951 43701305 43460875 43871608 43585896 42600540 42387712
4883 42387712 42592083 43383651 43663872 43986821 43297701 43077329 43764798 44463627 43448184
4874 43448184 43753738 43887562 43643185 44050192 43305085 43423238 44317632 44864987 44032551
$$ packed form
4940D1354070P40569J88191m65341j88o66628K39891o23006N33749k367N87770
4930D1886710K03965n59240q0552m24212K56224J80243j24462L01540m41426K31975
4920D1430765J290467N6195j113601m09404K14486O33097M94693p84847J19175
4911D1931026N6633P41213J71919r70240R0831j78743r4811K49939K04254Q6864
4901D2288885j003878J047659O49830n37658K08359j31379M87294k46324k59031
4892D2503757L56382j25074N89886L76354k40430M10733k85712r85356k12828
4883D2387712K04371P91568K80221L22949o89120k20372O87469O98829j015443
4874D3448184L05554J33824k44377M07007p45107J18153Q94394N47355q32436
$$ plain form
4865 44032551 43779793 43756650 43537667 43531312 42996331 43911525 43474103 43581515 43380287 43355300
4855 43355300 43604212 44013877 43945442 44217691 45068514 45554105 45350028 45637708 44958155 44116456
4845 44116456 44534381 45171232 45722743 45974996 46206596 46031931 46466883 46439405 47145972 47511708
4835 47511708 46761720 47011734 47715633 46782603 47867132 48338554 48569832 48786126 49011248
4826 49011248 49233945 49439658 49308385 49775806 49924282 50771770 51494505 50936984 51566438
4817 51566438 52774775 52645349 52751269 52827260 53692421 54582689 54444505 55605933 56059263
4808 56059263 55995176 57208632 57827264 58241737 59052909 59960698 60904397 61269471 61600286
4799 61600286 62603496 64290314 66001168 66562471 67957062 69522880 70592033 71524538
$$ packed form
4865D4032551k52758k3143k18983o355n34981R15194m37422J07412k01228k4987
4855D3355300K48912M09665o8435K72249Q50823M85591k04077K87680o79553q41699
4845D4116456M17925O36851N51511K52253K31600j74665M34952k7478P06567L65736
4835D7511708p49988K50014P03899r33030J084529M71422K31278K16294K25122
4826D9011248K22697K05713j31273M67421J48476Q47488P22735n57521O29454
4817E1566438J208337j29426J05920P5991Q65161Q90268j38184J161428M53330
4808E6059263o4087J213456O18632M14473Q11172R07789R43699L65074L30815
4799F1600286J003210J686818J710854N61303J394591J565818J069153R32505
$$ plain form
4791 71524538 73938621 76524806 78855046 81239079 84022169 87880706 90110731 93754351
4783 93754351 98402001 102466438 106640192 112263361 117137615 122025910 127768128 133711640
4775 133711640 140262393 146099212 152142395 157250086 162363894 167059889 169458020 171234951
4767 171234951 172546252 173041023 173442968 172541518 171703701 170610359 170200819 169985715 168881714
4758 168881714 169281940 169534271 169513841 169320215 169143845 169146464 168965455 168303032 168182515 166718400
4748 166718400 164120074 160947275 156929070 150564933 144999113 139018966 132131909 126397294
4740 126397294 120535260 114457514 108952610 103948610 99226831 95386581 90995990 86485079
4732 86485079 81690959 78288995 74856991 71731063 68664917 65586797 63423081 61312308
$$ packed form
4791G1524538K414083K586185K330240K384033K783090L858537K230025L643620
4783I3754351M647650M064437M173754N623169M874254M888295N742218N943512
4775A33711640O550753N836819O043183N107691N113808M695995K398131J776931
4767A71234951J311301M94771M01945r01450q37817j093342m09540k15104j104001
4758A68881714M00226K52331k0430j93626j76370K619j81009o62423j20517j464115
4748A66718400k598326l172799m018205o364137n565820n980147o887057n734615
4740A26397294n862034o077746n504904n004000m721779l840250m390591m510911
4732H6485079m794120l401964l432004l125928l066146l078120k163716k110773
$$ plain form
4724 61312308 59651851 57577676 56379011 54688589 52847783 50719416 49566686 48463874
4716 48463874 46963083 46077566 45092048 44299442 43682776 42311274 41525233 40092804 39439615
4707 39439615 38986023 38741235 37874302 35969203 35403625 34377846 33985476 33324172 33113692
4698 33113692 32213939 32049641 31597192 30014950 30053228 29921852 30058669 29098880 27616119
4689 27616119 27591835 27306529 27474565 26053167 26389380 26010000 25581028 24664721 24455220
4680 24455220 24779929 24185625 24319569 23732463 22955543 22645070 22318906 22227339 21537922 21368368
4670 21368368 21874742 21250174 20194692 20820308 20376815 19299990 20015861 20002521 18958455
4661 18958455 18285749 18069819 16912851 17268526 17483064 17842312 17420446 17697661 16671772
$$ packed form
4724F1312308j660457k074175j198665j690422j840806k128367j152730j102812
4716D8463874j500791q85517r85518p92606o16666j371502p86041j432429o53189
4707C9439615m53592k44788q66933j905099n65578j025779l92370o61304k10480
4698C3113692q99753j64298m52449j582242L8278j31376J36817r59789j482761
4689B7616119k4284k85306J68036j421398L36213l79380m28972r16307k09501
4680B4455220L24709n94304J33944n87106p76920l10473l26164r1567o89417j69554
4670B1368368N06374o24568j055482O25616m43493j076825P15871j3340j044066
4661A8958455o72706k15930j156968L55675K14538L59248m21866K77215j025889
$$ plain form
4652 16671772 15981156 16563802 15919453 15041798 15480465 14755003 14629542 15003448 14357688
4643 14357688 15473793 15190594 14417112 14781873 13619458 12950224 13683907 13990570 13439118
4634 13439118 13094436 12695599 12896992 13197611 12553528 11982152 12693193 13010822 12965114 13522299
4624 13522299 12753575 13042299 12640224 12515963 11654585 10642046 11546199 11636707 11576509 11233266
4614 11233266 11119619 10191978 9908084 10447840 10536948 10297929 10659399 9963400 8772313
4605 8772313 8668583 8916056 9593819 9337794 10228424 10043817 9311790 9347083 10161412 10498778
4595 10498778 9668248 8986753 8896253 8503500 9317480 9692472 9692821 9278424 9525721 9933965
4585 9933965 9309704 8394815 8373389 9409121 9561580 9504227 9397066 9656969 9616708 10021849
$$ packed form
4652A6671772o90616N82646o44349q77655M38667p25462j25461L73906o45760
4643A4357688J116105k83199p73482L64761j162415o69234P33683L06663n51452
4634A3439118l44682l98837K01393L00619o44083n71376P11041L17629m5708N57185
4624A3522299p68724K88724m02075j24261q61378j012539R04153R0508o0198l43243
4614A1233266j13647r27641k83894N39756Q9108k39019L61470o95999j191087
4605H772313j03730K47473O77763k56025Q90630j84607p32027L5293Q14329L37366
4595A0498778q30530o81495r0500l92753Q13980L74992L49m14397K47297M08244
4585I933965o24261r14889k1426J035732J52459n7353j07161K59903m0261M05141
$$ plain form
4575 10021849 9889965 9175951 8818358 8948940 8478666 8521874 8653746 9325063 8921791 8901177
4565 8901177 8497865 9330003 9496360 8646611 8617468 7880063 8521831 8509963 7741282 7515468
4555 7515468 7326112 8109351 8546044 7905790 7433733 7260449 7562557 7619911 7505051 8072500
4545 8072500 8362424 8126420 7995600 7083618 6763252 7604691 8197816 7506996 7605609 6845981
4535 6845981 7243735 7909763 7733680 7249476 7607534 8199571 8420923 7687078 7625253 7137594
4525 7137594 7514132 7424091 7757909 8568141 8330595 7691750 6840981 7373606 7561001 7877351
4515 7877351 8078379 7873683 7835029 8045058 7479598 6926655 7170524 7202378 7165719 7429139
4505 7429139 6799148 6616501 7784421 8386379 8470431 9219100 9101087 9193445 9039553 8629904
$$ packed form
4575A0021849j31884p14014l57593J30582m70274M3208J31872O71317m03272k0614
4565H901177m03312Q32138J66357q49749k9143p37405O41768j1868p68681k25814
4555G515468j89356P83239M36693o40254m72057j73284L02108N7354j14860N67449
4545H072500K89924k36004j30820r11982l20366Q41439N93125o90820R8613p59628
4535F845981L97754O66028j76083m84204L58058N92037K21352p33845o1825m87659
4525G137594L76538r0041L33818Q10232k37546o38845q50769N32625J87395L16350
4515G877351K01028k04696l8654K10029n65460n52943K43869L1854l6659K63420
4505G429139o29991j82647J167920O01958Q4052P48669j18013R2358j53892m09649
$$ plain form
4495 8629904 8427201 8704630 9141446 9497225 9129357 8861851 8353108 8031348 8006253 7643454
4485 7643454 7738418 8073613 7676737 7369989 8006018 7945435 7538975 7681161 8834807 8386537
4475 8386537 8385801 8381486 8335623 9061345 8810255 8295139 8469095 9527034 9467239 9166078 8958508
4464 8958508 9632582 10243997 9444607 9165092 9456377 9496282 10593716 10708083 10970552 11008464
4454 11008464 10677903 10564835 11402051 10913028 11148146 12890891 13065869 12658484 13488648
4445 13488648 13495836 12882867 13801130 14725730 14635981 14662660 14974771 14357852 14609891 16418190
4435 16418190 17094621 16421564 16408071 16712702 18023764 17935745 18127837 18296744 17644853 18214443
4425 18214443 18509867 19413101 19549712 20015071 20243425 20612167 21209730 21289282 21740029 22364884
$$ packed form
4495H629904k02703K77429M36816L55779l67868k67506n08743l21760k5095l62799
4485G643454R4964L35195l96876l06748O36029o0583m06460J42186J153646m48270
4475H386537p36m315m5863P25722k51090n15116J73956J057939n9795l01161k07570
4464H958508O74074O11415p99390k79515K91285L9905J097434J14367K62469L7912
4454A1008464l30561j13068Q37216m89023K35118J742745J74978m07385Q30164
4445A3488648P188o12969R18263R24600q9749K6679L12111o16919K52039J808299
4435A6418190O76431o73057j3493L04631J311062q8019J92092J68907o51891N69590
4425A8214443K95424R03234J36611M65359K28354L68742N97563P9552M50747O24855
$$ plain form
4415 22364884 21576366 22236525 23924361 23898260 24420561 24845376 26555109 26954586 27561349
4406 27561349 29125929 29939655 30490016 30881856 31902520 34421728 35461664 36295039 37495207
4397 37495207 39487289 42552431 44147998 46136076 48876645 52187701 55063392 58926213
4389 58926213 63792187 69053623 74577703 81278173 87925986 95556775 104411006 113682811
4381 113682811 124138869 132536538 138689315 145683693 153195054 161087427 170646430 182711309
4373 182711309 194929043 203593493 208716866 210587253 211839333 214199867 218235702 224428438
4365 224428438 231712356 236477388 235782156 230110424 221162322 209164284 201231681 196276093
4357 196276093 192391496 189156843 184172724 175269437 164434766 152216225 139684475 130591610
$$ packed form
4415B2364884p88518O60159J687836k6101N22301M24815J709733L99477O06763
4406B7561349J564580Q13726N50361L91840J020664K519208J039936Q33375J200168
4397C7495207J992082L065142J595567J988078K740569L311056K875691L862821
4389E8926213M865974N261436N524080O700470O647813P630789Q854231R271805
4381A13682811J0456058Q397669O152777O994378P511361P892373R559003J2064879
4373A82711309J2217734Q664450N123373J870387J252080K360534M035835O192736
4365B24428438P283918M765032o95232n671732q948102j1998038p932603m955588
4357A96276093l884597l234653m984119q903287j0834671j2218541j2531750r092865
$$ plain form
4349 130591610 122843702 116793268 110248294 102315866 95479137 86750464 77929927 70360879
4341 70360879 63790930 58229887 53892521 50673740 46960416 44328035 42244524 40841082
4333 40841082 38919615 36157539 33911547 32644575 31802685 30280815 28907395 27855621
4325 27855621 27525280 26270126 25252409 24733915 24308895 24411905 23383945 22446972 21442305
4316 21442305 20855523 20578710 19897377 18878893 18876943 17952097 17770599 16874133 16787738 16615151
4306 16615151 16860163 16804240 15531176 14359774 14704705 15323441 14958886 15170360 14602418
4297 14602418 14665728 14706023 15045866 14517047 14197001 13961803 13664171 13224607 13015915 12729551
4287 12729551 12323250 12912940 12947518 12741960 12794611 12443985 12693465 11606564 11513350 11329864
$$ packed form
4349A30591610p747908o050434o544974p932428o836729q728673q820537p569048
4341G0360879o569949n561043m337366l218781l713324k632381k083511j403442
4333D0841082j921467k762076k245992j266972q41890j521870j373420j051774
4325B7855621l30341j255154j017717n18494m25020J03010j027960r36973j004667
4316B1442305n86782k76813o81333j018484j950r24846j81498q96466q6395j72587
4306A6615151K45012n5923j273064j171402L44931O18736l64555K11474n67942
4297A4602418O3310M0295L39843n28819l20046k35198k97632m39564k08692k86364
4287A2729551m06301N89690L4578k05558N2651l50626K49480j086901r3214j83486
$$ plain form
4277 11329864 11121056 11497526 11470509 11940680 11639336 10924860 11229249 11608260 11097153 10481050
4267 10481050 10613162 10395717 10921950 11166307 10411048 10059176 10117940 9961295 10266077 9634912
4257 9634912 9520031 10089427 9820823 10209753 9689177 9630826 9457438 8937188 8936736 8465168
4247 8465168 8400508 9465757 9719682 10351736 10111326 9989529 9833098 9498076 9180244 9628645
4237 9628645 9036610 9345788 9342977 9468770 9485752 9852612 10131053 10381418 11190402 11617612
4227 11617612 11450972 11514156 12313814 13433691 13051011 12491955 12024856 11464782 11707376
4218 11707376 10565011 10407101 10102100 9671050 8558081 8512248 9095161 8757221 7831100
4209 7831100 8073266 7922377 8184339 9279177 8965126 8973969 8821251 8530091 8684002 8631742
$$ packed form
4277A1329864k08808L76470k7017M70171l01344p14476L04389L79011n11107o16103
4267A0481050J32112k17445N26233K44357p55259l51872N8764j56645L04782o31165
4257I634912j14881N69396k68604L88930n20576n8351j73388n20250m52m71568
4247H465168o4660J065249K53925O32054k40410j21797j56431l35022l17832M48401
4237I628645n92035L09178k811J25793J6982L66860K78441K50365Q08984M27210
4227A1617612j66640O3184P99658J119877l82680n59056m67099n60074K42594
4218A1707376j142365j57910l05001m31050j112969m5833N82913l37940r26121
4209G831100K42166j50889K61962J094838l14051Q843j52718k91160J53911n2260
$$ plain form
4199 8631742 8567565 8650846 8528816 8681585 8116986 8432806 8704223 9337028 9294018 7603291
4189 7603291 7424956 7777505 8093585 8265195 8391831 8402636 8957043 8037741 8135870 7981932
4179 7981932 7457907 7414085 7561071 8584051 9013190 9018291 7617476 6960885 7089305 7597433
4169 7597433 8175917 8372764 8658841 8221107 8377197 8688686 8868400 9152803 8997185 9257083
4159 9257083 9349834 9341014 9623049 9706707 9921322 9790514 8774410 8931923 8945000 8805480
4149 8805480 9304619 9816891 10046806 10560453 10285496 10516771 11340213 11759168 10873273 11355671
4139 11355671 11822974 11623203 11844888 11988527 12083617 12180421 12242289 12250607 13008081 13006711 13202282
4128 13202282 12609425 13395079 13703446 13558638 13788732 13444588 13462175 14197305 14015221 14593716
$$ packed form
4199H631742o4177Q3281j22030J52769n64599L15820K71417O32805m3010j690727
4189G603291j78335L52549L16080J71610J26636J0805N54407r19302R8129j53938
4179G981932n24025m3822J46986J022980M29139N101j400815o56591J28420N08128
4169G597433N78484J96847K86077m37734J56090L11489J79714K84403j55618K59898
4159I257083R2751q820K82035Q3658K14615j30808j016104J57513J3077j39520
4149H805480M99139N12272K29915N13647k74957K31275Q23442M18955q85895M82398
4139A1355671M67303j99771K21685J43639R5090R6804O1868Q318P57474j370J95571
4128A3202282n92857P85654L08367j44808K30094l44144J7587P35130j82084N78495
$$ plain form
4118 14593716 14657937 14724623 15087863 14397591 14075172 14639997 15176259 14520446 14087239 14916563
4108 14916563 14518669 14436771 15365158 16381812 16927141 17015501 16680321 16811719 17407951 17682605
4098 17682605 17430798 18358191 19310628 19084448 18776976 18614138 19161368 20556459 20319403
4089 20319403 19781449 20428256 20883600 20136507 20379629 21460679 21513342 22060989 22766609
4080 22766609 23052698 23158921 23770090 24190765 24806241 24841971 25644381 27076586 28113088
4071 28113088 28460428 28931993 29960462 30096660 30998032 32288287 32766952 32567892 32315593
4062 32315593 33646272 35232155 36179289 37961271 38647791 39355413 41009529 42098351 42479674
4053 42479674 43119097 44038416 44664475 45077368 46325008 47801489 49340586 50158855 50492437
$$ packed form
4118A4593716O4221O6686L63240o90272l22419N64825N36262o55813m33207Q29324
4108A4916563l97894q1898R28387J016654N45329Q8360l35180J31398N96232K74654
4098A7682605k51807R27393R52437k26180l07472j62838N47230J395091k37056
4089B0319403n37954O46807M55344p47093K43122J081050N2663N47647P05620
4080B2766609K86089J06223O11169M20675O15476L5730Q02410J432205J036502
4071B8113088L47340M71565J028469J36198R01372J290255M78665j99060k52299
4062C2315593J330679J585883R47134J781982O86520P07622J654116J088822L81323
4053D2479674O39423R19319O26059M12893J247640J476481J539097Q18269L33582
$$ plain form
4044 50492437 51774370 54303781 56224130 57104095 58496214 59942253 61393330 63029612
4036 63029612 64524747 66972760 69118089 70674377 72216378 74914754 77270088 79630060
4028 79630060 83215811 85958741 89162517 92176820 95637359 99247485 102459005 106388753
4020 106388753 110517227 113655927 117870953 121919446 126492810 130757207 135444552 139838349
4012 139838349 144835001 149287119 153746039 158928448 165263996 171407656 175921052 180611706
4004 180611706 186607906 191912144 197713560 203836530 209775273 215454419 222737338 230399082
3996 230399082 238730135 246304025 255032910 264817356 276358573 287725434 300171365 313025879
3988 313025879 329187676 348700018 373583742 403121072 439140121 441876842 417545396
$$ packed form
4044E0492437J281933K529411J920349Q79965J392119J446039J451077J636282
4036F3029612J495135K448013K145329J556288J542001K698376K355334K359972
4028G9630060L585751K742930L203776L014303L460539L610126L211520L929748
4020A06388753M128474L138700M215026M048493M573364M264397M687345M393797
4012A39838349M996652M452118M458920N182409O335548O143660M513396M690654
4004A80611706N996200N304238N801416O122970N938743N679146P282919P661744
3996B30399082Q331053P573890Q728885R784446J1541217J1366861J2445931J2854514
3988C13025879J6161797J9512342K4883724K9537330L6019049K736721k4331446
$$ plain form
3981 417545396 389183860 348673076 313042045 288668115 272916214 259902820 249163700
3974 249163700 240243103 233364367 226089459 221458805 216000208 210627844 204179727 199617742
3966 199617742 192890229 187214977 182575453 177176700 172348780 167972950 163443439 158838838
3958 158838838 154321463 150984455 146506590 142482152 138140549 133929422 129161878 124586511
3950 124586511 120596137 116834709 113304935 109568879 105209781 102140475 99073237 95633391
3942 95633391 92119982 89522458 87123177 84553760 80914360 78451086 76585065 74673002
3934 74673002 72961280 70899702 69179482 67624809 66332302 65691627 64743418 63035991
3926 63035991 62247672 62336328 61300351 60166041 58737482 58622825 59248694 59554720 58656999
$$ packed form
3981D17545396k8361536m0510784l5631031k4373930j5751901j3013394j0739120
3974B49163700q920597o878736p274908m630654n458597n372364o448117m561985
3966A99617742o727513n675252m639524n398753m827920m375830m529511m604601
3958A58838838m517375l337008m477865m024438m341603m211127m767544m575367
3950A24586511l990374l761428l529774l736056m359098l069306l067238l439846
3942I5633391l513409k597524k399281k569417l639400k463274j866021j912063
3934G4673002j711722k061578j720220j554673j292507o40675r48209j707427
3926F3035991p88319Q8656j035977j134310j428559j14657O25869L06026q97721
$$ plain form
3917 58656999 58352117 57776561 57351214 57401409 58108717 58044341 58930244 58811370 58488904 59325185
3907 59325185 60470278 60959087 61008033 60615299 60625461 61434677 61436851 62610909 62928025 63191417
3897 63191417 64155880 64497822 65514051 66872154 67234271 68625506 68894760 69486045 70806170
3888 70806170 72124347 73654654 75527058 76468209 79377147 81120808 83024216 84251283
3880 84251283 86748955 89376775 92222511 94313622 97079512 100201612 103920155 108084787
3872 108084787 111028799 114330318 118592775 123650098 128624038 133289974 138502829 144882390
3864 144882390 151918632 158995239 165438229 173333357 181565645 189895805 198103768 206357014
3856 206357014 215214254 223429841 231651561 240039906 247322538 254849882 261083228 266035948
$$ packed form
3917E8656999l04882n75556m25347N0195P07308o4376Q85903j18874l22466Q36281
3907E9325185J145093M88809M8946l92734J0162Q09216K174J174058L17116K63392
3897F3191417R64463L41942J016229J358103L62117J391235K69254N91285J320125
3888G0806170J318177J530307J872404R41151K908938J743661J903408J227067
3880H4251283K497672K627820K845736K091111K765890L122100L718543M164632
3872A08084787K944012L301519M262457N057323M973940M665936N212855O379561
3864A44882390P036242P076607O442990P895128Q232288Q330160Q207963Q253246
3856B06357014Q857240Q215587Q221720Q388345P282632P527344O233346M952720
$$ plain form
3848 266035948 270031258 273517467 275320526 275619535 276079920 275813809 274344478 271993889
3840 271993889 268849302 264653644 260069264 254702946 249206799 242745262 235998603 228638581
3832 228638581 221508075 213334923 204711904 196088899 187532804 177985558 169589506 162514459
3824 162514459 155179707 147896455 141433474 134505148 128708132 123414953 117593977 112701320
3816 112701320 108719053 103703050 100292954 97338009 93380039 90309946 88205612 85725343
3808 85725343 83476842 81142762 79185583 77908753 76603920 74556442 72909377 70551732
3800 70551732 69385550 68955015 67549152 67013270 65710913 64743327 64342921 63935437 63170332
3791 63170332 62996921 62047416 61902451 60967828 60077539 59751310 58342756 58176829 57894033
$$ packed form
3848B66035948L995310L486209J803059K99009M60385k66111j469331k350589
3840B71993889l144587m195658m584380n366318n496147o461537o746659p360022
3832B28638581p130506q173152q623019q623005q556095r547246q396052p075047
3824A62514459p334752p283252o462981o928326n797016n293179n820976m892657
3816A12701320l982267n016003l410096k954945l957970l070093k104334k480269
3808H5725343k248501k334080j957179j276830j304833k047478j647065k357645
3800G0551732j166182m30535j405863n35882j302357r67586m00406m07484p65105
3791F3170332j73411r49505j44965r34623q90289l26229j408554j65927k82796
$$ plain form
3782 57894033 58212388 58155769 57867473 57892292 57011242 57499757 57313575 57596646 57016514 56044936
3772 56044936 56591358 57609665 58067512 58099751 58709101 59004052 59248510 60169339 60342263
3763 60342263 60684650 60926387 61803187 62849505 63437372 64257064 64845130 66338124 68511940
3754 68511940 70097883 71839447 73832443 76210255 78802809 81248019 84802170 88138465
3746 88138465 91060630 95280074 99643329 105116281 110933469 117576741 124319106 132037060
3738 132037060 141328556 152219468 162553891 174371701 185791841 198119607 211918459
3731 211918459 225653544 238990236 252111075 262882388 271666805 277823545 281902681
3724 281902681 284812521 286210591 284604890 283271446 281172497 278482958 275359539 273018906
$$ packed form
3782E7894033L18355n6619k88296K4819q81050M88515j86182K83071n80132r71578
3772E6044936N46422J018307M57847L2239O09350K94951K44458R20829J72924
3763F0342263L42387K41737Q76800J046318N87867Q19692N88066J492994K173816
3754F8511940J585943J741564J992996K377812K592554K445210L554151L336295
3746H8138465K922165M219444M363255N472952N817188O643272O742365P717954
3738A32037060R291496J0890912J0334423J1817810J1420140J2327766J3798852
3731B11918459J3735085J3336692J3120839J0771313Q784417O156740M079136
3724B81902681K909840J398070j605701j333444k098949k689539l123419k340633
$$ plain form
3716 273018906 270929880 266704943 262247647 256444778 248700477 238427218 226505380 214474514
3708 214474514 200990549 187103788 174167483 161696402 150487800 139777182 130055042
3701 130055042 120950929 113903683 107168904 102168486 96284955 91018973 87322346 83778768
3693 83778768 79599477 75567861 73175890 70649058 68258653 66873475 64399943 62822242
3685 62822242 61646538 60575630 59367021 57410344 56432372 55909099 55423033 54859705 54122766
3676 54122766 53052499 52997469 53377467 52503610 51779939 51016868 50764233 50908328 51375041
3667 51375041 50924936 51071153 50679414 49787228 50089077 50564017 49652566 50132849 51483633
3658 51483633 51629035 52186193 52286637 53408198 53723694 54787216 55162883 55246294 56424090
$$ packed form
3716B73018906k089026m224937m457296n802869p744301j0273259j1921838j2030866
3708B14474514j3483965j3886761j2936305j2471081j1208602j0710618r722140
3701A30055042r104113p047246o734779n000418n883531n265982l696627l543578
3693H3778768m179291m031616k391971k526832k390405j385178k473532j577701
3685F2822242j175704j070908j208609j956677r77972n23273m86066n63328p36939
3676E4122766j070267n5030L79998q73857p23671p63071k52635J44095M66713
3667E1375041m50105J46217l91739q92186L01849M74940r11451M80283J350784
3658E1483633J45402N57158J00444J121561L15496J063522L75667Q3411J177796
$$ plain form
3649 56424090 58289869 60201796 60956361 62064286 63383868 65485629 66810181 67955919
3641 67955919 69667566 71877534 73559765 75611095 77400542 79325662 80643230 82372781
3633 82372781 84369106 86412135 87223828 88481407 89918230 91996497 93017794 93786142
3625 93786142 94681846 96680727 97888691 97989115 98783201 98163333 97924846 97809998 98120646
3616 98120646 98489915 99056629 98651252 98411641 98517414 98637614 98367660 97687879 98134038
3607 98134038 98047668 98929456 99737960 100397693 100984939 101651076 102566237 103383370 105590599
3598 105590599 107289771 108979037 111454375 114366523 117529431 120749201 126285444 130936422
3590 130936422 135867968 141572567 146482690 152460319 158708619 165329885 171724825 178640971
$$ packed form
3649E6424090J865779J911927P54565J107925J319582K101761J324552J145738
3641F7955919J711647K209968J682231K051330J789447J925120J317568J729551
3633H2372781J996325K043029Q11693J257579J436823K078267J021297P68348
3625I3786142Q95704J998881J207964J00424P94086o19868k38487j14848L10648
3616I8120646L69269N66714m05377k39611J05773J20200k69954o79781M46159
3607I8134038q6370Q81788Q08504O59733N87246O66137R15161Q17133K207229
3598A05590599J699172J689266K475338K912148L162908L219770N536243M650978
3590A30936422M931546N704599M910123N977629O248300O621266O394940O916146
$$ plain form
3582 178640971 185732787 192393835 199339695 205768308 212741306 220024708 226275849 232421106
3574 232421106 237830787 243984068 248762499 254207387 259772855 264686513 268223132 271426300
3566 271426300 274013253 275122933 276606848 277824264 278131666 278173319 278096530 277895924 277800099
3557 277800099 277836644 277111675 276273913 275478687 276131775 275056949 273684760 274093274 273076989
3548 273076989 272719156 273366962 273191166 273040992 271345592 270932075 271537490 270776490 269967624
3539 269967624 270399170 269427752 268809397 267514073 267077280 265016498 263310062 261156286 258362292
3530 258362292 255566570 251279109 247046094 241705064 236730878 231693626 225842472 219935226
3522 219935226 213227241 206648089 200437594 193726943 187614203 181204361 173866565 167444690
$$ packed form
3582A78640971P091816O661048O945860O428613O972998P283402O251141O145257
3574B32421106N409681O153281M778431N444888N565468M913658L536619L203168
3566B71426300K586953J109680J483915J217416L07402M1653p6789k00606r5825
3557B77800099L6545p24969q37762p95226O53088j074826j372189M08514j016285
3548B73076989l57833O47806j75796j50174j695400m13517O05415p61000q08866
3539B69967624M31546r71418o18355j295324m36793k060782j706436k153776k793994
3530B58362292k795722m287461m233015n341030m974186n037252n851154n907246
3522B19935226o707985o579152o210495o710651o112740o409842p337796o421875
$$ plain form
3514 167444690 161293340 154724171 148486123 142438916 137534284 132216227 127313329 121729689
3506 121729689 116676747 111700508 108067561 104457293 101106578 98981722 96540941 94613925
3498 94613925 93143368 92468557 91495480 89925464 89519525 88626879 88245128 87632832 87393266
3489 87393266 87479847 87647112 88162065 87000485 86834104 87166723 86128864 85648583 85077744
3480 85077744 85093565 85153885 84948207 83611792 83108763 82592998 80960350 79879819 78310662
3471 78310662 76909215 75980927 73547353 71068965 69319532 67804367 66211458 63966686
3463 63966686 61969250 59849995 58747566 56558576 54262253 52517840 49980005 48590840
3455 48590840 46551418 45399280 43913377 41907085 40484811 38944607 37553412 37246128
$$ packed form
3514A67444690o151350o569169o238048o047207m904632n318057m902898n583640
3506A21729689n052942m976239l632947l610268l350715k124856k440781j927016
3498I4613925j470557o74811r73077j570016m05939q92646l81751o12296k39566
3489H7393266Q6581J67265N14953j161580j66381L32619j037859m80281n70839
3480H5077744J5821O0320k05678j336415n03029n15765j632648j080531j569157
3471G8310662j401447r28288k433574k478388j749433j515165j592909k244772
3463F3966686j997436k119255j102429k188990k296323j744413k537835j389165
3455D8590840k039422j152138j485903k006292j422274j540204j391195l07284
$$ plain form
3447 37246128 35537334 34079542 33420437 32739887 31593037 31120727 29836480 29048902 27488423
3438 27488423 27157997 26319941 26071017 25550389 24850395 23685363 23863403 24026866 23367315
3429 23367315 23586723 23450300 23086108 22381153 21724805 20766931 20401414 19604601 19501370
3420 19501370 19147393 19964125 19616521 18735353 18137563 18259972 17657740 17585032 16689587 16080886
3410 16080886 16014792 15762491 15095910 14260441 14631626 15826794 15929074 15657430 14452951
3401 14452951 13718766 13894718 13928682 13263181 13309517 12844293 12370604 13291070 13381451 12172264
3391 12172264 12836161 12059582 11939753 12520641 10802829 10200414 10959820 11348773 11876350
3382 11876350 11610669 10935635 9690910 9861250 9631152 10383184 9922858 8807353 9201148
$$ packed form
3447C7246128j708794j457792o59105o80550j146850m72310j284247p87578j560479
3438B7488423l30426q38056k48924n20628o99994j165032J78040J63463o59551
3429B3367315K19408j36423l64192p04955o56348r57874l65517p96813j03231
3420A9501370l53977Q16732l47604q81168n97790J22409o02232p2708q95445o08701
3410A6080886o6094k52301o66581q35469L71185J195168J02280k71644j204479
3401A4452951p34185J75952L3964o65501M6336m65224m73689R20466R0381j209187
3391A2172264O63897p76579j19829N80888j717812o02415P59406L88953N27577
3382A1876350k65681o75034j244725J70340k30098P52032m60326j115505L93795
$$ plain form
3373 9201148 9446527 10374723 10092039 9631211 8785126 9017323 9187896 9267288 9048835 8965071
3363 8965071 9133505 9779352 9876597 8352091 9170638 8718692 8628317 9039920 8753921 8339729
3353 8339729 7865632 8400386 8281114 8373891 9289095 9691357 8624678 8626155 8672442 8436795
3343 8436795 8055314 8149294 8636899 8370637 8016137 7500295 8003557 8023103 7414031 6956944
3333 6956944 6676231 7715903 7878246 8523743 8052119 7793590 7425627 7815507 7895711 7535730
3323 7535730 7287366 7409549 6991877 6980794 6873500 6956043 6520975 6645878 6696417 6753103
3313 6753103 7645073 7686592 7786259 7187297 7129937 6556904 6342873 6695815 7229636 7469796
3303 7469796 7209784 7543827 7600518 6741554 6894875 7055174 7495535 7662697 7561039 7477908
$$ packed form
3373I201148K45379R28196k82684m60828q46085K32197J70573P9392k18453q3764
3363H965071J68434O45847R7245j524506Q18547m51946r0375M11603k85999m14192
3353H339729m74097N34754j19272R2777R15204M02262j066679J477M6287k35647
3343H436795l81481R3980M87605k66262l54500n15842N03262J9546o09072m57087
3333F956944k80713J039672J62343O45497m71624k58529l67963L89880Q0204l59981
3323G535730k48364J22183m17672j1083j07294Q2543m35068J24903N0539N6686
3313F753103Q91970M1519R9667n98962n7360n73033k14031L52942N33821K40160
3303G469796k60012L34043N6691q58964J53321J60299M40361J67162j01658q3131
$$ plain form
3293 7477908 6902351 7612410 7584777 7992087 7826004 6782300 6321502 6688091 7013698 7339818
3283 7339818 8084377 7894343 7880759 7492333 7854404 7303852 7628573 7662153 8191914 7479038
3273 7479038 7266264 7989612 7872805 8480277 8269063 8780884 8332734 8070087 7916868 7973107
3263 7973107 8245246 8334708 7985405 7758834 7631846 7695409 8308966 8867767 9583709 8852059
3253 8852059 8374715 8904892 9043989 8960847 8501012 8762187 8979543 9092557 9089539 9146827
3243 9146827 9528715 9353561 9114397 8634598 9282592 9040715 8865417 8868678 8520846 8866399
3233 8866399 9443557 10119500 10475669 9914660 9098216 10138855 10040789 10470871 9861557 9678362
3223 9678362 10060683 10342482 10199591 10397588 10842176 11819785 12225133 11889227 12176690 13206208
$$ packed form
3293G477908n75557P10059k7633M07310j66083j043704m60798L66589L25607L26120
3283G339818P44559j90034j3584l88426L62071n50552L24721L3580N29761p12876
3273G479038k12774P23348j16807O07472k11214N11821m48150k62647j53219N6239
3263G973107K72139Q9462l49303k26571j26988O3563O13557N58801P15942p31650
3253H852059m77344N30177J39097q3142m59835K61175K17356J13014l018N7288
3243I146827L81888j75154k39164m79799O47994k41877j75298L261l47832L45553
3233H866399N77158O75943L56169n61009q16444J040639r8066M30082o09314j83195
3223I678362L82321K81799j42891J97997M44588R77609M05348l35906K87463J029518
$$ plain form
3213 13206208 12687266 12604256 12286541 12383692 12284439 12352782 12261822 12188634 12024896 11265561
3203 11265561 11284654 10845229 10047430 10249904 10970867 10429588 11126535 10547857 10176540 9823038
3193 9823038 9264724 9244003 9425581 9258772 9087756 8691406 8955385 9002883 10091594 9586877
3183 9586877 8703070 7412898 8177872 8821384 8373410 8255744 8385948 8085550 8639215
3174 8639215 8346920 8355328 8275004 7877766 7591084 8240388 8816127 8619555 9245488 9222806
3164 9222806 8070352 8174273 8626578 7809735 9111689 9348123 8603649 7500661 7574301
3155 7574301 8718629 8340843 8269088 9204410 9365907 8744157 8468252 7906802 7499595 7768065
3145 7768065 8145372 9280250 9229244 8651842 8924591 9413523 9983573 9558125 9028628 9576892
$$ packed form
3213A3206208n18942q3010l17715R7151r9253O8343r0960p3188j63738p59335
3203A1265561J9093m39425p97799K02474P20963n41279O96947n78678l71317l53502
3193I823038n58314k0721J81578j66809j71016l96350K63979M7498J088711n04717
3183I586877q83807j290172P64974O43512m47974j17666J30204l00398N53665
3174H639215k92295Q408q0324l97238k86682O49304N75739j96572O25933k2682
3164I222806j152454J03921M52305q16843J301954K36434p44474j102988P3640
3155G574301J144328l77786p1755R35322J61497o21750k75905n61450m07207K68470
3145G768065L77307J134878n1006n77402K72749M88932N70050m25448n29497N48264
$$ plain form
3135 9576892 9098280 9375292 9275264 9686639 9577548 9827244 9492352 9419608 9193012 9699800
3125 9699800 9373719 9063532 9359152 8870867 9873116 9943969 10273997 9661582 9384311 9081987
3115 9081987 8414088 8692224 9403656 9081248 9524222 10087866 10049992 9103603 9717847 9807525
3105 9807525 9051398 9223434 9553869 10156793 10391706 10614141 10414121 10652908 10513971 11489447
3095 11489447 12634574 12901968 12693453 12855178 14283922 15316757 16023539 16525942 17820642
3086 17820642 19191103 20838934 22921123 25397932 27866013 29722657 33047327 37302066
3078 37302066 42741968 44203824 41675886 38097096 32638032 27941229 24213005 22511044
3070 22511044 20737708 19714029 18650592 19399175 19484653 19136866 19309131 19731631 19953288
$$ packed form
3135I576892m78612K77012j00028M11375j09091K49696l34892p2744k26596N06788
3125I699800l26081l10187K95620m88285J002249P0853L30028o12415k77271l02324
3115I081987o67899K78136P11432l22408M42974N63644l7874r46389O14244Q9678
3105I807525p56127J72036L30435O02924K34913K22435k00020K38787j38937R75476
3095A1489447J145127K67394k08515J61725J428744J032835P06782N02403J294700
3086A7820642J370461J647831K082189K476809K468081J856644L324670M254739
3078C7302066N439902J461856k527938l578790n459064m696803l728224j701961
3070B2511044j773336j023679j063437P48583Q5478l47787J72265M22500K21657
$$ plain form
3061 19953288 19742201 21118758 22427836 23963669 25043136 27336728 29364886 31985438
3053 31985438 34987373 38312661 41572435 46370064 52282493 59200071 67338485 75935454
3045 75935454 75905495 68968511 59913944 49836989 40360246 34639144 30588786 27245096
3037 27245096 24208334 22769656 22504300 22124528 21168775 20247145 19497406 19603742 19907917
3028 19907917 19517059 19888490 20390487 20580577 20907585 21244625 22776349 24676102 25889433
3019 25889433 27073272 27958871 30809504 35035477 39043618 42415510 41191558 37500900
3011 37500900 33173263 28329241 24329294 21428284 19456594 17846605 17644028 16407953
3003 16407953 16333491 16595195 16385342 15873011 15536683 16050609 16429535 16550014 17676974
$$ packed form
3061A9953288k11087J376557J309078J535833J079467K293592K028158K620552
3053C1985438L001935L325288L259774M797629N912429O917578Q138414Q596969
3045G5935454k9959o936984r054567j0076955r476743n721102m050358l343690
3037B7245096l036762j438678k65356l79772r55753r21630p49739J06336L04175
3028A9907917l90858L71431N01997J90090L27008L37040J531724J899753J213331
3019B5889433J183839Q85599K850633M225973M008141L371892j223952l690658
3011C7500900m327637m844022l999947k901010j971690j609989k02577j236075
3003A6407953p4462K61704k09853n12331l36328N13926L78926J20479J126960
$$ plain form
2994 17676974 18521512 19035146 18724163 18628023 18218580 18184317 16783031 16321859 16095927 16049369
2984 16049369 14572594 13439868 13499585 13559437 13687652 13908188 14310821 14896909 14761131
2975 14761131 14685666 15073170 15734739 16841819 18573275 19093195 20910595 21757246 22467535
2966 22467535 23788752 23661672 24062749 22798592 21389387 19361229 17192228 16425872 14888372
2957 14888372 13896455 13438158 12555126 12588717 12253599 12423720 11757831 11159789 11271721 11201292
2947 11201292 11800417 11961565 12789167 13853239 13707598 14405152 14534755 14380647 14668425
2938 14668425 13815787 13271695 12674346 11640197 11132916 9981059 9902473 9857517 8611269
2929 8611269 8686494 8125109 7389999 7133926 6539586 6585665 6181322 6002841 5947493 5713693
$$ packed form
2994A7676974Q44538N13634l10983r6140m09443l4263j401286m61172k25932m6558
2984A6049369j476775j132726N9717N9852J28215K20536M02633N86088j35778
2975A4761131p5465L87504O61569J107080J731456N19920J817400Q46651P10289
2966B2467535J321217j27080M01077j264157j409205k028158k169001p66356j537500
2957A4888372r91917m58297q83032L3591l35118J70121o65889n98042J11932p0429
2947A1201292N99125J61148Q27602J064072j45641O97554J29603j54108K87778
2938A4668425q52638n44092n97349j034149n07281j151857p8586m4956j246248
2929H611269P5225n61385p35110k56073n94340M6079m04343j78481n5348k33800
$$ plain form
2919 5713693 6251568 4496145 4470219 5513511 5657970 5345342 5217761 4710091 5208833
2910 5208833 5671085 6180404 5435709 4258034 5102568 4834952 4782668 5152079 4863424 3746877
2900 3746877 2912968 3035202 3978439 4786786 4411297 3909938 4368779 4222351 3783030 3796389
2890 3796389 4722266 4480905 4057391 3694862 4013078 4511638 4585280 4233422 4357370 4302286
2880 4302286 4461390 4585581 4234238 3885574 5003594 4906088 4636019 4640064 5207519 4916105
2870 4916105 4280125 3676866 3815875 4454227 5498555 5111721 5216111 4882469 5194357
2861 5194357 4407083 4547620 4432581 4293215 4650821 4471513 4729782 4213791 4088833 4363292
2851 4363292 4288851 4320433 5418222 4101152 3652446 3888909 4004829 3476952 3712259 3760590
$$ packed form
2919E713693N37875j755423k5926J043292J44459l12628j27581n07670M98742
2910E208833M62252N09319p44695j177675Q44534k67616n2284L69411k88655j116547
2900C746877q33909J22234R43237Q08347l75489n01359M58841j46428m39321J3359
2890C796389R25877k41361m23514l62529L18216M98560P3642l51858J23948n5084
2880D302286J59104J24191l51343l48664J118020r7506k70069M045N67455k91414
2870D916105o35980o03259J39009O38352J044328l86834J04390l33642L11888
2861E194357p87274J40537j15039j39366L57606j79308K58269n15991j24958K74459
2851D363292p4441L1582J097789j317070m48706K36463J15920n27877K35307M8331
$$ plain form
2841 3760590 3745489 4341452 4280544 4158560 3938114 4128890 4141927 4699670 4580056 4860837
2831 4860837 4552601 4081335 4488050 3919194 4948446 5006767 4835340 4898966 4004247 3793326
2821 3793326 4310815 4134880 2945321 2959486 3387180 3388053 3546175 3246403 3109954 3228048
2811 3228048 3420789 3033184 2875854 3176443 2977922 3181957 2958686 3042037 2850885 2999286
2801 2999286 3079819 2912990 3436598 3499486 3310121 3262655 3812609 2654705 2060406 2005630
2791 2005630 2063773 2741790 3029946 2323634 2291041 2134804 2805831 2539289 2636902 2366860
2781 2366860 2031341 1374484 1039650 1283307 1465568 1940105 2145746 2318801 2694803 2814737
2771 2814737 3214352 3408535 3667002 2688865 2409594 2374071 2427162 1873314 1428196 1689017
$$ packed form
2841C760590j5101N95963o0908j21984k20446J90776J3037N57743j19614K80781
2831D860837l08236m71266M06715n68856J029252N8321j71427O3626q94719k10921
2821C793326N17489j75935j189559J4165M27694Q73J58122k99772j36449J18094
2811C228048J92741l87605j57330L00589j98521K04035k23271Q3351j91152J48401
2801B999286Q0533j66829N23608O2888j89365m7466N49954j157904n94299n4776
2791B005630N8143O78017K88156p06312l2593j56237O71027k66542R7613k70042
2781B366860l35519o56857l34834K43657J82261M74537K05641J73055L76002J19934
2771B814737L99615J94183K58467r78137k79271l5523N3091n53848m45118K60821
$$ plain form
2761 1689017 1257374 1879317 2196068 2443606 2077751 2132835 2266011 2128265 2504594 1606206
2751 1606206 1213518 731558 1363459 1468381 1189904 1784526 1822979 1304586 1890788 2202753
2741 2202753 1672526 1574528 912633 1994175 1788916 953117 849415 1526153 1326050 1364101
2731 1364101 1483229 1180480 1317312 2131559 2035599 1624465 1691997 2364999 1738847 1303625
2721 1303625 1147804 464705 447497 -368933 738838 641278 166761 605363 673082 777001
2711 777001 901052 601494 592038 658518 306678 921196 43009 -411978 70772 -224079
2701 -224079 -433404 -16042 644217 413908 1250399 1684059 94086 270103 415354 558512
2691 558512 870065 561039 1391385 2123849 1648991 2270647 1694598 807631 1167998 677730
$$ packed form
2761A689017m31643O21943L16751K47538l65855N5084J33176j37746L76329q98388
2751A606206l92688m81960O31901J04922k78477N94622L8453n18393N86202L11965
2741B202753n30227r7998o61895J081542k05259q35799j03702O76738k00103L8051
2731A364101J19128l02749J36832Q14247r5960m11134O7532O73002o26152m35222
2721A303625j55821o83099j7208q16430J107771r7560m74517M38602O7719J03919
2711G77001J24051k99558r456O6480l51840O14518q78187m54987M82750k94851
2701b24079k09325M17362O60259k30309Q36491M33660j589973J76017J45251J43158
2691E58512L11553l09026Q30346P32464m74858O21656n76049q86967L60367m90268
$$ plain form
2681 677730 -260612 121076 996341 1349471 1211456 1544198 1667059 1405535 1281368 1836615
2671 1836615 1255213 970389 779054 -57377 -626495 -69175 -122941 -215667 172612 340486
2661 340486 1268392 608796 523506 1034604 647840 297103 595693 365367 465738 795789
2651 795789 568979 22567 -368792 363477 573459 968750 528056 650451 779855 820022
2641 820022 947445 661187 -256974 37617 249103 184236 758734 443729 942185 324320
2631 324320 -267818 -129161 92759 431566 604060 373673 1622230 1276236 411320 113038
2621 113038 456567 516970 -359307 -148826 -726857 -1034966 -768637 -37843 -1356081 -825657
2611 -825657 -648199 -120075 -7641 22580 759260 94345 1095792 919555 327379 -399239
$$ packed form
2681F77730r38342L81688Q75265L53130j38015L32742J22861k61524j24167N55247
2671A836615n81402k84824j91335q36431n69118N57320n3766r2726L88279J67874
2661C40486R27906o59596q5290N11098l86764l50737K98590k30326J00371L30051
2651G95789k26810n46412l91359P32269K09982L95291m40694J22395J29404M0167
2641H20022J27423k86258r18161K94591K11486o4867N74498l15005M98456o17865
2631C24320n92138J38657K21920L38807J72494k30387J248557l45994q64916k98282
2621A13038L43529O0403q76277K10481n78031l08109K66329P30794j318238N30424
2611h25657J77458N28124J12434L0221P36680o64915J001447j76237n92176p26618
$$ plain form
2601 -399239 -670035 462108 697570 927040 27004 -155871 704882 578923 610575 801354
2591 801354 1348373 1083084 1214867 760342 927297 780687 40439 -569768 -247017 -19620
2581 -19620 -122032 567501 688240 -697341 -457598 -339727 -730784 -184990 -114589 -1033163
2571 -1033163 -366259 213818 1896814 1569984 -293566 -526467 -132958 220953 183172
2562 183172 387286 570400 755842 1630688 1109898 207571 911248 483040 -286762 294007
2552 294007 848963 969222 545618 575373 -317924 -256516 358372 952213 744860 478030
2542 478030 1028156 638113 519302 131286 -479522 186631 163785 -400866 137419 62808
2532 62808 -77297 303635 124514 578034 369857 -149629 -184643 -763696 -130201 420644
$$ packed form
2601c99239k70796J132143K35462K29470r00036j82875Q60753j25959L1652J90779
2591H01354N47019k65289J31783m54525J66955j46610p40248o10207L22751K27397
2581a9620j02412O89533J20739j385581K39743J17871l91057N45794P0401r18574
2571a033163O66904N80077J682996l26830j863550k32901L93509L53911l7781
2562A83172K04114J83114J85442Q74846n20790r02327P03677m28208p69802N80769
2552B94007N54956J20259m23604K9755q93297O1408O14888N93841k07353k66830
2542D78030N50126l90043j18811l88016o10808O66153k2846n64651N38285p4611
2532F2808j40105L80932j79121M53520k08177n19486l5014n79053O33495N50845
$$ plain form
2522 420644 183703 556685 224722 86503 -235782 -520208 618633 766182 241871 640219
2512 640219 507682 -307984 1065135 322948 1169740 519667 270340 485560 -75467 591180
2502 591180 664425 -493287 152821 576459 -343341 230200 851740 235382 227875 -703045
2492 -703045 -451284 -75588 273090 889935 491421 -302404 -1074157 302126 1211257 758517
2482 758517 490057 316572 -167551 -79918 -212759 364275 -182918 -816227 -276247 -71158
2472 -71158 885796 266950 -696599 -148669 70102 55091 -15415 90961 797104 517550
2462 517550 -53974 -560032 2757 659885 927158 931290 997708 1041491 1065580 1481961 1175100
2451 1175100 1153157 387109 -69679 -97444 730174 706588 153054 487398 234720 -24353
$$ packed form
2522D20644k36941L72982l31963j38219l22285k84426J138841J47549n24311L98348
2512F40219j32537q15666J373119p42187Q46792o50073k49327K15220n61027O66647
2502E91180P3245j157712O46108M23638r19800N73541O21540o16358p507r30920
2492g03045K51761L75696L48678O16845l98514p93825p71753J376283R09131m52740
2482G58517k68460j73485m84123Q7633j32841N77034n47193o33309N39980K05089
2472g1158R56954o18846r63549N47930K18771j5011p0506J06376P06143k79554
2462E17550n71524n06058N62789O57128K67273M132O6418M3783K4089M16381l06861
2451A175100k1943p66048m56788k7765Q27618k3586n53534L34344k52678k59073
$$ plain form
2441 -24353 358724 -210213 -727979 -311300 293633 171315 255150 -32863 352596 93721
2431 93721 -33160 -28363 -179952 -479726 -373843 -56117 -63596 -243910 -361774 21742 200651
2420 200651 520887 732426 846209 746745 181055 523324 466286 253334 232179 178726
2410 178726 444097 185280 -606909 -580144 -128950 343518 781528 535150 -150862 -1118254
2400 -1118254 -1305072 -869212 -421196 -1285392 -759687 -47414 533640 155566 68094 1006693
2390 1006693 397113 -252102 593978 885715 -349548 -620847 -113791 615367 145704
2381 145704 -66173 -130811 -436039 114994 208819 457245 -134095 -825170 -906645 318144
2371 318144 1201206 990406 765678 103282 -309511 -133474 598186 427068 212970 1461454
$$ packed form
2441b4353L83077n68937n17766M16679O04933j22318Q3835k88013L85459k58875
2431I3721j26881M797j51589k99774J05883L17726p479j80314j17864L83516J78909
2420B00651L20236K11539J13783r9464n65690L42269n7038k12952k1155n3453
2410A78726K65371k58817p92189K6765M51194M72468M38010k46378o86012r67392
2400a118254j86818M35860M48016q64196N25705P12273N81054l78074q7472R38599
2390A006693o09580o49215Q46080K91737j235263k71299N07056P29158m69663
2381A45704k11877o4638l05228N51033R3825K48426n91340o91075q1475J224789
2371C18144Q83062k10800k24728o62396m12793J76037P31660j71118k14098J248484
$$ plain form
2361 1461454 1801357 2103856 2631562 2138541 1584594 1729862 1772395 1749192 1192645 700323
2351 700323 -129238 -142484 -335637 -244586 -46730 1229141 1809493 1507163 382244 -226075
2341 -226075 -358203 44345 -79415 -200206 91469 -18469 354171 -172391 871093 915008
2331 915008 1022090 804322 907184 471872 -16962 -436882 55939 732120 1090785 909970
2321 909970 1060889 576060 279529 831799 1433479 1273994 443282 1150522 1959966 1094750
2311 1094750 872488 1090118 1382494 -202218 -1186481 -407981 -5739 47531 229545 887314
2301 887314 425781 244157 -312752 -277145 417341 -52453 -722480 -313827 -614180 -146939
2291 -146939 334688 -480148 145047 729371 629217 -347718 -493456 383684 921217 416375
$$ packed form
2361A461454L39903L02499N27706m93021n53947J45268M2533k3203n56547m92322
2351G00323q29561j3246j93153R1051J97856J275871N80352l02330j124919o08319
2341b26075j32128M02548j23760j20791K91675j09938L72640n26562J043484M3915
2331I15008J07082k17768J02862m35312m88834m19920M92821O76181L58665j80815
2321I09970J50919m84829k96531N52270O01680j59485q30712P07240Q09444q65216
2311A094750k22262K17630K92376j584712r84263P78500M02242N3270J82014O57769
2301H87314m61533j81624n56909L5607O94486m69794o70027M08653l00353M67241
2291a46939M81627q14836O25195N84324j00154r76935j45738Q77140N37533n04842
$$ plain form
2281 416375 535083 816602 896513 537968 1161434 506615 206667 536690 74164 340963
2271 340963 705981 1798612 709027 316867 625260 1178930 961945 797302 714188 655101
2261 655101 142739 321559 1062636 798207 62779 -503536 666945 1144134 1829195 1729915
2251 1729915 1487577 1683230 1328543 1054962 1460170 766566 929011 748197 331749 154871
2241 154871 559147 2016280 1819331 1152327 31796 -101275 -147113 253050 861936 991853
2231 991853 1283894 1423719 1725729 655039 647295 1118366 50434 -67070 1008437 825308
2221 825308 535163 1515481 842165 942590 1334702 1753606 1342499 1659927 942218 2306176
2211 2306176 3026178 1941845 1762104 1917857 1719917 1708817 855427 717427 1832906
$$ packed form
2281D16375J18708K81519P9911l58545O23466o54819k99948L30023m62526K66799
2271C40963L65018J092631j089585l92160L08393N53670k16985j64643q3114n9087
2261F55101n12362J78820P41077k64429p35428n66315J170481M77189O85061r9280
2251A729915k42338J95653l54687k73581M05208o93604J62445j80814m16448j76878
2241A54871M04276J457133j96949o67004j120531j33071m5838M00163O08886J29917
2231I91853K92041J39825L02010j070690p744M71071j067932j17504J075507j83129
2221H25308k90145R80318o73316J00425L92112M18904m11107L17428p17709J363958
2211B306176P20002j084333j79741J55753j97940j1100q53390j38000J115479
$$ plain form
2202 1832906 2271542 1912798 1980771 1414516 1538767 2371936 1962341 1890869 1719832 2192914
2192 2192914 2767677 2502862 2133016 1970142 2410865 2494821 2120133 1880116 1250505 930334
2182 930334 1410613 1132729 1076904 2269102 2427490 2381555 2213300 2717740 2448013 2192437
2172 2192437 2975309 3267802 3929200 3329752 2868067 3674276 4313229 3946369 4087869 3359879
2162 3359879 4089564 5143448 4420231 4856886 4916614 4278330 4221306 4864927 4966917 5196645
2152 5196645 4722568 4872424 4532858 4542034 5372056 5137815 4759172 5453296 5456319 5881191
2142 5881191 6217874 6704153 7365114 7771708 7574501 7038196 6923667 8324162 8105868
2133 8105868 8158040 8861335 8691479 9306081 9649345 10545037 10161372 10419444 10624742 10263580
$$ packed form
2202A832906M38636l58744O7973n66255J24251Q33169m09595p1472j71037M73082
2192B192914N74763k64815l69846j62874M40723Q3956l74688k40017o29611l20171
2182I30334M80279k77884n5825J192198J58388m5935j68255N04440k69727k55576
2172B192437P82872K92493O61398n99448m61685Q06209O38953l66860J41500p27990
2162C359879P29685J053884p23217M36655N9728o38284n7024O43621J01990K29728
2152E196645m74077J49856l39566R176Q30022k34241l78643O94124L023M24872
2142E881191L36683M86279O60961M06594j97207n36305j14529J400495k18294
2133H105868N2172P03295j69856O14602L43264Q95692l83665K58072K05298l61162
$$ plain form
2123 10263580 11460036 12252660 11910274 12277430 13733609 14793878 15393289 15780288 16778553
2114 16778553 17333924 19313579 20045678 20929287 22781365 23772103 25165519 27648742 30448380
2105 30448380 32807251 35576616 38387775 41418427 45088057 49166078 54436902 60407333
2097 60407333 68333937 76435368 85030933 95249541 108104849 122034936 141884308 164146174
2089 164146174 192975243 199477738 181628898 159780976 128899721 101406935 81636655
2082 81636655 69276257 58663792 50905216 44286443 40793535 37981762 35415148 33231172
2074 33231172 30682363 29225673 26590191 25129653 23729809 21623864 19779487 17899355
2066 17899355 17443726 16097626 15148708 14540849 15082837 14478384 13740541 13062351 12512710
$$ packed form
2123A0263580J196456P92624l42386L67156J456179J060269N99411L86999R98265
2114A6778553N55371J979655P32099Q83609J852078R90738J393416K483223K799638
2105C0448380K358871K769365K811159L030652L669630M078021N270824N970431
2097F0407333P926604Q101431Q595565J0218608J2855308J3930087J9849372K2261866
2089A64146174K8829069O502495j7848840k1847922l0881255k7492786j9770280
2082H1636655j2360398j0612465p758576o618773l492908k811773k566614k183976
2074C3231172k548809j456690k635482j460538j399844k105945j844377j880132
2066A7899355m55629j346100r48918o07859N41988o04453p37843o78190n49641
$$ plain form
2057 12512710 11685608 10599157 10622014 11371736 10423388 9468110 8826753 8816981 8102030 7912365
2047 7912365 7385237 6678600 6364929 6849343 7137395 7136470 6580232 6042811 6763205 6199920
2037 6199920 4714251 4426875 5004557 5274728 5369471 5740886 5293121 5053548 4636810 4995522
2027 4995522 4421399 3742476 3659883 3811923 4483076 3437675 2900447 2741021 3466427 3387491
2017 3387491 3638821 3721326 2687818 2986013 3652448 4131803 3101305 3336968 3841614
2008 3841614 2418799 1274867 1460376 1198984 1353783 2049296 2048022 2000076 1930884 2260432
1998 2260432 2185095 2367177 1565556 867983 1032254 1615535 1604195 2444125 2594335 1878257
1988 1878257 1698950 1484344 1338035 1236009 976274 1130073 1250624 838660 593022 427870
$$ packed form
2057A2512710q27102j086451K2857P49722r48348r55278o41357r772p14951j89665
2047G912365n27128p06637l13671M84414K88052r25n56238n37421P20394n63285
2037F199920j485669k87376N77682K70171R4743L71415m47765k39573m16738L58712
2027D995522n74123o78923q2593J52040O71153j045401n37228j59426P25406p8936
2017C387491K51330Q2505j033508K98195O66435M79355j030498K35663N04646
2008C841614j422815j143932J85509k61392J54799O95513j274m7946o9192L29548
1998B260432p5337J82082q01621o97573J64271N83281j1340Q39930J50210p16078
1988A878257j79307k14606j46309j02026k59735J53799J20551m11964k45638j65152
$$ plain form
1978 427870 217816 1120496 736724 648853 393688 701618 1001168 -35844 492334 555339
1968 555339 -417632 887152 915570 846686 1106631 1098952 1266985 1643312 1607689 774200
1958 774200 884689 549092 993934 1051969 882941 1228197 1290896 916995 1585923 1696060
1948 1696060 736158 775414 877464 906002 545129 267271 593808 1158875 689086 1168249
1938 1168249 228108 -488418 208158 557675 106780 656162 734424 942087 782845 386612
1928 386612 -139074 387080 866222 793950 820476 649464 282551 213515 18881 254539
1918 254539 1011376 23658 283882 59484 -417128 -620644 -236363 -580175 -64766 -262791
1908 -262791 -69144 -574346 -439232 407444 818603 145176 23748 119817 654830 606991
$$ packed form
1978D27870k10054R02680l83772q7871k55165L07930K99550j037012N28178O3005
1968E55339r72971J304784K8418o8884K59945p679J68033L76327l5623q33489
1958G74200J10489l35597M44842N8035j69028L45256O2699l73901O68928J10137
1948A696060r59902L9256J02050K8538l60873k77858L26537N65067m69789M79163
1938A168249r40141p16526O96576L49517m50895N49382P8262K07663j59242l96233
1928C86612n25686N26154M79142p2272K6526j71012l66913o9036j94634K35658
1918B54539P56837r87718K60224k24398m76612k03516L84281l43812N15409j98025
1908b62791J93647n05202J35114Q46676M11159o73427j21428R6069N35013m7839
$$ plain form
1898 606991 652078 679456 -230010 99472 748150 613173 298731 1045843 517438 172656
1888 172656 310432 -150780 199869 386604 607655 -83223 -664126 333570 627772 470473
1878 470473 72280 12602 -44321 -582914 -252255 -570616 -262697 35187 699708 733264
1868 733264 169350 610869 361179 274796 106551 310019 510222 587889 -16966 816722
1858 816722 1110144 1579963 791099 -125662 231893 -180428 111890 -251629 -214699 -295022
1848 -295022 -168311 206612 -1590 -225326 -47081 294208 176305 -393927 -185090 -596249
1838 -596249 -543091 -339488 499037 38873 -452977 -473927 -95091 56677 272056 728105
1828 728105 906523 547778 116541 652923 600327 635572 703706 1696620 1837433 994727
$$ packed form
1898F06991M5087K7378r09466L29482O48678j34977l14442P47112n28405l44782
1888A72656J37776m61212L50649J86735K21051o90878n80903R97696K94202j57299
1878D70473l98193n9678n6923n38593L30659l18361L07919K97884O64521L3556
1868G33264n63914M41519k49690q6383j68245K03468K00203P7667o04855Q33688
1858H16722K93422M69819p88864r16761L57555m12321K92318l63519L6930q0323
1848b95022J26711L74923k08202k23736J78245L41289j17903n70232K08837m11159
1838e96249N3158K03603Q38525m60164m91850k0950L78836J51768K15379M56049
1828G28105J78418l58745m31237N36382n2596L5245O8134R92914J40813q42706
$$ plain form
1818 994727 978330 492249 1141985 915811 362115 1090186 -151373 -126738 -90480 218246
1808 218246 -97859 156769 -335141 -289134 -270673 -194156 400300 1102571 835339 1121421
1798 1121421 511126 454889 1023879 645835 362723 901718 425272 573801 1011041 233479
1788 233479 324448 -235737 -201421 -348354 -891060 -137997 -560020 -997250 -179720 84967
1778 84967 -322908 -1172419 -893872 -652535 -396637 -604299 -192700 -258621 -703028 -252326
1768 -252326 -331109 -399216 -685669 -1115452 -1013054 -107171 336094 -223227 171373 -611976
1758 -611976 -559604 235629 313406 138894 -183502 196775 1353917 622168 6365 -358190
1748 -358190 -709253 143309 132395 65338 154257 11623 -50951 -561741 -903552 -1141371
$$ packed form
1818I94727j6397m86081O49736k26174n53696P28071j241559K4635L6258L08726
1808B18246l16105K54628m91910M6007J8461P6517N94456P02271k67232K86082
1798A121421o10295n6237N68990l78044k83112N38995m76446J48529M37240p77562
1788B33479R0969n60185L4316j46933n42706P53063m22023m37230Q17530K64687
1778H4967m07875q49511K78547K41337K55898k07662M11599o5921m44407M50702
1768b52326p8783o8107k86453m29783J02398R05883M43265n59321L94600p83349
1758f11976N2372P95233P7777j74512l22396L80277J157142p31749o15803l64555
1748c58190l51063Q52562j0914o7057Q8919j42634o2574n10790l41811k37819
$$ plain form
1738 -1141371 -765530 -314476 -644310 -676403 -344483 84830 352308 417566 965463 986520
1728 986520 324497 -451626 338127 198580 -118369 -389960 -344668 70032 -145654 -532169
1718 -532169 -971099 -1767289 -1050906 -399125 -43429 -265629 -591067 -439203 58471 157227
1708 157227 348507 571770 203317 343386 -487884 -25435 -370637 -327657 144659 307806
1698 307806 -513132 -464903 -383965 371313 262966 -325997 -124282 -257198 429750 45350
1688 45350 -123569 -525353 -264168 -727190 -563828 226440 -9890 219459 -405760 -941479
1678 -941479 -722519 -436878 -310218 27278 369710 -78082 -117608 -282707 -1232434 -518729
1668 -518729 -256430 -397451 -607827 -637383 327307 -139336 -362288 -403998 -102224 -398321
$$ packed form
1738a141371L75841M51054l29834l2093L31920M29313K67478O5258N47897K1057
1728I86520o62023p76123P89753j39547l16949k71591M5292M14700k15686l86515
1718e32169m38930p96190P16383O51781L55696k22200l25438J51864M97674R8756
1708A57227J91280K23263l68453J40069q31270M62449l45202M2980M72316J63147
1698C07806q20938M8229Q0938P55278j08347n88963K01715j32916O86948l84400
1688D5350j68919m01784K61185m63022J63362P90268k36330K29349o25219n35719
1678i41479K18960K85641J26660L37496L42432m47792l9526j65099r49727P13705
1668e18729K62299j41021k10376k9556R64690m66643k22952m1710L01774k96097
$$ plain form
1658 -398321 -1062992 -315243 -780664 -17908 134833 -101275 -656550 -122747 54724 -212266
1648 -212266 -378965 -621442 -673540 97827 -116248 -260502 170522 -55375 -288109 -486310
1638 -486310 -134030 -671322 147983 -769359 -299803 -230931 -1113068 -1163321 -108061 188348
1628 188348 -491794 117004 151891 -445092 -478624 -172195 -569929 -426328 20539 252821
1618 252821 -97622 472507 972462 673228 -469656 -741158 -244109 727884 -85088 -286735
1608 -286735 -50782 532 385602 -595009 -224694 -521325 18288 -59980 393031 1132679
1598 1132679 396234 -351472 -463210 -728553 -1058293 -558724 -63748 -89306 -664363 16254
1588 16254 -88627 -534245 -80053 -280126 -522626 -418974 -359996 -606291 195255 779452
$$ packed form
1658c98321o64671P47749m65421P62756J52741k36108n55275N33803J77471k66990
1648b12266j66699k42477n2098P71367k14075j44254M31024k25897k32734j98201
1638d86310L52280n37292Q19305r17342M69556O8872q82137n0253J055260K96409
1628A88348o80142O08798L4887n96983l3532L06429l97734J43601M46867K32282
1618B52821l50443N70129M99955k99234j142884k71502M97049R71993q12972k01647
1608b86735K35953N1314L85070r80611L70315k96631N39613p8268M53011P39648
1598A132679p36445p47706j11738k65343l29740M99569M94976k5558n75057O80617
1588A6254j04881m45618M54192k00073k42500J03652N8978k46295Q01546N84197
$$ plain form
1578 779452 660376 70465 328617 -33635 -891541 -290936 -910120 -760585 -175066 -832391
1568 -832391 -943993 -497532 51549 452054 -640309 -351138 -51776 -426791 214882 912001
1558 912001 546216 433872 -318582 -303780 33894 -380305 -208217 40165 -220214 -729967
1548 -729967 -929001 -724817 -463021 5540 1007992 252080 153903 -373546 -295550 -668871
1538 -668871 -1220165 -831180 -122920 -158980 -19907 -336441 418773 -125854 -544271 -484566
1528 -484566 -547987 -595360 -533611 280330 -527574 -612648 -257505 -100665 -229750 -383264
1518 -383264 427991 622734 114815 254468 -421519 -489335 -252151 -605100 -603383 212892
1508 212892 -514890 -251603 -533149 -438001 252191 274103 -147302 205987 125042 71681
$$ packed form
1578G79452j19076n89911K58152l62252q57906O00605o19184J49535N85519o57325
1568h32391j11602M46461N49081M00505j092363K89171K99362l75015O41673O97119
1558I12001l65785j12344p52454J4802L37674m14199J72088K48382k60379n09753
1548g29967j99034K04184K61796M68561J002452p55912r8177n27449P7996l73321
1538f68871n51294L88985P08260l6060J39073l16534P55214n44627m18417N9705
1528d84566o3421m7373O1749Q13941q07904q5074L55143J56840j29085j53514
1518c83264Q11255J94743n07919J39653o75987o7816K37184l52949J717Q16275
1508B12892p27782K63287k81546R5148O90192K1912m21405L53289q0945n3361
$$ plain form
1498 71681 49152 -689269 -142477 435963 -27522 -397797 -316916 -58019 -307458 -1156861
1488 -1156861 -144143 -62037 713966 491589 323920 180695 26217 -177382 -89664 -91246
1478 -91246 -371554 -233146 -376436 -289639 -160010 -732984 -439098 501286 262713 914602
1468 914602 535628 57904 -24492 -356460 157366 -177373 -883688 -414259 76801 -149756
1458 -149756 -543689 168435 1119071 998050 176660 691911 -415858 -827808 -731546 -64983
1448 -64983 9690 724340 239191 -117856 -77079 -796892 -612196 -488408 96910 15764
1438 15764 117911 -581852 -640227 -616298 -698313 -223743 153500 -491259 -974630 -715212
1428 -715212 -314086 -896946 -472752 -604147 15139 326200 -203514 -564613 -439365 -889611
$$ packed form
1498G1681k2529p38421N46792N78440m63485l70275Q0881K58897k49439q49403
1488a156861J012718Q2106P76003k22377j67669j43225j54478k03599Q7718j582
1478i1246k80308J38408j43290Q6797J29629n72974K93886R40384k38573O51889
1468I14602l78974m77724q2396l31968N13826l34739p06315M69429M91060k26557
1458a49756l93933P12124R50636j21021q21390N15251j107769m11950R6262O66563
1448f4983P4673P14650m85149l57047M0777p19813J84696J23788N85318q1146
1438A5764J02147o99763n8375K3929q2015M74570L77243o44759m83371K59418
1428g15212M01126n82860M24194j31395O19286L11061n29714l61099J25248m50246
$$ plain form
1418 -889611 -571668 379786 353408 407523 -293476 109299 51351 140615 190388 -189185 -17963
1407 -17963 -593790 -1143119 -1168026 -811828 33177 545358 713086 218813 152912 569616
1397 569616 300281 -417240 -842865 282439 -64615 -299366 205653 310090 220711 163515
1387 163515 474419 -61228 518246 537372 840164 -391273 -459529 658244 925221 260836
1377 260836 -288509 115283 860530 874259 304799 47270 949647 501086 -721930 -410571
1367 -410571 -150654 -249686 -133294 229483 -483913 -469370 -649770 -435035 167815 120684
1357 120684 95607 -75696 -609038 -577486 -352654 430138 921877 546181 965886 260618
1347 260618 -121704 832797 336078 127247 78936 685383 -148146 -986337 -924731 -609861
$$ packed form
1418h89611L17943R51454k6378N4115p00999M02775n7948Q9264M9773l79573J71222
1407a7963n75827n49329k4907L56198Q45005N12181J67728m94273o5901M16704
1397E69616k69335p17521m25625J125304l47054k34751N05019J04437q9379n7196
1387A63515L10904n35647N79474J9126L02792j231437o8256J117773K66977o64385
1377B60836n49345M03792P45247J3729n69460k57529R02377m48561j223016L11359
1367d10571K59917r9032J16392L62777p13396J4543j80400K14735O02850m7131
1357A20684k5077j71303n33342L1552K24832P82792M91739l75696M19705p05268
1347B60618l82322R54501m96719k08831m8311O06447q33529q38191O1606L14870
$$ plain form
1337 -609861 266546 -79326 437029 629097 -27229 -561991 -336201 -39361 -347645 -401135
1327 -401135 -268205 -151730 -243326 -258415 -128145 -422293 -15946 656780 1243946 1183120
1317 1183120 385722 -236340 180057 336166 -789813 -138850 -78494 -26214 -9897 548513
1307 548513 434504 -367114 -458823 -689267 -1123680 -767100 -218629 418634 -66000 -34826
1297 -34826 -860860 -766292 355537 -183180 7939 349305 33494 -448345 -1162393 -600418
1287 -600418 -527380 -890576 282504 653733 820892 1021141 901856 562865 120704 -207608
1277 -207608 97665 -26260 -217312 -172923 641419 706285 562249 341481 869064 1060109
1267 1060109 847933 578140 559287 -26705 -242891 -1011401 -632878 -887288 -249803 9084
$$ packed form
1337f09861Q76407l45872N16355J92068o56326n34762K25790K96840l08284n3490
1327d01135J32930J16475r1596j5089J30270k94148M06347O72726N87166o0826
1317A183120p97398o22062M16397J56109j125979O50963O0356N2280J6317N58410
1307E48513j14009q01618r1709k30444m34413L56580N48471O37263m84634L1174
1297c4826q26034R4568J121829n38717J91119L41366l15811m81839p14048N61975
1287f00418P3038l63196J173080L71229J67159K00249j19285l38991m42161l28312
1277b07608L05273j23925j91052M4389Q14342O4866j44036k20768N27583J91045
1267A060109k12176k69793j8853n85992k16186p68510L78523k54410O37485K58887
$$ plain form
1257 9084 -70003 98349 -156581 96111 423904 180116 261675 593955 -183382 128015
1247 128015 -332593 384226 512941 -238902 -644645 -384911 -570701 -267290 -67467 -129158
$$ packed form
1257I084p9087J68352k54930K52692L27793k43788Q1559L32280p77337L11397
1247A28015m60608P16819J28715p51843m05743K59734j85790L03411J99823o1691
$$ [...]
##END NTUPLES=NMR SPECTRUM
##END=
