##TITLE=1H_EC-3222-x3
 DMSO-d6
 8 sc, 
 27.07.2022
##JCAMPDX= 6.0         $$ Bruker NMR JCAMP-DX V2.0
##DATA TYPE= NMR SPECTRUM
##DATA CLASS= NTUPLES
##ORIGIN= UXNMR, Bruker Analytische Messtechnik GmbH
##OWNER= root
$$ XWIN-NMR		Version 3.5
$$ Wed Jul 27 10:35:24 2022 Russian Standard Time (UT+4h)  she@DPX200
##.OBSERVE FREQUENCY= 200.1313499994
##.OBSERVE NUCLEUS= ^1H
##.ACQUISITION MODE= SIMULTANEOUS
##.ACQUISITION SCHEME= undefined
##.AVERAGES= 8
##.DIGITISER RES= 18
##SPECTROMETER/DATA SYSTEM= spect
##.PULSE SEQUENCE= zg30
##.SOLVENT NAME= DMSO
##.SHIFT REFERENCE= (INTERNAL, DMSO, 0, 15.7513)
##AUDIT TRAIL= $$ (NUMBER, WHEN, WHO, WHERE, WHAT)
$$ ##TITLE= Audit trail, XWIN-NMR		Version 3.5
$$ ##JCAMPDX= 5.01
$$ ##ORIGIN= Bruker BioSpin GmbH
$$ ##OWNER= she
$$ F:/spectra/data/she/nmr/H-F/1/pdata/1/auditp.txt
$$ ##AUDIT TRAIL=  $$ (NUMBER, WHEN, WHO, WHERE, WHAT)
(   1,<2022-07-27 10:34:14.98 +0400>,<she>,<DPX200>,
      <created by zg, POWCHK disabled, PULCHK disabled
       configuration hash MD5:
       00 E9 B6 7A A2 85 ED C7 34 08 36 98 17 FE 4E 26
       data hash MD5: 16K
       D4 46 21 B7 1D 2C 18 31 F5 C0 BF DB 8D EE 58 9B>)
(   2,<2022-07-27 10:34:17.26 +0400>,<she>,<DPX200>,
      <Start of raw data processing
       efp BC_mod = 2 LB = 0.24 FT_mod = 6 PKNL = 1 PHC0 = -18037.38 PHC1 = 11.40068 SI = 16K 
       data hash MD5: 16K
       C2 EC 54 44 9F 7E 37 F3 81 E4 2C A1 C2 F4 71 66>)
(   3,<2022-07-27 10:34:33.92 +0400>,<she>,<DPX200>,
      <pk PHC0 = -0.1077886 PHC1 = -2.6 
       data hash MD5: 16K
       85 1F 9D BA 79 FA D6 3E E5 19 D8 61 C4 2F C6 04>)
(   4,<2022-07-27 10:34:37.06 +0400>,<she>,<DPX200>,
      <abs ABSG = 5 
       data hash MD5: 16K
       0B B3 1B 84 22 95 B6 E4 9C EC EE BD AE 78 F9 47>)
$$ ##END=
$$ 
$$ hash MD5
$$ 2D 92 38 A3 2D 08 4A E0 35 A5 AC C9 CF 8A 7C 50
##$RELAX= 
##$RELAX= 
##$RELAX= 
##$RELAX= 
##$RELAX= 
##$RELAX= 
$$ Bruker specific parameters
$$ --------------------------
##$DU= <F:/spectra>
##$EXPNO= 1
##$NAME= <H-F>
##$PROCNO= 1
##$TYPE= <nmr>
##$USER= <she>
##$AMP= (0..31)
100 100 100 100 100 100 100 100 100 100 100 100 100 100 100 100 100 100 
100 100 100 100 100 100 100 100 100 100 100 100 100 100 
##$AQSEQ= 0
##$AQ_mod= 1
##$AUNM= <au_zg>
##$AUTOPOS= <>
##$BF1= 200.13
##$BF2= 200.13
##$BF3= 200.13
##$BF4= 200.13
##$BF5= 200.13
##$BF6= 200.13
##$BF7= 200.13
##$BF8= 200.13
##$BYTORDA= 1
##$CFDGTYP= 0
##$CFRGTYP= 5
##$CHEMSTR= <none>
##$CNST= (0..31)
1 1 145 1 1 1 1 1 1 1 1 1 1 1 1 1 1 1 1 1 1 1 1 1 1 1 1 1 1 1 1 1 
##$CPDPRG= <>
##$CPDPRG1= <>
##$CPDPRG2= <>
##$CPDPRG3= <>
##$CPDPRG4= <mlev>
##$CPDPRG5= <mlev>
##$CPDPRG6= <mlev>
##$CPDPRG7= <mlev>
##$CPDPRG8= <mlev>
##$CPDPRGB= <>
##$CPDPRGT= <>
##$D= (0..31)
0 1.2 0 0 0 0 0 0 0 0.06 0 0.03 0 0 0 0 0.0002 0 0 0 0 0 0 0 0 0 0 0 0 
0 0 0 
##$DATE= 1658903654
##$DBL= (0..7)
120 120 120 120 120 120 120 120 
##$DBP= (0..7)
150 150 150 150 150 150 150 150 
##$DBP07= 0
##$DBPNAM0= <>
##$DBPNAM1= <>
##$DBPNAM2= <>
##$DBPNAM3= <>
##$DBPNAM4= <>
$$ [...]
##$SUBNAM2= <"">
##$SUBNAM3= <"">
##$SUBNAM4= <"">
##$SUBNAM5= <"">
##$SUBNAM6= <"">
##$SUBNAM7= <"">
##$SUBNAM8= <"">
##$SUBNAM9= <"">
##$SW= 18.0517283424941
##$SWIBOX= (0..15)
0 0 2 0 0 0 0 0 0 0 0 0 0 0 0 0 
##$SW_h= 3612.71676300578
##$TD= 16384
##$TD0= 1
##$TE= 0
##$TE2= 300
##$TE3= 300
##$TEG= 300
##$TL= (0..7)
0 120 120 120 120 120 120 120 
##$TP= (0..7)
150 150 150 150 150 150 150 150 
##$TP07= 0
##$TPNAME0= <>
##$TPNAME1= <>
##$TPNAME2= <>
##$TPNAME3= <>
##$TPNAME4= <>
##$TPNAME5= <>
##$TPNAME6= <>
##$TPNAME7= <>
##$TPOAL= (0..7)
0.5 0.5 0.5 0.5 0.5 0.5 0.5 0.5 
##$TPOFFS= (0..7)
0 0 0 0 0 0 0 0 
##$TUNHIN= 0
##$TUNHOUT= 0
##$TUNXOUT= 0
##$USERA1= <user>
##$USERA2= <user>
##$USERA3= <user>
##$USERA4= <user>
##$USERA5= <user>
##$V9= 5
##$VALIST= <valist>
##$VCLIST= <CCCCCCCCCCCCCCC>
##$VD= 0
##$VDLIST= <DDDDDDDDDDDDDDD>
##$VPLIST= <PPPPPPPPPPPPPPP>
##$VTLIST= <TTTTTTTTTTTTTTT>
##$WBST= 1024
##$WBSW= 4
##$XGAIN= (0..3)
0 0 0 0 
##$XL= 0
##$YL= 0
##$YMAX_a= 61481
##$YMIN_a= -102017
##$ZGOPTNS= <>
##$ZL1= 120
##$ZL2= 120
##$ZL3= 120
##$ZL4= 120
##$ABSF1= 15.73587
##$ABSF2= -2.315979
##$ABSG= 5
##$ABSL= 3
##$ALPHA= 0
##$AQORDER= 0
##$ASSFAC= 0
##$ASSFACI= 0
##$ASSFACX= 0
##$ASSWID= 0
##$AUNMP= <proc_1d>
##$AZFE= 0.1
##$AZFW= 0.1
##$BCFW= 0
##$BC_mod= 2
##$BYTORDP= 0
##$COROFFS= 0
##$CY= -3
##$DATMOD= 1
##$DC= 0
##$DFILT= <>
##$DTYPP= 0
##$F1P= 0
##$F2P= 0
##$FCOR= 1
##$FTSIZE= 16384
##$FT_mod= 6
##$GAMMA= 0
##$GB= 0
##$INTBC= 1
##$INTSCL= 0
##$ISEN= 128
##$LB= 0.24
##$LEV0= 0
##$LPBIN= 0
##$MAXI= 10000
##$MC2= 0
##$MEAN= 0
##$ME_mod= 0
##$MI= 1.114404
##$NCOEF= 0
##$NC_proc= -9
##$NLEV= 6
##$NOISF1= 3.799351
##$NOISF2= 2.8
##$NSP= 0
##$NTH_PI= 0
##$NZP= 0
##$OFFSET= 15.7513
##$PC= 1
##$PHC0= -18037.49
##$PHC1= 8.80068
##$PH_mod= 1
##$PKNL= yes
##$PPARMOD= 0
##$PSCAL= 0
##$PSIGN= 0
##$REVERSE= no
##$SF= 200.130004050264
##$SI= 16384
##$SIGF1= 3
##$SIGF2= 2
##$SINO= 5.538805
##$SIOLD= 16384
##$SREGLST= <1H.CDCl3>
##$SSB= 0
##$STSI= 16384
##$STSR= 0
##$SW_p= 3612.71676300578
##$SYMM= 0
##$S_DEV= 0
##$TDeff= 16384
##$TDoff= 0
##$TI= <>
##$TILT= no
##$TM1= 0
##$TM2= 0
##$TOPLEV= 0
##$USERP1= <user>
##$USERP2= <user>
##$USERP3= <user>
##$USERP4= <user>
##$USERP5= <user>
##$WDW= 1
##$XDIM= 16384
##$YMAX_p= 307580973
##$YMIN_p= -3038322
$$ End of Bruker specific parameters
$$ ---------------------------------
##NTUPLES= NMR SPECTRUM
##VAR_NAME=  FREQUENCY,     SPECTRUM/REAL,   SPECTRUM/IMAG
##SYMBOL=    X,             R,               I
##VAR_TYPE=  INDEPENDENT,   DEPENDENT,       DEPENDENT
##VAR_FORM=  AFFN,          ASDF,            ASDF
##VAR_DIM=   16384,         16384,           16384
##UNITS=     HZ,            ARBITRARY UNITS, ARBITRARY UNITS
##FACTOR=    0.220516191357247, 1,           1
##FIRST=     3152.30770439713, 0,            0
##LAST=      -460.409058608653, 0,           0
##MIN=       -460.409058608653, -3038322,    0
##MAX=       3152.30770439713, 307580973,    0
$$ Real data points
##PAGE= N=1
##DATA TABLE= (X++(R..R)), XYDATA
$$ [...]
6732E97017N75638n26928J43657O6229J68357n20034j90298k35384J6847Q1455
$$ 597017 1172655 645727 789384 855613 1023970 503936 313638 78254 95101 176556
6722A76556p03222O51887J124914p32252J43077r0332K16375K09788j62109k20988
$$ 176556 -526666 125221 1250135 517883 660960 570628 787003 996791 834682 613694
6712F13694O2973r2200k26824P19661L44354m66418l76579k46832K06364K69895
$$ 613694 676667 584467 357643 1077304 1421658 955240 578661 331829 538193 808088
6702H08088j36066m1415J61155q8813n27906P51700k70709O4037p35243l68442
$$ 808088 672022 630607 791762 702949 175043 926743 656034 720071 -15172 -383614
6692c83614P89100K40374K12252Q8928k92883k81819J27657j06565K25931m97922
$$ -383614 405486 645860 858112 947040 654157 372338 499995 393430 619361 121439
6682A21439k59756p997J66038J79458M70668L11516j05993L93986k27942q02596
$$ 121439 -138317 -146314 19724 199182 669850 981366 875373 1269359 1041417 238821
6672B38821q8641m1487J2095J49429N76778J06337q7189k94921J20790n36714
$$ 238821 150180 108693 120788 270217 846995 953332 866143 571222 692012 155298
6662A55298k4748K82416Q6253P17181L25918j5069m38820k60583M06501m33654
$$ 155298 130550 412966 499219 1216400 1542318 1527249 1088429 827846 1234347 800693
6652H00693M45841K68913K17733O0331m45344L67373p18145o15236J1331L42387
$$ 800693 1246534 1515447 1733180 1793511 1348167 1715540 997395 382159 393490 735877
6642G35877k23511K33446n65303K88153L22882L90250P32633k39049j05947J8896
$$ 735877 512366 745812 180509 468662 791544 1181794 1914427 1675378 1569431 1588327
6632A588327j83562p22756P97289p3696j52406K5762l17435R80094l15525l02769
$$ 1588327 1404765 682009 1479298 1405602 1253196 1278958 961523 1941617 1626092 1323323
6622A323323Q34046o80585Q66304o0793o67243J82177o56700K26990j61468o3776
$$ 1323323 2157369 1476784 2343088 2282295 1615052 1797229 1140529 1367519 1206051 1142275
6612A142275p6164j46435k62919k52068K4920O84633J08996K12029L05995K80603
$$ 1142275 1066111 919676 656757 404689 429609 1114242 1223238 1435267 1741262 2021865
6602B021865n29037Q9966P0928n7553k68924M75528l31121n75561M5981L81800
$$ 2021865 1492828 1582794 1653722 1596169 1327245 1802773 1471652 896091 942072 1323872
6592A323872m06278J54860R86618l71408p59383O21178L50164L93647j204172
$$ 1323872 917594 1072454 2059072 1687664 928281 1549459 1899623 2293270 1089098
6583A089098J42138M18871k38657m73160K27267P43664n01595K48921o46450M05612
$$ 1089098 1231236 1650107 1411450 938290 1165557 1909221 1407626 1656547 1010097 1415709
6573A415709j53602L01505o64628K14170M70710n23479N78948o20242k38305R9962
$$ 1415709 1262107 1563612 898984 1113154 1583864 1060385 1639333 1019091 780786 880748
6563H80748J71960J210634M7094N11332k90933j216237k57053N14554k36805k01955
$$ 880748 1052708 2263342 2310436 2821768 2530835 1314598 1057545 1572099 1335294 1133339
6553A133339q3779J181857K98410p21481J17285K22287k83142K28892l7249j80491
$$ 1133339 1049560 2231417 2529827 1808346 1925631 2147918 1864776 2093668 2056419 1875928
6543A875928M60990l31786l05792M33380J75055j108066L1359L9868J79303N02824
$$ 1875928 2336918 2005132 1699340 2132720 2307775 1199709 1231068 1270936 1450239 1953063
6533A953063p3982L70198O7823j88010l98462J60347j3619O6351K65052L40469
$$ 1953063 1879081 2249279 2317102 2129092 1730630 1890977 1877358 1943709 2208761 2549230
6523B549230q55412J27462J137281m83016k78283L59202k73928N0594Q01917m19331
$$ 2549230 1693818 1821280 2958561 2475545 2197262 2556464 2282536 2333130 3135047 2715716
6513B715716j24530K09429o99276N79760N47440l64906P9205M1989j17443m94922
$$ 2715716 2591186 2800615 2101339 2681099 3228539 2863633 2942838 2984827 2867384 2372462
6503B372462J84253p68131J109156J71219q19319j45971k27640M57661O1897O41662
$$ 2372462 2556715 1788584 2897740 3068959 2249640 2103669 1876029 2333690 2395587 3037249
6493C037249K65070K20661j40857j17584j72131o06978j25642K79099M86547p4652
$$ 3037249 3302319 3522980 3382123 3264539 3092408 2485430 2359788 2638887 3125434 3050782
6483C050782l44436J88202P13317r4090n86208J53543L65907L67499n93926j71940
$$ 3050782 2706346 2894548 3607865 3513775 2927567 3081110 3447017 3814516 3220590 3048650
6473C048650J84974K98104J6145J84803m80813k75039j83845O11484M09114j36611
$$ 3048650 3233624 3531728 3547873 3732676 3251863 2976824 2792979 3404463 3813577 3676966
6463C676966j174249r1600K38495L19480L65185n60716Q26680l93844m09802j84357
$$ 3676966 2502717 2411117 2649612 2969092 3334277 2773561 3600241 3206397 2796595 2612238
6453B612238N59066o05895L11715O9254O21759O66512l60373o63475K77031M67116
$$ 2612238 3171304 2565409 2877124 2946378 3568137 4234649 3874276 3210801 3487832 3954948
6443C954948k55576J80607j68418o24547q22961J239113n8505k73943J106406
$$ 3954948 3699372 3879979 3711561 3087014 2264053 3503166 3444661 3170718 4277124
6434D277124N26975l01042n67694K6964L09721O27133k70810J76109K42678j213531
$$ 4277124 4804099 4503057 3935363 3962327 4272048 4899181 4628371 4804480 5047158 3833627
6424C833627J05996J57967L62123n00115K75550O56351o66028J45352l29176N46515
$$ 3833627 3939623 4097590 4459713 3959598 4235148 4891499 4225471 4370823 4041647 4588162
6414D588162M39820r3502N67207n23804r0829K4097L9854O8232j60557J74846
$$ 4588162 5027982 4934480 5501687 4977883 4887054 4911151 4951005 5019237 4858680 5033526
6404E033526j89923K42120j146343K18793k08277R6350P35429k51763j45610j08211
$$ 5033526 4843603 5085723 3939380 4158173 3949896 4046246 4781675 4529912 4384302 4276091
6394D276091M06566j01406N35703j32271o8078l43858K86370M19222j017663M56230
$$ 4276091 4682657 4581251 5116954 4984683 4916605 4572747 4859117 5278339 4260676 4716906
6384D716906R88477q4837k40264n5920R6293L25647m30977n60629M34800O21494
$$ 4716906 5705383 5620546 5380282 5324362 5420655 5746302 5315325 4754696 5189496 5810990
6374E810990q7227j58642N35843n61801r9217L09104J80685Q82897J031344q78206
$$ 5810990 5723763 5565121 6100964 5539163 5439946 5749050 5929735 6812632 7843976 6965770
6364F965770q3117M48872l79248k20686q59396R82427K50964L943o50271r3806
$$ 6965770 6882653 7331525 6952277 6731591 5872195 6854622 7105586 7109529 6459258 6365452
6354F365452L8062N10511k47472J21344M28073P47870J60987k97597m96753j29152
$$ 6365452 6403514 6914025 6666553 6787897 7215970 7963840 8124827 7827230 7330477 7201325
6344G201325K86653o47158J200470M66580k44301L09897k17261O3642M11800O24853
$$ 7201325 7487978 6840820 8041290 8507870 8263569 8573466 8356205 8419847 8831647 9456500
6334I456500O7224q22838M10480J56839K06982J49151L31971l18882j80642Q51015
$$ 9456500 9523724 8700886 9111366 9268205 9475187 9624338 9956309 9637427 9456785 10307800
6324A0307800K89871K48696M29330m01643K30094j18032j68867R91141M42614
$$ 10307800 10597671 10846367 11275697 10874054 11104148 10986116 10817249 11808390 12251004
6315A2251004j75797J632871K74431O32556j14003K33459J751033L0470J075751
$$ 12251004 12075207 13708078 13982509 14615065 14501062 14734521 16485554 16516024 17591775
6306A7591775Q19690k75220K27548j6933J044270J620560M0492l61275J194115
$$ 17591775 18411465 18136245 18363793 18346860 19391130 21011690 21052182 20690907 21885022
6297B1885022J262938n30376l17937P77855J79380j60292P50430N59499l77057
$$ 21885022 23147960 22617584 22299647 23077502 23256882 23096590 23847020 24406519 24029462
6288B4029462J10272M96234P58412J31591q2606l63446o13200N58303J070799
$$ 24029462 24139734 24635968 25394380 25525971 25443365 25079919 24466719 25025022 26095821
6279B6095821K58204N67546L95746J121855R46081m92505R58403J672378L53122
$$ 26095821 26354025 26921571 27317317 28439172 29385253 28892748 29851151 31523529 31876651
6270C1876651m73523k2678J402369J446452J03326R08115J032236J25222N99140
$$ 31876651 31403128 31380450 32782819 34229271 34332597 35240712 36272948 36398170 36997310
6261C6997310M28995O67042N66881m01785j78450n60503L51644O77597O80781
$$ 36997310 37426305 38093347 38660228 38258443 38079993 37519490 37871134 38548731 39229512
6252C9229512Q6519K7771m45992P0625K89313K24530m76513k15372l15146k19124
$$ 39229512 39316031 39343802 38897810 38968435 39257748 39482278 39005765 38790393 38475247 38256123
6242C8256123M92098k08958k08573k09911K2120p17344O05717K43345L5699M51320
$$ 38256123 38748221 38539263 38330690 38120779 38142899 37425555 38031272 38274617 38310316 38761636
6232C8761636o01653L98717l43039k03467j268217K1148l5375R524n56998j022230
$$ 38761636 38159983 38558700 38215661 38012194 36743977 36765125 36729750 36739274 36182276 35160046
6222C5160046n71817j729378p54811n87106j198043k86745j923695o3493m06518
$$ 35160046 34588229 32858851 32104040 31516934 30318891 30032146 28108451 28044958 27638440
6213B7638440j554545l33949q70918j72970o99676j498397j326286q66572k65206
$$ 27638440 26083895 25749946 24879028 24706058 24006382 22507985 21181699 20315127 20049921
6204B0049921Q7197m11451k08121j63714J22446K85338j141767p80191K75729
$$ 20049921 20137118 19725667 19517546 19353832 19476278 19761616 18619849 17839658 18115387
6195A8115387J679744K34320n91738P80136J280509P06688j30889Q19937R23683
$$ 18115387 19795131 20029451 19437713 20217849 21498358 22205046 22074157 22894094 23817777
6186B3817777m27952M14178P41130L32366J284987M19563m09150k37919J273287
$$ 23817777 23389825 23804003 24545133 24877499 26162486 26582049 26172899 25934980 27208267
6177B7208267j70832M06090N84192M61791m36181k16410p51592L42161n42188
$$ 27208267 27037435 27443525 28027717 28489508 28053327 27836917 27085325 27427486 26885298
6168B6885298k76904o52048j02616l25802k26597n30580r17149m69835j719412
$$ 26885298 26608394 25956346 25853730 25527928 25301331 24770751 23853602 23383767 21664355
6159B1664355k81104o14898r61268m90339j346401j94234j75565q34169q45774
$$ 21664355 21383251 20768353 19807085 19316746 17970345 17776111 17600546 16766377 15920603
6150A5920603q65645j005173r93916l85284k65726O0439k30312j288027l63971
$$ 15920603 15054958 14049785 13055869 12670585 12404859 12465298 12234986 10946959 10582988
6141A0582988k49642m13196j3634n16092k74732O1597j67457m16679j102073Q5650
$$ 10582988 10333346 9920150 9906516 9390424 9115692 9177289 9009832 8593153 7491080 7576730
6131G576730J74954N0308j02569n10695N4048J11854N58162m46452q61731j01388
$$ 7576730 7751684 7801992 7699423 7188728 7242776 7354630 7912792 7466340 6604609 6503221
6121F503221k9694L0107j81107o56008J28715N49337J08113P257k26217J2752
$$ 6503221 6473527 6503634 6322527 5666519 5795234 6344571 6452684 6459941 6233724 6246476
6111F246476M4866j242247M88155l83370R6832N78141m98458m20073L85653j47741
$$ 6246476 6291342 5049095 5537250 5153880 5250712 5828853 5330395 4910322 5295975 5148234
6101E148234k93885m55175Q30121K48966r32321n24402J91643K08426j034020
$$ 5148234 4854349 4399174 5229295 5478261 4545940 4021538 4213181 4421607 3387587
6092C387587J60145M02799p04847O49471P24891n55418j372625j01673P73611
$$ 3387587 3547732 3950531 3245684 3895155 4620046 4064628 2692003 2590330 3363941
6083C363941n6059O0193N62844j0640K43437p764L92092p12268m73183P5029Q9325
$$ 3363941 3307882 3368075 3930919 3920279 4163716 4155952 4548044 3835776 3362593 3437622 3526947
6072C526947o50441J217Q54312P36587q941j132010K39460O11114Q3181J91939
$$ 3526947 2876506 2877723 3732035 4468622 4459681 3327671 3567131 4178245 4261426 4453365
6062D453365q46307N39614K81292j058070L92011m85538l62901j61122J8021M57791
$$ 4453365 3607058 4146672 4427964 3369894 3761905 3276367 2913466 2752344 2770365 3228156
6052C228156Q25442q05777k23581N65611P00891J67406r16665N82251o69672l66694
$$ 3228156 4053598 3247821 3024240 3589851 4290742 4458148 3541483 4123734 3454062 3087368
6042C087368L40690K99709K86914J03689j26036m11427j44376J3714K01651Q53355
$$ 3087368 3428058 3727767 4014681 4118370 3992334 3580907 3436531 3450245 3651896 4505251
6032D505251O79961N06161n45852k04177J12015j32144M84314K34529J85357j037737
$$ 4505251 5185212 5691373 5145521 4941344 5053359 4921215 5405529 5640058 5825415 4787678
6022D787678m27041Q33167K43957j034573P8793M2185M61526O9102j24383q77953
$$ 4787678 4360637 5193804 5437761 4403188 4481981 4524166 4985692 5054794 4930411 4052458
6012D052458M45177J120729K10711p00742R84612k78149J063978O57010j53638
$$ 4052458 4497635 5618364 5829075 5128333 6112945 5834796 6898774 7555784 7402146
6003G402146n2753j26696K22271j46575O14734N37470O34086l19512o6129Q51801
$$ 7402146 7349393 7222697 7444968 7298393 7913127 8450597 9084683 8765171 8699042 9550843
5993I550843K80119J25164Q16185Q76090j34611J011563M66394K8952M68042J128050
$$ 9550843 9830962 9956126 10772311 11648401 11513790 12525353 12991747 13020699 13488741 14616791
5983A4616791Q28009O08746l39870N98140R93298M51825N46479j275847P30469
$$ 14616791 15444800 16053546 15713676 16311816 17305114 17756939 18303418 17027571 17758040
5974A7758040O78741M62496J71309k94569n94953P1587n99477M12941k02081J01625
$$ 17758040 18436781 18899277 19070586 18776017 18181064 18252651 17653174 18066115 17864034 17965659
5964A7965659L11193m23361l79670O43490j98009p0693M39105m76526P08413P3857
$$ 17965659 18276852 17853491 17473821 18117311 17919302 17848609 18287714 17811188 18519601 18593458
5954A8593458Q50505J177078Q2854m67644o22713L61819K8495L63713j38514l17044
$$ 18593458 19443963 20621041 20703895 20236251 19613538 19975357 20003852 20367565 20229051 19912007
5944A9912007m38631k71245p01076N05525n73366n033k24776j34100m21803n25099
$$ 19912007 19473376 19202131 18501055 19006580 18433214 18428181 18203405 18069305 17647502 17122403
5934A7122403j88865p78957K14291j82319j263369n74534L28249J49245M61105
$$ 17122403 16933538 16154581 16368872 16186553 14923184 14348650 14676899 14826144 15287249
5925A5287249q22981k89053P8252l69534n0898n18887l85669P57296N32551j14732
$$ 15287249 14464268 14175215 14253467 13883933 13833035 13314148 12928479 13685775 14218326 14103594
5915A4103594l31828J85126L26461N96398L29457K66451l87701j23514q88497
$$ 14103594 13771766 13956892 14283353 14879751 15209208 15475659 15087958 14964444 14075947
5906A4075947K06308p0235j124366P7509j209195J05837M03316p8691k90898k11439
$$ 14075947 14282255 14212020 13087654 13165163 11955968 12061805 12465121 12386430 12095532 11884093
5896A1884093R79396n49336l89873K18979n38817L84393R08216l3010o38058l22976
$$ 11884093 12863489 12314153 11924280 12143259 11604442 11988835 12897051 12864041 12225983 11903007
5886A1903007J004763j37941M5990m70176J74932M32639k76927j69447J55563
$$ 11903007 12907770 12769829 12815819 12345643 12520575 12953214 12676287 12506840 12662403
5877A2662403j03605l216K4858m04109l5334j93641m72466p83712q75762J86872
$$ 12662403 12558798 12555582 12580440 12176331 12140997 11947356 11474890 10691178 9815416 10002288
5867A0002288p73124J68824M39350j361531l86185J78837L2257q92542n75947
$$ 10002288 9229164 9397988 9837338 8475807 8089622 8268459 8300716 7408174 6832227
5858F832227k27249n78835J37406j34166k04682J5661n20544m02625J069285p1456
$$ 6832227 6604978 6026143 6163549 6029383 5824701 5840362 5319818 4917193 5986478 5915022
5848E915022j55707k70247o93105q8696Q68571m16215p16438p75062K14774O71650
$$ 5915022 5759315 5489068 4795963 4707267 5575838 5159623 4443185 3668123 3882897 4554547
5838D554547o03459m0063O33101K73929q34334j25659l71870K64611K07623P82578
$$ 4554547 3951088 3911025 4544126 4818055 3983721 3858062 3486192 3750803 3958426 4741004
5828D741004J72908j078423J75967P65307r37446p1880L74147P32050j159725
$$ 4741004 4913912 3835489 4011456 4776763 3839317 3767437 4141584 4873634 3713909
5819C713909J54569k99516j23372O42018L88782l88831m70648J88781K53045L45933
$$ 3713909 3868478 3568962 3445590 4087608 4476390 4087559 3616911 3805692 4058737 4404670
5809D404670j042788j44522R26521J49453O10808m51241r76767M9520J81312j80457
$$ 4404670 3361882 3217360 4143881 4293334 4904142 4452901 3476134 3525654 3706966 3526509
5799C526509q06982N16938Q9871n23111O84493j03284l75031m24005j135682m05847
$$ 3526509 2719527 3236465 3326336 2803225 3487718 3384434 3009403 2585398 1449716 1043869
5789A043869O14557J545265J274518j053288o12572r1853k11998M24491P16058
$$ 1043869 1658426 3203691 4478209 3424921 2812349 2720496 2508498 2932989 3649047
5780C649047K89477p51745l81854K87052K29216k14142J81926j03380l58627L07420
$$ 3649047 3938524 3186779 2804925 3091977 3321193 3107051 3288977 3185597 2826970 3134390
5770C134390K12446m48840K9440m94464k64133J6360J99178P41669K96952j39710
$$ 3134390 3346836 2897996 2927436 2432972 2168839 2185199 2384377 3126046 3422998 3283288
5760C283288j86386m07657j49164O16362N27066k44460r70014M43614M08706m24374
$$ 3283288 3096902 2689245 2540081 3156443 3683509 3439049 2469035 2912649 3321355 2896981
5750B896981j73650k89133K25016P17005r9752m27819n87570J10594M72727j95526
$$ 2896981 2723331 2434198 2659214 3376219 3276467 2848648 2261078 2371672 2844399 2648873
5740B648873J360169m76515p61285J65964M08712j06486Q59459Q86040p34247
$$ 2648873 4009042 3532527 2771242 2937206 3345918 3239432 4098891 4984931 4250684
5731D250684n29888q53460k20552L30938j74950j06327K46066L12024l79758J76103
$$ 4250684 3720796 2867336 2646784 2977722 2802772 2696445 2942511 3254535 2874777 3050880
5721C050880k15368M99790R8722k9799q5457m45615K2232P24327N2227P12650
$$ 3050880 2835512 3335302 3434024 3404225 3318768 2873153 2895385 3619712 3671939 4384589
5711D384589Q574q20054n87782L88641K87184m26563N7104o7025o44499M96407
$$ 4384589 4393163 3573109 2985327 3373968 3661152 3234589 3291693 3224668 2580169 3076576
5701C076576O04258q4869l86168N92717L28794j701704N1881Q03984P53340m8575
$$ 3076576 3680834 3595965 3209797 3802514 4131308 2429604 2481485 3285469 4038809 3990234
5691C990234m40735N8218j42161l8245j83900j88494n78867k46766K87057N51266
$$ 3990234 3549499 3607717 3465556 3427311 3243411 3054917 2476050 2229284 2516341 3067607
5681C067607J248327j42949O4286J44668n54931p78119M89031Q44113K83595k79964
$$ 3067607 4315934 4172985 4237271 4381939 3827008 3048889 3537920 4382033 4665628 4385664
5671D385664m09986J28990M88164J7005k35643j271840l4183J61885p2062N38896
$$ 4385664 3975678 4104668 4592832 4609837 4374194 3102354 3068171 3230056 3157994 3696890
5661C696890m38243m6988P96731P9378m0897L32694l26815l34663j51784J13097
$$ 3696890 3258647 3211659 4008390 4087768 4046871 4379565 4052750 3718087 3566303 3679400
5651C679400R76824j46387r8986K69607K21934l08663k57059q32930N46131O69499
$$ 3679400 4656224 4509837 4410851 4680458 4902392 4593729 4336670 3503740 4049871 4719370
5641D719370J82413k5142q37279n66642l91814Q09575P42161k51015j33874n7860
$$ 4719370 4901783 4876641 4039362 3472720 3080906 3890481 4632642 4381627 4247753 4189893
5631D189893k09749P678j47832M35566j59656m88052O60454M82657o75298P43907
$$ 4189893 3980144 3987822 3839990 4275556 4115900 3627848 4288302 4770959 4095661 4839568
5621D839568n57494N8453m25289q30603l2830P73458L14704K46558P7821p35776
$$ 4839568 4282074 4340527 3915238 3084635 3051805 3825263 4139967 4386525 4464346 3728570
5611C728570r05730K66901p9002R74559q61435q49459J903580J19560r1893j68895
$$ 3728570 2822840 3089741 3010739 3985298 3123863 2274404 4177984 4297544 4205651 4036756
5601D036756K98003M5312O70058p30870M9709j76220P42977j70261l59577L93938
$$ 4036756 4334759 4380071 5050129 4319259 4368968 4192748 4935725 4765464 4405887 4799825
5591D799825L02807K89776O94807q77974R2175N8237L62244n24370L56780m22712
$$ 4799825 5102632 5392408 6087215 5209241 5301416 5359653 5721897 5197527 5554307 5131595
5581E131595M6158O5055J281872j85441n76472N47614m59801O0521Q17296O22127
$$ 5131595 5177753 5242808 6524680 6339239 5762767 6310381 5850580 5911101 6728397 7350524
5571G350524p54301Q4008k86441Q43318L62488J92837L11208J789m38666K16289
$$ 7350524 6596223 6680231 6393790 7237108 7599596 7792433 8103641 8105430 7666764 7883053
5561G883053k36363N53980k65615L19308N29342n0655l14512L14767J26879N43905
$$ 7883053 7646690 8200670 7935055 8254363 8783705 8733050 8418538 8733305 8860184 9404089
5551I404089J06504Q15549q063r6698K73788J11056J95964R1259L65982L34290
$$ 9404089 9510593 10326142 10318079 10221381 10495169 10606225 10802189 10893448 11259430 11593720
5541A1593720j21189j30388J2739r7375j68202J746467L05994M95442j09358J025091
$$ 11593720 11472531 11342143 11354882 11257507 11089305 12835772 13141766 13637208 13527850 14552941
5531A4552941M14167j73376K82975m88258m49057R14540J104840L2631J53049
$$ 14552941 14967108 14793732 15076707 14588449 14139392 15053932 16158772 16191403 16344452
5522A6344452J85262O12149n5313O20857Q1485j4101j10605n20447O48967M85782
$$ 16344452 16529714 17141863 17086550 17707407 17788892 17774791 17664186 17143739 17792706 18278488
5512A8278488k43464Q7298K19692l80830j6341l82886O66207m96566l67157J020584
$$ 18278488 18035024 18122322 18342014 17961184 17944843 17561957 18228164 17731598 17364441 18385025
5502A8385025K55499j23325o82927Q50888P94140r03264Q0662M73336j7207P35173
$$ 18385025 18640524 18517199 17834272 18685160 19479300 18576036 18656698 19130034 19112827 19848000
5492A9848000N27035j05850k93053P00964K4292N29671o27152j64616R31746M83729
$$ 19848000 20375035 20269185 19976132 20677096 20701388 21231059 20603907 20439291 21371037 21854766
5482B1854766k47656J35413l20761l36052J88309P28544M62765P9340n58931M06604
$$ 21854766 21607110 21742523 21421762 21085710 21274019 22002563 22465328 22544668 21985737 22392341
5472B2392341N58486k05106P75131J120207k20579L44913K93772L24063j86667
$$ 22392341 22950827 22745721 23520852 24641059 24420480 24765393 25059165 25383228 25196561
5463B5196561K70314M8666j053119k8297R771Q2664M87420M20q64899J22176p3291
$$ 25196561 25466875 25515541 24462422 24434125 24443896 24526560 25013980 25014400 24149501 24271677 24198386
5452B4198386k05340k84666J81983p73839n72375M16537q50195l37784p5272J95702
$$ 24198386 23993046 23708380 23890363 23116524 22544149 22960686 22110491 21772707 21697435 21893137
5442B1893137j33388L35359j084381r02425J071183j22986j18587L04902o70906
$$ 21893137 21759749 22095108 21010727 20108302 21179485 21056499 20937912 21242814 20571908
5433B0571908J35687n09891M6345k61877p48319K10082O38758m41484K86006k33867
$$ 20571908 20707595 20197704 20244049 19982172 19233853 19443935 20082693 19641209 19927215 19693348
5423A9693348m86641j01091J72036n22002l39439J38631j87774r01783k34530
$$ 19693348 19206707 19105616 19277652 18755650 18416211 18554842 18367068 17465285 17230755
5414A7230755Q10687k54885n7200q80797k49361k54521M33361j90256n55640j56171
$$ 17230755 18041442 17786557 17729357 16848560 16599199 16344678 16778039 16587783 16032143 15875972
5404A5875972Q80527P44862k74186J12829L94672j72248M10566m76624j17416
$$ 15875972 16756499 17501361 17227175 17340004 17734676 17562428 17972994 17496370 17378954
5395A7378954k1852j74541J26971Q78608J1849O61500R9297J92603m7352L22129
$$ 17378954 17357102 17182561 17309532 18188140 18199989 18861489 18960786 19153389 19106037 19428166
5385A9428166K249K04041k04396N76632K10520j031670O18214M7732J437749P29830
$$ 19428166 19430415 19634456 19430060 20006692 20217212 19185542 19803756 19851488 21289237 22019067
5375B2019067o52327j58868R03942J184353o4566M43862J1788L22894K86941Q60106
$$ 22019067 21366740 21207872 22111814 23296167 23231601 23675463 23687251 24010145 24297086 25157192
5365B5157192L41686l6483N37963q46607M44721M91915J035386P07929m30507
$$ 25157192 25498878 25462395 26000358 25153751 25598472 26090387 27125773 27833702 27403195
5356B7403195k69412J289713P82486L1215K21365P39291J032285O95953L04980
$$ 27403195 27133783 28423496 29205982 29237197 29458562 30197853 31230138 31926091 32231071
5347C2231071J393541R37131P28523L26476m0136J062523J257357M40191Q38471
$$ 32231071 33624612 34561743 35290266 35616742 35576606 36639129 37896486 38336677 39175148
5338C9175148N96014L85725J290879R64693L46203Q45323J326069J362890Q55784
$$ 39175148 39771162 40156887 41447766 42412459 42758662 43603985 44930054 46292944 47148728
5329D7148728K021832J359350O42035J101333K006822K13767J594540K047020
$$ 47148728 49170560 50529910 51171945 52273278 54280100 54493867 56088407 58135427
5321E8135427L85959J137115J385002J659282K049765K171545K042713J839230
$$ 58135427 58521386 59658501 61043503 62702785 64752550 66924095 68966808 70806038
5313G0806038K147930K761031K478080K660415J816559K751929L102116K909773
$$ 70806038 72953968 75714999 78193079 80853494 82670053 85421982 88524098 91433871
5305I1433871L533400L588940L302030M234594L608437M850795N437708N364870
$$ 91433871 94967271 98556211 101858241 106092835 109701272 114552067 119989775 125354645
5297A25354645M637569N273320N184572O198140O830775P333547O270143P941185
$$ 125354645 129992214 135265534 140450106 146648246 153479021 160812568 167082711 175023896
5289A75023896P735374P783509Q763182Q763680Q669624Q795897P423391P782154
$$ 175023896 182759270 190542779 199305961 208069641 216739265 225535162 232958553 240740707
5281B40740707P639176O774111P348247N367514M578518K858346K330488O80390
$$ 240740707 248379883 255153994 262502241 267869755 272448273 275306619 277637107 278317497
5273B78317497o92004l053533l152630m752146n521914n254664p373242q016449
$$ 278317497 277625493 274571960 271419330 266667184 261145270 255890606 248517364 240500915
5265B40500915o504658p219451p827378o798831p293060o868155n986388p739565
$$ 240500915 233996257 226776806 218949428 212150597 204857537 197989382 192002994 184263429
5257A84263429p989291q143966q994079o955752n736674n793664n331770m547820
$$ 184263429 176274138 168130172 159136093 152180341 146443667 140650003 135318233 130770413
5249A30770413m985284m120982l476528l629933l597757l614642l861108k582386
$$ 130770413 125785129 121664147 118187619 114557686 110959929 107345287 103484179 100901793
5241A00901793j622567k707257k704126k641499j541395j683933o90207p10915
$$ 100901793 99279226 96571969 93867843 91226344 89684949 88001016 87310809 86599894
5233H6599894n83505K33212J229422J260939P84433K434965J840125j773028n229896
$$ 86599894 86016389 86249601 87479023 88739962 89524395 91959360 93799485 92026457 86796561
5224H6796561o675993n210638l606427k066883k380607k519751j580801j859406
$$ 86796561 80120568 74909930 71303503 69236620 66856013 64336262 62755461 60896055
5216F0896055k513859j708943o27935r18766l59636M0816j158074r64124j093871
$$ 60896055 58382196 56673253 56045318 55126552 54766916 54807732 53649658 52685534 51591663
5207E1591663l81768l791o90650L58095R17148J782606Q71461J153784K014706
$$ 51591663 51209895 51206104 50515454 50873549 51790697 53573303 54444764 55598548 57613254
5198E7613254K256588K470789K932912K626301l110072n701354n632111m679978
$$ 57613254 59869842 62340631 65273543 67899844 64789772 59088418 53456307 48776329
5190D8776329k485375j563828j717228j825999j684831j575272r07270q92997
$$ 48776329 46290954 44727126 43009898 41183899 39499068 37923796 37016526 36123529
5182C6123529j65867l06137j051061j620667o54548r53334K34409j54733m18005
$$ 36123529 35957662 35651525 34600464 32979797 32325249 31371915 31606324 31451591 31033586
5173C1033586m1467J461192J46248j69154P50462M35429L86782O93596J184384
$$ 31033586 30992119 32453311 32599559 32430405 33180867 33616296 34003078 34696674 35881058
5164C5881058K40057R7692j905974j915337j851186j559963j937849k49070o95535
$$ 35881058 36121115 36218807 34312833 32397496 30546310 28986347 27048498 26799428 26103893
5155B6103893j607402p6630q0463j139133m816M9462J34391p67188j005024o635
$$ 26103893 24496491 24419861 24339398 23200265 23195449 23244911 23379302 22612114 21607090 21600455
5145B1600455l97849k07699k11482j8591k93439n70979l84413O77790J09676l60020
$$ 21600455 21202606 20994907 20783425 20764834 20471395 19900416 19516003 20193793 20303469 19943449
5135A9943449k45415k16330j45181j21318p13395J48759j27619J35187J65204
$$ 19943449 19698034 19481704 19336523 19215205 18501810 18650569 18522950 18658137 18823341
5126A8823341m15311p22790j00189r212L26358l854j73239n490p8717l98089M01712
$$ 18823341 18408030 17685240 17585051 17575839 17902197 17898343 17725104 17719614 17640897 17242808 17644520
5115A7644520L78095l14134l54855o62000k50815J52174k89015M08283N33425
$$ 17644520 18022615 17708481 17353626 16691626 16440811 16592985 16303970 16712253 17245678
5106A7245678N03224m5720m273j44897m8594K21433J31226k2835J28770k36613
$$ 17245678 17748902 17703182 17698909 17554012 17505418 17726851 17858077 17835242 17964012 17727399
5096A7727399Q4084O26508Q37623j85270q51289J024502q38470k30135j106889
$$ 17727399 17811483 18437991 19275614 19090344 18239055 19263557 18425087 18194952 17088063
5087A7088063P29714K01299K27326O21668r05974j25041M50573P82209m70933
$$ 17088063 17817777 18019076 18246402 18868070 17962096 17837055 18287628 19069837 18598904
5078A8598904J29822R43396k51540n30621M6309Q98308J16157J98180M58615j54285
$$ 18598904 18728726 19672122 19420582 18889961 18936270 19834578 19950735 20148915 20607530 20453245
5068B0453245q25392L32487K97396R95983J82764n42667Q27545P56488O60925
$$ 20453245 19627853 19960340 20257736 21253719 21436483 20893816 21721361 22477849 23138774
5059B3138774M24352P36979L56505L76942k92751O42955J346092P38042J261182
$$ 23138774 23563126 24300105 24656610 25033552 24740801 25383756 26729848 27467890 28729072
5050B8729072J6304P57056J071280R07984O25907Q63851Q41996N97672L45945
$$ 28729072 28745376 29502432 30573712 31481696 32107603 32971454 33813450 34411122 34757067
5041C4757067N55172R37774Q96326J204513O28330L30340q4989Q76660N07511
$$ 34757067 35312239 36250013 37146339 38350852 38979182 39309522 39224533 40101193 40608704
5032D0608704m40184N66124J444274q6127O21208O57218K84495O19261l4522L31308
$$ 40608704 40168520 40734644 42178918 42092791 42713999 43371217 43655712 44274973 44240451 44571759
5022D4571759J171130O83754L92149J15497N04582p00688O77707m5478J076006
$$ 44571759 45742889 46426643 46818792 46934289 47438871 46738183 47415890 47370412 48446418
5013D8446418l7335o78539m02789R66703o33062r72981n18090l30956P0814m49212
$$ 48446418 48409083 47730544 47327755 48294458 47661396 46688415 46170325 45839369 45910183 45460971
5003D5460971q65479p25694q10972n47436k32356j221381J46818o72861n5224
$$ 45460971 44595492 43869798 43058826 42511390 42279034 41057653 41204471 40531610 40476386
4994D0476386j097469n32584j064167m51477O48741P7228k23094j31633l22021
$$ 40476386 39378917 38846333 37782166 37330689 37979430 38056658 37833564 37701931 37379910
4985C7379910l60095j102540n5794n69425k3213p14330l1647m57353m68382o62650
$$ 37379910 37019815 35917275 35861481 35292056 35268843 34554513 34522866 34065513 33597131 32934481
4975C2934481j275196K9253j133011n32564o53935q7019j228487J17531o91624
$$ 32934481 31659285 31688538 30555527 30022963 29369028 29282009 28053522 28171053 27479429
4966B7479429l4678L85703j378908o59808k35631K27428N0060J63032r27736K72305
$$ 27479429 27444751 27830454 26451546 25791738 25556107 25783535 25833595 25996627 25068891 25341196
4956B5341196M49873k21231J40636l81588j129765p09437N25515M53489j768K4847
$$ 25341196 25791069 25569838 25710474 25328886 24199121 23489684 24015199 24468688 24466920 24491767
4946B4491767m99020m08150L5694R34011J35164o87504J03848M80273L36325j97847
$$ 24491767 23992747 23584597 23620291 24554302 24689466 24001962 24105810 24586083 24922408 24724561
4936B4724561k86500m11259p03622P47403J20891m88329m89428J6502O86064M08084
$$ 24724561 24438061 24026802 23323180 24070583 24191474 23703145 23213717 23230219 23916283 24324367
4926B4324367r53341Q97576p07637L80809M63101m00509r76527L6462L10006l1947
$$ 24324367 23371026 24268602 23560965 23941774 24404875 24004366 23027839 23064301 23374307 23342360
4916B3342360O8551L6793O33444n69533L93939L94320l16821l05800k45563J77943
$$ 23342360 23410911 23447704 24081148 23511615 23905554 24299874 23983053 23677253 23431690 23609633
4906B3609633N18730K135R13282K02827j118306q0482j0629n28803J366635j119229
$$ 23609633 24128363 24130498 25043780 25246607 24128301 24047819 24037190 23508387 24875022 23755793
4896B3755793L11340n2556m50523l06179N10872M33346Q65695m1300K4906Q3233
$$ 23755793 24067133 24014577 23564054 23257875 23768747 24202093 25067788 25026488 25051394 25134627
4886B5134627k74244j44786J18134m5828M17724O84617m03539l8069j39765l10173
$$ 25134627 24860383 24715597 24833731 24787903 25205627 25890244 25486705 25448636 25308871 24998698
4876B4998698j85048M00470q6361J3337j27449j92582k54022M2576L24865m32224
$$ 24998698 24813650 25214120 25127759 25141096 25013647 24821065 24567043 24609619 24934484 24502260
4866B4502260K63782O12132m89342R2331K98211k67301J13404m3815n59851l95361
$$ 24502260 24766042 25378174 24888832 24981163 25279374 25012073 25125477 25081662 24521811 24126450
4856B4126450J009303K99240k68710J012159o24182n37531O30065P75152l35055
$$ 24126450 25135753 25434993 25166283 26178442 25554260 25016729 25646794 26421946 26086891
4847B6086891L91037L80291k53978l35992j5305j84193Q33370m84003l07258L27452
$$ 26086891 26477928 26858219 26604241 26268249 26252944 26068751 26902121 26418118 26110860 26438312
4837B6438312o08889Q15088l1479N64914p90561l56408Q94087k16761j67713N75597
$$ 26438312 25829423 26644511 26613032 27177946 26387385 26030977 26925064 26708303 26540590 27116187
4827B7116187J147895N709J32035M40920n88559R03524m06748N4352K9755j87694
$$ 27116187 28264082 28269791 28401826 28842746 28254187 29157711 28750963 28805315 28835070 28647376
4817B8647376L34238K50173K83092R54961M63390o41794O48466O04613j09756
$$ 28647376 28981614 29231787 29514879 30469840 30933230 30291436 30939902 31544515 31434759
4808C1434759L08233K87430J99228Q2189J207609R4421P27969J34036k17001P79894
$$ 31434759 31742992 32030422 32229650 32311839 33519448 33613869 34341838 34475874 34258873 35038767
4798C5038767J32149P14624L12939J457489P24084J613216J548506J65373O06028
$$ 35038767 35170916 35885540 36198479 37655968 38380052 39993268 41541774 41707147 42313175
4789D2313175K232739K367903J219303N73829K750605L095092K853039L084716
$$ 42313175 44545914 46913817 48133120 48706949 51457554 54552646 57405685 60490401
4781F0490401K901486L781142L905240M176669M598799L425350M007916L380954
$$ 60490401 63391887 67173029 71078269 75254938 79853737 83279087 87287003 90667957
4773I0667957L725233K825135K753411K486620O75450P8212o15416q75692K17863
$$ 90667957 94393190 97218325 99971736 102458356 103133806 103212018 102596602 101720910 101938773
4764A01938773R38373K5625n36731j063620j035691k57204L94435O14510K30154
$$ 101938773 102877146 102902771 102366040 101302420 100266729 100009525 100403960 101018470 101248624
4755A01248624J093481M41753L60967o24215P5941p57162k041290k164196k998536
$$ 101248624 102342105 102783858 103144825 102520610 102596551 101839389 99798099 97633903 94635367
4746I4635367l517495m496969l512466l405540l980803k798066l450589m183064
$$ 94635367 91117872 86620903 83108437 79702897 75722094 72924028 69473439 65290375
4738F5290375l383141l134578k412321l028447k903159k620221k007619k354590
$$ 65290375 61907234 58772656 56360335 53331888 50428729 47808508 45800889 43446299
4730D3446299j935830j525548j645500j560887j734825j387917m97587q68423
$$ 43446299 41510469 39984921 38339421 36778534 35043709 33655792 33158205 32289782
4722C2289782j301897l76150q70552j436074j257979l79754K29359o23787p70949
$$ 32289782 30987885 30611735 29741183 28305109 27047130 26667376 26896735 26272948 25501999
4713B5501999k68518M422j307016p84072j96610K39309q73142l65456p141j105785
$$ 25501999 25233481 25237903 23930887 23146815 22950205 23189514 22316372 21950916 21943775 20837990
4703B0837990l82166P0162p94513m14212p17934o82631m04629q16487l41183J028189
$$ 20837990 20455824 20525986 19731473 19317261 18599327 17916696 17512067 16695580 16354397 17382586
4693A7382586o33227k72384m71296o62556J68810J97879n61759j424999J27452
$$ 17382586 16749359 16476975 16005679 15343123 15511933 15709812 15148053 13723054 13850506
4684A3850506k7840R25555K37858m11103p26240l31566K12986j90813J21920k90894
$$ 13850506 13822666 14748221 14986079 14574976 13848736 13517170 13730156 13539343 13661263 13370369
4674A3370369n88841k8459j87664p15122j52688k14357J55547J16372j56338m59821
$$ 13370369 12781528 12753069 12565405 11850283 11697595 11483238 11638785 11755157 11598819 11138998
4664A1138998j79345M15264p39359o53834j61325K44551L8742r88640O3243J60965
$$ 11138998 10959653 11374917 10635558 9981724 9820399 10064950 10103692 9115052 9178295 9339260
4654I339260O8832k44414p9758n53513m66715L32672o00540j32799k10738j8902
$$ 9339260 9408092 9163678 9083920 8530407 8063692 8396364 7795824 7663025 7452287 7433385
4644G433385J99335k04156O84665r2520n10458o5858m68985N04235K29279l44678
$$ 7433385 7632720 7428564 8113229 8020709 7510251 7444393 6975408 7479643 7708922 7364244
4634G364244l75155l64563N26959P14971q36228P13896o58494o38940j34419l0517
$$ 7364244 6989089 6624526 7151485 7866456 7030228 7744124 7085630 6446690 6312271 6281754
4624F281754M81290j26588M22766m62187p45666l64637R57832j25290p20841l88020
$$ 6281754 6763044 6636456 7059222 6597035 5851369 5486732 6444564 6319274 5598433 5210413
4614E210413O33659j50417p05657J44134r7407M55904K63387j78654o2019P7155
$$ 5210413 5844072 5693655 4987998 5132132 5034725 5490629 5754016 5575362 5513343 5590498
4604E590498R51326N90842q41541j167493N81661R89906m80535k40629q69175
$$ 5590498 6541824 7132666 6291125 5123632 5705293 6695199 6214664 5974035 5104860
4595E104860K33228k9324k88407L00249m24894K02989k7010K28524P36614j020930
$$ 5104860 5338088 5308764 5020357 5320606 4895712 5098701 5071691 5300215 6036829 5015899
4585E015899J50771o67753n01191Q14662L32917P1721m84172R1744n51626M70806
$$ 5015899 5166670 4498917 3997726 4812388 5145305 5217026 4732854 4824598 4272972 4743778
4575D743778J69349j93377N0914l96577m09182N03528l581m65386M29254L88057
$$ 4743778 4913127 4719750 4770664 4374087 3964905 4468433 4464852 3999466 4428720 4816777
4565D816777Q07330M1371j68236n46413o121K58915k71243J91738j5700j53638
$$ 4816777 5624107 5665478 5497242 4950829 4944708 5203623 4932380 5124118 5108418 4954780
4555D954780j50261j44901r6475k73471o42685N72626k55563m38593N79398P74152
$$ 4954780 4804519 4659618 4563143 4289672 3646987 4219613 3964050 3525457 4104855 4879007
4545D879007r9461P4O43539p8394r76316k81167n92994k58830J016138O40545
$$ 4879007 4779546 4779620 5423159 5344765 4368449 4087282 3494288 3235458 4251596 4892141
4535D892141J5532j192161M19081k62299J13849J59975J14721j83996p19083N87872
$$ 4892141 4907673 3715512 4134593 3872294 3986143 4146118 4260839 4076843 3357760 3945632
4525C945632M07569j94281n69704N8880J140073q2877o8801k55690J65952k7074
$$ 3945632 4353201 4158920 3589216 3648096 4788169 4705292 4636491 4380801 4546753 4519679
4515D519679j54069O8714N04966R8806l39046l71521k30661K12371j65792O85581
$$ 4519679 4365610 4434324 4939290 5038096 4699050 4327529 4096868 4309239 4143447 4829028
4505D829028l94925l65823R1578l64570M29135R86586l04603n60545l48001l35500
$$ 4829028 4434103 4068280 4159858 3795288 4224423 5211009 4906406 4345861 3997860 3662360
4495C662360N68400o6710l60623O33818l27850k62435L32119m06527L91950L60477
$$ 3662360 4230760 4164050 3803427 4437245 4109395 3846960 4179079 3772552 4164502 4524979
4485D524979l60114J37204K0912j68656N39685J00168p1841p10739k02859M62780
$$ 4524979 4164865 4302069 4322981 4154325 4694010 4794178 4722337 4011598 3808739 4271519
4475D271519P13354L92830p99355M18886n35360M47766j61393p5883M5191J17875
$$ 4271519 4984873 5377703 4578348 4997234 4461874 4909640 4748247 4672364 4717555 4835430
4465D835430O79813O71298n40762L20102J84739J27840m03226l97518K75407k49827
$$ 4835430 5515243 6186541 5645779 5965881 6150620 6278460 5875234 5477716 5753123 5503296
4455E503296L45359m9681r4950M85282j66954k93566K16710J61117O80059K42053
$$ 5503296 5848655 5798974 5704024 6189306 6022352 5728786 5945496 6106613 6786672 7028725
4445G028725J76300J502789m06313j117615K73084O3296o82286l10957P11099
$$ 7028725 7205025 8707814 8301501 7183886 7456970 7520266 6837980 6527023 7238122
4436G238122j01237N78168N32467J60571j10530K92747J006905j943k13960Q42273
$$ 7238122 7136885 7715053 8247520 8408091 8297561 8590308 9597213 9595270 9381310 10223583
4426A0223583P4688r6296O92324j8357J30310J334181m35174n39242Q98055L94702
$$ 10223583 10298271 10201975 10894299 10875942 11006252 12340433 11905259 11366017 12264072 12658774
4416A2658774k83900J03874K66968K39924J378547k86660J32884J287774M75269
$$ 12658774 12374874 12478748 12745716 12985640 14364187 14077527 14210411 15498185 15973454
4407A5973454L0649Q83487K46238p8243L35231P04688Q52605R65850J071182M50139
$$ 15973454 16004103 16887590 17133828 17055585 17390816 18095504 18948109 19913959 20985141 21435280
4397B1435280J649054L54777J102240J672894J535532K192963K190126L946289
$$ 21435280 23084334 23439111 24541351 26214245 27749777 29942740 32132866 36079155
4389C6079155L068766L340863M568549M984980N505028O171969P675760O606774
$$ 36079155 39147921 42488784 47057333 52042313 57547341 63719310 71395070 78001844
4381G8001844O276760M803644L962743N266438O325050P693559J0047335R991278
$$ 78001844 84278604 89082248 93044991 98311429 104636479 112330038 122377373 132368651
4373A32368651Q205037L526514J8747L57210J508319N065083P265226P900598
$$ 132368651 140573688 144100202 144118949 144476159 145984478 151049561 158314787 166215385
4365A66215385O067341o98411n798055q875722p728776n262660l175085j505610
$$ 166215385 172282726 171584315 165786260 156910538 149181762 143919102 140744017 139238407
4357A39238407k90543k410655o593580j0683975r923047q470469o318194m698197
$$ 139238407 138947864 136537209 129943629 119259654 109336607 100866138 94547944 89849747
4349H9849747l648736m341998n821671o195072p653966o623205n905593n389929
$$ 89849747 86201011 81859013 76037342 69842270 62188304 55565099 49659506 44269577
4341D4269577k800568l040947l110325k743642k777974j638001j500247q10703
$$ 44269577 41469009 38428062 35317737 32574095 29796121 28158120 26657873 25847170
4333B5847170j778829j751946n54155r6437j522095j759591n43425r38497o30563
$$ 25847170 24068341 22316395 21762240 21665803 20143708 18384117 17840692 16902195 16271632
4324A6271632l9844o55545m87390N44466r27323r77364J6677m71525M77148p31284
$$ 16271632 16231788 15576243 15088853 15633319 14705996 13728632 13745309 13273784 13750932 13019648
4314A3019648p94767k05156L9161r2695o47729k88183o17796J44657N08380j022273
$$ 13019648 12224881 12019725 12058886 11966191 11318462 11030279 10412483 10557140 11065520 10043247
4304A0043247q35423k06750J47707P63197k18012k60874M06708k22068j91117
$$ 10043247 9207824 9001074 9148781 9911978 9693966 9433092 9839800 9617732 9426615
4295I426615j401213k84238O16594J91206Q27794l07163q97537j48901n28839
$$ 9426615 8025402 7741164 8357758 8548964 9376758 9069595 8172058 8023157 7494318
4286G494318L07454j01087O0155K18027j90943l34924P12263k13563J51089r52143
$$ 7494318 7801772 7700685 7760840 7978867 7787924 7453000 8165263 7951700 8102789 7150646
4276G150646L16218n11524l42715J24131J89711K35918M53950n33363r55453m33591
$$ 7150646 7466864 6955340 6612625 6736756 6926467 7162385 7616335 7082972 6127519 5693928
4266E693928O00148k72791o2070J81215o7778K21387m99171j85604M53654Q3465
$$ 5693928 6294076 6021285 5959215 6140430 6072652 6294039 5794868 5609264 6062918 6146383
4256F146383l11718p43599m90440J302229j36211o04262j036980L00896k17367
$$ 6146383 5834665 5091066 4600626 5902855 5766644 5162382 4125402 4426298 4208931
4247D208931N74274N2214O2580P91373m94012o24494l79986N79980Q72839k60041
$$ 4208931 4783205 4835419 4897999 5689372 5195360 4570866 4190880 4770860 5643699 5383658
4237E383658Q6803o28005l88741L38741P52659L19400m0973m09048m6567M67838
$$ 5383658 5470461 4842456 4453715 4792456 5545115 5864515 5823542 5414494 5367927 5835765
4227E835765J71735Q73730n0868L71796P30242n32831N09668k68943m02441o31531
$$ 5835765 6007500 6881230 6830362 7202158 7932400 7399569 7909237 7640294 7237853 6606322
4217F606322m34837o46162m51543P48352Q8737k09580m48695L5476L60847L31513
$$ 6606322 6171485 5525323 5073780 5822132 5910869 5701289 5252594 5288070 5648917 5980430
4207E980430k0015q50556l75651l7699m01637N36830L73780m01527m65785j087033
$$ 5980430 5960415 5109859 4734208 4696509 4294872 4831702 5205482 4803955 4338170 3251137
4197C251137J35551L00566K35348J64039L850J83947M45066l51861m64004l48514
$$ 3251137 3386688 3687254 3922602 4086641 4090491 4274438 4719504 4367643 3903639 3555125
4187C555125L77707N40961m50771p8920N99233o19557M80138l06403R51383J66206
$$ 3555125 3932832 4473793 4023022 3944102 4543335 3923778 4403916 4097513 5048896 5215102
4177E215102j039068J39139O14157K95328q45027j41533N55854m31586o05684
$$ 5215102 4176034 4315173 4929330 5224658 4379631 4238098 4793952 4362366 3756682
4168C756682R6552N69235M37813l57002M22969M70785J68043r7399K60369o85514
$$ 3756682 3853234 4422469 4860282 4503280 4926249 5397034 5565077 5467678 5728047 5042533
4158E042533j81072m8235L63232M4616n56807K49564K21657L39510N82798r7142
$$ 5042533 4861461 4813226 5176458 5221074 4664267 4913831 5135488 5474998 6057796 5960654
4148E960654p5565O51849m67418Q3701l47638m01288M40684n444o16803L67524
$$ 5960654 5885089 6536938 6069520 6153221 5805583 5404295 5844979 5839535 5222732 5590256
4138E590256J31521l90171P56844Q61088p3046L07850k05169l70827Q00358n16638
$$ 5590256 5721777 5331606 6088450 6949538 6876492 7184342 6979173 6608346 7408704 6892066
4128F892066N81436O93320j93972o58644p5581k409M0407j52091R1994N71380
$$ 6892066 7473502 8166822 7972850 7314206 7238625 7236216 7276623 7124532 7216526 7787906
4118G787906k43322k67191J016731p33800L5816R25893M23712p08746M68514q05203
$$ 7787906 7544584 7277393 8294124 7560324 7596140 8522033 8945745 8236999 8705513 7900310
4108G900310m91001N33644m94865j73193O75506K43922j54257O87104j12025L07323
$$ 7900310 7409309 7942953 7448088 7274895 7950401 8194323 8040066 8727170 8615145 8922468
4098H922468L81402L86459L37301k5394k90604J76223K52051Q13831p04427N721
$$ 8922468 9303870 9690329 10027630 10002236 9711632 9887855 10139906 10953737 10249310 10255031
4088A0255031J46656O31849L40730K47247p573M03342m29424J46414L28571k12358
$$ 10255031 10401687 11033536 11374266 11621513 11613940 12017282 11587858 11734272 12062843 11850485
4078A1850485P62144O428P56659M24901l43324K66071R36249l58192L48253J88766
$$ 11850485 12612629 12619057 13375716 13800617 13457293 13723364 14659613 14301421 14649674 14838440
4068A4838440l8824N74632k6579m18683P15535Q96082J077976P12181O50008O85226
$$ 14838440 14799616 15374248 15347669 14928986 15644521 16540603 17618579 18330760 18980768 19665994
4058A9665994n3657Q86107J821977J48232M36702N23473o3828J17077O25457R81769
$$ 19665994 19612337 20498444 22320421 22468653 22905355 23428828 23365000 23482077 24107534 25089303
4048B5089303J129814L41572J138456K98877P57977K90787J643434J249261j80236
$$ 25089303 26219117 26560689 27699145 27998022 28755999 29046786 30690220 31939481 31759245
4039C1759245O10382J685977J362630J337623O61163J518574J944852J689621
$$ 31759245 32369627 34055604 35418234 36755857 37417020 38935594 40880446 42570067
4031D2570067J155983J329249N60466J880012J024323J806208L197853J709450
$$ 42570067 43726050 45055299 45615765 47495777 48520100 50326308 53524161 55233611
4023E5233611K340881K134547J882288K312305K409619K663557K449346K502458
$$ 55233611 57574492 59709039 61591327 63903632 66313251 68976808 71426154 73928612
4015G3928612K733498K629911M007904K214023K858212L379178L485713K718573
$$ 73928612 76662110 79292021 83299925 85513948 88372160 91751338 95237051 97955624
4007I7955624L734424K415362L498645L561330L397547L067272L709031K749978
$$ 97955624 101690048 104105410 107604055 111165385 114562932 117630204 121339235 124089213
3999A24089213M338407M675071N536024M910922M869313O939080P521344P840231
$$ 124089213 128427620 133102691 138638715 143549637 148418950 155358030 162879374 170719605
3991A70719605J0008830J2913484J3307458J6284135K0646027K5494430L0892751
$$ 170719605 180728435 193641919 206949377 223233512 243879539 269373969 300266720
3984C00266720P314253k4275203l6879174l1727840j9600685j3557987r754491
$$ 300266720 307580973 283305770 246426596 214698756 195098071 181540084 171785593
3977A71785593p691240o512408o679997o960979n612609m252058l575250m272724
$$ 171785593 164094353 157581945 150901948 143940969 138328360 134076302 130501052 126228328
3969A26228328m544416l060035k995634l749352k831450l793344l405827l064928
$$ 126228328 121683912 118623877 115628243 111878891 109047441 105254097 101848270 98783342
3961I8783342k656510k494464k574832k866231l225282k509433j930032l069333
$$ 98783342 96126832 93632368 91057536 88191305 84966023 82456590 80526558 77457225
3953G7457225l410154k478505k755835k092721k417725k652666k150007j999731
$$ 77457225 74047071 71568566 68812731 66720010 64302285 61649619 59499612 57499881
3945E7499881k727443k421198j465642j061825k008676k069966j652115j077396
$$ 57499881 54772438 52351240 50885598 49823773 47815097 45745131 44093016 43015620
3937D3015620r93254r22832j047140j223822j144149p21288j297733q96522j164255
$$ 43015620 42022366 41099534 40052394 38828572 37684423 36963135 35665402 34768880 33604625
3928C3604625l86343q67531J46788k63467j104068p89117M03089n2034j00265
$$ 33604625 33218282 32350751 32497539 32234072 31130004 30340887 30743976 30691942 30591677
3919C0591677o98373l45967J3470N55633r0364K03747P4053k47167j74822l10453
$$ 30591677 29893304 29547337 29560807 30116440 30026076 30229823 30303876 30056709 29881887 29571434
3909B9571434P45665L99166K9937J33800l6001K34543M57665n04775l62091J426014
$$ 29571434 30317099 30716265 30746202 30880002 30844001 31078544 31536209 31031434 30669343 32095357
3899C2095357L07459j08340J767303O99743l90392L88643L82379O49435K65695
$$ 32095357 32402816 32294476 34061779 34761522 34371130 34759773 35142152 35791587 36057282
3890C6057282K89190J03625P01951l916J465597M62660P04439J108016Q11636
$$ 36057282 36346472 36450097 37152048 37148132 38613729 39076389 39780828 40888844 41700480
3881D1700480J310909J761094M36140J470708J494539J341271J557187J261486
$$ 41700480 43011389 44772483 45208623 46679331 48173870 49515141 51072328 52333814
3873E2333814K485258K280994J740485K071765J998248K527657K895455L176935
$$ 52333814 54819072 57100066 58840551 60912316 62910564 65438221 68333676 71510611
3865G1510611L318640K964707N375952M878704M697381L996328M837798M990238
$$ 71510611 74829251 77793958 83169910 88048614 92745995 96742323 101580121 106570359
3857A06570359M851153O067533O670062O119821N771815N331725N664291M244553
$$ 106570359 111421512 117489045 124159107 130278928 136050743 141382468 147046759 151291312
3849A51291312L129364M160227L077543K179422J662681L85506J079435K94344
$$ 151291312 154420676 158580903 161658446 163837868 165500549 165886055 166965490 167259834
3841A67259834j541081m70034j799905k781450k236119k831541l434291m463182
$$ 167259834 165718753 165248719 163448814 160667364 158431245 155599704 152165413 147702231
3833A47702231l670800n094593m839312n758976n456069n301620n936261m695529
$$ 147702231 144031431 138936838 134097526 128338550 122882481 117580861 111644600 106949071
3825A06949071m587357o089579n299214m870371m676855l546781l254252l677896
$$ 106949071 102361714 96272135 90972921 86102550 81425695 77878914 74624662 70946766
3817G0946766k431332l595493l272623j288293j717652l484038k029786j313476
$$ 70946766 68515434 64919941 61647318 60359025 58641373 55157335 53127549 51814073
3809E1814073k373429j755158p79859j963036j196670m57413j707496q00639j210380
$$ 51814073 49440644 47685486 46905627 44942591 43745921 43288508 41581012 40780373 39569993
3800C9569993p26683p83833j380711p6165l33583r96632q58127J11625m41111
$$ 39569993 38843310 38059477 36678766 36602601 36269018 35272386 34414259 34525884 34084773
3791C4084773p18574J66132k34691r11544q39603J12877l14540o96620K73783
$$ 34084773 33366199 33532331 33297640 32386096 31546493 31659370 31344830 30648210 30921993
3782C0921993j15275n37356m1896p46391J77072L51917n3150o7728n21046p6892
$$ 30921993 30806718 30269362 30227466 29481075 29658147 30010064 29956914 29889186 29368140 29291248
3772B9291248M23801O37049r128P54254l30151J41757o35655j73305K89572N89800
$$ 29291248 29715049 30352098 30342970 31097224 30767073 30908830 30273175 30099870 30389442 30979242
3762C0979242Q16522J0189M71632P8634L41183k10188N94128P66608J113154K83526
$$ 30979242 31795764 31805953 32277585 32356219 32697402 32487214 33081342 33847950 34961104 35244630
3752C5244630J156698P13586J480352P04972J452432J982597J193973J808495
$$ 35244630 36401328 37114914 38595266 39300238 40752670 42735267 43929240 45737735
3744D5737735J620111K437361K950571L558979L726121M514508M672885N728570
$$ 45737735 47357846 49795207 52745778 56304757 60030878 64545386 69218271 74946841
3736G4946841O063131P313452P483657P514783Q731624R722050R049856R076976
$$ 74946841 81009972 88323424 95807081 103321864 112053488 121775538 130825394 139902370
3728A39902370Q740940P603784N890235L977944L796584J733635M06938l81551
$$ 139902370 148643310 156247094 162137329 166115273 169911857 171645492 172052430 171670879
3720A71670879m83789j359757n70778j408051o552j025049k321643k747550l835259
$$ 171670879 171187090 169827333 169256555 167848504 167841952 166816903 164495260 161747710 157912451
3711A57912451m014521o122435p645023q683961q482417q971695r333473p268409
$$ 157912451 153897930 147775495 140130472 131446511 122964094 113992399 104658926 97390517
3703I7390517p404734o588556o165237m837845n090412m881000l530341k652846
$$ 97390517 89985783 83397227 77231990 72394145 67303733 62422733 58892392 56239546
3695E6239546l294146l165524k475579j986948j599102k341181k095854j260500
$$ 56239546 52945400 49779876 47304297 45317349 43718247 41377066 39281212 38020712
3687C8020712r50203p07998j402686o10145j031469j281042n26065r74065N40513
$$ 38020712 37070509 36362511 34959825 34349680 33318211 32037169 31511104 30537039 31077552
3678C1077552r93783p97260m21956m95515m19923O08446r2688p50151L62883j290364
$$ 31077552 30083769 29286509 28864553 28369038 27949115 28557561 28464873 27714722 28077605 26787241
3668B6787241J70535K02752j27609L54682j35075m39817m18299L09282M12899
$$ 26787241 26957776 27160528 27032919 27387601 27252526 26812709 26394410 26703692 27116591
3659B7116591M55599j46400P03345k34228K94348P68029Q69798m35311j14614
$$ 27116591 27572190 27425790 28129135 27894907 28189255 28957284 29827082 29391771 29277157
3650B9277157P70770J635146J715834P23711L06661M59825J098561J44890J164876
$$ 29277157 30047927 31683073 33398907 34122618 34429279 34889104 35987665 36132555 37297431
3641C7297431R00277J370101K007333J193108K51279J804930R79604R85907K6946
$$ 37297431 38197708 39567809 41575142 42768250 43019529 44824459 45804063 46789970 46816916
3632D6816916L35051K356142N81532N88300R69917R62047P6335J053539o6744
$$ 46816916 47151967 49508109 50089641 50677941 51647858 52609905 52686240 53739779 53673035
3623E3673035R78310n37126o2374k90592P52458q9443j55934P49658j039146j93957
$$ 53673035 54651345 54114219 54051845 53761253 54513711 54424268 54268334 55017992 53978846 53784889
3613E3784889l31876K14320J61423o65654p61231l86496q047J53442L02246Q25510
$$ 53784889 53453013 53667333 53828756 53163102 52401871 52015375 52007328 52160770 52463016 53288526
3603E3288526L92844K22564J245656J118221Q99776J764775K020781J618005J673005
$$ 53288526 53681370 53903934 55149590 56267811 57167587 58932362 60953143 62571148 64244153
3594F4244153K392149J919963K921937K187777K806387M141027M106466L821416
$$ 64244153 66636302 68556265 71478202 73665979 76472366 80613393 84719859 88541275
3586H8541275L882248M628523M405598L692903M132165M391125M432400M742216
$$ 88541275 92423523 97052046 101457644 105150547 109282712 113673837 118106237 122848453
3578A22848453M176673L191393L902244M673881L730499L675788K831187K417056
$$ 122848453 127025126 130216519 134118763 138792644 142523143 146198931 149030118 151447174
3570A51447174L128768K447165J986510J400696J104249R46574K49749q793L04367
$$ 151447174 154575942 157023107 159009617 160410313 161514562 162461136 162710885 162702092 163006459
3561A63006459m50340m92785O1123K20255j3172l72711p13621m54764K69472m29976
$$ 163006459 162556119 162063334 162124457 162344712 162331540 161958829 161245208 160790444 161059916 160629940
3551A60629940m90947n06505J014754K91134n49178m10665R11262l25801k27796
$$ 160629940 160138993 159632488 160647242 160938376 160389198 159978533 160889795 160563994 160336198
3542A60336198j04731p97780j2562J94675L70972k36447j298318p74826j246400
$$ 160336198 160231467 159433687 159421125 159615800 159986772 159750325 158452007 157677181 156430781
3533A56430781j456682j559350j220117j870327l469132k089553l145362l283027
$$ 156430781 154974099 153414749 152194632 150324305 146855173 144765620 141620258 138337231
3525A38337231l948392l229067m298041m090532m452501m967712l455966l884620
$$ 138337231 134388839 131159772 126861731 122771199 118318698 113350986 109895020 106010400
3517A06010400l268341l575284l901820m428944n020028l979012m570089k981415
$$ 106010400 102742059 99166775 95264955 90836011 85815983 81836971 77266882 74285467
3509G4285467k671730l002926k544465j889249k955743k750596k429358m93287
$$ 74285467 71613737 68610811 66066346 64177097 61221354 58470758 56041400 55548113
3501E5548113p05126j471179r81523L9569p71156j021437Q4878o57407l52233
$$ 55548113 54842987 53371808 52390285 52429854 51658698 50637261 50722139 50064732 49712499
3492D9712499j31144j46383K45112L51149K18545l14073M2869k1674j020135K81257
$$ 49712499 49581355 49434972 49680084 50031233 50249778 49935705 49978574 49956900 48936765 49218022
3482D9218022J90433O39216j226362L57189r4785j218112j1868j232497q55416
$$ 49218022 49408455 50047671 48821309 49178498 49083713 47865601 47853733 46621236 45765820
3473D5765820m40256j137639n23057j821483j233712j866633p52659p26222j267756
$$ 45765820 45325564 44187925 43664868 41843385 40609673 38743040 37990381 37264159 35996403
3464C5996403q00462p48206r42932o51118j032080j423659j356024o49285q03962
$$ 35996403 35195941 34447735 33504803 32853685 31821605 30397946 29041922 28392637 27588675
3455B7588675j766786j241714j463097j064118j146852j039309n1879n64003j239846
$$ 27588675 25821889 24580175 23117078 22052960 20906108 19866799 19814920 19250917 18011071
3446A8011071n22480j356077k91646m47038K02911m99170k72835j81769n28693
$$ 18011071 17488591 16132514 15840868 15393830 15596741 15097571 14824736 14642967 14114274
3437A4114274l62294M51876o42443m3800k94630r10276j54853o60644m7276k54814
$$ 14114274 13751980 14203856 13561413 13517613 13222983 12312707 12157854 11497210 11449934 11195120
3427A1195120J28321P58609j96875p23856L84301k13033q13758r70956j57107
$$ 11195120 11323441 12082050 11885175 11161319 11545620 11332587 10518829 9547873 9390766
3418I390766r72425L77634O09953p00169j52656m07109j35280J83962O43585l91808
$$ 9390766 8418341 8795975 9405928 8705759 8553103 8145994 8010714 8194676 8838261 8446453
3408H446453r23784q52250M08619j16513L15179k42268m86236M41762M12350n12525
$$ 8446453 7522669 6670419 7079038 6962525 7277704 7035436 6549200 6990962 7403312 6890787
3398F890787n51497n05739N68319J34251l92274m73350M72326l12315j279189
$$ 6890787 6339290 5833551 6401870 6536121 6143847 5670497 6142823 5830508 4551319
3389D551319P78476k78898o14324r5037O16662R37140M37315j247136j23935K16752
$$ 4551319 5329795 5050897 4436573 4341536 4958198 5895338 6332653 5085517 4961582 5178334
3379E178334j3773j465687M7790M56927r49196Q4957M79558L6626J21357L05628
$$ 5178334 5164561 3698874 3746664 4203591 3254395 3339352 3818910 3855536 3976893 4282521
3369D282521o04445k38054K94223P43580O32857R0292m90270n10727o87998j088217
$$ 4282521 3678076 3440022 3734245 4477825 5110682 5200974 4710704 4199977 3511979 2423762
3359B423762P06739L22532j43305m9024N30681n9129l28553j25638J77750k17166
$$ 2423762 3130501 3453033 3309728 3260704 3791385 3732256 3403703 3278065 3455815 3238649
3349C238649j29968J184611n7685j340159M56892O51969R2241p71924N69263j4462
$$ 3238649 3108681 4293292 4235607 2895448 3352340 4004309 4096550 3324626 3893889 3879427
3339C879427l90884K76850L82023M45027p63274p18185k55010r1021J057520J061716
$$ 3879427 3488543 3765393 4147416 4592443 3829169 3110984 2855974 2764953 3822473 4884189
3329D884189K256M3522j538762m80273N75850J42171m07970O36604o14821n82074
$$ 4884189 4886445 4929967 3391205 2910932 3486782 3628953 3220983 3857587 3242766 2660692
3319B660692P96473O95605j09317j51813p22575m92094p6946k9953O05470q5244
$$ 2660692 3457165 4152770 4043453 3891640 3169065 2676971 2600025 2570072 3175542 3090298
3309C090298K37211q9786J71458O27625n79282l71549O57088k23322o13441L48706
$$ 3090298 3327509 3237723 3409181 4036806 3457524 3085975 3743063 3519741 2906300 3255006
3299C255006J62775l228p12900J45455L04490j37093J80498l24630N2967k1410
$$ 3255006 3417781 3414553 2701653 2847108 3151598 3014505 3195003 2870373 2923340 2901930
3289B901930M29539k48047N03646O43668l19090o69666J24153o10861M79459N76027
$$ 2901930 3331469 3083422 3587068 4230736 3911646 3241980 3366133 2755272 3234731 3810758
3279C810758M34470K9906m08860l79381N28459N74967J31781k09380j175965M7870
$$ 3810758 4245228 4275134 3866274 3486893 4015352 4590319 4722100 4512720 3336755 3384625
3269C384625J81793M86191o93348r0565J151418j45199l43506k46441p19975N55092
$$ 3384625 3566418 4052609 3359261 3268696 4420114 4274915 3931409 3684968 2964993 3520085
3259C520085N96855J238834n57211l06793N47074n48377j00610O93175k18335
$$ 3520085 4116940 5355774 4798563 4491770 5038844 4490467 4389857 5083032 4864697
3250D864697m74689k19444J191848K1179l78268q51769j51358O51684K16215m65873
$$ 4864697 4390008 4170564 5362412 5383591 5005323 4153554 4002196 4653880 4870095 4404222
3240D404222P31738O0097N44641k0279k17204q9616n68551J97278N36342K37961
$$ 4404222 5135960 5196057 5740698 5720419 5503215 5413599 4845048 5042326 5578668 5816629
3230E816629M5550N77737o68195J21909l83950K48784N63906j104586m204O80096
$$ 5816629 5862179 6439916 5771721 5893630 5509680 5758464 6322370 5217784 5213580 5893676
3220E893676J86636k28173j63126P00782P42341k187M90459m0035L37512l12702
$$ 5893676 6080312 5852139 5689013 6389795 7132136 7129949 7620408 7580373 7917885 7605183
3210G605183p35357m0702N1497R94891k44219L05566n92440n40545k91388n67414
$$ 7605183 6869826 6829124 6880621 7875512 7631293 7936859 7344419 6803874 6512486 5945072
3200E945072r8378K13935q91311l5685j34654p23065O82631N69356n31416m56181
$$ 5945072 5846694 6060629 5169318 5133633 4998979 4275914 4958545 5527901 4996485 4540304
3190D540304r1460K94708M23177J42815o77658j251239K88644R03599l73809N45391
$$ 4540304 4448844 4743552 5166729 5309544 4631886 3380647 3669291 4572890 4199081 4744472
3180D744472N24621j71422n98820P6607l29565p24469M3106O66022k5189M74086
$$ 4744472 5269093 5097671 4498851 4575458 4245893 3521424 3564530 4230552 4205363 4679449
3170D679449K95837j69199j59931L08927l83184l72905P7826p9103o84098N20644
$$ 4679449 4975286 4806087 4646156 4955083 4571899 4198994 4276820 4197717 3513619 4034263
3160D034263M8128L44129J59259M93284m90217O68045N30441q60973j22350j02737
$$ 4034263 4082391 4426520 4585779 5079063 4588846 5256891 5787332 4926359 4804009 4701272
3150D701272m05997k15573L72384J1475R96580m71674L39504K01862K26326k12634
$$ 4701272 4295275 4079702 4452086 4463561 5460141 4988467 5327971 5529833 5756159 5543525
3140E543525m20535m86813L64556n57785M72255n52437j10802N88974j73229j94960
$$ 5543525 5122990 4636177 5000733 4442948 4915203 4362766 4251964 4840938 4667709 4472749
3130D472749L08884N0740N04652K10457l90317J16441m09587K77547l34685m29267
$$ 4472749 4781633 4832373 5337025 5547482 5157165 5273606 4864019 5141566 4806881 4377614
3120D377614J32521k38233M65684M06742j22746n97018M29916J230531j399200
$$ 4377614 4510135 4271902 4737586 5144328 5021582 4424564 4854480 6085011 4685811
3111D685811L26926L18672M52939p18687O41225o4616k21883K69218Q53703p01911
$$ 4685811 5012737 5331409 5784348 5065661 5706886 5642270 5420387 5689605 6543308 5841397
3101E841397L3821Q38742k30115k41484j45472L36694j22340O74278l00468J371327
$$ 5841397 5875218 6713960 6483845 6242361 6096889 6433583 6311243 6985521 6685053 8056380
3091H056380q84447R37074J383899R62427L93088J809438M81774K016799L084552
$$ 8056380 7171933 8109007 9492906 10455333 10848421 12657859 13139633 15156432 18240984
3082A8240984J672790L672325M263343M022839J390822j299496n858369n561695
$$ 18240984 19913774 23586099 27849442 31872281 33263103 31963607 26105238 20543543
3074B0543543k562516k288529j364358m70070j39313o47127o55332j274868k45177
$$ 20543543 17981027 15692498 14328140 13858070 13718757 13071630 12416298 11141430 10896253
3065A0896253J03995J07678N71982K31413k8855P32828R40160P26074K243923
$$ 10896253 11000248 11107926 11679908 11911321 11882466 12615294 13555454 14281528 16525451
3056A6525451J291354J331364J933670L601048M161161L107455N348595N906289
$$ 16525451 17816805 19148169 21081839 24682887 28844048 31951503 37300098 43206387
3048D3206387Q214721Q159108L78815p401285j0619999q291125n180927l420600
$$ 43206387 51421108 59580216 59959031 52557746 41937747 33646622 28465695 25045095
3040B5045095k919373k142199j502854k306679j877157k20891m80514q69631K75836
$$ 25045095 22125722 19983523 18480669 16173990 14296833 14075942 13595428 12725797 13001633
3031A3001633q17169P42p29227J86305N91640J60573o993R94005J307704R49089
$$ 13001633 12184464 12185206 11455979 11642284 12233924 12394497 12387504 13381509 14689213 15638302
3021A5638302J477974J446903J962194K007689K949124L672365L820383j475180
$$ 15638302 17116276 18563179 20525373 22533062 25482186 29154551 32974934 31499754
3013C1499754n696094m896547k751258k557846j351044o94991j044715j133145
$$ 31499754 25803660 20907113 18155855 15598009 14246965 13551974 12507259 11374114
3005A1374114j123519j349277j08260m9357j40531L45740P81104o01433l9478
$$ 11374114 10250595 8901318 8793058 8743701 8603170 8948910 9730014 9128581 9089103
2996I089103J231606Q61996r8926O63042q3136N64215r28049j054724k80230r64878
$$ 9089103 10320709 11182705 11083779 11746821 11663685 12227900 11299851 10245127 9964897 9000019
2986I000019p81556j043018l69973J04038j78397O40884P91546p7828k76630k76809
$$ 9000019 8218463 7175445 6805472 6909510 6731113 7371997 8163543 8085715 7809085 7532276
2976G532276O36736L96314L22765J223715J283623J48021J088660J140217J259499
$$ 7532276 8169012 8565326 8888091 10111806 11395429 11543450 12632110 13772327 15031826
2967A5031826M35766p6546j355642r82700p22045j219661p55037j89322r44366
$$ 15031826 15467592 15391046 14035404 13052704 12330659 11110998 10355961 10166639 9222273
2958I222273r14408l98183o81267q55033k60040l47939J126314J02890P33967
$$ 9222273 8307865 7909682 7228415 6373382 6113342 5765403 6891717 6994607 7728574
2949G728574K28459n57289O08803k84821q6083L00605Q03101K99352L00957o0882
$$ 7728574 7957033 7399744 8008547 7723726 7637643 7938248 8741349 9040701 9341658 9280776
2939I280776k52660l15589q01711j013773n29735q69004l58290J89614o02579
$$ 9280776 9028116 8712527 7910816 6897043 6367308 5498304 5140014 5329628 4727049
2930D727049n59964j359r2978r4521j24619M52150q40984k94407n66258l88976
$$ 4727049 4167085 4165726 4072748 3978227 3853608 4305758 3464774 3170367 2604109 2215133
2920B215133L6629K20999P27171K54237p37384L6984o97747n82902p7830N59455
$$ 2215133 2251762 2472761 3199932 3454169 2716785 2753769 2056022 1473120 1395290 1954745
2910A954745P30170q88489k4245Q37522o98457j3536M71814j37944m39189J39728
$$ 1954745 2684915 1796426 1772181 2609703 1911246 1897710 2369524 2231580 1792391 1932119
2900A932119J61717J48085n583q6933N67981K79892K50749p59863j64947n99234
$$ 1932119 2093836 2241921 2236338 2149405 2717386 2997278 3248027 2488164 2323217 1723983
2890A723983M3412J075537L71489j37743n25069j77301R1671K18668K59539q44639
$$ 1723983 1767395 2842932 3214421 3076678 2551609 2374308 2465979 2684647 2944186 2099547
2880B099547k67111r30308J119707J440224R6472j342407j352838K39265N39864
$$ 2099547 1832436 902128 2021835 3462059 3558531 2216124 863286 1102551 1642415
2871A642415P50515k195m39508R29061Q6090j96469Q07386k15679q26874j43129
$$ 1642415 2392930 2390735 1951227 2880288 2966378 2769909 3577295 3361616 2534742 2391613
2861B391613j17087k34331K37219Q08854o07373K30697p0234n41714o726q1868
$$ 2391613 2274526 2040195 2277414 3086268 2478895 2709592 2639358 2097644 2090918 2009050
2851B009050M69969l1439L34679j47047o41811p58854j56758Q41493O0154o2514
$$ 2009050 2479019 2447580 2782259 2635212 1993401 1234547 1077789 1919282 1979436 1916922
2841A916922L27869J233200q16030p75908J80556j4455m5021n00976o7955M20225
$$ 1916922 2244791 3477991 2661961 1886053 2066609 2052154 2007133 1506157 1438202 1858427
2831A858427M93803k50634K524M65025o12725m16549O26310m61580M55992N88202
$$ 1858427 2352230 2101596 2104120 2569145 1956420 1539871 2166181 1704601 2160593 2748795
2821B748795m37603N6459j52533n03194p22555M21156P06621R4213m19679l81970
$$ 2748795 2311192 2367651 2215118 1711924 989369 1410525 2117146 2211359 1791680 1409710
2811A409710l6321m10713O16941p4236P01888k2699K30664j00064o39995K98089
$$ 1409710 1373389 962676 1579617 1505381 2207269 2184570 2415234 2315170 1675175 1973264
2801A973264l96996K90473k75394q4401M57124N41594p27224r58743K37793O631
$$ 1973264 1576268 1866741 1591347 1506946 1964070 2505664 1778440 819697 1057490 1064121
2791A064121l04394L00233J263814n79110L2026p07628p37163J288246N02386
$$ 1064121 759727 1059960 2323774 1744664 1776690 1069062 331899 1620145 2122531
2782B122531j667939N23088Q93335k86846o88578J63955k25420N22938J5737K48166
$$ 2122531 454592 977680 1871015 1584169 895591 1059546 834126 1357064 1372801 1620967
2772A620967k73593n9259M32647k91484Q65321l14785j119892J44568K34703J31309
$$ 1620967 1347374 1288115 1720762 1429278 2294599 1979814 859922 1004490 1239193 1370502
2762A370502j11k9211r30456K71386J534056j30363j75057n64811j31856p38431
$$ 1370502 1370391 1341180 410724 682110 2216166 2085803 1910746 1345935 1214079 475648
2752D75648O7898O86168Q6867l57525m79269J82403r2915J167097q2291p97289
$$ 475648 543546 1229714 1316581 959056 479787 662190 569275 1736372 1654081 856792
2742H56792Q3934k72102k33212n72804N50935Q61701J36462l17513j04301m77579
$$ 856792 940726 668624 435412 -137392 413543 1275244 1411706 1094193 989892 512313
2732E12313K64168Q74847l79765l46762L10559J43873o09861k3197M90799k52169
$$ 512313 776481 1651328 1271563 924801 1235360 1379233 769372 746175 1236974 984805
2722I84805j93665n76165Q45571k65088l16927J99032n21739R6002R0984j7788
$$ 984805 791140 214975 1060546 795458 478531 677563 155824 251826 342810 325022
2712C25022N53163j7751k23646q26489L20499k16263n6546P82086o62334J42360
$$ 325022 878185 860434 636788 -189701 130798 -85465 -142011 640075 -22259 120101
2702A20101J046168r60465j04515L17034k72201O98941k87366n53673J269257
$$ 120101 1166269 205804 101289 418323 146122 845063 557697 4024 1273281
2693A273281p7447q26969k34719j46252l49632M29007q6522J03396m3394k24481
$$ 1273281 1195834 368865 134146 -12106 -361738 67269 -19253 84143 40749 -183732
2683a83732M22214O32987r9153q044K4571o65705M37019J74089k92242K20752
$$ -183732 238482 871469 772316 764272 788843 123138 560157 734246 442004 662756
2673F62756N46002n14028o53415l49340o78622M76692O99096j66783Q9597n03466
$$ 662756 1208758 694730 41315 -308025 -986647 -509955 189141 22358 111955 -391511
2663c91511k06970N73223J69006O2662k68846k93048Q8522r9126J4373N06329
$$ -391511 -598481 -25258 143748 206410 -62436 -355484 -266962 -366088 -351715 154614
2653A54614l62322k31482O28467n39213j30942R0234M35494N60329J79617o09711
$$ 154614 -207708 -439190 189277 -349936 -480878 -390644 44850 605179 784796 175085
2643A75085l4417N41795k6874K52290l90067r94886N86164q09265M59842j32244
$$ 175085 140668 682463 655589 907879 517812 -477074 109090 -700175 -240333 -372577
2633c72577m56259l50506l0179k5855M15174N71056k07863O21057j29334l75014
$$ -372577 -828836 -1179342 -1209521 -1235376 -820202 -249146 -457009 164048 34714 -340300
2623c40300J29226J47090k79631n27517J085256j76815p56135K84780N05089L99034
$$ -340300 -211074 -63984 -343615 -871132 214124 37309 -718826 -434046 71043 470077
2613D70077r45197M36541L50248j78992N7912j77356N72193n09859J42768j02221
$$ 470077 -475120 -38579 311669 132677 190589 13233 585426 75567 218335 116114
2603A16114K08156J81193l12343R13592l16401n08197L12634Q06936l98750q94021
$$ 116114 324270 505463 193120 1106712 790311 282114 594748 1401684 1002934 108913
2593A08913q29385J23891K06766J02263J197679l67072n94532q20603k65632N70902
$$ 108913 -720472 -596581 -389815 -287552 910127 543055 -51477 -872080 -1137712 -566810
2583e66810m31444N04034O01278l29778J85097O97980r33685K89548N75240m06205
$$ -566810 -998254 -494220 107058 -222720 -37623 660357 -273328 16220 591460 185255
2573A85255J70197J98070m98070l38807J45714q4198o0583L92432o72505j24355
$$ 185255 355452 553522 55452 -283355 -137641 -221839 -282422 110010 -562495 -686850
2563f86850O30755M98761m87108p1891o21123L56040N80590o81703n66376M49139
$$ -686850 -56095 442666 -44442 -116333 -737456 -381416 199174 -482529 -1048905 -599766
2553e99766J90366K30420n73212Q6045R72291L32468L12059m93330o48302j81251
$$ -599766 -409400 -178980 -752192 -666147 306144 638612 950671 457341 -190961 -372212
2543c72212J50683M05108j18611k55838J29901k9339M86922j334422o23874N45306
$$ -372212 -221529 183579 64968 -190870 -60969 -90308 396614 -937808 -1561682 -1016376
2533a016376J035150M66437l40287M62976P72263l00045p65238k18664N6579j00735
$$ -1016376 18774 485211 144924 607900 1380163 1080118 314880 96216 152795 52060
2523E2060J73779j57136N77623q16335K97725R0143k30982K35495p15272J23272
$$ 52060 225839 68703 646326 -170009 127716 217859 -13123 222372 -492900 -369628
2513c69628k73787Q04534P69777m44008K68448n97781n06151L19005L9481P4116
$$ -369628 -643415 161119 930896 486888 755336 157555 -348596 -29591 9890 84006
2503H4006j51990k14056K41302L86789m04712j51659l94149R8234R32544k76328
$$ 84006 -67984 -282040 -40738 346051 -58661 -210320 -604469 -506235 426309 149981
2493A49981j1826j69900K29457m66983L96213M08700l94410o70202j73488O72135
$$ 149981 138155 -31745 197712 -269271 126942 535642 141232 -528970 -702458 -30323
2483c0323L66329j79720q32034L67573p3936m13598R65230o14050j06186J28652
$$ -30323 336006 156286 -675748 -308175 -382111 -795709 169521 -444529 -550715 -422063
2473d22063R4065Q55274j148512L92845K82374m27826r55181J840389O5550p52328
$$ -422063 -327998 527276 -621236 -228391 53983 -373843 -1329024 511365 576915 -175413
2463a75413l59033N30717J08463p17343L18472K36071J61163N94428K0031l85595
$$ -175413 -534446 -3729 104734 -612609 -294137 -58066 103097 697525 717556 331961
2453C31961K26425L71139J139261j008705j091900K83716j43627n90455Q47144
$$ 331961 558386 929525 2068786 1060081 -31819 251897 108270 -482185 364959
2444C64959K80661p57727p05957M52005N45115R4036N92516M8767k67290l24883
$$ 364959 645620 -112107 -818064 -366059 179056 273092 865608 914375 647085 322202
2434C22202n28888L4372N11369o6657L41117m73094L26711M45783l27108J40061
$$ 322202 -206686 -172314 339055 272398 613515 140421 467132 912915 585807 725868
2424G25868L31080n95119m83333o47596k20062l3205J98694m43394K03963l88211
$$ 725868 1056948 461829 -21504 -669100 -889162 -922367 -723673 -1167067 -963104 -1351315
2414a351315O70651J026648j52971J84273k24099l40158j63995r3656M8284Q21720
$$ -1351315 -680664 345984 193013 377286 153187 -186971 -350966 -444622 -396338 425382
2404D25382l06985m9283j19347N68634m3339M5366m79193j39780j08834l57704
$$ 425382 118397 69114 -50233 518401 475062 520428 41235 -98545 -207379 -565083
2394e65083k95888K62565P79655k35778r57052M03478M60584j30705L99261j09405
$$ -565083 -860971 -598406 181249 -54529 -1011581 -608103 -147519 -278224 121037 11632
2384A1632n85763M99423P2093P10064k96301j330938K47256K74388M36456L19747
$$ 11632 -574131 -74708 -2615 707449 411148 -919790 -672534 -398146 38310 358057
2374C58057k58960Q25068k35847o83189K66236P89783K52225j16666j99799m84868
$$ 358057 99097 924165 688318 5129 271365 1061148 1313373 1196707 996908 512040
2364E12040k74404M96153j93266k67815O79814J96177q9027L61195M05703k7351
$$ 512040 237636 733789 540523 272708 952522 1148699 1059672 1420867 1826570 1799219
2354A799219r08156q51893p38684L51861M65861Q49679J92987q07675j50051j2791
$$ 1799219 891063 39170 -699514 -347653 118208 967887 1160874 353199 203148 190357
2344A90357n79628K52472j0460k03790L96277l55020m06864n34329N7750R38083
$$ 190357 -389271 -136799 -147259 -351049 45228 -309792 -716656 -1250985 -1193235 -255152
2334b55152L74429m50343Q5574k23644J152350r5722r7513q34286K29935K53042
$$ -255152 119277 -331066 -245492 -469136 683214 587492 489979 -344307 -114372 138670
2324A38670Q54778k05240n65863o8776k23286j99778K53773L15734k28032j14881
$$ 138670 993448 788208 222345 153569 -69717 -269495 -15722 300012 71980 -42901
2314d2901m34436L53588O24412m14398K27691o7748l64346Q5883k07134J63760
$$ -42901 -477337 -123749 500663 86265 313956 246208 -118138 -32255 -239389 -75629
2304g5629k85863N02989P54200L0319q37227j04087j75870L34268l40078n53433
$$ -75629 -361492 141497 895697 926016 88789 -15298 -191168 143100 -196978 -750411
2294g50411k11135J204877J81284L81525j20705J74514p08912r46753K6420j46672
$$ -750411 -961546 243331 424615 806140 685435 859949 151037 -795716 -769296 -915968
2284i15968Q16698M92894m69769k51216k52089o88207O91223K0438M96859j62911
$$ -915968 -99270 393624 -76145 -327361 -579450 -1267657 -576434 -555996 -59137 -222048
2274b22048O4995k47969j29763O11463j98778l653L90070l13897M77495m60526
$$ -222048 -157053 -405022 -534785 76678 -122100 -125753 264317 -49580 427915 -32611
2264c2611J34774J71873q0001M6667J746841K74777j234839o51513n19423J028668
$$ -32611 102163 274036 194035 240702 1987543 2262320 1027481 375968 -143455 885213
2254H85213k90860j10563M62754J62174K89385j37576o31599K48627j42258Q419
$$ 885213 594353 483790 946544 1108718 1398103 1260527 628928 877555 735297 743716
2244G43716m40942O17013K58104k38651K0496p72872J40038N66147o64552Q300
$$ 743716 302774 919787 1177891 939240 959736 186864 326902 893049 228497 236797
2234B36797J173283j460930n15836Q56385N038k88513N28792K44327P1809o20559
$$ 236797 1410080 -50850 -566686 289699 294737 6224 535016 779343 851152 230593
2224B30593K88115P30230l44592j366913J85986j9228J7401p553N51112J18303
$$ 230593 518708 1248938 904346 -462567 -276581 -295809 -278408 -285961 265151 383454
2214C83454Q1128J52650j78049R89313Q4956N6503K52536l01234l5718k58392
$$ 383454 464582 617232 439183 1428496 1513452 1569955 1822491 1521257 1485539 1227147
2204A227147r42981L37705q17428M04167N91638P07229l53283K41355j33728R6676
$$ 1227147 284166 621871 -195557 208610 800248 1507477 1154194 1395549 1261821 1358497
2194A358497m21338o10408M48208p11084Q45564Q21821r2316M5764m47256L77
$$ 1358497 937159 326751 774959 63875 909439 1731260 1638944 1684708 1237452 1237829
2184A237829k1577L1626j35140l78491m65152M59612L83360L02921Q40161p7807
$$ 1237829 1216252 1247878 1112738 734247 269095 728707 1112067 1414988 2255149 2177342
2174B177342k90559k98022N19618q8224n52514K16917J22338K24049L30831Q66347
$$ 2177342 1886783 1588761 2108379 2020155 1467641 1684558 1806896 2030945 2361776 3228123
2164C228123k45977j194936m4699N10478J161363p52714l44295q170r37865N41886
$$ 3228123 2982146 1787210 1742511 2252989 3414352 2661638 2317343 2309173 1371308 1913194
2154A913194M48832J074338N2866l01265J69270N693j67128M67076l94468n5979
$$ 1913194 2362026 3436364 3489230 3187965 3357235 3362928 3195800 3662876 3268408 3212429
2144C212429J76542L91610m38750j95309O34584K90199l56941O2627j87218M63065
$$ 3212429 3388971 3780581 3341831 3146522 3781106 4071305 3714364 3776991 3589773 4052838
2134D052838P52140m06934p9640L99583K58810j61483l25855J577445L92664m2911
$$ 4052838 4804978 4398044 4318404 4717987 4976797 4815314 4489459 6066904 6459568 6416657
2124F416657L59328j14896L39749L75384Q1526N58102K61548k79460N65378R59023
$$ 6416657 6775985 6661089 7000838 7376222 7457748 8015850 8277398 7997938 8563316 9522339
2114I522339N63985Q58624L77787P65191R64552N52919J313514J079885K254608
$$ 9522339 10086324 10944948 11322735 12087926 13052478 13605397 14918911 15998796 18253404
2105A8253404K317827J611624J209094J248608K041240L678257M626460N519988
$$ 18253404 20571231 22182855 23391949 24640557 26681797 30360054 34986514 40506502
2097D0506502O556588P791864R422129J1038092J3026001J7735474K0086199K5860165
$$ 40506502 47063090 54854954 64277083 75315175 88341176 106076650 126162849 152023014
2089A52023014Q367524j8303666l0328191k5783395j6474612j0879568p401157
$$ 152023014 160390538 142086872 111758681 85975286 69500674 58621106 51219949
2082E1219949o666325m685709m989363l953220k558932k898028j584329j171381
$$ 51219949 44553624 39867915 34878552 30925332 28366400 25468372 23884043 22712662
2074B2712662j437781j658474j919300j591837j473288j060400q42366o76717
$$ 22712662 21274881 19616407 17697107 16105270 14631982 13571582 12729216 12052499
2066A2052499j14005j263341j014930m04143n25873k08228l75022j074535o4879
$$ 12052499 11938494 10675153 9660223 9256080 8730207 8521979 8146957 7072422 7007543
2057G007543j50628K93609K0365n99548m23509m77700o15665m14211k95886J4477
$$ 7007543 6856915 7150524 7170889 6571341 6147832 5670132 5054467 4640256 4344370 4358847
2047D358847J71848j96562J5363j61804O63088m0389p52635j096990m80024L61526
$$ 4358847 4530695 4334133 4349496 4187692 4850780 4810391 4057756 2960766 2480742 2842268
2037B842268k26200L92029K46899o07115M48785J54134L26004l55309l16845r5559
$$ 2842268 2616068 3008097 3254996 2647881 3096666 3250800 3576804 3221495 2904650 2809091
2027B809091m9045n866l06130J88734o2283m58304J8668l91805k4805m1438O16630
$$ 2809091 2760046 2754180 2448050 2636784 2574501 2116197 2134865 1743060 1718255 1676817 2293447
2016B293447l33641N86518R3984m50691j30454n74176J68645l40935l04324L18270
$$ 2293447 1959806 2546324 2640308 2189617 2059163 1484987 1653632 1312697 1008373 1326643
2006A326643m81972l06404l1886M72660J79162M60994p90549J25096J161468j27145
$$ 1326643 844671 538267 506381 979041 1158203 1619197 828648 953744 2115212 1988067
1996A988067q94916l38132j28202J20154r35379R63051n94653R6978P06762o64626
$$ 1988067 1093151 755019 626817 746971 -188408 774643 179990 276968 983730 319104
1986C19104M42043k70482o86461N26237L92659j127795K58499N38321M51423j3534
$$ 319104 761147 490665 -195796 330441 723100 -404695 -146196 392125 843548 830014
1976H30014J2857m06977M36053k77443O92036L06256k98469j46912O8910L40051
$$ 830014 842871 435894 871947 594504 1286540 1592796 1294327 1147415 1216325 1556376
1966A556376m19271m08981P25643N67921p66671Q7432l86862l62246j61373O23218
$$ 1556376 1137105 728124 1453767 2021688 1255017 1342449 955587 593341 431968 1055186
1956A055186n81812J33173L24834J79926P9996o05447L439K96125j30393n98157
$$ 1055186 473374 606547 931381 1111307 1191303 585856 589295 885420 755027 156870
1946A56870j34702m6883Q1510o9598K99428m22904N22579k11503R2574o73352
$$ 156870 22168 -24715 56795 -12803 286625 -136279 386300 174797 267371 -405981
1936d05981j74589J10298J53233N40153l90126O8647k90364l42242M80200L82261
$$ -405981 -580570 -470272 -317039 223114 -167012 -98365 -388729 -730971 -250771 131490
1926A31490O29096n45786l33582L35576j59524K82522K46124r27316L00646N34967
$$ 131490 760586 214800 -118782 216794 57270 339792 585916 -341400 -40754 494213
1916D94213k84213M5426q41723k93586n8947M09529m1366L42456R6154L32901
$$ 494213 210000 255426 -586297 -879883 -938830 -529301 -570667 -228211 -132057 200844
1906B00844r60005K28549N15896N4938J65439j99570M90705J84178N09293j185733
$$ 200844 -759161 -530612 -14716 40222 205661 6091 496796 680974 1190267 4534
1896D534j10387J40894M46454j35248j35053K47665j64906q2072q0263R08327
$$ 4534 -105853 35041 481495 346247 211194 458859 293953 211881 131618 1039945
1886A039945l32719p32134M11877j707j6728m00002j53866M40228L65207J8424
$$ 1039945 707226 -24908 386969 385262 368534 -31468 -185334 254894 620101 638525
1876F38525m02412J27203J11776j26703j091628J20559L92472L08607P18828m03384
$$ 638525 236113 363316 475092 348389 -743239 -622680 -230208 78399 797227 393843
1866C93843o11689k59791J0871M07512o37438N1008N75925m02102P13007k45555
$$ 393843 -217846 -477637 -466766 -59254 -696692 -645684 -69759 -471861 241146 -4409
1856d409M59246j23081m69559K53883J17413L87793R58472j143416p7589n94290
$$ -4409 454837 331756 -137803 116080 233493 621286 1579758 436342 358753 -235537
1846b35537M05171K24154r8348j45585K52790k93732L11016J30019l43167J40972
$$ -235537 169634 393788 295440 149855 402645 108913 419929 549948 206781 347753
1836C47753r48825R2633l72736J03438N99889q5052P33459K84719m76163K95282
$$ 347753 -601072 -508439 -881175 -777737 -177848 -262900 470559 755278 279115 574397
1826E74397m72469j21050L08344R89502m68597P39964M24333k87713n33936j53674
$$ 574397 101928 -19122 289222 1278724 810127 1550091 1974424 1686711 1152775 999101
1816I99101r1650M26657M17001n81669o26073l74729K84579R71583j072584p40890
$$ 999101 907451 1334108 1751109 1169440 543367 168638 453217 1424800 352216 -388674
1806c88674J055717p71806J77537O88891L0050K92788k42130m1663K07314L51740
$$ -388674 667043 -104763 72774 761665 791715 1084503 842373 800710 1008024 1359764
1796A359764o58813r41366n96387L59600R01337N12984m77006o61924J66422m29819
$$ 1359764 700951 -240415 -836802 -477202 424135 937119 460113 -201811 -35389 -465208
1786d65208m43132Q02552Q2149J59138j45283L17557j12284k28862j88515k02515
$$ -465208 -908340 -105788 -23639 135499 -9784 307773 195489 -33373 -221888 -424403
1776d24403R70598j099066o29275M96349J044944K55943j421042L93349M33539
$$ -424403 546195 -552871 -1182146 -685797 359147 615090 -805952 -412603 20936
1767B0936K54417R7015M06938k13632m57834n94479J58758K92617L74143M38143
$$ 20936 275353 372368 779306 565674 107840 -486639 -327881 -35264 338879 777022
1757G77022L78522r93944p05498M68680J7186k74408K49537r13132K96226O85329
$$ 777022 1155544 161600 -543898 -75218 -58032 -332440 -82903 -996035 -699809 -14480
1747a4480R31973j94791n05622J56817o33057J66814J2914p75903K09352O36635
$$ -14480 917493 722702 217080 373897 -259160 -92346 -79432 -855335 -645983 -9348
1737i348l65793J098778m10308n8685N202n51596K10161Q6963n74690R16433L02103
$$ -9348 -375141 723637 313329 254644 259846 -291750 -81589 5374 -569316 347117 649220
1726F49220j012691P16407M84539l08592m76424m641l06230p01517o2296O61141
$$ 649220 -363471 352936 837475 528883 52459 47818 -258412 -959929 -1022225 -361084
1716c61084M93518m47261m22620N24986K22741k10490M95096R7800j1041J76799
$$ -361084 132434 -314827 -737447 -212461 10280 -200210 294886 392686 381645 558444
1706E58444M19652j778641M69510J85918r72463k78940k66218P89702N18893J38105
$$ 558444 978096 -800545 -331035 -145117 -1117580 -1396520 -1662738 -873036 -354143 -216038
1696b16038K63856l61323J87489j53969J21833j8271J03818j33733M69790p8660
$$ -216038 47818 -313505 -126016 -279985 -158152 -176423 -72605 -206338 263452 184792
1686A84792K47557J53501l45517n72319M92898K76936r04476M4207n68847o03693
$$ 184792 432349 585850 240333 -331986 160912 437848 -466628 -422421 -991268 -1594961
1676a594961N70997P20926L54425m20277o4499l43337J54619K62743P75643k40505
$$ -1594961 -1023964 -303038 51387 -368890 -433389 -776726 -622107 -359364 416279 175774
1666A75774k69898L76458m56086J6504N65723J49596j76441m67870M03037r6359
$$ 175774 -94124 282334 -173752 -157248 408475 558071 381630 -86240 316797 220438
1656B20438o74489n8685K56318j93806j70180n2491j89284O15269L79416L65229
$$ 220438 -454051 -512736 -256418 -450224 -620404 -672895 -862179 -246910 132506 497735
1646D97735p0502k51242j84237l63026O58965p66658k57386N26114j340160m6769
$$ 497735 427233 175991 -8246 -371272 287693 -478965 -736351 -210237 -1550397 -1597166
1636a597166M39436L62627l95783j79052R48520L01648j28206o18167j68019K31380
$$ -1597166 -1157730 -795103 -1190886 -1369938 -421418 -119770 -247976 -866143 -1034162 -802782
1626h02782L44887K73088m17762R56750o52732m25381k33385J229586o62028J34966
$$ -802782 -457895 -184807 -602569 354181 -298551 -723932 -957317 272269 -389759 -254793
1616b54793J82930L6724M18701k32788J00804J04801J26200j54827q79693J05795
$$ -254793 -71863 -35139 383562 150774 251578 356379 482579 327752 -551941 -446146
1606d46146L18143m12774L46493Q11267l63190P5067o53720K9981l72279J95954
$$ -446146 -128003 -540777 -194284 616983 253793 328860 -324860 -294879 -667158 -471204
1596d71204N17361K46293j52188j41873O5665M37972m94186j91927M5429p5490
$$ -471204 46157 292450 140262 -1611 64054 502026 7840 -184087 -138658 -214148
1586b14148l43065n421Q82637p76458M39735J024711J22010q64651j90572o42564
$$ -214148 -557213 -562634 320003 -456455 -16720 1007991 1130001 265350 74778 -567786
1576e67786J46102L13725j09899J37995r72639L38741R05337j042529J3321m31966
$$ -567786 -421684 -107959 -217858 -79863 -1052502 -713761 191576 -850953 -837632 -1269598
1566a269598K2863J55895n0514N65279O12850k15726k25214R7766m23536Q09021
$$ -1269598 -1246735 -1090840 -1141354 -576075 36775 -178951 -404165 -306399 -729935 79086
1556G9086k59091l20026L93200m98874l12316P66057p1835o36860M24537Q29111
$$ 79086 -180005 -500031 -106831 -605705 -918021 -151964 -223799 -860659 -436122 392989
1546C92989J65596p34065J35272j34696p63015P05259N86483q03761J275976N49318
$$ 392989 558585 -175480 -40208 -174904 -937919 -232660 353823 -449938 826038 1375356
1536A375356p88265O1935k18940N53640m41824q64637l58404r9387P73012J40291
$$ 1375356 587091 649026 430086 983726 541902 -322735 -681139 -780526 -7514 132777
1526A32777J54404j58222o04056o5514M71787k15167J03447m42961l15338n50335
$$ 132777 287181 128959 -475097 -540611 -68824 -283991 -180544 -623505 -938843 -1489178
1516a489178r2477N00898K5271Q40696M52983M00296j57950j023947M85111K41299
$$ -1489178 -1581655 -1080757 -1055486 -214790 238193 638489 480539 -543408 -58297 183002
1506A83002m0865q66351L88697Q48165J49009l88519j1435n64382L65161k00619
$$ 183002 142137 -724214 -335517 512648 661657 273138 261703 -302679 62482 -138137
1496a38137j94395k47141R16321n00677K31334l09394L16164N55057k92102m94517
$$ -138137 -332532 -579673 336648 -164029 67305 -242089 74075 629132 337030 -157487
1486a57487j2710R1759r5412L52721k58777J09241n48395L39844J45530M18480
$$ -157487 -170197 -78438 -173850 178871 -79906 29335 -519060 -179216 -33686 384794
1476C84794q18309M27694M19096K65594l08456L09161M44908K067j291231K68621
$$ 384794 -433515 -5821 413275 678869 370413 679574 1124482 1126549 -164682 103939
1466A03939K33537k71970o62862J112750L90803N9281j060521q25790K17701M3170
$$ 103939 337476 65506 -597356 515394 906197 965478 -95043 -920833 -703132 -659962
1456f59962J022967N19065l68650q24083L44671k33262l10343L85805N37638o19918
$$ -659962 363005 882070 513420 -310663 34008 -199254 -509597 -123792 413846 -206072
1446b06072o65416P8251K8141M65076J64455l2370J01515L68008L7683q34968
$$ -206072 -871488 -793237 -765096 -300020 -135565 -167935 -66420 301588 339271 -495697
1436d95697L70674Q31413k04185n67858J06052o36810O77700P6981o1012k95068
$$ -495697 -125023 706390 502205 -65653 40399 -596411 81289 158270 97258 -197810
1426a97810l66863k64076l17194R65110N25455m13033m72365J52799j50738n00207
$$ -197810 -564673 -828749 -1145943 -180833 344622 -68411 -540776 -387977 -538715 -1038922
1416a038922N58851L29036j94479j95459r8922Q31522Q6152q23040j13815L01786
$$ -1038922 -480071 -151035 -345514 -540973 -639895 191627 277779 -545261 -659076 -357290
1406c57290M58574J36656l9756l88366l42847J77714m61078K60420j14588o38036
$$ -357290 101284 237940 198184 -190182 -533029 -355315 -816393 -555973 -670561 -1308597
1396a308597N33767J6525l48232J400614k87722j007556N84536P92335q79881
$$ -1308597 -774830 -758305 -1106537 294077 6355 -1001201 -416665 375670 -504211
1387e04211l7167m54156j50063K87887N93478k09502M88084m13185R83457L10306
$$ -504211 -541378 -995534 -1145597 -857710 -264232 -473734 14350 -398835 584622 894928
1377H94928r75564L81408r89688L8651K79022P88179J83674r8059K2173J27478
$$ 894928 -80636 300772 -688916 -650265 -371243 416936 600610 502551 524724 652202
1367F52202J74821r66679j71892L58520K71240n18419P15992K7655j860901Q65905
$$ 652202 827023 -139656 -311548 46972 318212 -200207 515785 543440 -1317461 -451556
1357d51556P1657J44809m1125p74494O65383J427877m00823l05591j36709n05343
$$ -451556 -379899 -235090 -276215 -1050709 -385326 1042551 641728 336137 199428 -305915
1347c05915p31563K51163M68118M65372K21571m50624L4905M10913J63096m24100
$$ -305915 -1037478 -786315 -318197 147175 368746 -81878 -46973 363940 527036 102936
1337A02936J4808k83515M35484L29629l38954P9184p5918O4908q8542m62925M0001
$$ 102936 117744 -165771 269713 599342 260388 339572 263654 328562 240020 -222905 -182904
1326a82904l49285M84186J84960l12945k16113K04621K05163o1002M43966J01138
$$ -182904 -532189 -48003 136957 -175988 -392101 -187480 17683 -43319 400647 501785
1316E01785l12194l6869j36160j25714p14934K67889J046075m69089k34169j709
$$ 501785 189591 152722 16562 -109152 -824086 -556197 489878 20789 -213380 -215089
1306b15089j49265n8253k75840j25392N3383j74846J320703J91863r3072j78225
$$ -215089 -364354 -422607 -698447 -823839 -770456 -945302 375401 567264 474192 295967
1296B95967L35663k17880l69408k32651n78639Q60007L82345l38325n97288m27882
$$ 295967 631630 413750 44342 -188309 -766948 93059 475404 137079 -460209 -888091
1286h88091K47500J56842P32077l18639M09792J35279j85319k14556l64797l1421
$$ -888091 -640591 -483749 248328 -70311 339481 474760 289441 74885 -289912 -321333
1276c21333j46533M17401J98267J92835j67095j002707l87530O49609J106970
$$ -321333 -467866 -50465 147802 340637 173542 -829165 -1216695 -567086 539884
1267E39884p8528o87793J59674P63784j75846j10004j213182k38397J148206n05735
$$ 539884 461356 -226437 -66763 697021 521175 411171 -802011 -1040408 107798 -397937
1257c97937P28157R58772o68172l25092j170177l29945J122820j67991n73280
$$ -397937 330220 1288992 620820 295728 -874449 -1204394 -81574 -249565 -822845
1248h22845P16716R69550o29898L80249o21720p38636R03758m94215L54303L86063
$$ -822845 -106129 863421 233523 613772 -7948 -746584 157174 -337041 17262 403325
1238D03325q16244M66871N34406r6608n4008n83979n50111J120793j98468K57519
$$ 403325 -412919 53952 588358 491750 437742 -146237 -696348 424445 225977 483496
1228D83496O37370o96696n73341N59635q20090m86513K65234J54246L58201N57724
$$ 483496 1120866 424170 -149171 410464 -409626 -896139 -630905 -476659 -118458 439266
1218D39266o65233K23478M19232J09111l23573m25205l1900R02322n33312l93895
$$ 439266 -225967 -2489 416743 525854 202281 -222924 -254824 647498 114186 -279709
1208b79709J104969K08442p45864r42215l22070j00969O79989N59502l25087M53461
$$ -279709 825260 1033702 287838 -654377 -976447 -1077416 -397427 162075 -163012 290449
$$ [...]
##END NTUPLES=NMR SPECTRUM
##END=
