##TITLE=1H_EC-3222(IV-2)
 CDCl3
 8 sc, 
 25.07.2022
##JCAMPDX= 6.0         $$ Bruker NMR JCAMP-DX V2.0
##DATA TYPE= NMR SPECTRUM
##DATA CLASS= NTUPLES
##ORIGIN= UXNMR, Bruker Analytische Messtechnik GmbH
##OWNER= root
$$ XWIN-NMR		Version 3.5
$$ Mon Jul 25 13:59:09 2022 Russian Standard Time (UT+4h)  she@DPX200
##.OBSERVE FREQUENCY= 200.1313499994
##.OBSERVE NUCLEUS= ^1H
##.ACQUISITION MODE= SIMULTANEOUS
##.ACQUISITION SCHEME= undefined
##.AVERAGES= 8
##.DIGITISER RES= 18
##SPECTROMETER/DATA SYSTEM= spect
##.PULSE SEQUENCE= zg30
##.SOLVENT NAME= CDCl3
##.SHIFT REFERENCE= (INTERNAL, CDCl3, 0, 15.7348)
##AUDIT TRAIL= $$ (NUMBER, WHEN, WHO, WHERE, WHAT)
$$ ##TITLE= Audit trail, XWIN-NMR		Version 3.5
$$ ##JCAMPDX= 5.01
$$ ##ORIGIN= Bruker BioSpin GmbH
$$ ##OWNER= she
$$ F:/spectra/data/she/nmr/H-F/1/pdata/1/auditp.txt
$$ ##AUDIT TRAIL=  $$ (NUMBER, WHEN, WHO, WHERE, WHAT)
(   1,<2022-07-25 13:57:44.34 +0400>,<she>,<DPX200>,
      <created by zg, POWCHK disabled, PULCHK disabled
       configuration hash MD5:
       00 E9 B6 7A A2 85 ED C7 34 08 36 98 17 FE 4E 26
       data hash MD5: 16K
       FA F2 75 BF 7F E1 33 37 C2 45 CF FA FC 5F C7 12>)
(   2,<2022-07-25 13:57:46.95 +0400>,<she>,<DPX200>,
      <Start of raw data processing
       efp BC_mod = 2 LB = 0.24 FT_mod = 6 PKNL = 1 PHC0 = -18061.88 PHC1 = 11.00068 SI = 16K 
       data hash MD5: 16K
       79 75 4B 10 74 69 99 A5 C1 0B DD AD C6 8B 96 B4>)
(   3,<2022-07-25 13:58:09.21 +0400>,<she>,<DPX200>,
      <pk PHC0 = 24.56125 PHC1 = 0.5999999 
       data hash MD5: 16K
       0D 78 0D B1 C1 8F A5 5C 3A 93 AC BF F6 8C B7 33>)
(   4,<2022-07-25 13:58:21.25 +0400>,<she>,<DPX200>,
      <abs ABSG = 5 
       data hash MD5: 16K
       6D 98 99 FF C2 62 4C 5C 25 3B 1C 41 C6 21 04 A3>)
$$ ##END=
$$ 
$$ hash MD5
$$ 28 9C EE E7 0E B7 C0 5C 62 C0 60 17 84 7F B2 67
##$RELAX= 
##$RELAX= 
##$RELAX= 
##$RELAX= 
##$RELAX= 
##$RELAX= 
$$ Bruker specific parameters
$$ --------------------------
##$DU= <F:/spectra>
##$EXPNO= 1
##$NAME= <H-F>
##$PROCNO= 1
##$TYPE= <nmr>
##$USER= <she>
##$AMP= (0..31)
100 100 100 100 100 100 100 100 100 100 100 100 100 100 100 100 100 100 
100 100 100 100 100 100 100 100 100 100 100 100 100 100 
##$AQSEQ= 0
##$AQ_mod= 1
##$AUNM= <au_zg>
##$AUTOPOS= <>
##$BF1= 200.13
##$BF2= 200.13
##$BF3= 200.13
##$BF4= 200.13
##$BF5= 200.13
##$BF6= 200.13
##$BF7= 200.13
##$BF8= 200.13
##$BYTORDA= 1
##$CFDGTYP= 0
##$CFRGTYP= 5
##$CHEMSTR= <none>
##$CNST= (0..31)
1 1 145 1 1 1 1 1 1 1 1 1 1 1 1 1 1 1 1 1 1 1 1 1 1 1 1 1 1 1 1 1 
##$CPDPRG= <>
##$CPDPRG1= <>
##$CPDPRG2= <>
##$CPDPRG3= <>
##$CPDPRG4= <mlev>
##$CPDPRG5= <mlev>
##$CPDPRG6= <mlev>
##$CPDPRG7= <mlev>
##$CPDPRG8= <mlev>
##$CPDPRGB= <>
##$CPDPRGT= <>
##$D= (0..31)
0 1.2 0 0 0 0 0 0 0 0.06 0 0.03 0 0 0 0 0.0002 0 0 0 0 0 0 0 0 0 0 0 0 
0 0 0 
##$DATE= 1658743063
##$DBL= (0..7)
120 120 120 120 120 120 120 120 
##$DBP= (0..7)
150 150 150 150 150 150 150 150 
##$DBP07= 0
##$DBPNAM0= <>
##$DBPNAM1= <>
##$DBPNAM2= <>
##$DBPNAM3= <>
$$ [...]
##$SUBNAM2= <"">
##$SUBNAM3= <"">
##$SUBNAM4= <"">
##$SUBNAM5= <"">
##$SUBNAM6= <"">
##$SUBNAM7= <"">
##$SUBNAM8= <"">
##$SUBNAM9= <"">
##$SW= 18.0517283424941
##$SWIBOX= (0..15)
0 0 2 0 0 0 0 0 0 0 0 0 0 0 0 0 
##$SW_h= 3612.71676300578
##$TD= 16384
##$TD0= 1
##$TE= 0
##$TE2= 300
##$TE3= 300
##$TEG= 300
##$TL= (0..7)
0 120 120 120 120 120 120 120 
##$TP= (0..7)
150 150 150 150 150 150 150 150 
##$TP07= 0
##$TPNAME0= <>
##$TPNAME1= <>
##$TPNAME2= <>
##$TPNAME3= <>
##$TPNAME4= <>
##$TPNAME5= <>
##$TPNAME6= <>
##$TPNAME7= <>
##$TPOAL= (0..7)
0.5 0.5 0.5 0.5 0.5 0.5 0.5 0.5 
##$TPOFFS= (0..7)
0 0 0 0 0 0 0 0 
##$TUNHIN= 0
##$TUNHOUT= 0
##$TUNXOUT= 0
##$USERA1= <user>
##$USERA2= <user>
##$USERA3= <user>
##$USERA4= <user>
##$USERA5= <user>
##$V9= 5
##$VALIST= <valist>
##$VCLIST= <CCCCCCCCCCCCCCC>
##$VD= 0
##$VDLIST= <DDDDDDDDDDDDDDD>
##$VPLIST= <PPPPPPPPPPPPPPP>
##$VTLIST= <TTTTTTTTTTTTTTT>
##$WBST= 1024
##$WBSW= 4
##$XGAIN= (0..3)
0 0 0 0 
##$XL= 0
##$YL= 0
##$YMAX_a= 150999
##$YMIN_a= -254223
##$ZGOPTNS= <>
##$ZL1= 120
##$ZL2= 120
##$ZL3= 120
##$ZL4= 120
##$ABSF1= 15.74689
##$ABSF2= -2.304959
##$ABSG= 5
##$ABSL= 3
##$ALPHA= 0
##$AQORDER= 0
##$ASSFAC= 0
##$ASSFACI= 0
##$ASSFACX= 0
##$ASSWID= 0
##$AUNMP= <proc_1d>
##$AZFE= 0.1
##$AZFW= 0.1
##$BCFW= 0
##$BC_mod= 2
##$BYTORDP= 0
##$COROFFS= 0
##$CY= -3
##$DATMOD= 1
##$DC= 0
##$DFILT= <>
##$DTYPP= 0
##$F1P= 0
##$F2P= 0
##$FCOR= 1
##$FTSIZE= 16384
##$FT_mod= 6
##$GAMMA= 0
##$GB= 0
##$INTBC= 1
##$INTSCL= 0
##$ISEN= 128
##$LB= 0.24
##$LEV0= 0
##$LPBIN= 0
##$MAXI= 10000
##$MC2= 0
##$MEAN= 0
##$ME_mod= 0
##$MI= 1.114404
##$NCOEF= 0
##$NC_proc= -8
##$NLEV= 6
##$NOISF1= 3.799351
##$NOISF2= 2.8
##$NSP= 0
##$NTH_PI= 0
##$NZP= 0
##$OFFSET= 15.73477
##$PC= 1
##$PHC0= -18037.32
##$PHC1= 11.60068
##$PH_mod= 1
##$PKNL= yes
##$PPARMOD= 0
##$PSCAL= 0
##$PSIGN= 0
##$REVERSE= no
##$SF= 200.130007358347
##$SI= 16384
##$SIGF1= 3
##$SIGF2= 2
##$SINO= 5.538805
##$SIOLD= 16384
##$SREGLST= <1H.CDCl3>
##$SSB= 0
##$STSI= 16384
##$STSR= 0
##$SW_p= 3612.71676300578
##$SYMM= 0
##$S_DEV= 0
##$TDeff= 16384
##$TDoff= 0
##$TI= <>
##$TILT= no
##$TM1= 0
##$TM2= 0
##$TOPLEV= 0
##$USERP1= <user>
##$USERP2= <user>
##$USERP3= <user>
##$USERP4= <user>
##$USERP5= <user>
##$WDW= 1
##$XDIM= 16384
##$YMAX_p= 521658614
##$YMIN_p= -997612
$$ End of Bruker specific parameters
$$ ---------------------------------
##NTUPLES= NMR SPECTRUM
##VAR_NAME=  FREQUENCY,     SPECTRUM/REAL,   SPECTRUM/IMAG
##SYMBOL=    X,             R,               I
##VAR_TYPE=  INDEPENDENT,   DEPENDENT,       DEPENDENT
##VAR_FORM=  AFFN,          ASDF,            ASDF
##VAR_DIM=   16384,         16384,           16384
##UNITS=     HZ,            ARBITRARY UNITS, ARBITRARY UNITS
##FACTOR=    0.220516191357247, 1,           1
##FIRST=     3148.99960009205, 0,            0
##LAST=      -463.717162913734, 0,           0
##MIN=       -463.717162913734, -997612,     0
##MAX=       3148.99960009205, 521658614,    0
$$ Real data points
##PAGE= N=1
##DATA TABLE= (X++(R..R)), XYDATA
$$ [...]
6270B298354l99075K0526k57760j7320p1617j47532L28203k83624q380J12727
$$ 2298354 1899279 1919805 1662045 1644725 1573108 1425576 1753779 1470155 1461775 1574502
6260A574502j60392M96630k44876P2574p8051j9666K82357Q8040L0870k58075
$$ 1574502 1414110 1910740 1665864 1738438 1660387 1640721 1923078 2011118 2041988 1783913
6250A783913K63415M71225j06023j78213k00385j61548J82842P24214K63836m5990
$$ 1783913 2047328 2518553 2412530 2234317 2033932 1872384 2055226 2779440 3043276 2997286
6240B997286n7687k23854j69530k68502m75213k531k17099p4851P8482j56669
$$ 2997286 2939599 2715745 2546215 2277713 1802500 1799969 1582870 1508019 1586501 1429832
6230A429832m3090m4261L8079k91589j40660R9495J09235m21375N8901j3517l00154
$$ 1429832 1386742 1342481 1380560 1088971 948311 1047806 1157041 735666 794567 781050 480896
6219D80896L27640J86182j88984J47257J81531l73761k09648K46735L86731k43671
$$ 480896 808536 994718 805734 952991 1134522 760761 551113 797848 1184579 940908
6209I40908k47423L97159l1455j59803m24845J54469l2304O11J8320k36697p5009
$$ 940908 693485 1090644 1059189 899386 474541 629010 596706 597317 615637 378940 303931
6198C03931O473Q5351l8389M83890o9704k13323K25675j23493j36249Q7176R4063
$$ 303931 310404 395755 357366 841256 771552 558229 783904 660411 524162 611338 705401
6187G05401j54785Q0929j23651l96270K17877M08926J91117j07099Q8073j25378
$$ 705401 550616 631545 507894 111624 329501 738427 929544 822445 910518 785140
6177G85140p6153k04523K82995J19435j97114J82191m49130K98103J14171l92728
$$ 785140 708987 504464 787459 906894 709780 891971 442841 740944 855115 462387
6167D62387k95022N48528J50548l92869M34206j46037K0575J61651l47795j46262
$$ 462387 167365 715893 866441 473572 907778 761741 782316 943967 596172 449910
6157D49910j27514P25226K16322L2516l80263L21756j42569l77836L97166J32187
$$ 449910 322396 1047622 1263944 1296460 916197 1237953 1095384 717548 1114714 1246901
6147A246901k16538r2317J08032l90492N9871K33113Q8011k6489k75946m2533
$$ 1246901 1030363 938046 1046078 655586 715457 948570 1036581 1010092 734146 691613
6137F91613K5369J4974Q9634k92770K43834N25158l92407j18522L79243j22219
$$ 691613 716982 731956 821590 528820 772654 1297812 905405 786883 1166126 1043907
6127A043907J2472l13622J67306L02501l12086L51967L00720k51183j05075j20661
$$ 1043907 1056379 742757 910063 1212564 900478 1252445 1553165 1301982 1196907 1076246
6117A076246j4644j45351L74968j69692m5234K86153k12634o8421j19461K9447
$$ 1076246 1061602 916251 1291219 1121527 1076293 1362446 1149812 1081391 961930 991377
6107I91377j02113N28502O0862n61771K05827K93397n7793o01578r2910J17258
$$ 991377 889264 1417766 1478628 916857 1122684 1416081 1358288 756710 663800 781058
6097G81058N25677J84258j62419Q8068k62828L185Q8q0604K31919l3349k18521
$$ 781058 1306735 1490993 1328574 1416642 1153814 1156999 1157087 1076483 1308402 1275053 1056532
6086A056532j79632L20043r9087p1865k04559L25953N37250k04060J0058K88013
$$ 1056532 876900 1196943 1097856 1025991 821432 1147385 1684635 1480575 1490633 1778646
6076A778646l84744J2337K22125j14996J46293J48841j87275j12057J66532K49349
$$ 1778646 1393902 1406239 1628364 1513368 1659661 1808502 1621227 1509170 1675702 1925051
6066A925051J97269N1229n5719O443r1746J68014O92562M83599K2756o36444j18580
$$ 1925051 2122320 2173549 2117830 2124273 2032527 2200541 2893103 3376702 3399458 2763014 2644434
6055B644434j49076L78063j95149J00413J46034k5106l01399l92322J48462k81140
$$ 2644434 2495358 2873421 2678272 2778685 2924719 2899613 2598214 2205892 2354354 2073214
6045B073214l21695O50410k54331R3974k16890l91360M11353J45529K79860K27235
$$ 2073214 1751519 2401929 2147598 2241572 2024682 1633322 2044675 2190204 2470064 2697299
6035B697299K41699j47211O01773O34183O2662p5725R7538K6458J81461L1886
$$ 2697299 2938998 2791787 3393560 4027743 4090405 4014680 4112218 4138676 4320137 4352023
6025D352023j93467k47038k79910l43770N5224j46675m64044r7666q0628j08885
$$ 4352023 4158556 3911518 3631608 3287838 3343062 3196387 2732343 2634677 2554049 2445164
6015B445164J85275J67849J61905j74339J12489J30623p344J31802J41421m4274
$$ 2445164 2630439 2798288 2960193 2785854 2898343 3028966 3021622 3153424 3294845 3250571
6005C250571r3433J55131Q6091J84764J42868p9877J81089K92774J95028q0453
$$ 3250571 3157138 3312269 3398360 3583124 3725992 3646115 3827204 4119978 4315006 4234553
5995D234553K16797j56491j76561l00656N5402Q0831N3539L89285k51851r1718
$$ 4234553 4451350 4294859 4118298 3817642 3873044 3953875 4007414 4396699 4144848 4053130
5985D053130k85358J76968J01940m273l397K88952L88466L02898o5760N0119K91734
$$ 4053130 3767772 3944740 4046680 4042407 4039010 4327962 4716428 5019326 4953566 5003685 5295419
5974E295419L47037K50448R3489j31654k14711k28557k59400K95374K80406k14236
$$ 5295419 5642456 5892904 5986393 5854739 5640028 5411471 5152071 5447445 5727851 5513615
5964E513615M0262L1131o5849J49367m09642Q2059M14184K03469P4080q1078j57009
$$ 5513615 5553877 5585008 5519159 5668526 5258884 5340943 5755127 5958596 6032676 5951598 5794589
5953E794589J52941J185J80963R0197l64886J02588K2019L59933K83848k42427
$$ 5794589 5947530 5948715 6129678 6219875 5854989 5957577 5979596 6339529 6623377 6380950
5943F380950j27319L27902k0626K39907M0312j16762k15497K24071J70607N6762
$$ 6380950 6253631 6581533 6560907 6800814 6841126 6724364 6508867 6732938 6903545 6960307
5933F960307N55110j69017o29111j39762l55251q506L44922k84704j00202n06782
$$ 6960307 7515417 7346400 6717289 6577527 6222276 6213770 6558692 6273988 6173786 5667004
5923E667004J11453J04307j86281J95084K92069l15763j81052L46895k8270O0236
$$ 5667004 5778457 5882764 5696483 5891567 6183636 5867873 5686821 6033716 6005446 6065682
5913F065682M63869j19601k38433j6744L37169L03995L6410m45378p1920O68331
$$ 6065682 6529551 6409950 6171517 6154773 6491942 6795937 6832347 6386969 6315049 6983380
5903F983380K44439J62061L28705M69573O05632J52864Q76208N46954j46773J62351
$$ 6983380 7227819 7389880 7718585 8188158 8793790 8946654 9822862 10369816 10223043 10385394
5893A0385394o29101k53266k57869l80860J34875K91215J56218K65254J51779
$$ 10385394 9756293 9503027 9245158 8864298 8999173 9290388 9446606 9711860 9863639
5884I863639m3941L36660M18132r6734r1566M35516N87100L14986R08236J008893
$$ 9863639 9819698 10156358 10574490 10477756 10386190 10821706 11408806 11723792 12632028 13640921
5874A3640921M11150O37743Q55659J57872P36949J458396J240853O38278j49740
$$ 13640921 14052071 14689814 15545473 15703345 16440294 17898690 19139543 19777821 19628081
5865A9628081j70861n18564l55179n12047j85025o4816J77587P26784J55176M92111
$$ 19628081 19457220 18938656 18583477 18071430 17886405 17821589 17999176 18725960 18881136 19373247
5855A9373247R79254L22765J096911J849785J392895J627947J716417J796758
$$ 19373247 20352501 20675266 21772177 23621962 25014857 26642804 28359221 30155979
5847C0155979J791373K442029K604407L233446L630811L384953L483792K741257
$$ 30155979 31947352 34389381 36993788 40227234 43858045 47242998 50726790 53468047
5839E3468047J356233n83613k367586l145256l758277k532516k116044k116433
$$ 53468047 54824280 54240667 51873081 48727825 44969548 42437032 40320988 38204555
5831C8204555j790868p66401m38037k18806j15979j03537L41248R62459J053038
$$ 38204555 36413687 35647286 35209249 34990443 34874464 34770927 35112175 36074634 37127672
5822C7127672J184524J868770J471338K108168J978292K399143L341602L412852
$$ 37127672 38312196 40180966 41652304 43760472 45738764 48137907 51479509 54892361
5814E4892361M187754M764212N059789N797779N981569N579026M631355K130198
$$ 54892361 59080115 63844327 68904116 74701895 80683464 86262490 90893845 93024043
5806I3024043j095039l440736n613518o816853p755971o134578n403282m467091
$$ 93024043 91929004 88488268 82874750 76057897 68301926 62167348 56764066 52296975
5798E2296975l991472k962904k108338k018683j832016k50987k50335j152220
$$ 52296975 48305503 45342599 43234261 41215578 39383562 39132575 38882240 37730020
5790C7730020o83557j13585L89903L60233M76730R46569J409056J275094J860983
$$ 37730020 37046463 36932878 37322781 37683014 38159744 39106313 40515369 41790463 43651446
5781D3651446K137881J977938K569365K660840K345472J802005O42016o95859
$$ 43651446 45789327 47767265 50336630 52997470 55342942 57144947 57786963 57091104
5773E7091104k382551l480292m806482m229248m133448l566000l085394k459771
$$ 57091104 54708553 51228261 46421779 42192531 38059083 34493083 31407689 28947918
5765B8947918j839320j438616j449564j257919q31854j89436l32492o16347n63120
$$ 28947918 27108598 25669982 24220418 22962499 22130645 21941209 21608717 20992370 20429250
5756B0429250j95403M5127l85500K0913o3004N27138M99350m4582M33882M02058
$$ 20429250 20233847 20278974 19893474 19914387 19851383 20378521 20877871 20833289 21267171 21669229
5746B1669229l1380j28836m17312r21491j681542j276753q06474j521953r77344
$$ 21669229 21637849 21509013 21091701 20170210 18488668 17211915 16405441 14883488 13906144
5737A3906144m35233n36043m06583n70725k07490k64290n40910K35935j91726
$$ 13906144 13470911 12934868 12528285 11957560 11750070 11485780 10944870 11180805 10989079
5728A0989079k00398L19947k01542j05532O1560J49020M34613N61258n3195J09619
$$ 10989079 10788681 11108628 10907086 10801554 10863114 11012134 11446747 12008005 11954810 12064429
5718A2064429O06234L88663L50393q51860j241285p91102r68653k67169m76666
$$ 12064429 12670663 13059326 13409719 12557859 11316574 10525472 9556819 9289650 8812984
5709H812984k82761l07925k09233k51693J62493K77393n54742j75139L95508l07613
$$ 8812984 8530223 8222298 8013065 7761372 7923865 8201258 7646516 7471377 7866885 7559272
5699G559272Q1514p7355j10400J33431K53112M0597K17678L09738L31534M55915
$$ 7559272 7640786 7563431 7453031 7586462 7839574 7880171 8097849 8407587 8739121 9195036
5689I195036O3908l1224l51294m96502n09221l94699l43074m32827j85092J65009
$$ 9195036 9258944 9227720 8876426 8379924 7870703 7476004 7132930 6700103 6515011 6680020
5679F680020k38146q9892r3889o0836j33779K02743n3404J0338j31252J34017
$$ 6680020 6441874 6351982 6258093 6197257 6063478 6266221 6212817 6223155 6091903 6225920
5669F225920l38770k45291K3206K43000R2225m914m94177j39729O1805K42474
$$ 6225920 5887150 5641859 5665065 5908065 6000290 5995376 5501199 5361470 5423275 5665749
5659E665749J11261m50238k68199K93455K18677K19430j72487k13661n8488K3377
$$ 5665749 5777010 5326772 5058573 5352028 5570705 5790135 5617648 5403987 5345499 5368876
5649E368876k0321k99249j22469m19177k72135N07487J10888K93352r3686l29206
$$ 5368876 5348555 5049306 4926837 4507660 4235525 4743012 4853900 5147252 5053566 4724360
5639D724360J1849R023J78544k88470k29767k06924p0521n0409o723l86003L12066
$$ 4724360 4736209 4745232 4923776 4635306 4405539 4198615 4128094 4077685 4070962 3684959 3997025
5628C997025O5169m15897K9632l09375M54579k27105k26105P8648O7371p1390
$$ 3997025 4062194 3646297 3675929 3366554 3821133 3594028 3367923 3446571 3513942 3442552
5618C442552n0307K61934l1897M89129k22765j23813K8377O3757m8750k64536
$$ 3442552 3392245 3654179 3622282 4111411 3888646 3764833 3793210 3856967 3808217 3543681
5608C543681K69620J43595j97005k37704m94732L78352l76414N4125p2936M8541
$$ 3543681 3813301 3956896 3759891 3522187 3027455 3405807 3029393 3083518 3010582 3059123
5598C059123K90231J80085o49k0676n74632O39321K80041k30075q7132J24688
$$ 3059123 3349354 3529439 3528790 3508114 2933482 3572803 3852844 3622769 3535637 3660325
5588C660325R4096j598M43433R193j42809J2032j21013m1207L945j03814O44064
$$ 3660325 3754421 3752823 4196256 4205449 4062640 4074672 3953659 3912452 3916397 3812583 4456647
5577D456647j02152j58115P6976k7360P5153J86024K37692J16615J87919M04779
$$ 4456647 4354495 4196380 4273356 4245996 4321149 4507173 4744865 4861480 5049399 5454178
5567E454178Q8419J86571K77655J61086K92760P13912J42752P31790M50266J138747
$$ 5454178 5542597 5729168 6006823 6167909 6460669 7174581 7317333 8049123 8499389 9638136
5557I638136P13528J9868j075758j389737r98982j201918j46849r9123L06851
$$ 9638136 10351664 10371532 9295774 7906037 6907055 5705137 5558288 5459165 5766016
5548E766016p26370k78506K86161R2296k70813l87886k00001P0210M15783n6067
$$ 5766016 5039646 4761140 5047301 5139597 4868784 4480898 4280897 4351107 4766890 4710823
5538D710823k19722J95155M64791R7575l51418M61147L9046J65150q30258L09306
$$ 4710823 4491101 4686256 5151047 5248622 4897204 5358351 5397397 5562547 4732289 5041595
5528E041595K81504J11577k22785q07679L95865J38846k42904N11188j12112j06986
$$ 5041595 5323099 5434676 5211891 4404212 4800077 4938923 4696019 5207207 5095095 4988109
5518D988109J81549j32701J68964p3745J45877J13482p8281j25446M93214l02363
$$ 4988109 5169658 5036957 5205921 5132176 5278053 5391535 5313254 5187808 5681022 5378659
5508E378659L13027N56341k01581M9785L08314P23068J90331k99104J53296l23525
$$ 5378659 5691686 6248027 6046446 6096231 6404545 7127613 7317944 7018840 7172136 6848611
5498F848611K98994j19167R579q5366O20394P7087j06370L1285k66621j13188
$$ 6848611 7147605 7028438 7038017 6952651 7573045 7650132 7543762 7575047 7308426 7195238
5488G195238k40384n9333J75913J9151L56795j20643J82610R0178L21165L0644
$$ 7195238 6954854 6895521 7071434 7090585 7447380 7326737 7509347 7599525 7920690 7951334
5478G951334M62290K88019L47129J050364P13885R38529N72178M35470k60508
$$ 7951334 8413624 8701643 9048772 10099136 10813021 11751550 12323728 12759198 12498690
5469A2498690n01082n38919o52895L54224o0827J50480K08978l01443j00000J42530
$$ 12498690 11997608 11458689 10805794 11160018 11099191 11249671 11458649 11157206 11057206 11199736
5459A1199736j18013m12340j06965k53832q19515J16107K44617N47626J33045
$$ 11199736 11081723 10669383 10562418 10308586 9489071 9605178 9849795 10397421 10530466
5450A0530466L72614K13296N80668P03740J56047O33220K07991R79724J015487
$$ 10530466 10903080 11116376 11697044 12400784 12556831 13190051 13398042 14377766 15393253
5441A5393253N49582J131740N21425q9112q58218m63919N0052k90344K99066m10246
$$ 15393253 15942835 17074575 17596000 17506888 16648670 16184751 16234803 15944459 16243525 15833279
5431A5833279K04072Q3865J33234J93876J23398J62872N08939P0306O2342O32524
$$ 15833279 16037351 16121216 16254450 16448326 16571724 16734596 17243535 17313841 17376183 18008707
5421A8008707J302452Q25211J505805Q77465J093984J106545J080125J187465
$$ 18008707 19311159 20136370 21642175 22519640 23613624 24720169 25800294 26987759
5413B6987759J552232J664614J665460K100278J664215K008953J968087J186656
$$ 26987759 28539991 30204605 31870065 33970343 35634558 37643511 39611598 40798254
5405D0798254J340636J773392K319110K331364L343779L678078M141672N013425
$$ 40798254 42138890 43912282 46231392 48562756 51906535 55584613 59726285 64739710
5397F4739710O056132O631644P077695P882709Q706439R338321R634431Q881795
$$ 64739710 70795842 77427486 84505181 92387890 101094329 110432650 120067081 128948876
5389A28948876Q100585P954909P369771O408547N000690K665941p86542m442942
$$ 128948876 137049461 145004370 152374141 158782688 163783378 166449319 165662777 161219835
5381A61219835o399791p569973p901914q400162q168746q932963r586392r420925
$$ 161219835 154820044 147250071 139348157 130947995 122779249 113846286 104259894 94838969
5373I4838969r141952p745732o424773n749286n355643m338013l613748l139292
$$ 94838969 85697017 77951285 71526512 65777226 60421583 56083570 52469822 49330530
5365D9330530l044173k385977j805708j665584j898089j416095j480053j289282
$$ 49330530 46286357 43900380 42094672 40429088 38530999 37114904 35634851 34345569
5357C4345569r49565p80758r68369j118964j167752r34451j051412j571392j023810
$$ 34345569 33396004 32615246 31646877 30527913 29360161 28425710 27374298 25802906 24779096
5348B4779096r85051j267635q31723p03806o90384q11174j263372o15410K8984
$$ 24779096 23794045 22526410 21694687 20990881 20300497 19489323 18225951 17610541 17639525
5339A7639525o38217r64p05038l54745j88988l27899m11612j84212O3132r8064
$$ 17639525 17001308 17000344 16295306 15940561 15751573 15423674 15012062 14827850 14890982 14792918
5329A4792918m79563o40752k06589j73188P3030k84128j25059n95763j44712n33437
$$ 14792918 14313355 13672603 13466014 13292826 13365856 13081728 12956669 12360906 12216194 11682757
5319A1682757o28869J30499k59238m55066m69842j01122j96856O434M8461k05607
$$ 11682757 11053888 11184387 10925149 10470083 10000241 9899119 9702263 9708697 9757158 9551551
5309I551551l51508j20318n50874J12381L61189l47596m70232N2207k17619k46952
$$ 9551551 9200043 9079725 8528851 8641232 9002421 8654825 8184593 8236800 8019181 7772229
5299G772229j89933J97009O4633k82888n05013j37236R2144j78695J1964M58221
$$ 7772229 7582296 7779305 7843938 7561050 7056037 6918801 7010945 6832250 6844214 7302435
5289G302435j03380k60805J62104l93424p8993L45759L94679j56043P2882k25430
$$ 7302435 7199055 6938250 7100354 6706930 6627937 6973696 7368375 7212332 7285214 7059784
5279G059784j50778J46355q9875l94382n75761K54010K28350J88001o4225k10120
$$ 7059784 6909006 7055361 6965486 6571104 5995343 6249353 6477703 6665704 6601479 6391359
5269F391359r3800J79946j65421P6100L71439O3929K02310p8000l74104M75150
$$ 6391359 6297559 6477505 6312084 6388184 6759623 6823552 7025862 6947862 6573758 7048908
5259G048908J62764N11855r50O87824P24904l46K02978Q1225K87876J07288o11348
$$ 7048908 7211672 7723527 7722577 8410401 9135305 9134959 9337937 9419162 9707038 9814326 9202978
5248I202978k91975N66987M81749L21624K76855Q88849R78568P21936J192166
$$ 9202978 8911003 9477990 9959739 10281363 10558218 11447067 12425635 13147571 14339737
5239A4339737J196601R73706J903959J566315J507848K490083L227956L314943
$$ 14339737 15536338 16510044 18414003 19980318 21488166 23978249 27206205 30521148
5231C0521148M945801O689500N152029k601424o552443p372796m917793l859819
$$ 30521148 35466949 42156449 47308478 44707054 38154611 30781815 25864022 22004203
5223B2004203k807194k250732k358065j489456j165375q46192q46729m66251q32691
$$ 22004203 19197009 16946277 14588212 13098756 11933381 11087189 10240460 9774209 8941518
5214H941518o84678l29899l68876l49704L8091r1438j98489N050J93513p1549
$$ 8941518 8256840 7926941 7558065 7208361 7246452 7155014 6956525 6961575 7155088 7083539
5204G083539J00919m21048k98045Q3675N64442M3673J68252J4856l30819k2136
$$ 7083539 7184458 6763410 6465365 6549040 7113482 7157155 7325407 7340263 7009444 6987308
5194F987308p19339n02781R2983m29730l35133j22700j12997k98957J58233o8823
$$ 6987308 6267969 5765188 5858171 5428441 5093308 4970608 4857611 4558654 4716887 4648064
5184D648064k80412j1791M9865k35437k88148K6024J49404J00215l39084k16561
$$ 4648064 4367652 4355861 4405726 4170289 3882141 3908165 4057569 4157784 3818700 3602139
5174C602139O0934K94472L29929m6610j31770O49252n27988k79084m01516k32193
$$ 3602139 3663073 3957545 4287474 4240864 4109094 4758346 4230358 3951274 3549758 3317565
5164C317565L19427j93534k34594k45742L27958L80322m22753l23582j69169M1662
$$ 3317565 3636992 3443458 3208864 2963122 3291080 3671402 3248649 2925067 2755898 2797560
5154B797560J36235j31828K18582K95899k5532k34559P595J05003j04909j68865
$$ 2797560 2933795 2801967 3020549 3316448 3290916 3056357 3063952 3168955 3064046 2895181
5144B895181J58862l24610K7849J87669j72604l29100m6075K21569j32196m09980
$$ 2895181 3054043 2729433 2757282 2944951 2772347 2443247 2397172 2618741 2486545 2076565
5134B076565K03137j3321Q6343N17903k20021L28176r2893j35649n0516K5248
$$ 2076565 2279702 2266381 2352724 2870627 2650606 2978782 2885889 2750240 2699724 2724972
5124B724972j77188o9838j04035K2410K82074J84850k78093k46846j35756l94017
$$ 2724972 2547784 2477946 2373911 2396321 2678395 2863245 2585152 2338306 2202550 1808533
5114A808533K46384K61767k83799j86292L48164k32801K0675M86090J41517k34852
$$ 1808533 2054917 2316684 2032885 1846593 2194757 1961956 1982631 2468721 2610238 2375386
5104B375386R7095K58941r6391m43360K18779K82617k85806O5597n3922N7947
$$ 2375386 2472481 2731422 2635031 2191671 2410450 2693067 2407261 2472858 2418936 2476883
5094B476883K51640j93769J7994j39077j30096p7344O53550J3280l63958N7001
$$ 2476883 2728523 2534754 2552748 2413671 2283575 2206231 2859781 2873061 2509103 2566104
5084B566104N26682l64104m71597L46477O7613J54635k09178J00702K93026j72816
$$ 2566104 3092786 2728682 2257085 2603562 2671175 2825810 2616632 2717334 3010360 2837544
5074B837544N6650K17028J65827L3309j68532n42991j93856l5443N13130K30055
$$ 2837544 2894194 3111222 3277049 3310358 3141826 2598835 2404979 2369536 2882666 3112721
5064C112721J09596n5024K83856J37708j24687k60682l05054J8831J05970O4225
$$ 3112721 3222317 3167293 3451149 3588857 3464170 3203488 2898434 2917265 3023235 3087460
5054C087460m69486l8856K96089N54546j9060j63065l34722l11422k59565L40384
$$ 3087460 2617974 2579118 2875207 3429753 3410693 3247628 2912906 2601484 2341919 2682303
5044B682303j36223k09324K36209K63293j20289m39184K2853k28967O1364L01025
$$ 2682303 2546080 2336756 2572965 2836258 2715969 2276785 2299638 2070671 2132035 2433060
5034B433060O1488M7484K21044j25641K93272J42632o0559L29735Q7440N0780
$$ 2433060 2494548 2542032 2763076 2637435 2930707 3073339 3012780 3342515 3429955 3480735
5024C480735J68713p0856K06975j27771j32429R1576L6381K58196K71189l9946
$$ 3480735 3649448 3578592 3785567 3657796 3525367 3616943 3653324 3911520 4182709 4142763
5014D142763n7837j99217M74679M37405o97688m46064J6139M08403K64062m89240
$$ 4142763 4084926 3885709 4360388 4797793 4100105 3654041 3670180 4078583 4342645 3853405
5004C853405k71426k79515j05297M28399n9762K29933J94419J3670j14966j14903
$$ 3853405 3581979 3302464 3197167 3625566 3565804 3795737 3990156 4003826 3888860 3773957
4994C773957K93725k27928n51024M54296k61074K82498K14911m1773M83029r6279
$$ 3773957 4067682 3839754 3288730 3743026 3481952 3764450 3979361 3937588 4420617 4324338
4984D324338o6406k20265J53303N50766J70007J8713J06603n2213o01214J13166
$$ 4324338 4257932 4037667 4190970 4741736 4911743 4930456 5037059 4984846 4383632 4496798
4974D496798k32207j34320k40321j3682L7621Q5491m6476J98560j52867N6981
$$ 4496798 4264591 4130271 3889950 3876268 3913889 3999380 3952904 4151464 3998597 4055578
4964D055578k16833q7171K13107r984L50752J83545L31003J01158J3162j93066
$$ 4055578 3838745 3751574 3964681 3954697 4305449 4488994 4819997 4921155 4934317 4741251
4954D741251J63778O46979N4911L79960j39346K1558j80066j94294O06553M93149
$$ 4741251 4905029 5552008 5606919 5986879 5847533 5869091 5689025 5494731 6101284 6594433
4944F594433k76540M76905K9536k81400M34798N1512M3341n2809k25887o32003
$$ 6594433 6317893 6794798 6824334 6542934 6977732 7029244 7072585 7019776 6793889 6161886
4934F161886l84826J5230J28084l31017J58030p2464l65320r1396L92517M21423
$$ 6161886 5777060 5792290 5920374 5589357 5747387 5674923 5309603 5218207 5610724 6032147
4924F032147M38075P3850J68492j96702M09259N33545R8175k38827J96462k56924
$$ 6032147 6470222 6544072 6712564 6515862 6925121 7458666 7556841 7318014 7514476 7257552
4914G257552j27924k78349M69276Q7P9886j23749k70673L39410N769L38013K80193
$$ 7257552 7129628 6851279 7320555 7320642 7400528 7276779 7006106 7345516 7351285 7689298 7969491
4903G969491J60898N94963Q3429K87290M41789O11561J320766N42578P3201o02026
$$ 7969491 8130389 8725352 8808781 9096071 9537860 10149421 11470187 12012765 12085966 11483940
4893A1483940p30356p00666o16685o34025o19j92367l83842J36517J87236L42153
$$ 11483940 10753584 10052918 9436233 8802208 8801589 8609222 8225380 8361897 8549133 8891286
4883H891286l54650k75430J20656k14051j97230J26406J12889J13336J20247q8522
$$ 8891286 8536636 8261206 8381862 8167811 7970581 8096987 8209876 8323212 8443459 8354937
4873H354937r4905j04781j15042m44905j35306k6965R4313K49638J01234K97392
$$ 8354937 8260032 8155251 8040209 7595304 7459998 7433033 7527346 7776984 7878218 8175610
4863H175610K5377L40824j05680M6205l605k46433K34275K18177Q0897J59707
$$ 8175610 8200987 8541811 8436131 8482336 8478731 8232298 8466573 8684750 8765647 8925354
4853H925354M15253o84329K46428k68278j52860K55862j38911K5245N30875j6198
$$ 8925354 9340607 8656278 8902706 8634428 8481568 8737430 8598519 8623764 9154639 9138441
4843I138441l01718J15813k20770K42987K6948q0959m70914K48392j93323N216
$$ 9138441 8836723 8952536 8731766 8974753 9001701 8920742 8449828 8698220 8504897 8510113
4833H510113o3838L5870L42641k7591K42175j03222L7409j391j53582J77273j53321
$$ 8510113 8446275 8482145 8824786 8797195 9039370 8936148 8973557 8972166 8818584 8995857 8842536
4822H842536P40891N5038K3038J66471J73608R941R4085M86736M65418n0707J9841
$$ 8842536 9583427 9638465 9661503 9827974 10001582 10011523 10105608 10592344 11057762 11007055 11026896
4811A1026896K89624j04845Q68718N1055l612L20172N19741L08093L99735R6319
$$ 11026896 11316520 11211675 12080393 12131448 12127836 12448008 12967749 13275842 13675577 13771896
4801A3771896M27707L84255L11233J59216O60697L21173M64334K03292N17456
$$ 13771896 14199603 14583858 14895091 15054307 15715004 16036177 16500511 16703803 17221259
4792A7221259P85048M38349M82708N17808N53045R63744J426435N97126P90405
$$ 17221259 18006307 18444656 18927364 19445172 19998217 20961961 22388396 22985522 23775927
4783B3775927N89286N06182M23720Q05713R25448O05173M55027R29079J441728
$$ 23775927 24365213 24871395 25295115 26100828 27026276 27631449 28086476 29015555 30457283
4774C0457283J131981J427668J775334K324529J606568K471333K439813K492091
$$ 30457283 31589264 33016932 34792266 37116795 38723363 41194696 43634509 46126600
4766D6126600L053242L132913L684883L833738M274364M242517M215513M425511
$$ 46126600 49179842 52312755 55997638 59831376 64105740 68348257 72563770 76989281
4758G6989281L430162J588268l7321j296451k447002k396163j524431j471891
$$ 76989281 80419443 82007711 81970390 80673939 78226937 75830774 74306343 72834452
4750G2834452j032980p63263K51667P92513N49923R82116J049759J279593J844557
$$ 72834452 71801472 71038209 71289876 72082389 72632312 73614428 74664187 75943780 77788337
4741G7788337J932047K414990K661000K680406L322786M782419N097765N519260
$$ 77788337 79720384 82135374 84796374 87476780 90799566 95581985 100679750 106199010
4733A06199010O335008P197426Q023475Q364109R225462Q766377Q473483P239529
$$ 106199010 112534018 119731444 127754919 136119028 145344490 154110867 162584350 169823879
4725A69823879M150575J099557k518370m718813n767535o049752m409012l287441
$$ 169823879 173974454 175074011 172555641 167836828 162069293 156019541 151610529 148323088
4717A48323088k352415j054451P4483Q31694J022727J672099J557807K092391
$$ 148323088 145970673 144916222 144990705 145822399 146845126 148517225 150075032 152167423
4709A52167423K305416K363481K561104K510255K069675K052582J083815J563213
$$ 152167423 154472839 156836320 159397424 161907679 163977354 166029936 167113751 168676964
4701A68676964J618012J984394L193296L446075L960241M033003M637113L681447
$$ 168676964 170294976 172279370 175472666 178918741 182878982 186911985 191549098 195230545
4693A95230545P17785k362233m926467p722715r384250j0419738j0049589q788602
$$ 195230545 195948330 193586097 188659630 180936915 171552665 161132927 151083338 142294736
4685A42294736p823132o052637m638347l485616j644906n01495K63636J293188
$$ 142294736 134471604 128418967 123780620 120295004 118650098 118148603 118412239 119705427
4677A19705427K254228J766734r6575k960431n450747p054107p370720o538873
$$ 119705427 121959655 123726389 123629814 120669383 115218636 108164529 100793809 94254936
4669I4254936n583221m938917m787229l520162l415901k667704j964059j325151
$$ 94254936 88671715 83732798 78945569 75425407 72009506 69341802 67377743 66052592
4661F6052592j432395j003856p04683p25300l33008j9883J98713J15807r0218
$$ 66052592 64620197 63616341 62911658 62186358 61853350 61833467 62032180 62147987 62057769
4652F2057769o32504j722892j994793j992323k112829j954516j920128j470524
$$ 62057769 61425265 59702373 57707580 55715257 53602428 51647912 49727784 48257260
4644D8257260j660602j132122r70604p84609l42046n62207l97264m01891n59573
$$ 48257260 46596658 45464536 44493932 43709323 43367277 42805070 42407806 42005915 41446342
4635D1446342p53915j205127n09861o31683j045075q24134m16875k10883n19945
$$ 41446342 40692427 39487300 38977439 38345756 37300681 36476547 36059672 35848789 35328844
4626C5328844n91979j053413q55343q20965q95397q67340r55383j396268j408616
$$ 35328844 34736865 33683452 32828109 32007144 31111747 30244407 29289024 27892756 26484140
4617B6484140m11982o41462p06653n25476p62051j059622m06561k44046k12410
$$ 26484140 26072158 25430696 24724043 24198567 23436516 22376894 21970333 21726287 21513877
4608B1513877l25346l79089n51782l50348j37333l11328l77733j09816l85933
$$ 21513877 21188531 20809442 20257660 19907312 19769979 19458651 19080918 18971102 18585169
4599A8585169n46354q57373k69658K55316P6449j03244k75759j98104m162o78
$$ 18585169 18038815 17181442 16911784 17167100 17243549 17140305 16864546 16666442 16662280 16661602
4589A6661602j45533L7687j25741l04880P7645K78890j53179j36708K67870K53822
$$ 16661602 16516069 16553756 16428015 16123135 16200780 16479670 16326491 16189783 16457653 16711475
4579A6711475n0980m27692l50627L05869M62488r9415k83378k18670K60225L1773
$$ 16711475 16660495 16232803 15882176 16188045 16650533 16551118 16267740 16049070 16309295 16341068
4569A6341068P5231O16021M28287m46282K2317K61405q9975m56247j74071J78500
$$ 16341068 16416299 17032320 17460607 17014325 17036642 17298047 17208072 16751825 16577754 16756254
4559A6756254M43147M46777j62309Q7199l22055j35344J36270J65251p0469k8924
$$ 16756254 17199401 17646178 17483869 17571068 17249013 17113669 17249939 17415190 17344721 17315797
4549A7315797J87415q6090j32177K45602l33414j59709K73578L64573m7983n2598
$$ 17315797 17503212 17417122 17284945 17530547 17197133 17037424 17311002 17675575 17627592 17574994
4539A7574994K77174m804k60495j48162j57555L56883K85984k00014J39996o9045
$$ 17574994 17852168 17847364 17586869 17438707 17281152 17638035 17924019 17724005 17864001 17794956
4529A7794956n0210m8833j97599O7651L64183J68191j43259k53164j74229l39144
$$ 17794956 17744746 17695913 17498314 17565965 17930148 18098339 17955080 17701916 17527687 17188543
4519A7188543k67k54123j26709J15093l21007O5016q1710j56864j77808O48445
$$ 17188543 17188276 16934153 16807444 16922537 16601530 16666546 16584836 16427972 16250164 16898609
4509A6898609K04390k31569j31307O67393K03602n4345Q41745J72051M3607N43645
$$ 16898609 17102999 16871430 16740123 17407516 17611118 17556773 18398518 18570569 18614176 19157821
4499A9157821J03511J59308J250j07126J29849L82053k30600Q6552Q3650K06444
$$ 19157821 19261332 19420640 19421890 19314764 19444613 19826666 19596066 19682618 19766268 19972712
4489A9972712K33527J87709J75346Q8139R1695k23049N03683M11210j68939j97066
$$ 19972712 20206239 20393948 20569294 20657433 20749128 20526079 21029762 21440972 21272033 21074967
4479B1074967O64738P40343K44573P85469M79979Q1666N99802L29536J11081L34476
$$ 21074967 21739705 22480048 22724621 23510090 23990069 24071735 24671537 25001073 25112154 25446630
4469B5446630M39001M63119O56184N73714j4604K40875J360775J066555R79735
$$ 25446630 25885631 26348750 27004934 27578648 27564044 27804919 29165694 30232249 31211984
4460C1211984O87176J018790J000771R99064R63416J009240J795867J007379J119778
$$ 31211984 31899160 32917950 33918721 34917785 35881201 36890441 38686308 39693687 40813465
4451D0813465J694882K011286K118635J777668K747135K639109L288715L582353
$$ 40813465 42508347 44519633 46638268 48415936 51163071 53802180 57090895 60673248
4443F0673248L615417L850070M460773N167402N193305N437645O168316O907171
$$ 60673248 64288665 68138735 72599508 77766910 82960215 88397860 94566176 101473347
4435A01473347P886482R283778J0812699J2691335J3952468J6124874J9171803
$$ 101473347 109359829 118643607 129456306 142147641 156100109 172224983 191396786
4428A91396786K2306823K5478123K8281719K9838901K3578497O286975j5963295
$$ 191396786 213703609 239181732 267463451 297302352 320880849 327167824 311204529
4421C11204529k9795492l2057469k8240654k4520145k1449274j8058899j5544730
$$ 311204529 281409037 249351568 221110914 196590769 175141495 157082596 141537866
4414A41537866j2627002r964312q523164p609586o334403n685416m900547m341352
$$ 141537866 128910864 118946552 110423388 102813802 96479399 90793983 85893436 81552084
4406H1552084m185324m102373m121139l950384l739662k943332k262012j485735
$$ 81552084 77366760 73264387 69143248 65192864 61453202 58509870 56247858 54762123
4398E4762123j628139j762204k003970j721943j879538j752785j684313j695710
$$ 54762123 53133984 51371780 49367810 47645867 45766329 44013544 42329231 40633521
4390D0633521j305159j406519r79347j279358r93519j086278r31052j212990j093603
$$ 40633521 39328362 37921843 36942496 35663138 34669619 33583341 32652289 31439299 30345696
4381C0345696j135009q64143n32728l23599p55249p58766p42309o34455j33792
$$ 30345696 29210687 28346544 27813816 27490217 26734968 25976202 25233893 24599438 24465646
4372B4465646p57955m42359o02777m13016l18006o91913J35587q6851l36922k03716
$$ 24465646 23707691 23265332 22662555 22249539 21931533 21239620 21375207 21288356 20951434 20747718
4362B0747718o88672n48266p0662k94143m56817j5962L50628n14190p73942K31406
$$ 20747718 20059046 19510780 19440118 19145975 18689158 18673196 19023824 18509634 17735692 17967098
4352A7967098J4360j40024q3328J09882k89824L05843L40563J11290o8364p5956
$$ 17967098 17981458 17841434 17758106 17867988 17578164 17884007 18224570 18335860 18267496 18191540
4342A8191540J60180K97572K31054m49007o5183l61329m90087j57804M39114K01498
$$ 18191540 18351720 18649292 18880346 18431339 18366156 18004827 17514740 17356936 17796050 17997548
4332A7997548J22101k27273K36695Q11941P74311M37179R72264O04876J10646
$$ 17997548 18119649 17892376 18129071 18941012 19715323 20152502 21124766 21729642 21840288
4323B1840288m6783P144p50931q85184K30918j9008j34898K38501j77021L64556
$$ 21840288 21793505 21800649 21049718 20164534 20395452 20376444 20241546 20480047 20303026 20667582
4313B0667582K12829O20799Q59894P10866N95047N41534Q39916J251618P87200
$$ 20667582 20880411 21501210 22361104 23071970 23667017 24208551 25048467 26300085 27087285
4304B7087285J15232L05900J82506N29621Q61482Q86236k9876j84927R6311o31359
$$ 27087285 27202517 27508417 27690923 28220544 29082026 29968262 29938386 29753459 29849770 29218411
4294B9218411n5925K22069L72289Q04521Q76275J623445J627226J359824J887524
$$ 29218411 29162486 29384555 29756844 30561365 31437640 33061085 34688311 36048135 37935659
4285C7935659J806684K324783K838307J388660k089609m449881m847590m113672
$$ 37935659 39742343 42067126 44905433 46294093 44204484 39754603 34907013 30793341
4277C0793341k455053k137440j461406j201830p08006n87144p04475o98355l45142
$$ 30793341 28338288 26200848 24739442 23537612 22829606 22242462 21537987 20839632 20494490
4268B0494490o22851p34202p26129n37597n57440r86982o02497j50089n98612
$$ 20494490 19871639 19137437 18411308 17873711 17316271 16329289 15726792 15576703 14978091
4259A4978091k64880J85718j06720r12073k5347R7232j86710k89544k8591n44205
$$ 14978091 14713211 14898929 14792209 13880136 13854789 13952021 13765311 13475767 13447176 12902971
4249A2902971K20380Q3093R0615K21073l98461k09198m65116l08402L8272l92695
$$ 12902971 13123351 13206444 13297059 13518132 13119671 12910473 12445357 12136955 12175227 11782532
4239A1782532l68590j49528o0612M60038j003l43755J00846j3690J33379l51180
$$ 11782532 11413942 11264414 11203802 11663840 11662837 11319082 11419928 11406238 11539617 11188437
4229A1188437k2062k08389K34627m06409n31041N8831q9180O5846j18522j45022
$$ 11188437 11166375 10957986 11192613 10786204 10255163 10313994 10224814 10290660 10172138 10027116
4219A0027116l29807L53220J63165K29655k09752k26166j73759k35504k20596
$$ 10027116 9697309 10050529 10213694 10443349 10233597 10007431 9833672 9598168 9377572
4210I377572K78769J73992l34242P7942L84015k64647N8471J5213P3698M22130
$$ 9377572 9656341 9830333 9496091 9574033 9958048 9693401 9751872 9767085 9840783 10262913
4200A0262913o11447l78903l22990K69746L4959l60294O3756J69385j79790n06456
$$ 10262913 9651466 9272563 8949573 9219319 9254278 8893984 8957740 9127125 8947335 8440879
4190H440879K06178l13942n2814R6686J79424k06504o2740j98931Q2108k01853
$$ 8440879 8647057 8333115 8280301 8376987 8556411 8349907 8287167 8088236 8170344 7968491
4180G968491K06949K75047N4357j85625N4284k75294p7565j6677R2686m64710
$$ 7968491 8175440 8450487 8504844 8319219 8373503 8098209 8020644 8003967 8096653 7631943
4170G631943j60896r718J20756O3588l63102K78516j78351j52689M59607O7018
$$ 7631943 7471047 7461329 7582085 7645673 7282571 7561087 7382736 7230047 7689654 7756672
4160G756672k72067j84448l49688M2147L06306M77293l21446k51076j42809j31235
$$ 7756672 7484605 7300157 6950469 6992616 7298922 7776215 7454769 7203693 7060884 6929649
4150F929649L56459k58685j48810J07713q0441j61540K9883K34871K05384J21912
$$ 6929649 7286108 7027423 6878613 6986326 6905885 6744345 6774228 7009099 7214483 7336395
4140G336395j25901J26979m30108J5264L46315K72929k824m03557k78102K91651
$$ 7336395 7210494 7337473 6907365 6922629 7268944 7541873 7539049 7135492 6857390 7149041
4130G149041l7509j67725M9893J47713J71389k32476K59341J18612J0811k68478
$$ 7149041 7111532 6943807 6993700 7141413 7312802 7080326 7339667 7458279 7469090 7200612
4120G200612Q0418J80354j6510q9779n2467J48651k19432m10973M1174j42133
$$ 7200612 7281030 7461384 7444874 7355095 7302628 7451279 7231847 6820874 6862048 6719915
4110F719915n1974J90885R7610M19043j52375k65222L7589J95710n40532K26598
$$ 6719915 6667941 6858826 6956436 7375479 7223104 6957882 6995471 7191181 6650649 6877247
4100F877247j99401l04345J24911L82232J83849q5207q6264J68742j82405K47918
$$ 6877247 6677846 6373501 6498412 6880644 7064493 6979286 6893022 7061764 6879359 7127277
4090G127277o0053n38098N63752o0500j89987m9018L70245P04582K7946J04379
$$ 7127277 7067224 6529126 7092878 7032378 6842391 6793373 7163618 7868200 7896146 8000525
4080H000525l1751M20679r0097l09895K32602L2250M66624J20390L35824j05301
$$ 8000525 7968774 8389453 8299356 7989461 8222063 8254313 8720937 8841327 9177151 9071850
4070I071850J32736N7306L01609l794J00481m44611Q2163L37946k39316L32424
$$ 9071850 9204586 9261892 9563501 9559707 9660188 9215577 9297740 9635686 9396370 9728794
4060I728794K47207N45782k36594j89067L95666K57118J79248K52144K83065l84419
$$ 9728794 9976001 10521783 10285189 10096122 10491788 10748906 10928154 11180298 11463363 11078944
4050A1078944m6280L0407M06639P16762M85385L05374j10017M28077N08660K72186
$$ 11078944 11032664 11063071 11469710 12186472 12671857 12977231 12867214 13295291 13803951 14076137
4040A4076137L012p6310O4310K7757L81355Q22083q416K35273J95354K55826K20667
$$ 14076137 14079149 14002839 14067149 14094906 14476261 15298344 15289928 15525201 15720555 15976381 16197048
4029A6197048L94425N10432M74616N63162M31931L24081N36881N29386N12249
$$ 16197048 16591473 17101905 17576521 18139683 18571614 18895695 19432576 19961962 20474211
4020B0474211J80274P07791P70266P82874N43032N87126Q91300Q48131R00124
$$ 20474211 20654485 21362276 22132542 22915416 23458448 24045574 24936874 25785005 26685129
4011B6685129O85795J155097J078064J121344J295695J155376J216375J506994
$$ 26685129 27370924 28526021 29604085 30725429 32021124 33176500 34392875 35899869
4003C5899869J713422J802936J833255J720568J911608K056101K451218K350468
$$ 35899869 37613291 39416227 41249482 42970050 44881658 46937759 49388977 51739445
3995E1739445K588022K226137K400657L064100L333123K864177K981273L416544
$$ 51739445 54327467 56553604 58954261 62018361 65351484 68215661 71196934 74613478
3987G4613478L042288L595858L330269L773502L649580M055807M414831L935107
$$ 74613478 77655766 81251624 84581893 88355395 92004975 96060782 100475613 104410720
3979A04410720L984072M281817M646264M438675L767126L695575L687700M278149
$$ 104410720 108394792 112676609 117322873 121761548 125528674 129224249 132911949 137190098
3971A37190098L577791L512692L963869M075898M055121M273265L525198L066019
$$ 137190098 140767889 144280581 148244450 152320348 156375469 160648734 164173932 167239951
3963A67239951L058504K728281K023293J277694J177633R42792P16791P84227
$$ 167239951 170298455 173026736 175050029 176327723 177505356 178448148 179164939 179949166
3955A79949166J017831N55566M35914k07247n20909o24238o88385j364238k193571
$$ 179949166 180966997 181522563 181958477 181751230 181230321 180606083 179917698 178553460 176359889
3946A76359889k177868k178030k603413l327766l552523l127162k826496l295708
$$ 176359889 174182021 172003991 169400578 166072812 162520289 159393127 156566631 153270923
3938A53270923l829307l545779l742981m119577m137763m551457l607830m524767
$$ 153270923 149441616 145895837 142152856 138033279 133895516 129344059 125736229 121211462
3930A21211462n076130m618098m374469m474428m215628l993752m118144l708764
$$ 121211462 116135332 111517234 107142765 102668337 98452709 94458957 90340813 86632049
3922H6632049l608908k956340l062662l707719k838065l096654l382419k848056
$$ 86632049 83023141 80066801 77004139 73296420 70458355 67361701 63979282 61131226
3914F1131226k856610k910481k217259k200792k339817k478478k117350j795008
$$ 61131226 58274616 55364135 53146876 50946084 48606267 46127789 44010439 42215431
3906D2215431j351452j230444j926535j106696j386876j481437j305889j581628
$$ 42215431 40863979 39633535 37707000 36600304 35213428 33731991 32426102 30844474
3898C0844474q53767r48908r40090j010820j131492q90295o28374n71750r70126
$$ 30844474 29990707 29041799 28101709 27090889 25959397 25069102 24440728 23868978 22898852
3889B2898852k23788n93136p1268l58998q60801k81948J66601p14856o02911l25296
$$ 22898852 22675064 22081928 22010660 21651662 20790861 20508913 20675514 19960658 19357747 19032451
3879A9032451l71634J10795m39260p7045q3033o56377l58860m03317o47564J21775
$$ 19032451 18660817 18771612 18332352 18255307 18172274 17515897 17157037 16753720 16106156 16227931
3869A6227931M47995m2729k94214p69777p8518J61842J17687j72755k7968l61503
$$ 16227931 16675926 16633197 16338983 15569206 15490688 15652530 15770217 15597462 15569494 15207991
3859A5207991l31683k78885k68485k37644J11912m54433J80409j69428j35763
$$ 15207991 14876308 14597423 14328938 14091294 14203206 13748773 13929182 13759754 13623991
3850A3623991K92338k24490M1076k27923J85287J3846j92743m15321L8235k74895
$$ 13623991 13916329 13691839 13732915 13504992 13690279 13704125 13511382 13096061 13134296 12859401
3840A2859401k0549L45796l03803K5101J13266l02792p6499n7175J59451k44467
$$ 12859401 12838852 13184648 12880845 12905946 13019212 12716420 12639921 12582746 12742197 12497730
3830A2497730K35672K4793n2518K5380K69908j88839m6686K18486r1553l36054
$$ 12497730 12733402 12758195 12705677 12731057 13000965 12812126 12765440 12983926 12892373 12556319
3820A2556319m320Q8258m3896K17045j63374k04140L8177M5418M6432p49452k13554
$$ 12556319 12551999 12640257 12596361 12813406 12650032 12445892 12484069 12529487 12575919 11826467 11612913
3809A1612913M91701J69949m6266Q6227Q7800Q0006J56692Q8297k62840n0779
$$ 11612913 12104614 12274563 12228297 12314524 12402324 12482330 12639022 12727319 12464479 12413700
3799A2413700l0430K96178M34797O3333M05722k56245L12006k0275J56324K58042
$$ 12413700 12383270 12679448 13114245 13177578 13583300 13327055 13639061 13618786 13775110 14033152
3789A4033152M1194N24244K67468l65185p7420N71387q258K04453K94545k14487
$$ 14033152 14074346 14598590 14866058 14500873 14423453 14994840 14986582 15191035 15485580 15271093
3779A5271093J37284m18264o0382L13406J7053k76318K17107K76228K32612m25661
$$ 15271093 15408377 14990113 14929731 15243137 15260190 14983872 15200979 15477207 15709819 15284158
3769A5284158m61618Q2043J67252j41069j20940q2933j36494m71716J92423j07471
$$ 15284158 14822540 14904583 15071835 14930766 14809826 14726893 14590399 14118683 14311106 14203635
3759A4203635k63367j11649M4005J24444j83034j80694M8684M9688j05089K5382
$$ 14203635 13940268 13828619 13872624 13997068 13814034 13633340 13682024 13731712 13626623 13652005
3749A3652005J609L01439K49868j00861J11493J6187j11493J19482r6615J48707
$$ 13652005 13653614 13955053 14204921 14104060 14215553 14231740 14120247 14239729 14143114 14291821
3739A4291821j3091M42072N61538j43060k20811K01589N37737N84555K4851L54171
$$ 14291821 14278730 14720802 15282340 15139280 14918469 15120058 15657795 16242350 16267201 16621372
3729A6621372q5943q9578K76584L27389j49678M0002K62116P0225M14951Q66607
$$ 16621372 16535429 16445851 16722435 17049824 16900146 16940148 17202264 17272489 17687440 18554047
3719A8554047l25252J20675R0106J30750L28690J72017Q7957K7738j00036N46580
$$ 18554047 18228795 18349470 18439576 18570326 18899016 19071033 19158990 19186728 19086692 19633272
3709A9633272M30866K08874M59887L623k83248O67287M03833L1123L50213N45908
$$ 19633272 20064138 20273012 20732899 20736522 20453274 21120561 21524394 21555517 21905730 22451638
3699B2451638M05185M34771J70199N31680M41914m8103O19192K49491K40197l609
$$ 22451638 22856823 23291594 23461793 23993473 24435387 24387284 25006476 25255967 25496164 25492555
3689B5492555J45313L11814O52623K46644L75816N63927L17367M71885M13247
$$ 25492555 25637868 25949682 26602305 26848949 27224765 27788692 28106059 28577944 28991191
3680B8991191P00762N00094Q3216Q61536N83366K00273R54160P36231N76129Q29694
$$ 28991191 29691953 30192047 30275263 31136799 31720165 31920438 32874598 33610829 34186958 35016652
3670C5016652Q00910R98086N73365O21077Q80301Q95320R61219J122916J143351
$$ 35016652 35817562 36815648 37389013 38010090 38890391 39785711 40746930 41869846 43013197
3661D3013197J176528J303095J202786J552202J580766J518328J733984J458270
$$ 43013197 44189725 45492820 46695606 48247808 49828574 51346902 53080886 54539156
3653E4539156J940459J965504J471154J669997J951115J800114J730611K045321
$$ 54539156 56479615 58445119 59916273 61586270 63537385 65337499 67068110 69113431
3645F9113431J996767J735700K253720J783610K379641J955068K003760J499557
$$ 69113431 71110198 72845898 75099618 76883228 79262869 81217937 83221697 84721254
3637H4721254J392645J334280J099822O29663O84749J389054J108192N78763N19494
$$ 84721254 86113899 87448179 88548001 89177664 89862413 91251467 92359659 92938422 93457916
3628I3457916R16764O65604L95069K56090M99586K85560O4944M34769j63932K35034
$$ 93457916 94374680 95040284 95435353 95691443 96191029 96476589 96541533 96976302 96812370 97047404
3618I7047404J37959L2306J201974K24831P28067J133750J673734J098219J366517
$$ 97047404 97185363 97217669 98419643 98644474 99372541 100506291 102180025 103278244 104644761
3609A04644761J816453K417832K820097K664858L549196L863490M048381M853614
$$ 104644761 106461214 108879046 111699143 114364001 117913197 121776687 125825068 130678682
3601A30678682N722808N493112N773978O162288O560684O531266P214910P241694
$$ 130678682 136401490 141894602 147668580 153830868 160391552 166922818 174137728 181379422
3593A81379422P712777Q313673Q302209Q689493Q692973R057006R355444R216968
$$ 181379422 189092199 197405872 205708081 214397574 223090547 232147553 241502997 250719965
3585B50719965R617033R156656Q342213Q007395P446644P563206P010731P167534
$$ 250719965 260336998 269493654 277835867 285843262 293289906 300853112 307863843 315031377
3577C15031377O717943O345781N579851N292494N120487M010160L541958K499917
$$ 315031377 321749320 328095101 333674952 338967446 344087933 348098093 351640051 354139968
3569C54139968K116172J950247K144797J740364J774426K232184K044709K507148
$$ 354139968 356256140 358206387 360351184 362091548 363865974 366098158 368142867 370650015
3561C70650015K252969L019384K984017L646353M516012N717057O935236P597348
$$ 370650015 372902984 375922368 378906385 382552738 387068750 392785807 399721043 407318391
3553D07318391R152843J0190114J1518860J3396144J4455061J4090974J3458186
$$ 407318391 416471234 426661348 438180208 451576352 466031413 480122387 493580573
3546D93580573J1474263Q713324N517294K373160m60533k957110l765299l990895
$$ 493580573 505054836 513768160 519285454 521658614 521198081 518240971 514475672 510484777
3538E10484777l231648k369481k173037r80178j19150m58781j616134l237322
$$ 510484777 507253129 504883648 502710611 501730433 501611283 501152502 499536368 496299046
3530D96299046o467727r238500j2042850j3794313j3671442j2819987j0891554
$$ 496299046 489831319 480592819 468549969 454755656 441084214 428264227 417372673
3523D17372673q586678n736445j954452N38661L890506O159488P881029R038603
$$ 417372673 408785995 403049550 401095098 401633759 405524265 411683753 419564782 428603385
3515D28603385R290178Q514652P031559M589706J691059q76401l297117n165028
$$ 428603385 437893563 446408215 453439774 458029480 459720539 458844138 455547021 450381993
3507D50381993n727615n835202n116320m086266m797415m169939l523771l592235
$$ 450381993 444654378 438819176 433702856 429616590 424819175 420649236 417125465 413533230
3499D13533230n533948p602343r896282j2860629j5232789j6995774j8157175
$$ 413533230 407999282 400396939 390500657 377640028 362407239 345411465 327254290
3492C27254290j8516551j8262186j6562567j4657802j2947249j1846064j0249393
$$ 327254290 308737739 290475553 273912986 259255184 246307935 234461871 224212478
3485B24212478r085271q121461p261920o625020n524155n030909n067102m606335
$$ 224212478 215127207 207005746 199743826 193118806 187594651 182563742 177496640 172890305
3477A72890305m602442m217868m424828m072466m221380l639184l177235l540987
$$ 172890305 168287863 164069995 159645167 155572701 151351321 147712137 144534902 140993915
3469A40993915l306205l324495l268678k824654k900998l030080k471299k909149
$$ 140993915 137687710 134363215 131094537 128269883 125368885 122338805 119867506 116958357
3461A16958357l084231k934387k849265k155125k674322k815498k669078k570196
$$ 116958357 113874126 110939739 108090474 105935349 103261027 100445529 97776451 95206255
3453I5206255k076159j829347k019224k229961j674033j228179j694582j398890
$$ 95206255 93130096 91300749 89281525 87051564 85377531 84149352 82454770 81055880
3445H1055880j329288j597306k002978j697027j374426j134722q87292j649830
$$ 81055880 79726592 78129286 76126308 74429281 73054855 71920133 71032841 69383011
3437F9383011j190515j004973q93598j134544r20977j226618j447057r44440q20897
$$ 69383011 68192496 67187523 66293925 65159381 64238404 63011786 61564729 60620289 59799392
3428E9799392j039013j129394n07706n01215o71653p37855n36621j104977r27421
$$ 59799392 58760379 57630985 57123279 56622064 55950411 55212556 54675935 53570958 52643537
3419E2643537n48023q31553p85019o16816j85193o20787p53466p60492r78334
$$ 52643537 52095514 51263961 50478942 49862126 49676933 49056146 48302680 47542188 46563854
3410D6563854r1974q29999r29768J10540r78769o92563m27901l51291n25316p23770
$$ 46563854 46471880 45641881 44712113 44822653 43843884 43151321 42723420 42372129 41846813 41123043
3400D1123043k57569l88835n93325l64107o28424k47468o80334l38480p93867
$$ 41123043 40865474 40476639 39883314 39519207 38890783 38643315 37962981 37624501 36830634
3391C6830634n32160l53569l02335n61717l88853n65643k11905k06654m34074
$$ 36830634 36298474 35944905 35642570 35080853 34692000 34126357 33914452 33707798 33273724
3382C3273724n64867m74286l00197k76496n10933n87383k09666k77313n53894
$$ 33273724 32708857 32234571 31934374 31657878 31146945 30559562 30349896 30072583 29518689
3373B9518689k81805k00598j14037r618l54363m7301m70234n46544l50302j57106
$$ 29518689 29236884 29036286 28922249 28912631 28558268 28510967 28040733 27494189 27143887 26986781
3363B6986781Q9763o3263n12892j17748l23778L63581N9041n28925k34063p90777
$$ 26986781 27076544 27013281 26500389 26382641 26058863 26422444 26481485 25952560 25718497 24927720
3353B4927720o08351K0894L49213j24097q9611k31924m40729k0960O0274k45963
$$ 24927720 24319369 24340263 24689476 24565379 24475768 24243844 23803115 23782155 23842429 23596466
3343B3596466k36775k86479l97362J41679K73832p2074J43487j91679p9103n16473
$$ 23596466 23359691 23073212 22675850 22817529 23091361 23019287 23162774 22971095 22891992 22375519
3333B2375519q7689j83409k50464K25986L2882J83119m55045p1822j37424K25741
$$ 22375519 22287830 22104421 21853957 22079943 22112825 22295944 21840899 21769077 21631653 21857394
3323B1857394M16716l31426l58788M54971M110l29279L05508Q6101k39024k34374
$$ 21857394 22274110 21942684 21583896 22038867 22042977 21713698 22019206 22105307 21866283 21631909
3313B1631909k7402M991p4009K41866P4066M57671J73560n0499n4390m0278M37773
$$ 21631909 21604507 21609498 21535489 21777355 21851421 22309092 22482652 22432153 22377763 22337485 22775258
3302B2775258M57781j21056L83432o965J68041L38995N6028J87741K28668L23369
$$ 22775258 23233039 23111983 23495415 23488450 23656491 23995486 24051514 24239255 24467923 24791292
3292B4791292Q84414j86287J58008K81300K63703M59133L18293J18198M42408
$$ 24791292 25675706 25489419 25647427 25928727 26192430 26651563 26969856 27088054 27530462
3283B7530462K75758M75959L40418K26853R689O31899N26250P44576M36481P7030
$$ 27530462 27806220 28282179 28622597 28849450 28859139 29491038 30017288 30761864 31198345 31275375
3273C1275375O67483M97337P03074O60605O54912J091017R31605N38462J506600
$$ 31275375 31942858 32440195 33143269 33803874 34458786 35549803 36481408 37019870 38526470
3264C8526470J155591J143129J294026J332325J061991J991049K219102J393457
$$ 38526470 39682061 40825190 42119216 43451541 44513532 46504581 48723683 50117140
3256E0117140J919144K300982K140644K740608K843487K788353L152863L522163
$$ 50117140 52036284 54337266 56477910 59218518 62062005 64850358 68003221 71525384
3248G1525384K849393K867267J605219O75872n3217m91810r09465j748700k541482
$$ 71525384 74374777 77242044 78847263 79523135 79469918 78978108 78068643 76319943 73778461
3239G3778461k731849k819813k485188k065846k296947j499140j462309o79277
$$ 73778461 71046612 68226799 65741611 63675765 61378818 59879678 58417369 57738092
3231E7738092j59144m76220p88612q04411n04869l04694M91588L60920Q57873
$$ 57738092 57578948 57102728 56314116 55509705 55004836 54700142 55191730 55552650 56410523
3222E6410523J102274J064221R74696K042627K103688J950576J875535L98088
$$ 56410523 57512797 58577018 59551714 61594341 63698029 65648605 67524140 67922228
3214F7922228j67064p49075M46562J335316K343258L143717M572372O831592Q528170
$$ 67922228 67755164 67006089 67452651 68787967 71131225 74274942 78847314 85678906 94207076
3205I4207076P137113k751822j1241979j1449963q799938n988857m382424k905932
$$ 94207076 101344189 98592367 87350388 75900425 67100487 61111630 56729206 53823274
3197E3823274k209097j689794r57670q35386m04314n79679M44017L17354j34840
$$ 53823274 51614177 49924383 48966713 48131327 47727013 47147334 47591351 47908705 47773865
3188D7773865K20954Q80212J442284J618756K076496K205076K379141K184415
$$ 47773865 47994819 48875031 50317315 51936071 54012567 56217643 58596784 60781199
3180F0781199M138199O203795Q244893N073918n874733j1355341j1112549p714077
$$ 60781199 64919398 71123193 79368086 84442004 78567271 67211930 56099381 48385304
3172D8385304n276914l784971l116766k715845k144160j481339j612033j286410
$$ 48385304 43108390 39323419 36206653 33490808 31346648 29865309 28253276 26966866
3164B6966866q40498j215423q06442r83695o20928m99644o16515q70277m60866
$$ 26966866 26126368 24910945 24104503 23120808 22499880 22000236 21383721 20513444 20052578
3155B0052578l00152K29726l00957o61582k88100m89865Q4766k00306j87735o24363
$$ 20052578 19752426 19982152 19681195 19019613 18731513 18241648 18326414 18126108 17938373 17314010
3145A7314010l15092l38991o05189J40711k45618l7148n68342n38994J58137k33391
$$ 17314010 16998918 16659927 16054738 16195449 15949831 15912683 15344341 14805347 14963484 14730093
3135A4730093O414l78783l45120o3014J02714k26845k52432K58569k1911l92120
$$ 14730093 14736507 14357724 14012604 13949590 14052304 13825459 13573027 13831596 13809685 13417565
3125A3417565o9938P0477J5622l49274j10000J17085l64839k50669K18546R1197
$$ 13417565 13347627 13418104 13433726 13084452 12974452 13091537 12726698 12476029 12694575 12785772
3115A2785772k08797J51153Q6735k35244l38170n083j24004j22086m20820J77335
$$ 12785772 12576975 12728128 12814863 12579619 12241449 12236366 12112362 11990276 11569456 11746791
3105A1746791K46634J14678r802J00115N02873k12429l45394L89550K28650J64049
$$ 11746791 11993425 12108103 12098301 12198416 12701289 12488860 12143466 12533016 12761666 12925715
3095A2925715K32258J33107J70192L16534p2092M68403N99488R40182N84168P11120
$$ 12925715 13157973 13291080 13461272 13777806 13705714 14174117 14773605 15713787 16297955 17009075
3085A7009075P38539J152012Q67760J006149J443041J821537J747565K926483
$$ 17009075 17747614 18899626 19767386 20773535 22216576 24038113 25785678 28712161
3077B8712161L209032L257234L888499K122036k653111n206338m591304l541091
$$ 28712161 31921193 35178427 39066926 41188962 38535851 33329513 28738209 25197118
3069B5197118k539355j417986r04534o55494q17382p76688l41839j23607j01860
$$ 25197118 22657763 21239777 20335243 19679749 18862367 18085679 17743840 17620233 17518373
3060A7518373L33648J94022r8052K83673Q86458P77874J125218J781822J429772
$$ 17518373 17852021 18046043 17947991 18231664 19118122 19895996 21021214 22803036 24232808
3051B4232808J756403K523535L146167L983252L111010l4479l741689n502712
$$ 24232808 25989211 28512746 31658913 35642165 38753175 38718696 34977007 29474295
3043B9474295m354934l459220k174459j842203j245533r07735r40155j391907
$$ 29474295 25119361 21660141 19485682 17643479 16397946 15490211 14550056 13158149
3035A3158149m13481m89375o51792m20756K65096q45361l60576o8946l73293l37477
$$ 13158149 12744668 12255293 11603501 11182745 11447841 10602480 10241904 10172958 9799665 9462188
3025I462188m44986p7018L44932n87027l2535L7945k34709j42938k41820R1613
$$ 9462188 9017202 8940184 9285116 8698089 8665554 8703499 8468790 8325852 8084032 8175645
3015H175645j83480K07l4676j55787r2122k80080j44858J15888k82958R6585P5459
$$ 8175645 7992165 7992372 7957696 7801909 7709787 7429707 7284849 7400737 7117779 7214364 7289823
3004G289823l57615j05202L1742k16250l37926q8170R3017J00708L94326j37709
$$ 7289823 6932208 6827006 6858748 6642498 6304572 6216402 6309419 6410127 6804453 6666744
2994F666744p2642l07183K06495n090Q3824j87052j46756K58882j51584K78958
$$ 6666744 6594102 6286919 6493414 6488324 6572148 6385096 6238340 6497222 6345638 6624596
2984F624596k2387r0436l09117j27201j95J94248L6021k66010M18126J83880r5846
$$ 6624596 6602209 6511773 6202656 6075455 6075260 6269508 6305529 6039519 6457645 6641525 6545679
2973F545679K54522k43408q6186k41241K5222J30357j79427L80377J31923j29380
$$ 6545679 6800201 6556793 6470607 6229366 6254588 6384945 6205518 6585895 6717818 6588438
2963F588438K75381k02800K12210l06598L84825l93114q7575K46048N0476J75624
$$ 6588438 6863819 6661019 6873229 6566631 6951456 6558342 6470767 6716815 6767291 6942915
2953F942915l7896K57403K23380j22566j47692K04115J76529R1427L14840M25492
$$ 6942915 6905019 7162422 7385802 7263236 7115544 7319659 7496188 7587615 7902455 8327947
2943H327947J35483J67848N646N9622M86373k9893j25776R58478L70405R2964
$$ 8327947 8463430 8631278 8636924 8696546 9182919 9153026 9027250 9985728 10356133 10449097
2933A0449097k97680M76510M00992M01328j84526O9555K04073M26315L74245l07118
$$ 10449097 10151417 10627927 11028919 11430247 11245721 11315276 11519349 11945664 12319909 12012791
2923A2012791q253M99991k813J22936L45550j8863K26390M15304j15905O46616
$$ 12012791 12004538 12504529 12501716 12624652 12970202 12951339 13177729 13593033 13477128 14123744
2913A4123744M51222K51813L72475L53321Q09260O07870J121039P26140R7281
$$ 14123744 14574966 14826779 15199254 15552575 16361835 16969705 18090744 18816884 18914165
2904A8914165N95944r729K63789j05239K0256l20741j003503l88538l88008l22041
$$ 18914165 19510109 19500380 19764169 19658930 19679186 19358445 18354942 17966404 17578396 17256355
2894A7256355K00422l49010k72586j0284r3492L8549L8079L77570N36683J94927
$$ 17256355 17456777 17107767 16835181 16824897 16731405 16769954 16808033 17185603 17722286 17917213
2884A7917213L86205M60146Q3133P88379P97971L65518N00096J93004J00068j11310
$$ 17917213 18303418 18763564 18846697 19635076 20433047 20798565 21298661 21491665 21591733 21480423
2874B1480423q9190l71265o89443j11455l37976o40923p66673r20672o40649n75777
$$ 21480423 21391233 21019968 20330525 20219070 19881094 19240171 18473498 17552826 16912177 16336400
2864A6336400l71099m50723o37881j7511M36324K02826n23503L7172m70128J21617
$$ 16336400 15965301 15514578 14876697 14859186 15295510 15498336 14974833 15012005 14541877 14663494
2854A4663494J12291R1631m30266J18931P8439l89178r44o13136l03585p35036
$$ 14663494 14775785 14867416 14437150 14556081 14634520 14245342 14244398 13631262 13327677 12592641
2844A2592641m08953o92943o26804p1935o72872m08153o02819k11234O9133l86743
$$ 12592641 12183688 11490745 10863941 10792006 10119134 9710981 9108162 8896928 8966061 8579318
2834H579318m60087m64586n61867Q1069j69450j17877O1739n41124J1883j07573
$$ 8579318 8119231 7654645 7092778 7173847 7004397 6886520 6948259 6407135 6419018 6311445
2824F311445k16456J67607K3121m91428J10838o36716k50956L08320m97691l45535
$$ 6311445 6094989 6262596 6285717 5794289 5905127 5268411 5017455 5325775 4828084 4482549
2814D482549q3088p3178J20261j50645J94097p7892n65996Q2745K97871l7009
$$ 4482549 4399461 4326283 4446544 4295899 4489996 4412104 3846108 3928853 4226724 4189715
2804D189715o36430n5391l6937j21556L29047L33894l83972j37194k04841j39961
$$ 4189715 3553285 3497894 3460957 3339401 3668448 4002342 3618370 3481176 3276335 3136374
2794C136374p2079m1973j8881j58267O5640P43086p1555m16102j53217k309m8824
$$ 3136374 3064295 3022322 3003441 2845174 2910814 3653900 3582345 3166243 3013026 3010717 2961893
2783B961893l12024m01359L08453M32983p2981o5171J98415k11376l8159Q639
$$ 2961893 2649869 2248510 2556963 2989946 2916965 2851794 3050209 2838833 2800674 2809313
2773B809313k33252o2756l00424l99961j26477P3931L06482K86120R2733p3890
$$ 2809313 2576061 2513305 2212881 1812920 1686443 1760374 2066856 2352976 2445709 2371819
2763B371819o9010J09012r6992L2373p2427r3270Q1213j06376R9010l58238m4099
$$ 2371819 2302809 2411821 2314829 2347202 2274775 2181505 2262718 2156342 2255352 1897114 1853015
2752A853015N7556l8701J84521p29391K35235k22239j44683M047M09807k34912
$$ 1853015 1910571 1871870 2056391 1327000 1562235 1339996 1195313 1199360 1609167 1374255
2742A374255r4958O2384J97408K45795m14371J12985K00838K0959J24738p34467
$$ 1374255 1279297 1341681 1539089 1784884 1370513 1483498 1684336 1705295 1830033 1095566
2732A095566l08751Q2355L32428j31606j58494p8156k28891L38743M49645j31440
$$ 1095566 786815 869170 1201598 1069992 911498 833342 604451 943194 1392839 1261399
2722A261399k23885K61183m06910p80595j03919M95728m8360o2639O15945K45915
$$ 1261399 1037514 1298697 891787 111192 7273 503001 454641 392002 1007947 1253862
2712A253862m74221K31375j41940K89461K08498m54574k7833M93591m69882j16999
$$ 1253862 779641 1011016 869076 1158537 1367035 912461 884628 1378219 908337 791338
2702G91338M33498j08716p08335J44875k3939n49615L42487K73119N3147l67764
$$ 791338 1224836 1116120 407785 552660 528721 -20894 321593 594712 647859 280095
2692B80095M00984L9352J18224K48876o09958k95268K26953J4061K24189J20988
$$ 280095 681079 720431 838655 1087531 477573 182305 409258 423319 647508 768496
2682G68496j66202K19632N9802R3382k13874j28217K95927k21629j5134o8211
$$ 768496 602294 821926 881728 975110 761236 633019 928946 707317 692183 623972
2672F23972J1128N1247L87001J43525m96563N1829J22892J71016p7468k87897
$$ 623972 635100 686347 1073348 1216873 720310 772139 895031 1066047 988579 700682
2662G00682j46307K3611k77885K5441J64573K99482j20268o5810P0797K21594
$$ 700682 554375 577986 300101 325542 490115 789597 669329 603519 674316 895910
2652H95910l11691j77033P2677M3109l24370n7700P6097k6878M03200M8893J07633
$$ 895910 584219 407186 479863 522972 198602 140902 216999 190121 593321 642214 749847
2641G49847L13503J5439l17764Q0695k59468J07222l16866l288K63723l1620J34048
$$ 749847 1063350 1078789 761025 841720 582252 689474 372608 369320 633043 601423 735471
2630G35471l23509k90085J08247L05055J85115k19134k19756k96225K51899L99479
$$ 735471 411962 121877 230124 535179 720294 501160 281404 -14821 237078 636557
2620F36557K4721m02936M25449j16624L19047k16769l53303j78656K28582L94662
$$ 636557 661278 258342 683791 567167 886214 669445 316142 137486 366068 760730
2610G60730o37880j08964J74707K69016j35172J40432o496J20599j82566K75914
$$ 760730 122850 13886 188593 457609 322437 462869 456373 576972 394406 670320
2600F70320j53198r0705n02569K3812R46524l07393j76189j55496q0251K76718
$$ 670320 517122 426417 -76152 -52340 894184 586791 410602 255106 174855 451573
2590D51573Q1632k4532j63893K44700J50849K60346k44090n9116O6295k8820k42810
$$ 451573 533205 508673 344780 589480 740329 1000675 756585 697469 763764 734944 492134
2579D92134j39211M6163p5708K77682m88861L92229J33958j46748j76164j593
$$ 492134 352923 399086 323378 601060 112199 504428 638386 491638 315474 313881
2569C13881p3813L9907K59660l12010l6814J42533K9039r770Q050N8226o4744
$$ 313881 240068 279975 539635 227625 190811 333344 362383 352613 360663 418889 354145
2558C54145k21684m7042L85870L24781l16717P4184j91033K63418n3517j23694
$$ 354145 132461 85419 471289 796070 479353 553537 362504 625922 572405 448711
2548D48711j90059k29741L43485j93652K13944k97945q320Q7830k5961j52037
$$ 448711 258652 28911 372396 178744 392688 94743 86423 174253 148292 -3745
2538c745k3866L65213K68903L6763m45010J06276O0678K03972k18857n16425K30530
$$ -3745 -27611 337602 606505 643268 198258 304534 365212 569184 350327 -166098 64432
2527F4432J60347o7591m082l08980K54890l8813J44405K66753l41193J85313L77612
$$ 64432 224779 157188 153106 -155874 99016 60203 204608 471361 130168 315481 693093
2516F93093K6261l75152k24271J90487l42094l06180L52942m4250j62708N56349
$$ 693093 719354 344202 119931 310418 -31676 -337856 15086 -29164 -191872 364477
2506C64477k5237j89286J59103J46781j14853k26602L20620k01922o8298o8129
$$ 364477 339240 149954 309057 455838 340985 114383 435003 233081 164783 96654
2496I6654j62775J12188L16738L27126l31768m7213P6547k35905N54214J16159
$$ 96654 -66121 46067 362805 689931 358163 310950 387497 151592 705806 821965
2486H21965m93033k19130R3304L6962j2000j64044J03495O8437j96015J38509
$$ 821965 328932 109802 203106 240068 228068 64024 167519 235956 39941 178450
2476A78450j04657j33482M575K76791l2663j30726p7213M3594N4384j64395K6967
$$ 178450 73793 -59689 -55114 221677 189014 58288 -18925 24669 79053 -85342 -58375
2465e8375j59242j15667M7933p5099L47455Q9521R4393l12825q6109k28907O7621
$$ -58375 -217617 -333284 -285351 -360450 -12995 76526 170919 -141906 -228015 -456922 -389301
2454c89301K43266j45855J9881L08450K96940p7270J25752j86066l63319J32457
$$ -389301 -146035 -291890 -272009 36441 333381 256111 381863 195797 -167522 -35065
2444c5065K55209l8008l5850J87788o7835l43634p5492J88883O9132j27060l8309
$$ -35065 220144 182136 146286 334074 266239 -77395 -152887 35996 105128 -21932 -60241
2433f0241k04352J23486K9256J23331K23301M0868n9585k66093k6219J59895J04229
$$ -60241 -264593 -141107 -111851 11480 234781 275649 216064 -50029 -76248 83647 187876
2422A87876L36864m6364N3862l04683j9350k33441j18973M38572O9102m21837
$$ 187876 524740 478376 532238 227555 208205 -25236 -144209 294363 363465 -58372
2412e8372J64998K43940R459K36776j98606K70985j46780o80173K04118l4285
$$ -58372 106626 350566 360025 596801 398195 669180 522400 -157773 46345 12060
2402A2060R7301K57990o6652p7114L36676l44687K26147r8038k13211L17663K22989
$$ 12060 109361 367351 300699 223585 560261 215574 441721 343683 130472 448135 671124
2391F71124k01435J8099k8100l90826J7035k42361k39385L53242J98758L55938
$$ 671124 469689 487788 459688 68862 85897 -156464 -395849 -42607 156151 512089
2381E12089L30274j86220J35232J73130o8315q4096m77498L4713O61023k42564
$$ 512089 842363 656143 791375 964505 896190 812094 334596 369309 1030332 787768
2371G87768j39847O81304l44543m93006K03361J13457n74503k4587M70085m53980
$$ 787768 647921 1329225 984682 491676 695037 808494 233991 209404 679489 225509
2361B25509L45959k58669K13199m83385m00O5416l01963r8237j7503J43286O6261
$$ 225509 571468 312799 525998 42613 42213 107629 -194334 -292571 -310074 -166788 -100527
2350a00527K21664O3552k44132J73118Q4397O5113m57530k03042K10394L7406
$$ -100527 121137 184689 -59443 113675 198072 263185 -194345 -397387 -186993 -149587
2340a49587j46836L62715J57382K15648j80318J15229J02362p9263K20387J00569
$$ -149587 -296423 66292 223674 439322 259004 374233 476595 397332 617719 718288
2330G18288q5207j84140l28518j8578O3692M90288K36251n26589l15794L17763
$$ 718288 633081 448941 120423 101845 165537 655825 892076 365487 49693 367456
2320C67456O1461n49596M99113k2687k2422L94973M0569r6276k06331l92686Q7054
$$ 367456 428917 -120679 378434 355747 333325 728298 768867 672591 466260 73574 160628
2309A60628J84346j70467j10954K05273J17809M2586L2706J70157Q6071k94242
$$ 160628 344974 174507 63553 268826 386635 429221 461927 632084 718155 423913
2299D23913l25418j02208K13580P8446m53510L09211L56707r029j33817r785L5698
$$ 423913 98495 -3713 209867 288313 -165197 144014 500721 491692 357875 348090 383788
2288C83788j07750o24278L4541P5879K92269j08082m1061K18349J39467N940K35379
$$ 383788 276038 -348240 -313699 -237820 54449 -53633 -94694 123655 263122 269062 504441
2277E04441m25796m64K61178l13471N6288r6950K75718n7278j48349K15656r2920
$$ 504441 78645 78181 339359 25888 82176 -14774 260944 203666 55317 270973 178053
2266A78053J04380j62460q1724k00171J12610r3821K90151M11217O194j87475
$$ 178053 282433 119973 38249 -161922 -49312 -143133 147018 558235 564429 376954
2256C76954j34594L94100k73323m59413L55280J75420j22338K83077k7937q6121
$$ 376954 242360 636460 363137 -96276 259004 434424 312086 595163 567226 481105
2246D81105l23825K39792k8651K67214j38180r3970k23424P8789K2835M13833
$$ 481105 157280 397072 368421 635635 497455 403485 180061 258850 281685 695518
2236F95518l8770k40236L32962l2169n7703J41869m1188L5172J81151n4675l38375
$$ 695518 656748 416512 749474 717305 659602 801471 760283 795455 976606 921931 583556
2225E83556N0522L41668J53813k13917j14330j5214J15335j36676j38021O9612
$$ 583556 634078 975746 1129559 915642 801312 786098 901433 764757 626736 696348
2215F96348J59224j65980k41667N38417n63261J19899J14595J95896k4394r4196
$$ 696348 855572 689592 447925 986342 423081 542980 657575 853471 829077 734881
2205G34881K32066K45308L4162o5763P7877j09027K55150K00714l20279m37254
$$ 734881 966947 1212255 1246417 1180654 1258531 1149504 1404654 1605368 1285089 847835
2195H47835M73671J46144n764K49591M4810m84974J20117K50814r5248J54584
$$ 847835 1321506 1467650 1461886 1711477 1756287 1271313 1391430 1642244 1546996 1701580
2185A701580J35372K15181n28240M09805M31242K35320K63192J07861m5083j16122
$$ 1701580 1836952 2052133 1523893 1933698 2364940 2600260 2863452 2971313 2926230 2810108
2175B810108K90147l04864J94550K48064J85240J45251M1528J36263m22806J69205
$$ 2810108 3100255 2795391 2989941 3238005 3423245 3568496 3610024 3746287 3323481 3492686
2165C492686N69983M13384j14824l78683J87214L05738N46706N1159K31095J90247
$$ 3492686 4062669 4476053 4361229 3982546 4169760 4475498 5022204 5073363 5304458 5494705
2155E494705K67786o8611M31288n29736n69347R27288K88975K4821L02742k63647
$$ 5494705 5762491 5693880 6125168 5595432 5026085 5953373 6242348 6267169 6569911 6306264
2145F306264M44210M12712o3140R64686K45426L86787M83008O20815K63411N24065
$$ 6306264 6750474 7163186 7100046 8064732 8310158 8696945 9179953 9800768 10064179 10588244
2135A0588244M38072M01028K68822P05451Q56497J421951L75702J053914N77284
$$ 10588244 11026316 11427344 11696166 12401617 13258114 14680065 15055767 16109681 16686965
2126A6686965J058689J227354J635292J611017J824637K423600K606922K622969
$$ 16686965 17745654 18973008 20608300 22219317 24043954 26467554 29074476 31697445
2118C1697445L245037L051287L112547L828963L823748N308003O902314P422662
$$ 31697445 34942482 37993769 41106316 44935279 48759027 54067030 60969344 68392006
2110F8392006Q751386J0918386J2549999J4506528J8856679K5708842L2008555
$$ 68392006 77143392 88061778 100611777 115118305 133974984 159683826 191692381
2103A91692381K4038782j5060337m1021542l7356160k5318724j7066493j2509476
$$ 191692381 215731163 200670826 159649284 122293124 96974400 79907907 67398431
2096F7398431r846754p342408n673833n050752l480170l236953k598870j035606
$$ 67398431 57551677 50209269 44535436 39484684 36004514 32767561 30168691 29133085
2088B9133085p52540j447624k667823j844415j872763j688620j318869p53818
$$ 29133085 28380545 26932921 24265098 22420683 20547920 18859300 17540431 16786613
2080A6786613j123939q42772m65775o71277k52017k92215r03409p93103k39419
$$ 16786613 15662674 14819902 14354127 13682850 13430833 13138618 12235209 11442106 11202687
2071A1202687m71006p25983n70123n16761m13383n83422j20836k7430l67986l22543
$$ 11202687 10731681 10005698 9435575 8918814 8505431 7922009 7801173 7773743 7405757 7083214
2061G083214O5480J11597j82206l27654l67841j19973m57816j25687j28606K58016
$$ 7083214 7148694 7260291 7078085 6750431 6382590 6262617 5804801 5679114 5550508 5808524
2051E808524l04378n55615j81450n3415r2793M2888r1373o4821L3038J00689m33329
$$ 5808524 5504146 4948531 4767081 4713666 4620873 4663761 4572388 4507567 4540605 4641294 4207965
2040D207965j98956j51810m7577n9362J04067o1070l80496j20757J66665l41433
$$ 4207965 4009009 3857199 3809622 3750260 3854327 3793257 3412761 3292004 3458669 3117236
2030C117236k91015k1420k32031J83339m3363o3246K7435j16910O7711m92786
$$ 3117236 2826221 2804801 2572770 2756109 2712746 2649500 2676935 2560025 2627736 2134950
2020B134950L21539j41746N9275R5627k67729p83256K69836M8189k55761K27581
$$ 2134950 2456489 2314743 2374018 2469645 2201916 1418660 1688496 1736685 1480924 1708505
2010A708505l23971K96099P21453l48550l58501j45317r467k24563J07922K49439
$$ 1708505 1384534 1680633 2402086 2053536 1695035 1549718 1540251 1315688 1423610 1673049
2000A673049K08561k54202O8155N5381j61034q6975j51785j2744Q8597k05665
$$ 1673049 1881610 1627408 1695563 1750944 1589910 1502935 1351150 1338406 1427003 1221338
1990A221338N3229R9220j31960n27421n9685N14449k20378j6972k42648l78499
$$ 1221338 1274567 1373787 1241827 714406 654721 1169170 948792 931820 689172 310673
1980C10673M65104M25530L51680n80676n58216J51444J96786L04799J29110k37965
$$ 310673 775777 1201307 1552987 972311 414095 565539 762325 1067124 1196234 958269
1970I58269j62908L91262k87273k84410R5175m7976k6194J28872k94658O472K7588
$$ 958269 795361 1186623 899350 614940 710115 662139 635945 764817 470159 476631 504219
1959E04219J31626l21987J74852M7189J66360n87949O07224k77804O4462r513
$$ 504219 635845 313858 488710 535899 702259 114310 721534 443730 508192 498679
1949D98679L04749k98566o7654l2682l80323K21164j04031p9159P6387k89707
$$ 498679 803428 504862 437208 404526 24203 245367 141336 62177 138564 -151143
1939a51143J45056N73056k46182m618K08664L605N083O7305m8085R7156k49337
$$ -151143 -6087 566969 320787 316169 524833 528438 533521 600826 552741 649897 400560
1928D00560J46021K95073n80450j0534K42850L845p5880k64207r7164L1684K05907
$$ 400560 546581 841654 261204 250670 493520 497365 421485 157278 60114 91798 297705
1917B97705K3483q7245r7213J02005Q0963K0350l96582l99138K33507J87130j48091
$$ 297705 321188 233943 136730 238735 319698 340048 -56534 -455672 -222165 -35035 -183126
1906a83126M12589J80419m22366o3766J90363K9036j59953J08025M0735j46881
$$ -183126 229463 409882 -12484 -76250 114113 143149 -16804 91221 131956 -14925
1896a4925K72926l41880o8242j17206M77886l06632Q1377K12025m45802Q9413
$$ -14925 258001 -83879 -152121 -269327 208559 -98073 -16696 195329 -250473 -161060
1886a61060N04781j27857J70528j75783m90591q1464L81002J70832j10342K55194
$$ -161060 343721 215864 386392 210609 -279982 -361446 19556 190388 80046 335240
1876C35240j30710K12076k82819l64049M7240J57617m3638l50691o7196J04857
$$ 335240 204530 416606 133787 -230262 -183022 -25405 -69043 -419734 -486930 -382073
1866c82073K71412J20483k12851O0757N6711K8770j97173K47524n8502p3073K47968
$$ -382073 -110661 9822 -203029 -142272 -85561 -56791 -253964 -6440 -64942 -138015 109953
1855A09953l00104K02292J62816p7633L62561l77162k11702N9583l77808K34103
$$ 109953 -190151 12141 174957 97324 459885 82723 -128979 -69396 -447204 -213101
1845b13101J29559L26117n7695j01068J16660j30722L36528O811J44741M59819
$$ -213101 -83542 242575 184880 83812 200472 69750 406278 413089 557830 1017649
1835A017649K00921j75056R3961j9995m83695J7913P0620K45015l20208m48949
$$ 1017649 1218570 1043514 1137475 1117480 633785 651698 722318 967333 647125 198176
1825A98176m49616J32663J77747k47824K5647L80704j96538J52884K91935j4779
$$ 198176 -251440 -118777 58970 -188854 -163207 217497 20959 173843 465778 450999
1815D50999j22245q6919J97420J14394j61417l84621j99677J5820J27945j81926
$$ 450999 328754 241835 439255 553649 392232 7611 -192066 -176246 -48301 -230227
1805b30227K96896k05406m71986m9877N78531J99111j01327l20631Q9634R4076
$$ -230227 66669 -138737 -610723 -660600 -82069 117042 15715 -304916 -215282 -121206
1795a21206l94473K50058K19866N4802O3071k16965L29361O0050p049J2968K6010
$$ -121206 -515679 -265621 -45755 9047 72118 -144847 184514 244564 237515 250483 276493
1784B76493L38043m44753j64372L8711K85590L6862l48928k14661l32965M17129
$$ 276493 614536 169783 5411 44122 329712 366574 17646 -197015 -529980 -112851
1774a12851R9175K8461J630k31824j35024L93368J72020k3100J20905M62131k03674
$$ -112851 -13676 14785 16415 -215409 -350433 42935 214955 191855 312760 774891 571217
1763E71217m49090k05895l00393L54641K68774n9240k04634L08814m20806j53907
$$ 571217 122127 -83768 -384161 -29520 239254 180014 -24620 284194 -136612 -290519
1753b90519J98559L58729j2142j39440J84481Q1195J98435k58741l19700J39894
$$ -290519 -91960 266769 254627 115187 299668 380863 579298 320557 857 140751
1743A40751k72468L643K19665J73791l88431J73000j05296k33118K68287j47460
$$ 140751 -131717 -128074 91591 265382 -123049 49951 -55345 -288463 -20176 -167636
1733a67636J37964j3903L9081n06706R3854K59055Q9123p9747L51947m50497K76271
$$ -167636 -29672 -43575 -4494 -511200 -417346 -158291 -69168 -148915 203032 -247465 28806
1722B8806n04102L78313L75346j02896l1671j87439K36016J99053M02133j28585
$$ 28806 -475296 -96983 278363 175467 143796 -43643 192373 391426 793559 664974
1712F64974j84793m85309J11675p6243m44206N30956K13679k06242k42528j62795
$$ 664974 480181 -5128 106547 30304 -413902 117054 330733 124491 -118037 -280832
1702b80832p371k805Q4713J25313N79076j73406m5503j19764j8705j60548L24312
$$ -280832 -288203 -291008 -206295 -80982 498094 324688 279185 159421 140716 -19832 304480
1691C04480J43351m89825k31589L22671K65508O4893R998j62594l71213K52719
$$ 304480 447831 -41994 -273583 49088 314596 379489 389487 226893 -144320 108399
1681A08399J35513l07949j55109j41276j51966K06672N9590L85626k9223j88289
$$ 108399 243912 -64037 -219146 -360422 -512388 -305716 -246126 139500 110277 -78012
1671g8012P7107j39790m36714P3373M11913m81614M5149J89678J31594L50540
$$ -78012 -905 -140695 -577409 -504036 -92123 -573737 -528588 -338910 -207316 143224
1661A43224N164J8431o21220r9289K2811l16700L12676K68165K01084K3878J07917
$$ 143224 148388 166819 -454401 -553690 -530879 -847579 -534903 -266738 -65654 -41776 66141
1650F6141j03473k17389K1016R6464M22274j94888m23754O7908J98502j69249
$$ 66141 -37332 -254721 -233705 -137241 285033 90145 -333609 -265701 -67199 -236448
1640b36448j29676L10368j1354L13145M80618m92962j78990m51709j05038K13218
$$ -236448 -366124 -55756 -67110 246035 726653 233691 54701 -397008 -502046 -288828
1630b88828J15441J35070M24633k21758n40877M03608L18766j92104k79001M690
$$ -288828 -173387 -38317 386316 164558 -376319 27289 346055 153951 -125050 -120360
1620a20360m8964K75300j75244j97567p8371j8014m6149K68238J77867j37550
$$ -120360 -169324 105976 -69268 -266835 -345206 -363220 -409369 -141131 36736 -100814
1610a00814k8592R4884j38993j52283j06165J776K35068l7376k6830N56170j51562
$$ -100814 -129406 -34522 -173515 -325798 -431963 -430187 -195119 -232495 -259325 296845 145283
1599A45283m80121n4440j64638J48993M87631R2768l09352j11894Q3050j92013
$$ 145283 -334838 -389278 -553916 -404923 82708 175476 -133876 -245770 -162720 -354733
1589c54733K27693m7979j61746K0947K73111J82214M15810K9716m03629j87378
$$ -354733 -127040 -175019 -336765 -315818 -42707 139507 555317 585033 181404 -5974
1579e974j28572R2689L02938n88052J8078m0607r8858N02775n0684L64347k44038
$$ -5974 -134546 -41857 261081 -326971 -308893 -349500 -448358 54417 3733 368080 124042
1568A24042m83617o4486M99698L0515k11909k70740M37198J3677n20130m4079
$$ 124042 -359575 -424061 75637 106152 -105757 -376497 60701 74378 -445752 -489831
1558d89831K44507M28925l15669Q9605q6815l6125j82762M90212M4467j7431j12996
$$ -489831 -245324 183601 -132068 -42463 -129278 -165403 -348165 142047 186514 169083 56087
1547E6087k98181J62072K54572k7842k42852K0268J45371J20067P952l09443m32522
$$ 56087 -242094 -80022 174550 146708 -96144 -75876 69495 189562 197514 -111929 -544451
1536e44451P7586K03552J29839j53483M7505K70931J13064l03919J44466j30584
$$ -544451 -466865 -263313 -133474 -286957 -239452 31479 144543 -159376 -14910 -145494
1526a45494R4211r5126j64603J55054k5135q0238L17865P9779k79174k67562M8542
$$ -145494 -51283 -146409 -311012 -155958 -181093 -261331 56534 136313 -142861 -410423 -361881
1515c61881N64199j83284k83267j18635J75725L25333N6209j32776n55510L04529
$$ -361881 202318 19034 -264233 -382868 -207143 118190 174399 41623 -513887 -209358
1505b09358L78566j91438N6653l66051k58765K30230k67014J18568n3468J86862
$$ -209358 169208 -22230 34423 -331628 -590393 -360163 -627177 -508609 -562077 -375215
1495c75215K7720l3944J35583o3257N88022K70679l83068o7984k9289k21207J35832
$$ -375215 -347495 -381439 -245856 -309113 278909 549588 166520 98536 69247 -151960 -16128
1484a6128M8404r1152J61499j528n13785K13426j65272Q3550J3792J04087j30248
$$ -16128 32276 -58876 102623 101095 -412690 -199264 -364536 -280986 -267194 -163107 -293355
1473b93355J50006O92720l48564k98782j18615K68913k00668K15113j61205K3618
$$ -293355 -143349 549371 200807 -97975 -216590 52323 -148345 66768 -94437 -70819
1463g0819K96961j41341o41715N25722L386m01261K17299K77209j57772k58706
$$ -70819 226142 84801 -556914 -31192 -27806 -429067 -211768 65441 -92331 -351037
1453c51037N3720J82607k4511m14277R0460K75022N7253l30177K49720O5275k89117
$$ -351037 -297317 -114710 -139221 -553498 -463038 -188016 -130763 -460940 -211220 -145945 -435062
1442d35062p0076K49446j03924K20143K87679m38837j02886j07237M81153K50436
$$ -435062 -505138 -255692 -359616 -139473 148206 -290631 -393517 -500754 -19601 230835
1432B30835k01482L9393k07697Q7105q7122J2450j06934k21811K07152J44464
$$ 230835 29353 68746 -138951 -51846 -138968 -126518 -233452 -455263 -248111 -103647
1422a03647n9257k24184K25249q4343j57974O7363J53285j57014K32753n6130
$$ -103647 -162904 -387088 -161839 -246182 -404156 -336793 -183508 -340522 -107769 -163899
1412a63899j32057K49790P1462j25535l60378J07715j68479K14803J13689R6609
$$ -163899 -295956 -46166 25296 -100239 -460617 -352902 -521381 -306578 -192889 -96280
1402i6280L0644N318N4701k83340j17854L10060j01929n19524N11307K20468k98311
$$ -96280 -65636 -60318 -5617 -288957 -406811 -96751 -198680 -718204 -206897 13571 -284740
1391b84740q4842j75915P12245m00044j21408n1210j0669K17143J11634J61450
$$ -284740 -369582 -545497 166748 -233296 -354704 -405914 -416583 -199440 -87806 73644
1381G3644o8658J91748k5678l21866K27211J68825p4951l21270q0365j58338M94855
$$ 73644 4986 196734 171056 -150810 76401 245226 170275 -150995 -231360 -389698 105157
1370A05157o53775j54812J80373P04356K64640o08504J50464j49127o4932l2335
$$ 105157 -548618 -703430 -523057 181299 445939 -162565 -12101 -161228 -226160 -258495
1360b58495P0459m4912j9833j67128L19891M09101m14379l39902K1174O806p0039
$$ -258495 -188036 -232948 -252781 -419909 -100018 309083 -105296 -445198 -424024 -417218 -487257
1349d87257L1334M68733J49967k44078J7232k20044R0789J58499J40600l4443
$$ -487257 -455923 12810 162777 -81301 -64069 -284113 -193324 -34825 105775 71332
1339G1332p1159q7269J53925k47933J3510K33578k14917L21958L6834P6916p2517
$$ 71332 173 -87096 66829 -181104 -167594 65984 -148933 173025 209859 286775 214258
1328B14258j26197j25295L19955Q8380J69030p23179l02730o8704M0700N6046
$$ 214258 88061 -37234 282721 371101 540131 -183048 -485778 -554482 -513782 -457736
1318d57736M57695K39590k17156o1996J09055J08408j76622j37835m05530K14332
$$ -457736 -41 239549 22393 -39603 69452 177860 1238 -136597 -542127 -327795
1308c27795j40587j51901L14123P4110Q4142j35678o2333K34347K55209o17055
$$ -327795 -468382 -620283 -306160 -232050 -147908 -283586 -345919 -111572 143637 -473418
1298d73418L12163j58086L9146M5815K84519j94632J11620K5740j91442k15720
$$ -473418 -161255 -319341 -280195 -234380 50139 -144493 -32873 -7133 -198575 -414295
1288d14295J64764L10674J27107M23904N837l79436l42442J97540J61551j24520
$$ -414295 -249531 61143 188250 612154 617991 238555 -103887 93653 255204 130684
1278A30684m40969L54234J12728l2918J29821K40685o9689l07244l3347r9092
$$ 130684 -310285 43949 156677 123759 253580 494265 424576 117332 83985 -15107
1268a5107O5368k1118R0571l88058k21774J9525L142J53930J86524j84727j11521
$$ -15107 50261 29143 119714 -268344 -490118 -470593 -467451 -313521 -126997 -311724 -423245
1257d23245K02923p4180K01536m8338K6215k11162Q9913L51334l93157L53918
$$ -423245 -220322 -294502 -92966 -141304 -115089 -326251 -236338 114996 -278161 75757
1247G5757J99051k23925j05302L35594O184j16003L3486m68468l65p1357L85957
$$ 75757 274808 50883 -54419 281175 287359 171356 204842 -263626 -263991 -335348 50609
1236E0609K95826k1703j1389j56490j36229K00416J02728K24942k41937L11740
$$ 50609 346435 324732 313343 156853 20624 221040 323768 548710 306773 618513
1226F18513m81915k9077j70464R1021k03042q8080J93640j73195N1593L66443
$$ 618513 136598 107521 -62943 28078 -174964 -263044 -69404 -242599 -191006 175437
1216A75437O5927j52877J05716J13779j26511K3626m39966k55179M15104j1652
$$ 175437 241364 88487 194203 307982 181471 205097 -234869 -490048 -74944 -86596
1206h6596J3748L7076l0689n4241N87233K5769m2620m14445k10218J97466J84025
$$ -86596 -72848 -35772 -66461 -120702 466531 492300 449680 35235 -174983 22483 206508
1195B06508k14524k8530M43397k16673o33958l70837N93113r8642J429O19997
$$ 206508 -8016 -36546 406851 190178 -443780 -814617 -221504 -320146 -318717 301280
1185C01280j21836m6737k42016L80381r0657m81884J21787O0538L46589k77030
$$ 301280 179444 132707 -109309 271072 180415 -301469 -179682 -119144 227445 -49585
1175d9585j65305R3482K50309p7886L36310l38137n58440J0975M09801j64579
$$ -49585 -214890 -121408 128901 51015 387325 49188 -509252 -498277 -88476 -253055
1165b53055j12917K72271M04205m29921j94842K87915L8713L8645O9307k95J01946
$$ -253055 -365972 -93701 310504 -119417 -314259 -26344 12369 51014 120321 120026 221972
1154B21972l3747p59617R7947J21920K17740q8368K81851Q6002l31826l05936
$$ 221972 188225 -571392 -473445 -351525 -133785 -222153 59698 145700 -186126 -492062
1144d92062M79078J69943k8325N45923l18624l02263m14869Q2126K7872K77899
$$ -492062 -12984 156959 128634 674557 355933 53670 -361199 -279073 -251201 26698
1134B6698L19120j11696k47871J33383J9984m05038o3887K5670j6666m05489J39497
$$ 26698 345818 234122 -13749 119634 139618 -265420 -329307 -303637 -320303 -725792 -586295
1123e86295L21507K93624J42690M55500q49520K87381r8480K851k70176k01017
$$ -586295 -264788 28836 171526 627026 -222494 64887 -33593 -30742 -300918 -501935
1113e01935M85515L98545m66663K7614K86216r7066j8947L34118n19776j97642
$$ -501935 -16420 382125 -84538 -56924 229292 132226 113279 447397 -72379 -270021
1103b70021K44569L0175m0120J0274K54056r4830l73453K25983r7842m30434M17521
$$ -270021 -25452 4723 -35397 -25123 228933 134103 -239350 -13367 -111209 -541643 -124122
1092a24122n2009M74467O5543l09665P9899m37734N02343J30146n31329l16818
$$ -124122 -176131 298336 363879 54214 134113 -303621 198722 328868 -202461 -519279
1082e19279J08393M00403p8058J91182k88471K92062o5029j75228p5055J40467
$$ -519279 -410886 -10483 -88541 102641 -185830 106232 41203 -134025 -209080 -68613
1072f8613k4905K50378L10308j16328j60462l057N3519k05163K7299M6166K16612
$$ -68613 -93518 156860 467168 350840 190378 187321 240840 35677 62976 109142 325754
1061C25754M1610m414k06656j25231J29846j34100O3767k12004L18365k16056
$$ 325754 367364 362950 156294 31063 160909 26809 90576 -121428 196937 -19119
1051a9119k9111M95420L0860o29656L21859k13293P6812p1895L8704L39273r4710
$$ -19119 -48230 447190 478050 -151606 170253 -43040 33772 -38123 581 339854 245144
1040B45144J3331M8526q5832j61796k69759m25876j14542L40833m7938N9722K04090
$$ 245144 258475 307001 221169 59373 -210386 -636262 -750804 -409971 -457909 -398187 -194097
1029a94097m7774K96142k64452k36327K58417l5155L16512P6593n8636k95770
$$ -194097 -241871 54271 -210181 -446508 -188091 -223246 93266 169859 111223 -184547
1019a84547j5628n3685q0737m36469j9128K40052N6633L47668N47422k18317J77354
$$ -184547 -200175 -253860 -334597 -771066 -790194 -550142 -493509 -145841 401581 183264 360618
1008C60618l63914n98029N54291j9055k6569N2379l24916M6691N26712k49513
$$ 360618 -3296 -601325 -47034 -66089 -92658 -40279 -365195 -318504 208208 -41305
998d1305j20402K34800L9863J99538k90271j9245K69048l15625M81515Q6615j72099
$$ -41305 -161707 73093 112956 312494 22223 2978 272026 -43599 437916 524531 352432
987C52432k99575J33067j63015k48618L7343K23931j87549j0328K78418K36599
$$ 352432 52857 185924 22909 -225709 -188366 35565 -151984 -162312 116106 352705
977C52705o3262M576m02985j96495N1432K40937k8304M11240j12121k86125m5724
$$ 352705 289443 294019 -108966 -305461 -254029 -13092 -41396 369844 257723 -28402 -74126
966g4126J78643j25922J41264L00953j05239k06240k88157k88365j9769K55442
$$ -74126 104517 -21405 119859 420812 315573 109333 -178824 -467189 -486958 -231516
956b31516J22411L72041K66022m73750m33805J0396N32645J09006n98655N09604
$$ -231516 -109105 262936 528958 55208 -378597 -368201 164444 273450 -325205 184399
946A84399K86894j32011K19186k62884k00831j66394k52538K44087N31766J0885
$$ 184399 471293 339282 558468 295584 94753 -71641 -324179 -80092 451674 462559
936D62559k32073k41716J67926L46952r0751j22402o9124p3926j60153J28171
$$ 462559 230486 -11230 156696 503648 412897 290495 221371 147445 -12708 115463
926A15463j05442l43969J79367J93190k57568K07175n7243P9925j68868j62002
$$ 115463 10021 -333948 -154581 38609 -218959 -11784 -69027 10898 -157970 -319972
916c19972j86522m7646m11205M93664L55228K6275J11491l0548o3827K9714j28569
$$ -319972 -506494 -554140 -965345 -471681 -116453 -90178 21313 -9235 -73062 -43348 -171917
905a71917j46762O46551K1892l22527L75419M3581l23144K70080l37273l3579
$$ -171917 -318679 327872 349764 27237 402656 446237 123093 393173 55900 22321
895B2321J11897K32369p8793k92293J72357k70458K1064K20061m08082N2928N22371
$$ 22321 134218 366587 287794 -4499 167858 -102600 -81536 138525 -269557 -216629 305742
884C05742j26920m05812K23259K22585L18566j35865Q2535K28712l2698m64560
$$ 305742 178822 -226990 -3731 218854 537420 401555 484090 712802 680104 215544
874B15544m05385L62477o2061k50007O9783m27913J63679j49125L19587N68868
$$ 215544 -189841 172636 110575 -139432 -69649 -497562 -333883 -483008 -163421 405447
864D05447n9685l05262J06L26433n85320K70236k36504j68483Q3412L64410R8220
$$ 405447 345762 40500 40606 367039 -218281 51955 -184549 -353032 -269620 94790 193010
853A93010j84201j29157L38857j15902M7085l43120j36212J76715k06306k51680
$$ 193010 8809 -120348 218509 102607 149692 -193428 -329640 -152925 -359231 -610911
843f10911L30901J72136J93543R8003k87490n8153J24301p9623j35229j86364
$$ -610911 -280010 -107874 85669 183672 -103818 -161971 -37670 -117293 -252522 -438886
833d38886j820L03836j34414j48305N80658j8315j51208K76201l23712j76973
$$ -438886 -440706 -136870 -271284 -419589 161069 142754 -8454 267747 -55965 -232938
823b32938j97769L82119L7500k28719J45175M28855l48625l78062J30202J74416
$$ -232938 -430707 -48588 -11088 -239807 -94632 334223 -14402 -392464 -262262 -87846
813h7846J85030j30478J71093j48520j51692k46232K62256K15709k07816K10378
$$ -87846 97184 -33294 137799 -10721 -162413 -408645 -146389 69320 -138496 71882
803G1882J44393l01886N6861r4168k61743N35365j72135n49663M34487K14933
$$ 71882 216275 -85611 -28750 -122918 -384661 150704 -21431 -571094 -136607 78326
793G8326p4363N01488j21639q6318l15866R973o5969l48508m7608L75877l3058
$$ 78326 3963 505451 383812 297494 -18372 -8399 -74368 -422876 -470484 -94607 -127665
782a27665Q1863m4593j50258M763j78101m409N44510J23530m8933j37251m88538
$$ -127665 -45802 -90395 -240653 -235890 -413991 -418400 126110 249640 200707 63456 -425082
771d25082l8829M54578J8627j7807J86113q4654k11737O52708J23428l33328O7728
$$ -425082 -463911 -9333 9294 -8513 177600 92946 -118791 533917 657345 324017 391745
760C91745p6646j60923O3442k17435J2451n34l4513R5156j00879q4732K1611L800
$$ 391745 315099 154176 217618 183 12634 12100 -22413 72743 -28136 -112868 -91257 -87457
748h7457J11487L18696o8499J464l95712J31369k31828k7586J69232o5244L82887
$$ -87457 24030 342726 274227 275691 -120021 11348 -220480 -248066 -78834 -144078 238809
737B38809M1794j7211j25817N43951n15375j15066j71371M2005P33784j49964
$$ 238809 280603 263392 137575 681526 166151 51085 -120286 -78281 655503 505539
727E05539m27951j28218J79153j8479k79533P7096L82127q8112O9150R1974R653
$$ 505539 77588 -50630 128523 110044 -169489 -92393 289734 201622 270772 362746 372399
716C72399K97750j1781m12748k00191n38865M67452J24211J34107L11537l07787
$$ 372399 670149 658368 245620 45429 -493436 -25984 98227 232334 543871 236084
706B36084n4491k55266o0611q7835j53051j7864L25678K44274j49825J91938m65701
$$ 236084 181593 -73673 -134284 -222119 -375170 -393034 -67356 176918 27093 219031 -246670
695b46670j64691J75096M68080o5486j13545J4144M2445N259P0250j79816J35786
$$ -246670 -411361 -236265 231815 166329 52784 66928 109373 114632 184882 5066 140852
684A40852l30467q9304L45978J8546K65954j4204K53185j65443l20251n1075L2012
$$ 140852 -189615 -278919 67059 85605 351559 337355 590540 425097 104846 53771 85783
673H5783j11961P4955L8155K2133r288j89202J88902j8332M2315r6671m7971o0132
$$ 85783 -26178 48777 86932 109065 99777 -89425 99477 81145 123460 26789 -21182 -81314
661h1314n5184o6923K1201j73482N7046O6931q5531l6624M03261l61534J22682
$$ -81314 -136498 -203421 -182220 -355702 -298656 -231725 -317256 -353880 49381 -312153 -189471
650a89471M07094o7121J85654P935N35848k05061m44147l94419m0941O4087L07570
$$ -189471 217623 150502 336156 344091 879939 674878 230731 -163688 -204629 -140542 167028
639A67028k01374K0045O7643l35754R9437j62038n9617P9849R4931j28882r9874
$$ 167028 -34346 -14301 53342 -282412 -182975 -345013 -404630 -324781 -229850 -358732 -458606
$$ [...]
##END NTUPLES=NMR SPECTRUM
##END=
